##TITLE=1H_EC-3299(IV-33)x
 DMSO
 8 sc, 
 6.9.2023
##JCAMPDX= 6.0         $$ Bruker NMR JCAMP-DX V2.0
##DATA TYPE= NMR SPECTRUM
##DATA CLASS= NTUPLES
##ORIGIN= UXNMR, Bruker Analytische Messtechnik GmbH
##OWNER= root
$$ XWIN-NMR		Version 3.5
$$ Wed Sep  6 15:23:02 2023 Russian Standard Time (UT+4h)  she@DPX200
##.OBSERVE FREQUENCY= 200.13135
##.OBSERVE NUCLEUS= ^1H
##.ACQUISITION MODE= SIMULTANEOUS
##.ACQUISITION SCHEME= undefined
##.AVERAGES= 8
##.DIGITISER RES= 18
##SPECTROMETER/DATA SYSTEM= spect
##.PULSE SEQUENCE= zg30
##.SOLVENT NAME= DMSO
##.SHIFT REFERENCE= (INTERNAL, DMSO, 0, 15.7535)
##AUDIT TRAIL= $$ (NUMBER, WHEN, WHO, WHERE, WHAT)
$$ ##TITLE= Audit trail, XWIN-NMR		Version 3.5
$$ ##JCAMPDX= 5.01
$$ ##ORIGIN= Bruker BioSpin GmbH
$$ ##OWNER= she
$$ F:/spectra/data/she/nmr/H-F/1/pdata/1/auditp.txt
$$ ##AUDIT TRAIL=  $$ (NUMBER, WHEN, WHO, WHERE, WHAT)
(   1,<2023-09-06 15:21:29.76 +0400>,<she>,<DPX200>,
      <created by zg, POWCHK disabled, PULCHK disabled
       configuration hash MD5:
       00 E9 B6 7A A2 85 ED C7 34 08 36 98 17 FE 4E 26
       data hash MD5: 16K
       10 D4 A8 79 29 E4 9B 81 7E 06 70 64 B6 9D D0 E9>)
(   2,<2023-09-06 15:21:42.89 +0400>,<she>,<DPX200>,
      <Start of raw data processing
       efp BC_mod = 2 LB = 0.24 FT_mod = 6 PKNL = 1 PHC0 = -21041.42 PHC1 = 11.45271 SI = 16K 
       data hash MD5: 16K
       51 1F 52 77 7A 47 90 28 D0 1E AB 48 A6 3C 9D FF>)
(   3,<2023-09-06 15:21:58.06 +0400>,<she>,<DPX200>,
      <pk PHC0 = -3.926345 PHC1 = 4.400001 
       data hash MD5: 16K
       BD 5F 38 09 04 1C 41 22 76 35 A1 4D 70 D3 E7 57>)
(   4,<2023-09-06 15:22:03.04 +0400>,<she>,<DPX200>,
      <abs ABSG = 5 
       data hash MD5: 16K
       24 E3 4C EE B7 39 35 9F DD 19 62 85 5D BC E6 D7>)
$$ ##END=
$$ 
$$ hash MD5
$$ A6 BC 0A 48 AB 5B 3F 7F 01 82 7C AB 04 0C 18 A6
##$RELAX= 
##$RELAX= 
##$RELAX= 
##$RELAX= 
##$RELAX= 
##$RELAX= 
$$ Bruker specific parameters
$$ --------------------------
##$DU= <F:/spectra>
##$EXPNO= 1
##$NAME= <H-F>
##$PROCNO= 1
##$TYPE= <nmr>
##$USER= <she>
##$AMP= (0..31)
100 100 100 100 100 100 100 100 100 100 100 100 100 100 100 100 100 100 
100 100 100 100 100 100 100 100 100 100 100 100 100 100 
##$AQSEQ= 0
##$AQ_mod= 1
##$AUNM= <au_zg>
##$AUTOPOS= <>
##$BF1= 200.13
##$BF2= 200.13
##$BF3= 200.13
##$BF4= 200.13
##$BF5= 200.13
##$BF6= 200.13
##$BF7= 200.13
##$BF8= 200.13
##$BYTORDA= 1
##$CFDGTYP= 0
##$CFRGTYP= 5
##$CHEMSTR= <none>
##$CNST= (0..31)
1 1 145 1 1 1 1 1 1 1 1 1 1 1 1 1 1 1 1 1 1 1 1 1 1 1 1 1 1 1 1 1 
##$CPDPRG= <>
##$CPDPRG1= <>
##$CPDPRG2= <>
##$CPDPRG3= <>
##$CPDPRG4= <mlev>
##$CPDPRG5= <mlev>
##$CPDPRG6= <mlev>
##$CPDPRG7= <mlev>
##$CPDPRG8= <mlev>
##$CPDPRGB= <>
##$CPDPRGT= <>
##$D= (0..31)
0 1.2 0 0 0 0 0 0 0 0.06 0 0.03 0 0 0 0 0.0002 0 0 0 0 0 0 0 0 0 0 0 0 
0 0 0 
##$DATE= 1693999289
##$DBL= (0..7)
120 120 120 120 120 120 120 120 
##$DBP= (0..7)
150 150 150 150 150 150 150 150 
##$DBP07= 0
##$DBPNAM0= <>
##$DBPNAM1= <>
##$DBPNAM2= <>
##$DBPNAM3= <>
##$DBPNAM4= <>
$$ [...]
##$SUBNAM3= <"">
##$SUBNAM4= <"">
##$SUBNAM5= <"">
##$SUBNAM6= <"">
##$SUBNAM7= <"">
##$SUBNAM8= <"">
##$SUBNAM9= <"">
##$SW= 18.05172834244
##$SWIBOX= (0..15)
0 0 2 0 0 0 0 0 0 0 0 0 0 0 0 0 
##$SW_h= 3612.71676300578
##$TD= 16384
##$TD0= 1
##$TE= 0
##$TE2= 300
##$TE3= 300
##$TEG= 300
##$TL= (0..7)
0 120 120 120 120 120 120 120 
##$TP= (0..7)
150 150 150 150 150 150 150 150 
##$TP07= 0
##$TPNAME0= <>
##$TPNAME1= <>
##$TPNAME2= <>
##$TPNAME3= <>
##$TPNAME4= <>
##$TPNAME5= <>
##$TPNAME6= <>
##$TPNAME7= <>
##$TPOAL= (0..7)
0.5 0.5 0.5 0.5 0.5 0.5 0.5 0.5 
##$TPOFFS= (0..7)
0 0 0 0 0 0 0 0 
##$TUNHIN= 0
##$TUNHOUT= 0
##$TUNXOUT= 0
##$USERA1= <user>
##$USERA2= <user>
##$USERA3= <user>
##$USERA4= <user>
##$USERA5= <user>
##$V9= 5
##$VALIST= <valist>
##$VCLIST= <CCCCCCCCCCCCCCC>
##$VD= 0
##$VDLIST= <DDDDDDDDDDDDDDD>
##$VPLIST= <PPPPPPPPPPPPPPP>
##$VTLIST= <TTTTTTTTTTTTTTT>
##$WBST= 1024
##$WBSW= 4
##$XGAIN= (0..3)
0 0 0 0 
##$XL= 0
##$YL= 0
##$YMAX_a= 154307
##$YMIN_a= -173533
##$ZGOPTNS= <>
##$ZL1= 120
##$ZL2= 120
##$ZL3= 120
##$ZL4= 120
##$ABSF1= 15.76892
##$ABSF2= -2.282929
##$ABSG= 5
##$ABSL= 3
##$ALPHA= 0
##$AQORDER= 0
##$ASSFAC= 0
##$ASSFACI= 0
##$ASSFACX= 0
##$ASSWID= 0
##$AUNMP= <proc_1d>
##$AZFE= 0.1
##$AZFW= 0.1
##$BCFW= 0
##$BC_mod= 2
##$BYTORDP= 0
##$COROFFS= 0
##$CY= -3
##$DATMOD= 1
##$DC= 0
##$DFILT= <>
##$DTYPP= 0
##$F1P= 0
##$F2P= 0
##$FCOR= 1
##$FTSIZE= 16384
##$FT_mod= 6
##$GAMMA= 0
##$GB= 0
##$INTBC= 1
##$INTSCL= 3.70164e-10
##$ISEN= 128
##$LB= 0.24
##$LEV0= 0
##$LPBIN= 0
##$MAXI= 10000
##$MC2= 0
##$MEAN= 0
##$ME_mod= 0
##$MI= 1.114404
##$NCOEF= 0
##$NC_proc= -5
##$NLEV= 6
##$NOISF1= 3.799351
##$NOISF2= 2.8
##$NSP= 0
##$NTH_PI= 0
##$NZP= 0
##$OFFSET= 15.7535
##$PC= 1
##$PHC0= -21045.35
##$PHC1= 15.85271
##$PH_mod= 1
##$PKNL= yes
##$PPARMOD= 0
##$PSCAL= 0
##$PSIGN= 0
##$REVERSE= no
##$SF= 200.130003609876
##$SI= 16384
##$SIGF1= 3
##$SIGF2= 2
##$SINO= 5.538805
##$SIOLD= 16384
##$SREGLST= <1H.CDCl3>
##$SSB= 0
##$STSI= 16384
##$STSR= 0
##$SW_p= 3612.71676300578
##$SYMM= 0
##$S_DEV= 0
##$TDeff= 16384
##$TDoff= 0
##$TI= <>
##$TILT= no
##$TM1= 0
##$TM2= 0
##$TOPLEV= 0
##$USERP1= <user>
##$USERP2= <user>
##$USERP3= <user>
##$USERP4= <user>
##$USERP5= <user>
##$WDW= 1
##$XDIM= 16384
##$YMAX_p= 297673766
##$YMIN_p= -314625
$$ End of Bruker specific parameters
$$ ---------------------------------
##NTUPLES= NMR SPECTRUM
##VAR_NAME=  FREQUENCY,     SPECTRUM/REAL,   SPECTRUM/IMAG
##SYMBOL=    X,             R,               I
##VAR_TYPE=  INDEPENDENT,   DEPENDENT,       DEPENDENT
##VAR_FORM=  AFFN,          ASDF,            ASDF
##VAR_DIM=   16384,         16384,           16384
##UNITS=     HZ,            ARBITRARY UNITS, ARBITRARY UNITS
##FACTOR=    0.220516191357247, 1,           1
##FIRST=     3152.74800881444, 0,            0
##LAST=      -459.96875419134, 0,            0
##MIN=       -459.96875419134, -314625,      0
##MAX=       3152.74800881444, 297673766,    0
$$ Real data points
##PAGE= N=1
##DATA TABLE= (X++(R..R)), XYDATA
$$ [...]
8691A30383m472k9269M1158K5246k8551k0551K3650N3355O2768j6677L376n7983
8679A82433O493m039O4443l9931k5920L7889l1166J0717N2237J7838n9142j3351
8667A98501N5873L0260j6861r709p069L8457p728L806O0856l5736k640l879k279
8654C01852j5211P3313o391p137J06507K2151j7701L5116N0127K115J3521L2494
8642E90756N5328N8842M6984N2913J10471L2080j3323J14028J59956J17033J25903
8631A450971N8933K5747O9999O7042K7116M8109L0800j2173m760N1404l6084N0996
8619A828100p4733j08500m9632p6015j09726r2752r3251q1149p8589p8045o8525
8608I17183k5841L03J3828o7273m0110k1519j122L8934L0761l427M1291O7462
$$ y = [130383, 125911, 96642, 137800, 163046, 134495, 113944, 137594, 190949, 253717, 237040, 240416, 182433, 188926, 184887, 249330, 209399, 183479, 221368, 190202, 200919, 253156, 270994, 211852, 198501, 254374, 284634, 267773, 258064, 250995, 289452, 281724, 285530, 346386, 310650, 308010, 304131, 301852, 286641, 359954, 353563, 346426, 452933, 475084, 457383, 492499, 542626, 544741, 558262, 590756, 646084, 704926, 751910, 804823, 915294, 947374, 934051, 1048079, 1208035, 1325068, 1450971, 1509904, 1535651, 1605650, 1672692, 1699808, 1747917, 1778717, 1766544, 1761784, 1813188, 1777104, 1828100, 1753367, 1644867, 1595235, 1519220, 1409494, 1316742, 1223491, 1142342, 1063753, 985708, 917183, 891342, 891645, 905473, 838200, 798090, 776571, 775449, 814383, 845144, 841717, 883008, 950470]
8596I50470L6313J02663J12776P6126Q5715N4345L7012L7539N4917J521k960N4464
8584A600901O496k8720n9193k9016q6816j5735j78959m0043M46j15014o8251p5753
8572I10343j3003m4997r9538q7501l8070j0514m4168L038N767k9402q5743q225
8560D57987O26K5317L2562J23884J27917N8230J07661J12182J2793j2426j14544
8549I32189q1912k348L0005L9230O5690J10749l3248j27146j03096j10856o5403
8538F53854j04328p3463l1169n3138j2177P060o968j34j8307m6202l266M1992
8526C53754j7055m5240J7786j9323L9005m6253J5610N8545R2188K3204P5803J28229
8514F76253J07687N2821n2737q0999k4551q9314j0277j4484L8315J28559J0788
$$ y = [950470, 986783, 1089446, 1202222, 1278348, 1364063, 1418408, 1455420, 1492959, 1547876, 1549397, 1546437, 1600901, 1607397, 1578677, 1519484, 1490468, 1403652, 1387917, 1208958, 1168915, 1169361, 1054347, 986096, 910343, 897340, 852343, 752805, 665304, 627234, 616720, 572552, 575590, 581357, 551955, 466212, 457987, 458613, 483930, 516492, 640376, 768293, 826523, 934184, 1046366, 1059159, 1046733, 932189, 850277, 847929, 877934, 917164, 982854, 1093603, 1060355, 933209, 830113, 719257, 653854, 549526, 476063, 444894, 391756, 379579, 386639, 379671, 379537, 361230, 315028, 311762, 353754, 336699, 291459, 309245, 289922, 328927, 282674, 298284, 356829, 449017, 472221, 548024, 676253, 783940, 836761, 784024, 703025, 678474, 589160, 578883, 564399, 602714, 731273, 742061]
8503G42061j07246p3904r1080r1727p5000n9085L8875l7584m3866J4823k6631
8492A89636J0451k4539l2341K2158j7237p4391J1635N8565k4602j5247j3291K8083
8480A18880J804l3062m3201O4001n322l1422J5885j9572J9584J3732o278l5761
8468E9268K0686J7053j4049l029q116n6833j4492O1161k6051j6816J1985j7277
8456A3490q883L1837J0481J86n3455l7924J7522j500L6429r940l0446L8707K041
8443H545m0909l468L5457N8214J2763l9004m727M918j388q097p145J2510k0001
8430G668m4937K8363J9949j9159L2553P899J1739M086l2741j4247M2538M8602
8418I2313l7964J0273l4788J5423m7060n02M7803k3678l1698j7748R059l1728
$$ y = [742061, 634815, 560911, 469831, 378104, 303104, 244019, 282894, 245310, 201444, 216267, 189636, 200087, 175548, 143207, 165365, 148128, 73737, 85372, 143937, 119335, 104088, 90797, 118880, 120684, 87622, 44421, 108422, 103100, 71678, 87563, 67991, 87575, 101307, 95029, 59268, 79954, 97007, 82958, 79929, 71813, 14980, 488, 61649, 35598, 18782, 30767, 13490, 4607, 36444, 46925, 47111, -6344, -44268, -26746, -28246, 8183, -1757, -32203, 6504, 8545, -32364, -35832, -375, 57839, 70602, 31598, 26871, 31789, 30401, 22304, 15159, 27669, 7668, -37269, -8906, 11043, -8116, 24437, 32336, 44075, 48161, 15420, 1173, 43711, 92313, 54349, 64622, 29834, 45257, -1803, -2305, 45498, 21820, -9878, -27626, -18567, -50295]
8406e0295j0103J3971N549k4807j1511K7803L897K2429K1684k8496m5664K7294
8394d8249J6658j9112L2993m5078N37M5222J0054j139k6788L1766m2877j7985
8382f3998L4992L3595m1k1681q342k4393J4653n591r017J09J1855m1494L2278
8369d7075k549K3318K1712J1127l4025m5948L6398J7658m0336l7306L9506N5753
8357a767r883L2911l3717O477J7610n3587M5575k9091J6713k2723k7838k3022
8345h2342L4826K1621l2278n063j3784j482K5250N7353O697k5484M928l1378J5138
8332b5998M784j1831L539l6206O1203q963k5117J8501m7969l6599k0621L7839
8320h7438M3051j4203l06k5916N480J1273N6073k5455K3073j0011l0157J1064
$$ y = [-50295, -60398, -46427, -40878, -65685, -77196, -49393, -45496, -23067, -1383, -29879, -75543, -48249, -31591, -50703, -17710, -62788, -62251, -17029, -6975, -8114, -34902, -3136, -46013, -63998, -29006, 4589, 4548, -17133, -25475, -49868, -35215, -40806, -49823, -49714, -37859, -79353, -47075, -49624, -26306, -4594, 6533, -27492, -73440, -37042, -19384, -59720, -97026, -57520, -1767, -11650, 21261, -12456, -5979, 11631, -41956, 3619, -25472, -8759, -31482, -59320, -82342, -47516, -25895, -58173, -63236, -77020, -78502, -53252, 4101, 10798, -14686, -9758, -41136, -25998, -21214, -33045, -29506, -65712, -4509, -13472, -38589, -20088, -68057, -104656, -125277, -87438, -44387, -58590, -58896, -84812, -79332, -68059, -11986, -37441, -14368, -24379, -54536, -43472]
8308d3472M037J7595k8661k3286m5631O0128N5793O027j6623L0067Q375o0924
8296c6575j0139J2770R639J931O379j008j2121n2711J2141L8223J0492K2627m5118
8283d3470k7916p051M3975K9573l0009l0557j4142K2812r899K6626J3257J4822
8271a1979k5870K3034m326J110L3705K6900k4791l2260k0163m4547M6083L1666
8259a438l0998m2471L2331L8693r141j5578K0732l0979j2549M8518p486k415J4948
8246B167o7238L9595O177j3747m0808m878q913l653R243J0447M7295J2832k555
8233a4036j5778K105l3085k8832M3236L7423m5543j7396L7542L137j8727j5285
8221f5239N8155M2850r061k396n3550J1832K7659j4069k8260O001m681k288P360
$$ y = [-43472, -39435, -21840, -50501, -73787, -119418, -59290, -3497, 2530, -14093, 15974, 24349, -36575, -46714, -33944, -24305, -22374, -15995, -17003, -29124, -81835, -69694, -31471, -20979, 1648, -43470, -71386, -78437, -34462, -4889, -34898, -65455, -79597, -56785, -66684, -40058, -26801, -11979, -37849, -14815, -19141, -18031, 15674, 42574, 17783, -14477, -34640, -79187, -33104, -1438, -32436, -74907, -42576, -3883, -13024, -28602, -7870, -38849, -51398, -2880, -10366, -12781, 2167, -65071, -25476, -19299, -33046, -73854, -78732, -87645, -91298, -82055, -71608, -24313, -11481, -14036, -29814, -27709, -60794, -89626, -46390, -8967, -54510, -71906, -34364, -31227, -49954, -65239, -7084, 35766, 26705, 24309, -29241, -17409, 10250, -3819, -32079, -26078, -30759, -33047, -25687]
8208b5687m1203J2413K0047l1674L6630J5008L2731n2097l6460L0803K6995o1631
8196g4125J9560J0907J056j27085j44938J88268K2534M2416L2171J191k1650M1056
8184h639L8197k9121p6761J4049M7152L3030l0867j4904l236J1184L238l4786
8172e1464J6725j5159O4840j1806l4011r061j4193L4444l8995k6748P2052r975
8160b3351K0667N929l2283N549N3296n58l924k2641l2344K2057J3617j8069K4607
8147A2552J2641j8781m4120j3870k0470O8069M861l6028J0997o1134J2110k050
8135g5223L7358M7670l9852l9948m9717L3676O806J9499J0040j2061J9349K7689
8123a4714k9208n8700L0096J3282K4741P4998j5635r7547M220M7280K3136m0114
$$ y = [-25687, -66890, -54477, -34430, -66104, -29474, -14466, 18265, -33832, -70292, -39489, -12494, -74125, -54565, -43658, -42602, -169687, -314625, -126357, -103823, -61407, -29236, -28045, -49695, -8639, 29558, 437, -76324, -62275, -15123, 17907, -12960, -27864, -31100, -19916, -16678, -51464, -34739, -49898, 14942, 3136, -30875, -39936, -54129, -19685, -58680, -85428, -13376, -23351, -2684, 3245, -29038, -23489, 29807, 29249, 25325, 2684, -29660, -7603, 6014, -12055, 12552, 25193, 6412, -37708, -51578, -72048, -3979, 882, -35146, -24149, -85283, -73173, -75223, -37865, 9805, -30047, -69995, -119712, -86036, -79230, -59731, -49691, -61752, -42403, -14714, -43922, -102622, -72526, -59244, -34503, 40495, 24860, -72687, -68467, -21187, 1949, -38165]
8111c8165K5718J3382k0105o3765L8587j7624j7817L4708K036j7204j1015N8158
8099a3106j5265j6913K8491j9387m6559M9997O1266M4896j1343p9276m2362K4976
8087c4585Q265j7994L7719m1109l3331N555m7181K6859q096N6765L8463J2145
8075C475J600n864K3483k5801k9536k3157L0954K3286K4815m6663l2808K8807
8063b7409J0618R068k9796l034j9072L1294P946j1980l574m4715j7896L5246J615
8050f1689j416J908P922O3737J9348n4744M620M2659m1765L598L4351j7955l2185
8037c1611K9366j2862R182j9575K6321J6240N659K0458l6774l2153n9422N499
8025g9672J7363K3201J707m007l517L448N8967k1913j5693K6532n8939K5148m0489
$$ y = [-38165, -12447, 935, -19170, -82935, -44348, -61972, -79789, -45081, -43045, -60249, -71264, -13106, -28371, -45284, -16793, -36180, -82739, -32742, 28524, 73420, 62077, -17199, -59561, -34585, -26320, -44314, -6595, -47704, -81035, -75480, -122661, -95802, -103898, -47133, -8670, 3475, 5075, -789, 22694, -3107, -32643, -55800, -24846, -1560, 23255, -23408, -56216, -27409, -16791, -7723, -37519, -40553, -59625, -28331, -20385, -32365, -35939, -80654, -98550, -63304, -61689, -63105, -61197, -53275, 10462, 29810, -24934, -20314, 22345, -19420, -15822, 18529, 574, -31611, -2245, -15107, -5925, -25500, 821, 17061, 22720, 43178, 6404, -25749, -85171, -79672, -62309, -39108, -37401, -41408, -44925, -41477, 17490, -4423, -20116, 6416, -52523, -27375, -67864]
8012f7864j7215J9414k0574L1263m0763K0154L6219j6147K9196k641L158J7732
8000h068J815j4472J9947j4349m7252K9014l2543q017K4880L0726J3245N956k9672
7987b8790J960J3636j4907j4427j3550R76j1642N396J0930K3835K2769j7043M606
7974a6251J6350J7693k1711l6611J1806K7465l4183j3183k227J2941J5474j3224
7962c5661l3628K0747N711J4369P102l1526N0m1089J6207j603j8639J5032J6314
7949f6614p267P777K8934K9841o562J1778j1263m3282J1396L4081m259M9464o2713
7936b8689l6831J7805J458M614M0233k917p490j4945J0401m022o5842j2857O0808
7923c8274q46j7801J3218l9387L8067N0678n470l3528l8112J9707K4293M1305
$$ y = [-67864, -85079, -65665, -86239, -54976, -95739, -75585, -39366, -55513, -26317, -28958, -25800, -8068, -6253, -20725, -778, -15127, -62379, -33365, -65908, -73925, -49045, -18319, -5074, 882, -28790, -26830, -13194, -28101, -42528, -56078, -55102, -66744, -61348, -50418, -26583, -3814, -20857, -16251, 99, 17792, -3919, -40530, -28724, -1259, -35442, -48625, -50852, -37911, -22437, -35661, -69289, -48542, -42831, -28462, -21360, -52886, -52836, -93925, -77718, -79321, -97960, -82928, -66614, -73881, -66104, -37170, -7329, -13891, -2113, -13376, -56658, -45262, -11181, -15440, 34024, -28689, -65520, -47715, -46257, -41643, -1410, -4327, -11817, -26762, -16361, -20383, -86225, -99082, -38274, -39120, -56921, -43703, -83090, -45023, 5655, 185, -33343, -71455, -51748, -27455, 13850]
7911A3850K4703j5483j8993l442j1682N793J3288l6272J8021m4190k7874o704
7899h8985P7415k5452J3442R047j1953k0236J4159N1523o2636m1915J0733M3697
7887c1161K431J8435l9070k6144N571L2344O9666k0600o31o293l5776K3212L827
7874d189L4203j356p6626N0617J1428q232m018N9463m4587l8162R50m0358k163
7861f3030J9982L7450k1019l680k0742J6516L6013j7022O587k2765q333R513o7180
7848i7710N0923J7929J2066m2144N279N9067j6072l717j0663j8799N9950J2134
7836B8243m3766J6485J9833m2510P1426K4236n5384L6018j2170n2104K9130L4403
7824E3840l3488n8244L3235p876j4795J8167q435m621K2093m19K6800O6658n8253
$$ y = [13850, 38553, 23070, 4077, 635, -11047, -5254, 8034, -28238, -10217, -54407, -82281, -88985, -11570, -37022, -23580, -14533, -26486, -46722, -32563, 18960, -43676, -85591, -74858, -31161, -28730, -10295, -49365, -75509, -69938, -37594, 32072, 11472, 10841, 4548, -31228, -8016, -4189, 30014, 28658, -47968, 2649, 14077, 5845, 1827, 61290, 16703, -21459, -20509, -60867, -63030, -43048, -5598, -26617, -30297, -51039, -34523, 1490, -15532, -8945, -31710, -40043, -30530, -97710, -46787, -28858, -16792, -58936, -53657, 5410, -10662, -14379, -25042, -43841, 16109, 28243, -15523, 962, 20795, -21715, 49711, 73947, 18563, 54581, 42411, -9693, 19437, 53840, 20352, -37892, -4657, -12533, -27328, -9161, -17596, -22217, -124, -543, 26257, 92915, 34662]
7811C4662m0487k7607L6800J3387O5178q4855o7152L1041J1312L3902l0758k035
7799b6612o086J0720L023L025r137j5325O8745l9014k4444L1748m390K6992J8403
7786C7648j038l8752j6434L9015L0322m5918l1340L4371q777k0949L7698j4580
7774A266m3790J6267K5028J7182J1122l2975j5978m3462K1883J7006J7372k3415
7762c2494K7423N4573J2497k0401k4103n372Q86L4203m460j9342J1468j3005k3873
7749b000M0683m0270J6344L9696J1817m6742l8700O269L2799p515n4849o629J4825
7736c4272N8686L2788Q18j1246j6129l4112k4498J6987Q506k5888N640J5006j6910
7723b4624l328J8249m73j6287j2018j9009N1688j3212k611J9164l0031m5752j3544
$$ y = [34662, -5825, -33432, 3368, 16755, 81933, -2922, -70074, -39033, -27721, 6181, -24577, -26612, -32698, -21978, -18955, -15930, -25067, -40392, 28353, -10661, -35105, -3357, -7747, 19245, 37648, 36610, -2142, -18576, 20439, 50761, 4843, -26497, 7874, -903, -21852, 15846, 1266, -42524, -26257, -1229, 15953, 27075, -5900, -21878, -65340, -43457, -26451, -9079, -32494, -5071, 49502, 61999, 41598, 17495, 12123, 13009, 47212, 42752, 23410, 34878, 21873, -2000, 38683, -1587, 14757, 54453, 66270, 19528, -19172, -12903, 19896, 12381, -42468, -49097, -34272, 24414, 57202, 58020, 46774, 30645, -3467, -27965, -10978, -2472, -28360, -22720, -7714, -24624, -27952, -9703, -10176, -26463, -38481, -57490, -5802, -19014, -21625, -2461, -32492, -78244, -91788]
7710i1788P6507R0290J0028j1582N07j5375O34p7659L116J6365K6704M882l5192
7697b563L731K5620K9623k1996k7440L6347j7117m394o3430m6005R795M2192L1925
7684c712k4667j485k231P500m777L6161J8616j4548m17J9787q12p189q078k781
7670A1367L0104K9652k7411L05j4174L5992l8740j1773m840J5285r733k0817M8825
7657D4042L4110r1169J6331J7606r600M484J553k8015j9134J3606J7602K5394
7645B6810M9973k6523n1024J4337j4136n116m7336j255J1897K7936n3779M3952
7633b4264Q6534O722k0978j8687l785O4546j5784m6007k8277m521m516J8579L0581
7620D0143l3874L336J6928o6512j4289M2066M9269K1653J0827n5029J0714O435
$$ y = [-91788, -15281, 75009, 85037, 73455, 73962, 58587, 59221, -18438, -15322, 1043, 27747, 32629, -2563, 1168, 26788, 56411, 34415, 6975, 43322, 26205, 21811, -41619, -87624, -77829, -35637, -3712, -28379, -29864, -32095, -24595, -29372, 6789, 25405, 10857, 10440, 30227, 29415, 22226, 14148, 11367, 41471, 71123, 43712, 44017, 29843, 65835, 27095, 15322, 10482, 25767, 16034, -4783, 44042, 78152, -13017, 3314, 20920, 11320, 15804, 17357, -10658, -29792, -16186, 1416, 26810, 76783, 50260, -764, 13573, -563, -5679, -53015, -54270, -42373, -14437, -68216, -24264, 62270, 68992, 48014, 29327, 25542, 90088, 74304, 28297, 20, -4501, -9017, 9562, 40143, 6269, 9605, 26533, -39979, -54268, -12202, 37067, 58720, 69547, 14518, 25232, 31667]
7608C1667l212j1876j2341j6773M815J8022M3987N2191j7715n4612r7486M1958
7596b1375M1813M439j0743K1570j8463K9058M8998j6631j2593o003J8420J8109
7584I6599J3900l2529j8262k4901L2048j1812l3945M8427L9127M510o621j9277
7572H7264m260j1428J224M48j0066k6281j7270J5096K3900n4662K7361R024l011
7559C7339K3113r300L1072o4767J3408K7897k8870Q981L7194m4715J6014L3161
7547H0527L1985L6398o6922O249j2952j9957j803N1890m112l2677j2261K2826
7535G9191m536J0038K3011m1603J7109k5219M3640J731K4346n5383l1102M0714
7523H1937N088O796m4691k7169L8517K3889k6666J4283M4024l8439M5244N252
$$ y = [31667, 28455, 16579, 4238, -12535, -7720, 10302, 54289, 106480, 88765, 34153, -63333, -21375, 20438, 24877, 14134, 35704, 17241, 46299, 95297, 78666, 66073, 60070, 78490, 96599, 110499, 77970, 59708, 34807, 66855, 55043, 21098, 69525, 108652, 113162, 106541, 87264, 83004, 71576, 72800, 73248, 63182, 36901, 19631, 34727, 58627, 3965, 31326, 40350, 37339, 60452, 51152, 82224, 17457, 30865, 58762, 29892, 38873, 76067, 31352, 47366, 80527, 112512, 148910, 81988, 88237, 75285, 55328, 53525, 105415, 101303, 68626, 56365, 79191, 74655, 84693, 107704, 66101, 83210, 57991, 101631, 103362, 127708, 72325, 41223, 81937, 87025, 93821, 49130, 21961, 60478, 84367, 57701, 71984, 116008, 77569, 122813, 128065]
7511A28065m142q614P05K3719k4762M1599L7375k5560j617m8776J5495j1075K0543
7498A42955j1036J4836K8795J6013L237L7841k491p3604P826M3776j5197k3555
7486A69396P5948l1397p0039J0009k932J3771L1328K3503K8655J2012j7866K5263
7474B67651K0321l6884K8017r294M033L131r818j8877L0280P906L3425M2437k774
7461C59554M7894L9k2686M1815j1671l7188K1971Q8336l8093j279N20K0242M2545
7448E11999N3311o1957J1883J2415J689N1711j08213L9781L6309n937j0586L5096
7436E67501L3272k4834l814l996L9818K8418Q625o1157L730j5266J9237K487J2207
7423F06228L2885J148l5789j5979l1611J3307K1905L0731k0479j2294m9909m194
$$ y = [128065, 123923, 115309, 116014, 139733, 114971, 156570, 193945, 168385, 166768, 117992, 133487, 122412, 142955, 131919, 146755, 175550, 191563, 194800, 232641, 230150, 156546, 164372, 208148, 192951, 169396, 245344, 213947, 143908, 153917, 150985, 164756, 196084, 219587, 248242, 260254, 242388, 267651, 287972, 251088, 279105, 269811, 273844, 276975, 267157, 248280, 278560, 286466, 319891, 362328, 359554, 407448, 407487, 384801, 426616, 414945, 377757, 399728, 488064, 449971, 448692, 449212, 469454, 511999, 565310, 503353, 515236, 527651, 529340, 581051, 472838, 512619, 548928, 542991, 532405, 567501, 600773, 575939, 572125, 568129, 607947, 636365, 644990, 583833, 587563, 572297, 591534, 594021, 606228, 639113, 640261, 604472, 588493, 556882, 570189, 592094, 622825, 602346, 590052, 540143, 535949]
7411E35949N7261l0326Q496j9276p1820L3454j1920K4954L5288k3107o7l9736
7399D99150K5127m5372l876M1497n67l1224J7623N8657K285l4300j4462J4458
7387E28996k2158J5970J7058l8206M1721l4497J177k9774L6510K3865l014o414
7375E31234L2364n8156k5211l4101j2278O2648K9458L277n384m9905J3251q035
7363D79162k7537R570q328K0060k5872R160l1954L78k3628L8041r25k3045L55
7350D15437k083J4580n5259M889o1203K0948J4288n1732k5185J6539M1058k9524
7338C02753l1961J2144j9902o190j2265l4063n3452L2759Q5312K216m6884k2148
7326B08319l0663K7741K6208k7270K4390j2784j7297N964k7480K0248j8700K7220
$$ y = [535949, 593210, 562884, 571380, 552104, 480284, 513738, 501818, 526772, 562060, 538953, 538886, 499150, 524277, 478905, 475029, 516526, 515959, 484735, 502358, 561015, 563300, 529000, 514538, 528996, 506838, 522808, 539866, 501660, 543381, 508884, 510061, 480287, 516797, 540662, 537648, 531234, 563598, 505442, 480231, 446130, 433852, 496500, 525958, 529235, 523851, 473946, 487197, 479162, 451625, 461195, 452867, 472927, 447055, 456215, 424261, 424639, 401011, 439052, 438127, 415082, 415437, 413354, 427934, 372675, 377564, 316361, 337309, 351597, 299865, 274680, 291219, 332277, 302753, 270792, 282936, 263034, 256844, 244579, 210516, 157064, 189823, 275135, 277351, 230467, 208319, 177656, 205397, 231605, 204335, 228725, 215941, 198644, 204608, 177128, 197376, 178676, 205896]
7314B05896J7864n6288K591Q225j6913J326P5794n9178l1016j3530k1608K1432
7302A34595N3461j1169j5961p9600m795L6036m147j1170k1154J0619L5678m3099
7290G9294J6692K4854k5168j4334m2773k109N8206J1225l2132j0282k993k6845
7278C3635r093N1067k2458L226k8779m0459P307P2470l1284m5600M0711l4708
7266c965J7631J6605L7443O712m7860n8337M512Q1910R849k5374k2358m7721k7594
7253e8547j6596J086O3743k3799l2129O182M2378K8138j3013J6369J6068J9383
7241D9263l7262k080n42j5227L93K4941K6223L41J558L2950k2719k4575r079r844
7227A4341J5048l0841j5548k988J3427J2797J0777m3980J4028J4596n202R85r891
$$ y = [205896, 223760, 167472, 170063, 178288, 161375, 162701, 238495, 179317, 148301, 134771, 113163, 134595, 188056, 176887, 160926, 81326, 76531, 112567, 108420, 97250, 76096, 86715, 122393, 79294, 95986, 120840, 95672, 81338, 38565, 36456, 94662, 105887, 73755, 63473, 60480, 33635, 24542, 75609, 53151, 56377, 27598, -12861, -5554, 66916, 35632, -9968, 30743, -3965, 13666, 30271, 67714, 74426, 26566, -31771, -27259, 54651, 64500, 39126, 16768, -30953, -58547, -75143, -74057, -10314, -34113, -66242, -60060, -17682, 10456, -2557, 13812, 29880, 49263, 12001, 9921, 9379, -5848, -5455, 19486, 45709, 46050, 47608, 80558, 57839, 33264, 24185, 14341, 29389, -1452, -17000, -19988, -6561, 6236, 17013, -26967, -12939, 1657, -3545, -2560, -12451]
7214a2451J3013O7938J0619m5617j501j3460K4610J4160P032m0698j0472N106
7202A8279j6660M456K1245L0173M3160l4296m0019j9410L4o685j2333M2210j487
7189B8667m9151L0651J0076m7929o5j651K0720k2430J0029o328L1215p788p20
7176d704m4299Q218M7071k9719O230m345L1260K4954J3536o0974J6945m206j6870
7163a6903J7478r950K4769k5317L0504J1l5996o436R851l1J4867O1104j3840L6206
7149H6317P204n3163l680P375k2538j2812K0376R636k8375P158K3727o4867M5621
7136B1979L0224O083m385k8143M084J5247j3485J954j7054j3580O597J5175l3823
7123i127Q098k791K4288q310p7424K8606M7207J5963k4404q648k294J6841p870
$$ y = [-12451, 562, 68500, 79119, 33502, 32001, 18541, 43151, 57311, 64343, 23645, 13173, 18279, 1619, 6075, 27320, 57493, 100653, 66357, 26338, 6928, 6962, 277, -12056, 30154, 28667, -20484, 10167, 20243, -27686, -27751, -29402, -8682, -31112, -21083, -27411, 3804, -3984, -4704, -49003, -40785, 6286, -23433, -17203, -21548, 9712, 34666, 48202, -12772, 4173, -33, -16903, 575, -9375, 15394, -9923, 20581, 20592, -15404, -21840, -11989, -12020, 2847, 63951, 50111, 86317, 93521, 40358, 36678, 44053, 21515, 8703, 29079, 38715, 10340, 17498, 41225, -23642, 21979, 52203, 58286, 53901, 25758, 29842, 45089, 31604, 33558, 16504, 2924, 9521, 24696, -9127, -1029, -3820, 20468, 12158, -65266, -36660, 10547, 26510, 2106, -6542, -8836, 8005, 135]
7110A35q359N5469J9089n0502k4464M9915J2217j4836K8522l5086J0368J175K7331
7097G0974J8145k3870J0243m0217j1706k5964j8928L7078K7927J3176J6292M0117
7085A13267l4234k5669J7869l3650r0536L8889J4462p635L979j4198L9170j2250
7073I464k3615K4120M500n6138J4713L5865k6932K5029K4474K8411k3242m9848
7061a3199J595Q547l1433M8025K5740j5352r938L7820K0537k9767L8361J0322
7049I1258j8787K2638k297K6857o4766p2876M4250O836N6912l6840j9787J1290
7037D4688m246P469k9239n3776L0131J0295k2099M9327l0517l3614O9938q516
7025B9841L7803o386l3807l317k0380M6776j5792j3359J3580j3068k3374m7947
$$ y = [135, -8224, 47245, 66334, 15832, -8632, 41283, 53500, 38664, 67186, 32100, 42468, 43643, 70974, 89119, 65249, 75492, 35275, 23569, -2395, -21323, 15755, 43682, 56858, 73150, 113267, 79033, 53364, 71233, 37583, -52953, -14064, 398, -7237, -3258, -17456, 21714, 9464, -14151, 9969, 14469, -41669, -26956, 8909, -18023, 7006, 31480, 59891, 36649, -13199, -11604, -3057, -34490, 13535, 39275, 23923, 13985, 51805, 72342, 42575, 80936, 91258, 72471, 95109, 92812, 119669, 54903, -17973, 26277, 33113, 90025, 53185, 33398, 44688, 40442, 47911, 18672, -35104, -4973, 5322, -16777, 32550, 2033, -31581, 38357, 29841, 67644, 61258, 27451, 24134, 3754, 50530, 34738, 21379, 34959, 21891, -1483, -49430]
7013d9430P798N4402q347k7932L4926L0382n5668n682J1007K4410J7970n1761
7001a7925K4302n168Q600l2394M663L8693m7799K6003q60N291j8651k0421L5384
6988b82l7148K1865p685k2278R124L1918L8328k9877m35m1879K402k4979O0195
6975g31J7378J2231L0784m4703J3007k1153K9821l497n8351J3226N4623n3404
6963a0769K03L7646j2091k7220J5577Q138n8848k5132L2544K8283l075M5559j0287
6950B0528J3397M231j2661k0261m8525L0979N4747n6992J8522J2788k4739K670
6938e316L510L0695l7179k9858L8814L1126k1654l6818L4069L2625j1502n2493
6926b3981m4430L2102J3378M4653l8277j8095k282j1728L2816k6859K2958N9683
$$ y = [-49430, -41632, 12770, 4423, -23509, 11417, 41799, -13869, -19551, -8544, 15866, 33836, -17925, 6377, 1209, 9809, -22585, -17922, 20771, -27028, -1025, -1885, 3406, -15245, -35666, -282, -37430, -15565, -23250, -45528, -36404, -4486, 33842, 3965, 3530, -38349, -35947, -60926, -731, 16647, 28878, 59662, 14959, 27966, 6813, 36634, 33137, -25214, -11988, 42635, -10769, -10566, 27080, 14989, -12231, 3346, 11484, -47364, -72496, -39952, -11669, -14744, 30815, 20528, 33925, 38156, 25495, 5234, -43291, -12312, 42435, -14557, 3965, 16753, -7986, -5316, -1806, 28889, -8290, -38148, 666, 31792, 10138, -26680, 7389, 40014, 28512, -23981, -68411, -36309, -22931, 21722, -16555, -34650, -36932, -48660, -15844, -42703, -19745, 39938]
6914C9938n855J1797K7294o4661k0209m916P270p014r236M1442K1812m1686j5485
6901a9509J3996K1264J7077M210n0918k5210M3741L471J2458j7094J3480j9280
6889b314k770K2176m7456l3597L0596p316L4746J4632M6249m0276k0331j1118
6877a6779j7861O312M8965J4799j6214j6202Q759m9082l251P999M0375M3663p4716
6864b3233M0388k616l6307L3415q344n529L3022j3076M1054m0334n4587L2806
6852c341L3370K5401K5252m1216j8520n2715L090M7656j8632j7689l26j3395J0577
6839b0488k0076k3211L9145O6033q465j0228m6109M2305N1365l5844q429k6634
6827f36J9831j318m577k694J4313L4737j3556n2253l7720M7465K9236k8544k303
$$ y = [39938, 34083, 45880, 73174, 8513, -11696, -16612, -9342, -16356, -25592, 15850, 37662, -4024, -19509, -5513, 15751, 32828, 37038, -13880, -39090, 4651, 8122, 20580, 3486, 16966, -2314, -5084, 17092, -30364, -63961, -33365, -40681, -5935, 8697, 54946, 14670, -5661, -16779, -34640, -28328, 20637, 35436, 19222, 3020, 11779, -37303, -40554, -32555, 7820, 51483, -23233, 17155, 14539, -21768, 11647, 3303, -2226, 30796, 17720, 58774, 18440, -36147, -3341, 30029, 55430, 80682, 39466, 20946, -31769, -28679, 18977, 345, -17344, -17670, -31065, -20488, -40564, -63775, -24630, 41403, 32938, 22710, -23399, 18906, 70271, 34427, 25998, -636, 19195, 17877, 13300, 10606, 24919, 59656, 46100, -6153, -43873, 3592, 32828, 4284, 1981]
6814A981J3417J3953j2418j8445P697l2905K438M0322l026J8313l180n9925L5012
6801C234P468j7649j7861r781P847n186M7714K3530n5501J9150j1924o553L4142
6788A8630k1634K4877k726K5294k3503l4465L0223n067L2106l3295r885R00J9088
6775B0543k6838k5104M5408j0334K2019q755L3491J9610k3810J1685o582j9339
6763C1994j6684q03k9604j0342L1288n5185J1744K7n967K2102M0703O530k1160
6750D643n5906O199N161l3840M9766K7596L682l5048j577K7372P303K1620n0112
6737b3141L646L5153M3711J2627k2985l5554j0866L4150j4876k9497j7984j433
6725b7049M8439K7281m2321m1109J7782j4033p634L7969L0543K1315k0863k1063
$$ y = [1981, 15398, 29351, 16933, -1512, 6185, -26720, -24282, 16040, 13014, 31327, 28147, -31778, 3234, 10702, -6947, -24808, -34589, -26742, -31928, 15786, 39316, -16185, 2965, -8959, -15512, 18630, -3004, 21873, 19147, 44441, 20938, -13527, 16696, 11629, 43735, 10440, 555, 1455, 20543, -6295, -31399, 14009, 3675, 25694, 16939, 50430, 70040, 46230, 57915, 51333, 31994, 15310, 14507, -15097, -25439, 5849, -49336, -37592, -37565, -43532, -21430, 19273, 25803, 4643, -51263, -45064, -39903, -73743, -23977, 3619, 7301, -27747, -29324, -1952, 5351, 26971, -23141, -19495, 15658, 59369, 71996, 49011, 13457, 2591, 36741, 21865, -7632, -25616, -27049, 21390, 48671, 6350, -34759, -16977, -31010, -38644, -675, 29868, 51183, 30320, 9257]
6713I257J8035k2337J2972P506j9597m4616Q235K498j1567M987K6065K392j255
6700g425N8402k8106n7374K3297L5490r397j5336K2232R251o0768L3361J3007
6688A6634K1500k3537k99l7573q826l977j1427K9342J6961k4681j2050L8830L9615
6675D0512m3726R935M5936K7748n9340Q02J7165K8318K611n2288R488j5012M9251
6662F1400l6973k1158M5833J9199R065m4812M137m4968Q324K4135L2662l1709
6650B5135O0618l9557l0506J2886j297M9164j1507O983r525K0549n3245L3682
6638F3380j4836q459m5956N6260r093l6404K0475j6007M42K3825k1819j5384j7114
6625b0690N9160j563k9447j9880L2441J3458K1581J2354k7350m2713m284L2286
$$ y = [9257, 27292, 4955, 17927, 25433, 5836, -38780, -30545, -28047, -39614, -34627, -8562, -6170, -7425, 50977, 22871, -34503, -11206, 24284, 14887, -449, 21783, 31034, -29734, 3627, 16634, 38134, 14597, 14298, -23275, -32101, -36078, -47505, -18163, -1202, -25883, -37933, 897, 40512, -3214, 6721, 52657, 80405, 21065, 21867, 39032, 67350, 69961, 17673, 27161, 12149, 61400, 24427, 3269, 49102, 68301, 77366, 32554, 36691, -8277, 47, 24182, 56844, 25135, 85753, 46196, 15690, 28576, 27279, 76443, 64936, 71919, 62394, 82943, 29698, 63380, 48544, 40085, -5871, 50389, 41296, 4892, 25367, 9360, 9802, 33627, 11808, -3576, -20690, 38470, 36907, 7460, -12420, 20021, 33479, 55060, 67414, 40064, -2649, -6933, 25353]
6613B5353K8733k6866K6653k7823n513j6963j599m890O069L7786p85K5786m5540
6600B0401j0560L7712m412j8592j970m7852j9998k938P7244R995J1530k5123j4022
6587A1415J2972k1415J7254J0802j1718j6166p878K5466K4487j1321l7226Q036
6575D708L865L2217q101k9510l959K9366J767K0669J2458k2191j2654J6632q418
6562C6849j3894j043j6440J3414l198p317L7184O224j8097o3685K5828L1324P386
6549C4535M3026m2586k5022M0718j3882M117k006o958m9393J5206L029K6231j1340
6536A5675m3995O698O8062P297l060M5806q3398m2065K4950l520L2004L965k9671
6523a252J3172R059k3075L1596q469j8502J6846m9923M3804L412K8914o502k4547
$$ y = [25353, 54086, 27220, 53873, 26050, 20537, 3574, 1975, -2915, 3154, 40940, 40155, 65941, 20401, 9841, 47553, 43141, 24549, 22579, -25273, -45271, -48209, 29035, 39030, 50560, 25437, 11415, 24387, 2972, 20226, 31028, 19310, 3144, -4734, 20732, 45219, 33898, -3328, 4708, 8573, 40790, 32689, 3179, -780, 28586, 30353, 51022, 63480, 41289, 28635, 45267, 36849, 22955, 21912, 5472, 18886, 15688, 8371, 45555, 51779, 33682, -30003, -4175, 27149, 34535, 77561, 34975, 9953, 50671, 36789, 40906, 38900, 31942, -17451, -2245, 784, 27015, 15675, -28320, -21622, 46440, 53737, 50677, 96483, 13085, -28980, -4030, -7550, 24454, 28419, -1252, 11920, 20979, -2096, 29500, 21031, 2529, 19375, -30548, 13256, 16668, 45582, 39080, 14533]
6510A4533L0645J7093n8450j1710K1246M5359j2998o7076K3959K6819o202j0476
6498A2742k931M2251m0744l0493L996J6402J8996M4540K22n4343L6207k7704K4142
6485D3283Q990l9765K1071K8469K4645l7742j1083R452N528l9342J8922K0577
6473E3005O124j0787J504r345n8618L4707J0339O048j7872K0067j6873M411L9076
6460F1786k0113l3104L88L9253k3419K3865L2575J0775N271R02j911M2040K5288
6447A63596K0754K451k3329p1058J0499l8311m3651N1983k4124l9763j7188J9907
6435A1766N9249n286j028K5071J1631j117P445j9247q286Q189j5503k6827n165
6422D0892K2767m0616m346Q272L9547l001m8018N3376k3626o0159K6467R62O686
$$ y = [14533, 45178, 62271, 3821, -7889, 13357, 58716, 45718, -21358, 2601, 29420, 23218, 12742, 9811, 52062, 11318, -19175, -15179, 1223, 20219, 64759, 64981, 10638, 46845, 19141, 43283, 52273, 12508, 33579, 62048, 86693, 48951, 37868, 47320, 52848, 13506, 32428, 53005, 59129, 48342, 49846, 40501, -18117, 16590, 26929, 32977, 15105, 35172, 18299, 22710, 61786, 41673, 8569, 8957, 48210, 24791, 48656, 81231, 92006, 97277, 98179, 96268, 138308, 163596, 184350, 186801, 163472, 92414, 102913, 64602, 20951, 72934, 48810, 9047, -8141, 11766, 71015, 65729, 64701, 89772, 101403, 100286, 107731, 88484, 80198, 88387, 72884, 46057, 40892, 63659, 23043, 18697, 26969, 66516, 63515, 15497, 68873, 45247, -14912, 11555, 12517, 19203]
6409A9203L6177R138l295j9889m930N3036k6007L9638R682p4604l310J3811m046
6396D4604N0006r252l3767m1311J2687O599J6588L7692j269J2240k7976J2697
6384G9538J5732K6365k68l2594J0995n6423j3444K4456J2044N845J4451j3898
6372G2799Q220K7634k1806J8045P598j2656L521J842k5290K2067m0927K382M6734
6359A10163L0755j4939M1104l4213k2700J7746L9033L2439p1466M5424J0798K408
6347A86552k0305l807n750k8946K1006j2937K8769K1227k4050L9201J4097j3298
6335B01759j2837M5467m0903l8326K2945j7115q048R1223j2218j1452K9266P395
6323B57156L226j1811p4357k8786K1919L6128L2659R264Q278L6991l1924l0280
$$ y = [19203, 55380, 64518, 61223, 41334, 36404, 89440, 63433, 103071, 112753, 38149, 34839, 48650, 44604, 94610, 85358, 51591, 10280, 22967, 29566, 46154, 83846, 82577, 94817, 66841, 79538, 95270, 121635, 121367, 88773, 99768, 43345, 29901, 54357, 66401, 72246, 86697, 72799, 81019, 108653, 86847, 104892, 112490, 99834, 103355, 105197, 79907, 101974, 61047, 63429, 110163, 140918, 125979, 167083, 132870, 110170, 127916, 166949, 199388, 127922, 173346, 184144, 186552, 166247, 162440, 156690, 127744, 148750, 135813, 164582, 185809, 161759, 200960, 215057, 201759, 188922, 234389, 193486, 155160, 178105, 160990, 152942, 244165, 231947, 220495, 249761, 257156, 260382, 248571, 174214, 145428, 167347, 203475, 236134, 245398, 253676, 290667, 258743, 228463]
6311B28463O3060J732L6288k7255N0510R93j3529p111n743K2238J1848P7717M7089
6298D86300k6460L5294M4887J2907m9570K1465N0789m974J6000O6370K4641m5837
6286F31812J881K6815P1142L1935J2224j6747N1235K5636J7163J4539K0142l5043
6274H52734N5352K4148o71k1840j548Q1652k184j5399k147K9073n2627L5430L3793
6261A015766M8629m615Q265l0093j2350J6915k0266m1164K677q786j7793j2478
6249I44707n7304j1525j0293J7792L3250k1025J3018n6771M340L5964L7177n093
6237I24237l1451J91O993l189P474j0614n6473L6483Q417N2919N32L1959M1637
6224A009115L5777L4131n1654J5669O4316l4060M2390K8912M9020L0578j3327
$$ y = [228463, 291523, 293255, 329543, 302288, 352798, 353791, 340262, 333151, 327408, 349646, 361494, 439211, 486300, 459840, 495134, 540021, 552928, 503358, 524823, 575612, 570638, 586638, 653008, 677649, 631812, 633693, 660508, 731650, 763585, 775809, 759062, 810297, 835933, 853096, 867635, 887777, 852734, 908086, 932234, 931563, 909723, 908175, 989827, 987643, 972244, 970097, 999170, 946543, 981973, 1015766, 1064395, 1059780, 1068045, 1037952, 1025602, 1042517, 1022251, 981087, 983764, 974978, 957185, 944707, 887403, 875878, 865585, 883377, 916627, 895602, 908620, 851849, 856189, 892153, 929330, 924237, 892786, 892977, 899970, 896781, 904255, 893641, 837168, 873651, 882068, 934987, 935519, 967478, 1009115, 1044892, 1079023, 1027369, 1043038, 1107354, 1073294, 1115684, 1144596, 1193616, 1224194, 1210867]
6213A210867J0232J6816L6019K5731L2992J951J5368r900M1779J4312M221M4899
6201A445287n686L1135k1371l835M6437k2862n711p49p5832p446J2152l2644J95
6188A359070n1432R6l7466n2628q2080m2296j4969l0121m3666K7024m8979l7891
6176I44662j5350o9822j9222l2753m3919k4645n1212K129o296o0986j4832m442
6164F03312k7538m8233m8359n842k686j4877k4154K243j210j0839K6297J3445
6152D61559k3426j1097r367p7570N8624J8323k9358k7797j6140j2990K6754l9036
6140C18479M551J1329K3046K9302l6434J5947J7816l0712m4979j1569O6046l4679
6128C28143l298j0963L6418N0100m8558k965J7673M8811K4109k5307l3485j2069
$$ y = [1210867, 1221099, 1237915, 1273934, 1299665, 1332657, 1334608, 1349976, 1340076, 1381855, 1396167, 1400388, 1445287, 1439601, 1470736, 1449365, 1445530, 1491967, 1469105, 1463394, 1462645, 1386813, 1379367, 1391519, 1358875, 1359070, 1307638, 1307734, 1270268, 1217640, 1135560, 1093264, 1078295, 1048174, 1004508, 1031532, 982553, 944662, 929312, 859490, 840268, 807515, 763596, 738951, 687739, 689868, 683572, 622586, 607754, 603312, 575774, 527541, 479182, 473340, 470654, 455777, 431623, 433866, 432656, 421817, 448114, 461559, 438133, 427036, 417669, 340099, 398723, 417046, 387688, 359891, 343751, 330761, 357515, 318479, 323030, 334359, 357405, 386707, 350273, 366220, 384036, 353324, 308345, 296776, 362822, 328143, 324845, 313882, 350300, 400400, 351842, 348877, 366550, 415361, 439470, 414163, 380678, 368609]
6116C68609j6825j5495L2472J6063j7542K1469k4446N06K6073k5816M6420q471
6104D03017q359L9569p136J6414l0816j9538M0236L1621L719R905K1830k1331
6092D79131j8948L037M3431L4676L4884M1912l7474j969N5619J1130K3434N0577
6080G19440J8172N9995M282j2868L236l8895L3219K3673o818J4189J4916j3235
6068H19306n3815L3456P6650L904j499M0628l0375l2057O5384J2158k4760J4234
6056I23214k8470L6647J9429m3512K22K3748j7445l2510m689J4346r106k997r82
6043H77895k2784m3619j7189J1140j1725K5951N5508k2299k3761N770J6830O2742
6031I14459q049m6011K8819L2855O9069J8816l1519N5248K1061L3182O0581K1942
$$ y = [368609, 351784, 336289, 368761, 384824, 367282, 388751, 364305, 364811, 390884, 365068, 411488, 403017, 394658, 434227, 427091, 443505, 412689, 393151, 433387, 465008, 468727, 478632, 500462, 479131, 460183, 463220, 506651, 541327, 576211, 618123, 580649, 578680, 634299, 645429, 668863, 719440, 737612, 797607, 801889, 789021, 792257, 753362, 786581, 810254, 803436, 817625, 832541, 819306, 765491, 798947, 875597, 879501, 878002, 918630, 888255, 856198, 921582, 933740, 908980, 923214, 894744, 931391, 950820, 907308, 907530, 931278, 913833, 881323, 876634, 890980, 881874, 878877, 877895, 855111, 811492, 794303, 805443, 793718, 819669, 875177, 852878, 829117, 834887, 851717, 914459, 906410, 860399, 889218, 922073, 991142, 1009958, 978439, 1033687, 1054748, 1087930, 1148511, 1170453]
6019A170453j5011P233J8330J7620K8639j5034M4321O2708m385K515N6730m2644
6007A331475M4889J8549m6513L1320L0475O0818K597k1422J4608O329N2765j0382
5995A515508m1740J0206j7485K6992L9606k287J9277L6595m3602m7307J3826j305
5983A508284r685m582K5080N1684k9978j8976J2927L7742M5108m1357j4287M972
5971A566932l565k9431J9470K2260J7103q399n0804k1872L3279O1371l2740M4645
5959A618249j2345J0353m912l9769O52l1254J0171J5397j7761o990L2038j2223
5947A561606o5474j2282K3156l1903J5639J3357j3875l7732J3563O03j7178k2814
5935A426666P824K7292k5171J2756l02j7157M1340L508k298K2348p086j4179J2737
$$ y = [1170453, 1155442, 1162675, 1181005, 1198625, 1227264, 1212230, 1256551, 1319259, 1314874, 1317389, 1374119, 1331475, 1376364, 1394913, 1348400, 1379720, 1410195, 1471013, 1473610, 1452188, 1466796, 1473125, 1525890, 1515508, 1473768, 1483974, 1466489, 1493481, 1533087, 1530800, 1550077, 1586672, 1543070, 1495763, 1509589, 1508284, 1498599, 1494017, 1519097, 1570781, 1540803, 1521827, 1534754, 1572496, 1617604, 1576247, 1561960, 1566932, 1563367, 1533936, 1553406, 1575666, 1592769, 1584370, 1533566, 1511694, 1544973, 1606344, 1573604, 1618249, 1605904, 1616257, 1611345, 1571576, 1572228, 1540974, 1551145, 1566542, 1548781, 1541791, 1573829, 1561606, 1496132, 1483850, 1507006, 1475103, 1490742, 1504099, 1490224, 1452492, 1466055, 1466658, 1449480, 1426666, 1434490, 1461782, 1436611, 1449367, 1449065, 1431908, 1473248, 1476756, 1474458, 1496806, 1489720, 1475541, 1488278]
5922A488278k2052K2941K6710q52J5332N1578L405r35l906L9249o2171l6427L3852
5909A555002m3261M4247m3812j5287J9774L6394r964j7942j5981K9920K1017K3039
5897A583146L5153K0067K1466K345n768k9689N0334N8607M1108J4146j10231P7060
5885A757744O1322M849q991J4869l9636N0439L1623j936k0849J5515K100P486
5873A874535j4391l6221N6874n485J7399K046J2530P263k5310L1453K4346R59
5861A945998j5925J3254j4554K8900n865K2588L8562J1385M3248M3648O2309P3178
5849B246726K7811K7139K1849J4118L3755j1747K3143R94l2125n9342l0179m4074
5837B218068J4705m8750p4529n8218n2471p6666p0851p5365q1500m0135q1992
$$ y = [1488278, 1466226, 1489167, 1515877, 1515025, 1530357, 1581935, 1585340, 1584405, 1580499, 1619748, 1557577, 1521150, 1555002, 1511741, 1555988, 1512176, 1496889, 1516663, 1553057, 1543093, 1525151, 1509170, 1539090, 1560107, 1583146, 1618299, 1638366, 1659832, 1662177, 1656409, 1626720, 1677054, 1735661, 1776769, 1790915, 1680684, 1757744, 1819066, 1823915, 1814924, 1829793, 1790157, 1840596, 1872219, 1870283, 1849434, 1864949, 1867049, 1874535, 1860144, 1823923, 1880797, 1875312, 1892711, 1894757, 1907287, 1914550, 1889240, 1920693, 1945039, 1945998, 1930073, 1943327, 1928773, 1957673, 1951808, 1974396, 2012958, 2024343, 2067591, 2111239, 2173548, 2246726, 2274537, 2301676, 2323525, 2337643, 2371398, 2359651, 2382794, 2383788, 2351663, 2292321, 2262142, 2218068, 2232773, 2184023, 2109494, 2051276, 1998805, 1922139, 1851288, 1775923, 1694423, 1654288, 1572296]
5826A572296j14693k3623n8161l4667r1301l8320m301j9903j02388q3268j7122
5815I84549Q993k8118j5126k6157L0081l247l8082K8783j5597j0616r709Q996
5803I14750r482j9263q816l9126J4667k847L977l1160K9105N3423J9701J3112
5791I38041L1922K0638L8905j9242j932P959M884l1887l7685j7418k0649k3313
5779H90223o8372n8052o395m1195l3334k0058l3443m842m6934j335k0158K8535
5767E84640k2752m0170k5563k6836j8927P7610j8570J9716r390o5143Q488L4026
5755D97129q548m181j7327K4253J9538m586P628L749L6540L491l8371l3409j3666
5742D72240K769J7171j3138p2347N031K7o633k5661K7266n026k8291k1075m5748
$$ y = [1572296, 1457603, 1433980, 1375819, 1341152, 1249851, 1211531, 1207230, 1187327, 1084939, 1001671, 984549, 993542, 965424, 950298, 924141, 954222, 950975, 912893, 941676, 926079, 915463, 905754, 914750, 905268, 886005, 877189, 838063, 852730, 849883, 853860, 822700, 851805, 905228, 924929, 938041, 969963, 990601, 1029506, 1010264, 1008332, 1016291, 1021175, 989288, 951603, 934185, 913536, 890223, 821851, 763799, 757404, 716209, 682875, 662817, 629374, 624532, 577598, 576263, 556105, 584640, 561888, 521718, 496155, 469319, 450392, 528002, 509432, 529148, 519758, 454615, 463103, 497129, 488581, 484400, 467073, 491326, 510864, 506278, 513906, 517655, 554195, 557686, 519315, 485906, 472240, 475009, 492180, 479042, 406695, 411726, 411753, 405120, 379459, 406725, 401699, 373408, 352333, 306585]
5729C06585j2263J756J4055P604J3545j0524n6957k8486k004M1459M38n0800k768
5716B21640j3625K6818m938L774J7558j4262m9713J0168M1520O066k6189k877
5704B15940M9819j6114j5694L2441q185k4770J1391l1200m4584L2053R811M6605
5692B57513k1788m3371m0062j0148l8436O5632N5836j7164K3537k656l3965k7545
5680A67383L7841K2350j5952k3838J836K4543R587p448p709j3239O287L1038N1045
5667B83724j3040l8343K3712j6164j0096n226l3440K1847k7697N4676k8895j1183
5655A99875m747n252L6586r439K0069K4628l2932j6112J961j3649K2007J8403
5643B41398l8553O010j3907N953n283M0149L3556l0467J7698k017J4167L0174
$$ y = [306585, 294322, 296078, 310133, 317737, 331282, 320758, 263801, 235315, 233311, 274770, 275208, 224408, 221640, 208015, 234833, 229895, 233669, 251227, 236965, 187252, 197420, 238940, 245006, 218817, 215940, 265759, 249645, 233951, 266392, 258207, 233437, 244828, 213628, 169044, 201097, 210908, 257513, 235725, 192354, 152292, 142144, 103708, 169340, 225176, 208012, 231549, 228893, 194928, 167383, 205224, 227574, 211622, 187784, 189620, 214163, 223750, 216302, 208593, 195354, 201641, 232679, 283724, 270684, 232341, 256053, 239889, 229793, 224567, 191127, 212974, 185277, 239953, 211058, 199875, 195128, 189876, 226462, 217023, 237092, 261720, 228788, 212676, 214637, 200988, 222995, 241398, 202845, 208855, 194948, 200901, 195618, 235767, 269323, 238856, 256554, 254537, 268704, 298878]
5631B98878l9719o7921k0904m1054L2279K0321P106j2215J3196k143l425Q836
5619A93235j6338L3664O821k5784N7665k0960j588K5451J5029J0957l3830j3131
5607B31191N411K788J0125l2215L592L803J8752R5462N021l0677J0355K1007j5985
5594C28630M516o208j6822j5903K4510Q361l0264q064M811J2257J6060l5300k0849
5581B65735k2115M6227k7157J5611K4738J4925m880L5089J2856m8514j4053K5569
5569C24031K6034j5785j3979L6009K3591P2512M8629o9803K2139Q107k0946j0301
5557D30238N8972J8258J1289N645L4180M753N3915P399j1932P318j121j9277N0300
5544F49937r733l5866J0206J0179O1907O3146m0281k2323J7420M5086j932R4L160
$$ y = [298878, 259159, 191238, 170334, 129280, 161559, 181880, 188986, 176771, 189967, 187824, 184399, 193235, 176897, 210561, 217382, 191598, 249263, 228303, 226715, 252166, 267195, 278152, 244322, 231191, 236602, 239390, 249515, 217300, 220892, 224695, 243447, 338909, 343930, 313253, 323608, 344615, 328630, 333146, 326938, 310116, 294213, 318723, 327084, 296820, 288756, 293567, 305824, 321884, 286584, 265735, 243620, 289847, 262690, 278301, 303039, 317964, 313084, 348173, 361029, 312515, 298462, 324031, 350065, 334280, 320301, 356310, 379901, 452413, 501042, 431239, 453378, 461485, 440539, 430238, 489210, 507468, 518757, 524402, 558582, 563335, 617250, 624649, 612717, 620035, 618914, 599637, 649937, 640204, 604338, 614544, 624723, 686630, 749776, 709495, 687172, 704592, 749678, 747746, 747840, 751000]
5531G51000K3940j094M4584p894q969N7564L9714l2737L925n698K0261K2874p884
5518H99586L6842N311M5088j1023K119O2064K3298j3246J3613P3526K4197o6573
5506A094802P73J8632M2292J7183K2003M0297j6931l1702L6977L69K5764l0303
5494A220156K6418L7960j3485K3250J9047J9181K2267R324O3338J4079m412M698
5482A441821L7588o6340M7504O8525l9431R168j0083L4146j0465J9442k1447J0292
5470A520720L2914L9965K4201J915K7294L5675j3360m486j1269J940k0729O0371
5458A695151K3l3410M527k834m908k6022K711N894P846o2643K4523k2305j8469
5445A570084j4406L3968Q505j9998N17o323n5896k1196j524J9174K0722j5818
$$ y = [751000, 774940, 773846, 818430, 810536, 801567, 859131, 898845, 866108, 870033, 864335, 884596, 907470, 899586, 936428, 941739, 986827, 975804, 977923, 1039987, 1063285, 1050039, 1063652, 1137178, 1161375, 1094802, 1095575, 1114207, 1156499, 1173682, 1195685, 1235982, 1219051, 1187349, 1224326, 1224695, 1250459, 1220156, 1246574, 1284534, 1271049, 1294299, 1313346, 1332527, 1354794, 1364118, 1427456, 1441535, 1437123, 1441821, 1479409, 1413069, 1460573, 1529098, 1489667, 1498835, 1488752, 1522898, 1512433, 1531875, 1510428, 1520720, 1553634, 1593599, 1617800, 1619715, 1647009, 1682684, 1669324, 1664838, 1653569, 1655509, 1634780, 1695151, 1695174, 1661764, 1666291, 1663457, 1658549, 1632527, 1635238, 1641132, 1648978, 1586335, 1610858, 1588553, 1570084, 1555678, 1589646, 1598151, 1578153, 1578670, 1572347, 1516451, 1495255, 1493731, 1512905, 1533627, 1517809]
5433A517809o8458M0328K9463R77j6550L2121j9979l3540O8480j858K603l6762
5421A514634k1762M7538m766j0712J5902L5241m2535j7620J9065J8770M2738k52
5409A596241l44K3514k4248L01k3233o3042j0731K4761J3564k6530m2847N2168
5397A519574j6481J2969m7144k6594m0063n4715k2447q970l8931r0806m6698P483
5385A147177R3179n0637N0404j401K4992N4280O7135K4881K8826J3455r371O394
5373A449314L0351m4998L4349L604j0668p7997K1672m791r899M223J01528j3513
5361A483175K9414J22018N187J43070N5765O9745M2780J05531J11724L0991L0435
5350B229835R0640j612p141L7492N2528M8786q45m7218m5753N2403M8950N8065
$$ y = [1517809, 1449351, 1489679, 1519142, 1520119, 1503569, 1535690, 1515711, 1482171, 1550651, 1548793, 1551396, 1514634, 1492872, 1540410, 1535644, 1524932, 1540834, 1576075, 1533540, 1515920, 1534985, 1553755, 1596493, 1596241, 1595897, 1619411, 1595163, 1595464, 1572231, 1509189, 1498458, 1523219, 1536783, 1510253, 1467406, 1519574, 1503093, 1516062, 1468918, 1442324, 1402261, 1347546, 1325099, 1316129, 1277198, 1186392, 1139694, 1147177, 1240356, 1189719, 1240123, 1238722, 1263714, 1317994, 1385129, 1410010, 1438836, 1452291, 1442920, 1449314, 1479665, 1434667, 1469016, 1472620, 1461952, 1383955, 1405627, 1400836, 1390937, 1395160, 1496688, 1483175, 1512589, 1634607, 1639794, 1782864, 1838629, 1908374, 1951154, 2056685, 2168409, 2199400, 2229835, 2320475, 2318863, 2311722, 2349214, 2401742, 2450528, 2449683, 2402465, 2356712, 2409115, 2458065, 2516130]
5338B516130J5919P8339P2124K9675K5744N6437Q4006R2847R2910Q0341P9462
5327C223934Q5073P4618J19085Q8697O5916N7669M0512M0540M1565m700n7772
5316C775137J7793K296k2143J4473N6857J6632R9340O8978R5671J07613J22347
5305D354994K00877J80838J30415Q5920J85885J72905J37305J40231J10409J58605
5295E858384J58407J43292R1231R8641J67365Q7153J48532J60403J27006J88936
5285G229350J59912K40401J66227J90282K49170J59711K03842K03961K12970K28261
5275I244087K47132K26119J58146K04236K75450K35213K80065K88031L21393L22286
5265A1802158L61783L95339M10664M11912M46477N18057N56316O05953O03419
$$ y = [2516130, 2532049, 2610388, 2682512, 2712187, 2737931, 2794368, 2878374, 2971221, 3064131, 3144472, 3223934, 3309007, 3383625, 3502710, 3591407, 3657323, 3714992, 3755504, 3796044, 3837609, 3832909, 3775137, 3792930, 3795226, 3773083, 3787556, 3844413, 3861045, 3960385, 4029363, 4125034, 4232647, 4354994, 4555871, 4736709, 4867124, 4953044, 5138929, 5311834, 5449139, 5589370, 5699779, 5858384, 6016791, 6160083, 6251314, 6349955, 6517320, 6604473, 6753005, 6913408, 7040414, 7229350, 7389262, 7629663, 7795890, 7986172, 8235342, 8395053, 8598895, 8802856, 9015826, 9244087, 9491219, 9717338, 9875484, 10079720, 10355170, 10590383, 10870448, 11158479, 11479872, 11802158, 12163941, 12559280, 12969944, 13381856, 13828333, 14346390, 14902706, 15508659, 16112078]
5256A6112078O77871P16698P59010Q38112Q87383R51224J061018J112550J146520
5247B4262464J204927J201358J225152J302654J336326J383575J425655J692455
5239C5034566J751884J819058J951974K062245K283904K478165K786909L138973
5231E3307678L526839M015624M695207N519528O532880P854030R343299J1290456
5223A06085541J3751411J6663921K0230524K4085130K7805365K9986339K8524571
5216B67132802K1562801Q978163n889767j8595779k6458098k9153462k7962464
5209A89614196k4919415k1298275j7825284j4869113j2366747j0246868q632526
5202G9455968p301769o243980n414993m751577m109696l686660l258848k895969
$$ y = [16112078, 16789949, 17506647, 18265657, 19103769, 19991152, 20942376, 22003394, 23115944, 24262464, 25467391, 26668749, 27893901, 29196555, 30532881, 31916456, 33342111, 35034566, 36786450, 38605508, 40557482, 42619727, 44903631, 47381796, 50168705, 53307678, 56834517, 60850141, 65545348, 71064876, 77597756, 85451786, 94795085, 106085541, 119836952, 136500873, 156731397, 180816527, 208621892, 238608231, 267132802, 288695603, 297673766, 291783999, 273188220, 246730122, 217576660, 189614196, 164694781, 143396506, 125571222, 110702109, 98335362, 88088494, 79455968, 72154199, 65910219, 60495226, 55743649, 51633953, 47947293, 44688445, 41792476]
5194D1792476k530491k294977k043384j838173j692795j556577j461823j415676
5186B6958580j341759j240139j186210j077865r16142q67273p76517o91556o96205
5177A8164914o22041o24803n53942n60866n57276n10835m44347m54539m64874
5168A3371391l93951l25539l82799m20839l64386m21288l72368m24167l55983
5159I910071l27055l51928l01954l10971k63430k25819k14465j94217k63158k14061
5149G243013j73997k25483j90023k16311j05098j38454j72183j35487j46013j88630
5139E551334j38324k02939j38179j75207j63328j13740j19935j78880j02477p0170
5129D148155n1192o5336m1128j6064m6073q1887m4777l1589k7320k3864r8839
$$ y = [41792476, 39261985, 36967008, 34923624, 33085451, 31392656, 29836079, 28374256, 26958580, 25616821, 24376682, 23190472, 22112607, 21196465, 20329192, 19552675, 18861119, 18164914, 17542873, 16918070, 16364128, 15803262, 15245986, 14735151, 14290804, 13836265, 13371391, 12977440, 12651901, 12269102, 11848263, 11483877, 11062589, 10690221, 10266054, 9910071, 9583016, 9231088, 8929134, 8618163, 8354733, 8128914, 7914449, 7720232, 7457074, 7243013, 7069016, 6843533, 6653510, 6437199, 6332101, 6193647, 6021464, 5885977, 5739964, 5551334, 5413010, 5210071, 5071892, 4896685, 4733357, 4619617, 4499682, 4320802, 4218325, 4148155, 4096963, 4031627, 3990499, 3974435, 3928362, 3846475, 3801698, 3770109, 3742789, 3718925, 3620086]
5118C620086j59215j03458o5263j37056j43657j07954j81288q7789m7139p9722
5108B507545j12014k6045L130l3335J8591J869N990J9580k6782N1154J367k651
5096B408399J5995L0713N7202K3598n4376l566l8080k9060o3036l9640l3310p4016
5084B200823q777Q87l912m1192k5812k252M5357L4256M7375O2882N5581j885N4366
5071B417697O3809J7210J2785M4506O4721K6536N7934j2773j5794n5422L7384
5060B658593K8039l4722K7890K1667j3928n1743L3859r827K9316l1642J01150
5049B758652Q7974O0259K105K6599Q2395P1481k8456k915o239l6639o8009k6603
5037B920604k9445k6298j9690K7700q675m3598l8663J3135m045J4965K0870K607
$$ y = [3620086, 3460871, 3357413, 3292150, 3155094, 3011437, 2903483, 2722195, 2634406, 2587267, 2507545, 2395531, 2369486, 2372616, 2339281, 2357872, 2359741, 2365731, 2385311, 2358529, 2409683, 2411050, 2408399, 2424394, 2455107, 2512309, 2535907, 2481531, 2477965, 2439885, 2410825, 2347789, 2308149, 2274839, 2200823, 2192046, 2192933, 2189021, 2147829, 2122017, 2119765, 2165122, 2199378, 2246753, 2309635, 2365216, 2363331, 2417697, 2481506, 2498716, 2511501, 2556007, 2620728, 2647264, 2705198, 2692425, 2676631, 2621209, 2658593, 2686632, 2651910, 2679800, 2701467, 2687539, 2635796, 2669655, 2659828, 2689144, 2657502, 2758652, 2846626, 2906885, 2908990, 2935589, 3017984, 3089465, 3061009, 3058094, 3051855, 3015216, 2947207, 2920604, 2891159, 2864861, 2845171, 2872871, 2864196, 2820598, 2781935, 2795070, 2791025, 2805990, 2826860, 2829467]
5025B829467q024M416J255K9312l921M1815J2554M9351Q834J0087J8757k0195
5013B973708k5161J2535N3770J3650m7371k4947K9868j5147J6780L508l1846n9520
5001B899827L5567N2634n004n9883m4214j6733k1554o1773l4855n720M401q307
4989B734386n6594k3722J5447P318K9396J453l6994j1967J0501k7419j6787m7001
4977B578017l4541J4340R691k9719m3279o2906l0184k1226J971j6657m159K5406
4965B386754o9089J0885m4520n6842O896j1457m2355p8025j2050n4057n5532m7682
4953A932926k3167j195n0196o0508j8756j173J3199n2582j3337j5893k5225l7606
4941A646487j3682k3448k333p702l3018K342j1056p0234K1304L3603n1476m2735
$$ y = [2829467, 2821443, 2825859, 2827114, 2856426, 2852505, 2894320, 2906874, 2956225, 2965059, 2975146, 2993903, 2973708, 2948547, 2961082, 3014852, 3028502, 2981131, 2956184, 2986052, 2970905, 2987685, 2991193, 2959347, 2899827, 2935394, 2988028, 2983024, 2923141, 2878927, 2862194, 2840640, 2778867, 2744012, 2738292, 2742693, 2734386, 2677792, 2654070, 2669517, 2676835, 2706231, 2707684, 2670690, 2658723, 2669224, 2641805, 2625018, 2578017, 2543476, 2557816, 2567507, 2537788, 2494509, 2431603, 2401419, 2380193, 2382164, 2365507, 2361348, 2386754, 2317665, 2328550, 2284030, 2227188, 2234084, 2222627, 2180272, 2102247, 2090197, 2036140, 1980608, 1932926, 1909759, 1908564, 1858368, 1797860, 1779104, 1777931, 1791130, 1738548, 1725211, 1709318, 1684093, 1646487, 1632805, 1609357, 1607024, 1599322, 1566304, 1568646, 1557590, 1487356, 1508660, 1542263, 1490787, 1448052]
4929A448052m347M281K1827k7497m8097L1507M2255j754k1491M589L8189o2915
4917A424599K7594J646n8148j7240K6907M348N580P960J1675r603n6735l5294
4905A333289L2410j2456q164k0734j3239Q3902p560J0030N181m3688j7818k2999
4893A318154k5054K0291k5440j287l4095N287L6442K9739l2352o3858j7265K6122
4881A236684J7061l3174k7847k4504l9302j5476o632j2084K0779j1547j3231m5213
4869A045514J782K2654m565j0604K1512L0083o8532m2243l3534M6330N860l8420
4857I75837k2631p967j2578k9097r217m092J0523L1235K8290n4m387J4542n8239
4844I12165M9485K503o9849P292j6326J8530O6547k4435p0635O9446M7591K5723
$$ y = [1448052, 1443705, 1447986, 1469813, 1442316, 1394219, 1425726, 1467981, 1466227, 1444736, 1449325, 1487514, 1424599, 1452193, 1453839, 1395691, 1378451, 1405358, 1409706, 1415286, 1423246, 1434921, 1425318, 1368583, 1333289, 1365699, 1353243, 1345079, 1324345, 1311106, 1395008, 1387448, 1397478, 1402659, 1358971, 1341153, 1318154, 1293100, 1313391, 1287951, 1286664, 1252569, 1257856, 1294298, 1324037, 1291685, 1227827, 1210562, 1236684, 1253745, 1220571, 1192724, 1168220, 1128918, 1113442, 1106810, 1094726, 1115505, 1103958, 1090727, 1045514, 1047296, 1069950, 1065385, 1054781, 1076293, 1106376, 1037844, 995601, 962067, 1008397, 1014257, 975837, 953206, 945239, 932661, 903564, 894347, 890255, 900778, 932013, 960303, 960249, 955862, 970404, 912165, 961650, 964153, 894304, 901596, 885270, 903800, 970347, 945912, 875277, 944723, 992314, 1018037]
4832A018037k3097J7016K4644J8302O5796p461m5876K0113J4006L4493N1099O343
4820A193415N9272j7798K4952L1885N8742Q566K0828L7992K2416N6946k7020N8123
4808A528319m466N2275M6561R3552P5287N2546L2997L7052R6763p455L8706O1493
4796B103630L9226P0824O1106J20546J04838J01896J17172J00266J00629J21224
4786C041357R4970J29718J70427J76098K37250K15453J76998J67156K45266K37440
4776D892133L02345L16204L06277K24947K70732L35008L22962L25401K83491K75835
4766G855335K58048J39854K11329Q0752L6604K3159j3505j6367m428p711q4345
4755H478725q6284k2104m6179m5971j12126r3052j32847j79189j89288j92757
$$ y = [1018037, 994940, 1011956, 1036600, 1054902, 1120698, 1113237, 1067361, 1087474, 1101480, 1135973, 1187072, 1193415, 1252687, 1234889, 1259841, 1291726, 1350468, 1359034, 1379862, 1417854, 1440270, 1497216, 1470196, 1528319, 1523853, 1576128, 1622689, 1716241, 1791528, 1844074, 1877071, 1914123, 2010886, 2003431, 2042137, 2103630, 2142856, 2213680, 2274786, 2395332, 2500170, 2602066, 2719238, 2819504, 2920133, 3041357, 3136327, 3266045, 3436472, 3612570, 3849820, 4065273, 4242271, 4409427, 4654693, 4892133, 5194478, 5510682, 5816959, 6041906, 6312638, 6647646, 6970608, 7296009, 7579500, 7855335, 8113383, 8253237, 8464566, 8545318, 8581922, 8605081, 8591576, 8575209, 8570781, 8563070, 8478725, 8392441, 8370337, 8324158, 8278187, 8166061, 8073009, 7940162, 7760973, 7571685, 7378928]
4745G378928k36644k68712k92422l86225k84277k50498l04675l35710k98038k61824
4735D459903k55412k25105k65253k05599j03515j28111j81025k05024p7475o4861
4725B748523q6571j49822l4183n1519j21465p9645p8657k5514n3088p8041n0110
4714A939908j02535o1887K9282k9484p8384l8510k3035K4717p7378l9573n0030
4703A493091o7711m9j4338o4385Q023O403m5967K606n2235j7503r757j7893l9186
4690A181099n5501L829r014m120j7765J4327l9915k1099j2932k4548l5057k1322
4678I57982k2031j4459j8759k736j1598k2678m662O603l6859k0734k3609Q38m3692
4665G43606k2094J3583k5531k2575k7398j6551j8709m7191L2589K699j631M911
$$ y = [7378928, 7142284, 6873572, 6581150, 6194925, 5910648, 5660150, 5355475, 5019765, 4721727, 4459903, 4204491, 3979386, 3714133, 3508534, 3405019, 3276908, 3095883, 2890859, 2813384, 2748523, 2661952, 2512130, 2477947, 2426428, 2304963, 2225318, 2146661, 2121147, 2068059, 1990018, 1939908, 1837373, 1775486, 1804768, 1775284, 1696900, 1658390, 1635355, 1660072, 1582694, 1543121, 1493091, 1425380, 1425331, 1410993, 1346608, 1354631, 1361034, 1315067, 1317673, 1265438, 1247935, 1238178, 1220285, 1181099, 1125598, 1129427, 1120413, 1116293, 1098528, 1112855, 1072940, 1051841, 1038909, 1014361, 979304, 957982, 935951, 921492, 902733, 899997, 888399, 865721, 861059, 867662, 830803, 810069, 786460, 787298, 743606, 721512, 735095, 709564, 686989, 659591, 643040, 624331, 577140, 609729, 612428, 610797, 615708]
4653F15708j9688j6010r537N450k9493j6397k973J4665m1198M6499q3936P155
4641D70245j4426J704J3863j1452M034J8709m7859K188K1292J7558k7482m2083
4629D06291M462k6433J3035r977j4932P085J5942n5982k1334j9333J0130M101
4617C13055q923N145J9581j1367K3682P237j0318J9717j2823o902L64m2708J6255
4604C11995k9880j9604M0646K1769n7744K4325M4011k0912m8415N1782l4392o4829
4592B18752L4846J2011N5161k4216o254J9837k1857l6081K7395j7786K6492q46
4580B87454L8247j234k2395J1824j0470l1545J9678K7402j5793j1503j9628p691
4568B64346l643j2264K5126O204j2917M5293n9291m4065j9109K4585j2299j9239
$$ y = [615708, 596020, 580010, 570473, 575923, 546430, 530033, 527060, 541725, 500527, 547026, 463090, 470245, 455819, 457523, 471386, 459934, 463968, 482677, 434818, 437006, 458298, 475856, 448374, 406291, 410753, 384320, 397355, 387378, 372446, 379531, 395473, 339491, 318157, 298824, 308954, 313055, 304132, 309277, 328858, 317491, 341173, 348410, 338092, 357809, 344986, 338084, 338448, 295740, 311995, 282115, 262511, 303157, 324926, 267182, 291507, 335518, 314606, 266191, 317973, 283581, 218752, 253598, 265609, 320770, 296554, 290300, 310137, 288280, 252199, 279594, 261808, 288300, 287454, 325701, 324467, 302072, 313896, 303426, 271881, 291559, 318961, 303168, 291665, 272037, 264346, 260703, 248439, 273565, 279769, 266852, 312145, 252854, 208789, 189680, 214265, 201966, 182727]
4556A82727j0846R250J6166m965j5739q51k174P902M1053l4586N089o468J9325
4543B05883J2912j8377l7418K4510J9760R37k8690P873L6866j6965n0439k6788
4531A30064K8914n194l203M1238k1942m3582J0410j6427q683N5377O594j7174
4519A56392k6940L0547L8364K2174L6k2613n140K068m0233J1650j4047l8706K9064
4506A42616P0809j6237l3816J6922NJ6332K0272n751j8790N009L639j1273N896
4493A95633L015k9472M018Q182L0956K1033K8013k5236m3852K1580N871j1357
4481B08384R135L1078K600n1869L190m73k526N9271k2430L7578l4663k0722J3251
4468B31804r426J4538L2299l1608J4794O0079l5541J266J3369O4951k9965l4652
$$ y = [182727, 171881, 181131, 197297, 192332, 176593, 175742, 173568, 181470, 222523, 187937, 193026, 186558, 205883, 218795, 200418, 163000, 187510, 207270, 208207, 179517, 187390, 224256, 207291, 156852, 130064, 158978, 153784, 150581, 191819, 169877, 126295, 136705, 120278, 111595, 166972, 173566, 156392, 129452, 159999, 198363, 220537, 220573, 197960, 192820, 194888, 154655, 166305, 152258, 113552, 142616, 213425, 197188, 163372, 180294, 180299, 196631, 216903, 211152, 192362, 197371, 201010, 189737, 195633, 198648, 169176, 173194, 181376, 212332, 233365, 261378, 236142, 192290, 213870, 219741, 208384, 217519, 248597, 251197, 199328, 202518, 202045, 199519, 258790, 236360, 273938, 239275, 218553, 231804, 222378, 236916, 269215, 237607, 252401, 312480, 276939, 278205, 291574, 356525, 326560, 291908]
4456B91908J727j9295k4638j0976J8917J3919k1165N1291M84K2454k8495M1676
4444C37807K5579o187K2422N5232l8315j9956N8572O454k1100j5038K9154K206
4432D36830K2030j2612k8080n922k6771P2763N6353k407k2523L0562r736J8081
4420E28568P0214J8058K044J857j0802M6941P0396O847l7674L261K8510N2239
4408G80459N8925K4892Q4971M7317P1809L2743M9172P6255Q4529R4763r666L1975
4396A428144P8022N7524J8995K0808R3981J24171J41104J74270J37131K41098
4386B515248K37172L67427M12773M25221N07638M18451L15737J85645K32279L31395
4376E948986M75423O45691P66866O13363L34398Q4640q088J3943J62326M91904
$$ y = [291908, 293635, 274340, 249702, 238726, 257643, 271562, 250397, 301688, 302172, 324626, 296131, 337807, 363386, 357199, 379621, 434853, 396538, 376582, 435154, 441608, 420508, 405470, 434624, 436830, 458860, 446248, 418168, 412246, 385475, 458238, 514591, 512184, 489661, 520223, 510487, 528568, 598782, 616840, 618884, 620741, 609939, 656880, 727276, 734123, 696449, 699710, 728220, 780459, 839384, 864276, 949247, 996564, 1068373, 1101116, 1150288, 1226543, 1311072, 1405835, 1396169, 1428144, 1506166, 1563690, 1582685, 1603493, 1697474, 1821645, 1962749, 2137019, 2274150, 2515248, 2752420, 3119847, 3532620, 3957841, 4465479, 4883930, 5199667, 5385312, 5617591, 5948986, 6424409, 7070100, 7836966, 8450329, 8784727, 8869367, 8861279, 8875222, 9037548, 9529452]
4366I529452O51782N80116K55354k23312n05917o49018n19434k77078o2211Q7975
4356H867709j3639k72745n94988o82644o47080n51949l64903k54070j95407k71442
4346E018842l85974m31263m45082m07513l64271l24907k57080j83015j82837j85011
4336A851889j10397j64122q7382j46038r7241n3788r5424n0017K2782j4890j06964
4325I48408r0393J2455k0524k925l0296j358m5028o1724J883j2597K897m3686
4313F57112l888l9252j6585k0493m0585O371k2463k7949l2003J3425q669K324
4301D67345p20j4460l909J3517m2670o06J794o3364m583N1746K051p829J3706
4288D12018K6046l8929m2994l6162J4177j350l1339J7733M5594K1504N702l1536
$$ y = [9529452, 10181234, 10761350, 11016704, 10793392, 10287475, 9638457, 9119023, 8841945, 8779734, 8867709, 8854070, 8581325, 7986337, 7303693, 6656613, 6104664, 5739761, 5485691, 5290284, 5018842, 4632868, 4201605, 3756523, 3349010, 2984739, 2659832, 2402752, 2219737, 2036900, 1851889, 1741492, 1577370, 1489988, 1343950, 1246709, 1192921, 1097497, 1047480, 1070262, 1055372, 948408, 858015, 870470, 849946, 847021, 816725, 815367, 770339, 708615, 710498, 697901, 700798, 657112, 653224, 613972, 597387, 576894, 536309, 542680, 520217, 492268, 460265, 473690, 465021, 467345, 466625, 452165, 448256, 461773, 419103, 418497, 420291, 356927, 352344, 404090, 406141, 398312, 412018, 438064, 399135, 356141, 319979, 334156, 332806, 301467, 319200, 364794, 386298, 392000, 360464]
4276C60464P0155K8030p985Q9993L0343J14495J00436P1446J9725l6244l0752
4265H10106q7250q8196j24425q0239K1300l6966m1985l1388L857n3402l3923M033
4253B61522J7742m0887M049r740m0327P566Q959k4181m24M7775J782k0997k0571
4240A92268M0250k1330J5502L8415k838R526m0611l824l8723K6321K6106m4633
4228A96429K8256J6798p989J2212J8879K0106m0382Q140k5915k589R037r000K159
4215B26141m335j7708N7516K9547J7381K4798j2673l0099k6009K3470J3690j306
4203C00413m9993k5799M1431L3317K0843k0035l703k1784q240M5268j5380N5519
4191C51857k4059o459L4763k0053n488k9061j4353L4572J731Q432J01649L7514
$$ y = [360464, 430619, 458649, 450664, 540657, 571000, 685495, 785931, 857377, 877102, 840858, 810106, 722856, 634660, 510235, 429996, 451296, 414330, 372345, 340957, 344814, 291412, 257489, 261522, 279264, 238377, 242426, 232686, 192359, 199925, 208884, 184703, 184279, 232054, 233836, 212839, 192268, 232518, 211188, 226690, 265105, 262267, 271793, 231182, 227358, 188635, 214956, 241062, 196429, 224685, 241483, 233494, 245706, 264585, 284691, 244309, 252449, 226534, 223945, 232982, 223982, 226141, 221806, 204098, 261614, 291161, 308542, 333340, 320667, 290568, 264559, 288029, 301719, 300413, 250420, 224621, 266052, 299369, 320212, 300177, 296474, 274690, 266450, 311718, 296338, 351857, 327798, 321339, 356102, 336049, 330561, 301500, 287147, 321719, 323450, 331882, 433531, 471045]
4179D71045K8827j6353O6095K4736R0710M115k0039l1228K709k2836l9536m4597
4167E13648m2078k7219j2871J3823j8347p2587M3296K9806k7477l8951O759p8194
4155B89608m9471l9125n701K4700J9390N5200l218K4984L7119L3165j3975j2628
4143C60048J6799J0547o821k5910j8921L2667J9363L1786j8692J6273q915o547
4131D01677j3145j5642O9144J8595L6645L7114L41N8001R807K5398Q0407J19221
4119H27563K3081K0749k261J3643j9399J9533N2562l75O180M2713m890J5237P9610
4106A073946K5573k8245M6373R3078N8820O1847K6266P1442N6894M6126J01095
4095A633215Q7682R7266P3458O8003J28152J67382J8132N5996K0099O150n7305
$$ y = [471045, 499872, 483519, 549614, 574350, 665060, 669175, 649136, 617908, 620617, 597781, 558245, 513648, 471570, 444351, 431480, 445303, 426956, 354369, 397665, 427471, 399994, 361043, 367802, 289608, 240137, 201012, 195311, 220011, 239401, 294601, 291383, 316367, 353486, 386651, 372676, 360048, 376847, 387394, 380573, 354663, 335742, 368409, 387772, 419558, 400866, 417139, 408224, 401677, 388532, 372890, 442034, 460629, 497274, 534388, 534729, 592730, 602537, 627935, 708342, 827563, 850644, 871393, 869132, 882775, 863376, 882909, 935471, 935096, 941276, 983989, 979099, 994336, 1073946, 1099519, 1071274, 1117647, 1210725, 1269545, 1331392, 1357658, 1429100, 1485994, 1532120, 1633215, 1720897, 1818163, 1891621, 1959624, 2087776, 2255158, 2273290, 2329286, 2349385, 2355535, 2298230]
4084B298230j0108p7834J7674p1570L6885Q8232J7347N7375M1846R878Q4706J4107
4072B506768M6038P444N1118J09663R4751j011K5416j4392k6142P671K4434j2706
4060B819052J9670o0173n8201k072M4001j0934P874l1069N2777p6760M5130k9531
4048B719764m9293J3223K8955j0365K0700r31K4914o18l0881N2110L0146k6872
4036B770852l5683L7985M9709L9796O2286O4941O8758J00577N5897O5170Q9831
4025C370119J32700J02496J75131J19238J41432K07690K45444J92062K80641L90371
4015E357324L99105L91357M02996L14725K92611J89316J96540K57144L60509K89760
4005H451387L58698L43172L77766M63323M86134M23321N57809O03739Q83051J015140
$$ y = [2298230, 2288122, 2210288, 2227962, 2156392, 2193277, 2281509, 2298856, 2356231, 2398077, 2407955, 2492661, 2506768, 2552806, 2560250, 2611368, 2721031, 2815782, 2814771, 2840187, 2825795, 2799653, 2807324, 2831758, 2819052, 2838722, 2778549, 2720348, 2718276, 2762277, 2751343, 2759217, 2728148, 2780925, 2704165, 2749295, 2719764, 2670471, 2683694, 2712649, 2702284, 2722984, 2722053, 2746967, 2746349, 2715468, 2767578, 2797724, 2770852, 2735169, 2773154, 2822863, 2862659, 2924945, 2989886, 3058644, 3159221, 3215118, 3280288, 3370119, 3502819, 3605315, 3780446, 3899684, 4041116, 4248806, 4494250, 4686312, 4966953, 5357324, 5756429, 6147786, 6550782, 6865507, 7158118, 7347434, 7543974, 7801118, 8161627, 8451387, 8810085, 9153257, 9531023, 9994346, 10480480, 10903801, 11461610, 12065349, 12948400, 13963540]
3995A3963540J126875J099365J449024J732949K427733K959869M148704N615128
3987C4523187Q646252J2233685J8962521L0058856L5716986J1852314j1387755
3980A40606046k4832233l0557516k1395889j4374196r611067p251960n036160
3973B7547025l910603k716872k208444j552264j376110j133719j174116j078029
3965A2396868j130307q22189p90957n55688n62549m33166m56498k84354l09009
3956G052151k25315l25884k81110m64346l72936l67455j80073j52963j15653j19610
3946D446806r8577j28766o2519j81277j24525j19930p8772k19129j01634j46469
3936C185208q2961j20305k9950q5587o5744j48770j23926j20137q9481j22793
$$ y = [13963540, 15090415, 16189780, 17638804, 19371753, 21799486, 24759355, 28908059, 34523187, 43169439, 55403124, 74365645, 104424501, 140141487, 151993801, 140606046, 115773813, 85216297, 63820408, 49446212, 39835145, 32583185, 27547025, 23636422, 20919550, 18711106, 17158842, 15782732, 14649013, 13474897, 12396868, 11266561, 10444372, 9653415, 9097727, 8535178, 8102012, 7645514, 7361160, 7052151, 6826836, 6500952, 6219842, 5755496, 5382560, 5015105, 4835032, 4682069, 4566416, 4446806, 4348229, 4219463, 4156944, 3975667, 3851142, 3731212, 3652440, 3433311, 3331677, 3185208, 3102247, 2981942, 2951992, 2866405, 2800661, 2651891, 2527965, 2407828, 2318347, 2195554]
3926B195554j15544r7340k8755k8637p7670o8153l5501n5602o4654o0614j9378
3915A543706K8671o7281k3177m2630n5622m8940j5279j3400l0345n0789o7306
3904A157608n5531l1581l6678n240m5964o6406j3803l9843l2737O5738P22L5930
3892I32215O393m236J0729N3503J9392p7011p6527k646r941k5889l6501j14966
3880F74515q2739l3061m9554n7377l6434K7270j6865M3135k7975J2926p123M471
3868D51189N815L5585o639N6962k202j9838o4147M2548L6117R89l7801N683k3733
3855D80528l4143r147n3022k3561M1271j8141n4901N0708J5009n6429L2387J5199
3843C85758K7520j7890K4109J4240P7376Q9573J962R074o9621J4653J8824o7856
$$ y = [2195554, 2080010, 1982670, 1953915, 1925278, 1847608, 1779455, 1743954, 1688352, 1623698, 1563084, 1543706, 1572377, 1505096, 1481919, 1439289, 1383667, 1334727, 1319448, 1306048, 1275703, 1224914, 1157608, 1102077, 1070496, 1033818, 1028578, 982614, 916208, 902405, 862562, 829825, 895563, 896285, 932215, 938608, 934372, 945101, 998604, 1017996, 940985, 864458, 861812, 851871, 825982, 789481, 674515, 591776, 558715, 509161, 451784, 415350, 442620, 425755, 468890, 440915, 453841, 446718, 451189, 457004, 492589, 485950, 542912, 540710, 520872, 456725, 499273, 535390, 536379, 498578, 504261, 480528, 446385, 437238, 384216, 360655, 401926, 383785, 328884, 379592, 394601, 338172, 370559, 385758, 413278, 395388, 419497, 433737, 511113, 600686, 602648, 611722, 542101, 556754, 575578, 507722]
3831E07722K2365O280j585o1822k9398J9355L1528j6645O2816O524J0546n6688
3819E00998l2792j8023J6028L597J7367M3119q681P7077K9593m2210l3089l5072
3807E17912o9321l7861Q8065J0619o5929n3005l14L4757J5076L851o6276k5886
3795C51688M1066L4318N193l1980O802l3094J9854N368o754o885K9661K7430j171
3782D41496K2714K819k5364k8416K9858L8195L5294K326L7917K057j3198k476
3770E43222P1536r525k9413M261O9460l8975K8039J6535J7799J464q037o1563
3758F04803k479J6930L1358r24L0885p459M0429j0631J4969L6261L609P7469j0801
3745H24419k9010l7806K7565L7188M7947l3791m575k0914k3296J6741M6953J7294
$$ y = [507722, 530087, 536367, 534782, 472960, 443562, 462917, 494445, 477800, 540616, 547140, 557686, 500998, 468206, 450183, 466211, 469808, 487175, 530294, 521613, 598690, 628283, 586073, 552984, 517912, 448591, 410730, 498795, 509414, 443485, 390480, 390166, 424923, 439999, 443850, 377574, 351688, 392754, 427072, 432265, 400285, 407087, 373993, 393847, 399215, 392461, 385576, 415237, 442667, 441496, 464210, 467029, 441665, 413249, 443107, 481302, 516596, 518922, 556839, 558896, 545698, 543222, 614758, 605233, 575820, 580081, 649541, 610566, 638605, 655140, 672939, 674403, 666366, 604803, 602324, 619254, 650612, 649688, 680573, 673114, 713543, 702912, 717881, 754142, 757751, 835220, 824419, 795409, 757603, 785168, 822356, 870303, 836512, 831937, 811023, 787727, 804468, 851421, 868715]
3733H68715k7409K0469J6226K795j7462N275M4258J3138m427J5909L3105P3527
3721A044119K6595P714j5812r103N6683J4190Q5717Q3113M6283J9398M3490N0406
3709A452793L8471P4786R2242P2572O1314M2064J11486J33081J00565J43814J00434
3698B423622P7051P6492J41498J64129J25521R5170O9804j7163l096m7118l0252
3687C075658l6621j1524q793k6146n5758N1408M4013n8348q5799j483m4563k2470
3675B819574n358j0362p3840r9564m6436r4593K7505l5244o2920o2951q7687m1330
3663B226794p4075q7782m5537k5324k7601k6271j32003j09964q2421k8645q6039
3652A501132p1910m3237n5343k0416L517k7530l0334n7849r7196J9505m8624p7106
$$ y = [868715, 841306, 861775, 878001, 880796, 863334, 868609, 912867, 926005, 921578, 937487, 970592, 1044119, 1070714, 1078428, 1062616, 1053513, 1110196, 1124386, 1210103, 1293216, 1339499, 1358897, 1402387, 1452793, 1491264, 1566050, 1658292, 1730864, 1792178, 1834242, 1945728, 2078809, 2179374, 2323188, 2423622, 2500673, 2577165, 2718663, 2882792, 3008313, 3103483, 3173287, 3156124, 3153028, 3105910, 3075658, 3039037, 3027513, 3018720, 2992574, 2936816, 2988224, 3032237, 2973889, 2888090, 2886607, 2842044, 2819574, 2814216, 2803854, 2730014, 2630450, 2584014, 2489421, 2516926, 2481682, 2418762, 2355811, 2268124, 2226794, 2152719, 2064937, 2019400, 1994076, 1966475, 1940204, 1808201, 1698237, 1615816, 1587171, 1501132, 1429222, 1385985, 1330642, 1310226, 1313743, 1286213, 1255879, 1198030, 1100834, 1120339, 1071715, 994609]
3640I94609K7436k7355K7533m0101m2928L4816K1733k5971k6718J5528L0566K8251
3628A017399l6952n092J7696J3685l8323L1817k1045j8386k6403L2939K2067O572
3616I95974m902J70L7281K075o1203L6878n7294K686L369J5370M346j8496o582
3603I49672j6243K0547J8185M2101L2936k5152O207L4652r689K4444R504J4880
3591A102044M4365O9035P572M420K9339M7373L7914j2553M3922N7646M6564N189
3579A482830q659k901M8365j816n8600k6487K81K9743p9337n6683K9086M71J09582
3566A465875l5128l3643N2487k8529k0853O0401l8724O1310N6776k1729j896L1374
3554A547721N7514N7154O8747M6637m179L8920N7253K7813P9342J03016K4047
$$ y = [994609, 1022045, 994690, 1022223, 982122, 939194, 974010, 995743, 969772, 943054, 958582, 989148, 1017399, 980447, 975355, 993051, 1006736, 968413, 1000230, 979185, 960799, 934396, 967335, 989402, 995974, 991072, 991242, 1028523, 1030598, 969395, 1006273, 948979, 951665, 955034, 970404, 974750, 956254, 949672, 933429, 953976, 972161, 1014262, 1047198, 1022046, 1028253, 1062905, 1053216, 1077660, 1087164, 1102044, 1146409, 1215444, 1223016, 1227436, 1256775, 1304148, 1342062, 1329509, 1373431, 1431077, 1477641, 1482830, 1474171, 1471270, 1519635, 1517819, 1459219, 1432732, 1433013, 1462756, 1383419, 1326736, 1355822, 1356293, 1465875, 1430747, 1397104, 1449591, 1421062, 1400209, 1460610, 1421886, 1483196, 1539972, 1518243, 1516347, 1547721, 1605235, 1662389, 1731136, 1777773, 1773594, 1812514, 1869767, 1897580, 1976922, 2079938, 2103985]
3543B103985R3081J51385N3674N0128Q6275J63758R1270O2227J11225J51708J22759
3532C241475R9553M4641P7142J30508Q6941K8777J02774J05934N6285J07335J07155
3521D188520P5015M7286J12689J41770M9208J03706J14045R7942J43556J39862
3511E213599R7937R1868Q0952M0326j8690n4322k7489j2178j38105r2485j17248
3500E064165j25426j58168r2632j12007j49507n9254l9923p7049r2415j68091
3490C989693j29069j03422m6105p4383j11334p3083j10221j16535j01785l5776
3480C087980o5750j27025j12391j25671n1155q0454j44956j01390n3831l8831
3470B186526o0150r5424j13675q8349n9327k8827p4773q6094n179l9719m3392
$$ y = [2103985, 2197066, 2348451, 2402125, 2452253, 2538528, 2702286, 2793556, 2855783, 2967008, 3118716, 3241475, 3341028, 3385669, 3462811, 3593319, 3680260, 3709037, 3811811, 3917745, 3974030, 4081365, 4188520, 4263535, 4310821, 4423510, 4565280, 4614488, 4718194, 4832239, 4930181, 5073737, 5213599, 5311536, 5403404, 5484356, 5524682, 5505992, 5451670, 5424181, 5412003, 5273898, 5181413, 5064165, 4938739, 4780571, 4687939, 4575932, 4426425, 4367171, 4327248, 4250199, 4157784, 3989693, 3860624, 3757202, 3711097, 3636714, 3525380, 3452297, 3342076, 3225541, 3123756, 3087980, 3022230, 2895205, 2782814, 2657143, 2605988, 2525534, 2380578, 2279188, 2225357, 2186526, 2126376, 2030952, 1917277, 1828928, 1769601, 1740774, 1666001, 1579907, 1574728, 1535009, 1491617]
3459A491617m7949l2311l0821m9491k4910M777k7105k3073l2624J3939m4056p9322
3447A118671J887L5170N0184L342K3391L0755M646l4976r246j0820J1925J8621
3435A243550k6658J1875J261K418J1946k6232m7784m7877j9181o8520J6978J1577
3423A063353l1523k3930p0415k7962j2063j1645j5240l6758M307P508j7930k0457
3411H07245k0794J4498j5600k2332j1764O586L5706n2232k7197L7459k4596n2854
3399F74125J5032J5849Q259m1090o5430Q1247M7907p333j5385j9392o988J4923
3387G01724j502l5955J5939k4832M6562k0998J3783l0476j3762j4173n789j0713
3375F19808j0877L9564J3080j576k4032l6816K2202K0884M075J3431j6836l937
$$ y = [1491617, 1443668, 1411357, 1380536, 1331045, 1306135, 1310912, 1283807, 1260734, 1228110, 1242049, 1197993, 1118671, 1120558, 1155728, 1205912, 1209254, 1232645, 1263400, 1268046, 1233070, 1223824, 1213004, 1224929, 1243550, 1216892, 1228767, 1230028, 1232446, 1244392, 1218160, 1170376, 1122499, 1103318, 1034798, 1051776, 1063353, 1031830, 1007900, 937485, 909523, 897460, 885815, 870575, 833817, 838124, 845632, 827702, 807245, 786451, 800949, 785349, 763017, 751253, 757839, 793545, 741313, 714116, 751575, 726979, 674125, 689157, 705006, 713265, 672175, 606745, 687992, 735899, 728566, 713181, 693789, 686801, 701724, 700222, 664267, 680206, 655374, 701936, 680938, 694721, 664245, 650483, 636310, 630521, 619808, 608931, 648495, 661575, 659999, 635967, 599151, 621353, 642237, 646312, 659743, 642907, 638970]
3363F38970j945K9537j0440j018O2178k3948J0202M256o585K1948N2657L2782
3351H08594o044J9869N8005q536l0465K8644K4145J6066M584L37R149k1130N831
3338I09049K316L6267P3653P891p887L0344K2319L2861K6935K5202N2050R018
3326A220018L4419J9545L4638P4454M7638L6694K6968J06781p299O2745O0619
3315A717220J7353J29099M7757N3876P1923R1358L5058P5434J32600N5718J50005
3304B577401J15769J36682J49515Q7507J87879K11844J90151J59455J96957K20218
3294D233378K15950K74385K53735K25480K15705K45214K92315K61673K36104K24815
3284F678754K20372J18708J20807J73007J38591J9894J5997O0654M1731r3166
$$ y = [638970, 637025, 666562, 656122, 655104, 717282, 693334, 703536, 707792, 701207, 723155, 775812, 808594, 802550, 822419, 880424, 871888, 841423, 870067, 894212, 910278, 914862, 915199, 924348, 903218, 909049, 911365, 947632, 1021285, 1029176, 1021289, 1051633, 1073952, 1106813, 1133748, 1158950, 1211000, 1220018, 1254437, 1273982, 1308620, 1383074, 1430712, 1467406, 1494374, 1601155, 1593856, 1656601, 1717220, 1734573, 1863672, 1911429, 1965305, 2037228, 2128586, 2163644, 2239078, 2371678, 2427396, 2577401, 2693170, 2829852, 2979367, 3066874, 3254753, 3466597, 3656748, 3816203, 4013160, 4233378, 4449328, 4723713, 4977448, 5202928, 5418633, 5663847, 5956162, 6217835, 6453939, 6678754, 6899126, 7017834, 7138641, 7311648, 7450239, 7470133, 7486130, 7546784, 7588515, 7495349]
3274G495349J6698n95o0181q9141j28449j15794j52891k09240j67377k29265j44993
3263F214121k56353k48416k15010j84933k04668k07806r5891q1517j04271o1749
3253D553507O250J47283J90410K00536L3145j48027l94447m44114l87302l16832
3243C440409k19178j57361j64091j72376q0863r1209p6829j02138o7414m7330
3233B261620l7725Q956O1217k8453q978j563j2342q165n6197q1585l2594j10874
3221A953317n2503m9427J8304J5070J1757j2388J0191O7496J6264K211P3274M0649
3209B094215P9778N6017J3743l9383m7393k4852j00617j12071n8168j16777o5011
3198A679481o2848N664l9431p7583k7359k604j1020l4004K0197k3774j8465o7835
$$ y = [7495349, 7512047, 7511452, 7451271, 7362130, 7233681, 7117887, 6964996, 6755756, 6588379, 6359114, 6214121, 5957768, 5709352, 5494342, 5309409, 5104741, 4896935, 4801044, 4719527, 4615256, 4553507, 4559757, 4707040, 4897450, 5097986, 5131131, 4983104, 4588657, 4144543, 3757241, 3440409, 3221231, 3063870, 2899779, 2727403, 2646540, 2555331, 2478502, 2376364, 2308950, 2261620, 2223895, 2232851, 2294068, 2265615, 2256637, 2255074, 2242732, 2234567, 2178370, 2096785, 2064191, 1953317, 1900814, 1851387, 1869691, 1884761, 1896518, 1884130, 1894321, 1961817, 1978081, 1980292, 2053566, 2094215, 2173993, 2230010, 2243753, 2204370, 2156977, 2132125, 2031508, 1919437, 1861269, 1744492, 1679481, 1616633, 1622297, 1582866, 1505283, 1477924, 1475320, 1464300, 1430296, 1450493, 1426719, 1408254, 1340419]
3186A340419k4479k822n8968K524M1657n7598l6736M1937J625k7333j8575p3563
3174A128088K7613K6012o007P979J4259J357p162M3500L9853M5867J6529m862
3162A333026L5270L5997j0556K8353J00422M8876K4187M0072N0542N6131Q0413
3151A822733R4726J3943N4965J02588M7516J09320J00762J22500J77336R7612
3141B744001J45334J17872J39335J38619R7025J27148J33890J08790R0268Q7570
3131C929852P9894P3292P8323Q2639R2215R7109J18088J32425J14518p5527j87663
3120D535165k48086k20762k46775k41969j72750j70569j82334j62722j40874j49566
3110B598758j43134j00125j25037j26215q5283j02203p9007o7329k4239j17442
$$ y = [1340419, 1315940, 1313118, 1254150, 1256674, 1298331, 1240733, 1203997, 1245934, 1247559, 1220226, 1201651, 1128088, 1155701, 1181713, 1175706, 1183685, 1197944, 1199301, 1192139, 1235639, 1275492, 1321359, 1337888, 1333026, 1368296, 1404293, 1393737, 1422090, 1522512, 1571388, 1595575, 1635647, 1686189, 1742320, 1822733, 1917459, 1931402, 1986367, 2088955, 2136471, 2245791, 2346553, 2469053, 2646389, 2744001, 2889335, 3007207, 3146542, 3285161, 3382186, 3509334, 3643224, 3752014, 3842282, 3929852, 4009746, 4083038, 4161361, 4244000, 4336215, 4433324, 4551412, 4683837, 4798355, 4722828, 4535165, 4287079, 4066317, 3819542, 3577573, 3404823, 3234254, 3051920, 2889198, 2748324, 2598758, 2455624, 2355499, 2230462, 2104247, 2018964, 1916761, 1837754, 1770425, 1746186, 1628744]
3100A628744o3307n6632n0545n4392q6058N78p715o4561p1426j9733n8828j7966
3088A078159j1073r0130K4451o5116k6230L3989l2120j0293k2245k5028l9896
3077H14468l0927K4456j589p072R930K3009j8536l072m97l8487k755P762J3944
3064G90634k4757n8767K5782N6970n4966k5756m279n5708Q926j4265k0023J3176
3052F36967l0017J4401k0544m6701L6500m1124n9271N183j9739Q728L5372K2107
3040E41862l6609N362l0968j3312N8482l3346p100k869l8609l4234J4256J9001
3028D41916l9058p288N9099l1688l3840n001m5465L9000K9042L4989J7151k9368
3016D29489j1068l929N0604k5405L5028o1370J5693q008p569M0284m0617m345
$$ y = [1628744, 1565437, 1508805, 1458260, 1403868, 1317810, 1318388, 1310673, 1246112, 1174686, 1154953, 1096125, 1078159, 1067086, 976956, 1001407, 936291, 910061, 944050, 911930, 901637, 879392, 854364, 814468, 783541, 807997, 806408, 799336, 809266, 832275, 813739, 810667, 810170, 771683, 768928, 776690, 790634, 765877, 707110, 732892, 789862, 734896, 709140, 704861, 649153, 658079, 643814, 623791, 636967, 606950, 621351, 600807, 554106, 590606, 549482, 490211, 495394, 475655, 484383, 519755, 541862, 505253, 510615, 479647, 466335, 524817, 491471, 484371, 481502, 442893, 408659, 422915, 441916, 402858, 395570, 454669, 422981, 389141, 384140, 338675, 377675, 406717, 441706, 458857, 429489, 418421, 414492, 465096, 439691, 474719, 413349, 429042, 421034, 413465, 453749, 413132, 408787]
3004D08787j2922N3883j4961k0387N343O295L615p806j4959l2493L6941k0523
2992C90813J5673K1384l98K2763j4555J2327J9085L1169j5008j7525l83N40N2221
2979E18106J2828l2960O2508l8789j6545N3309l2201l4609l968J1361J6609J0120
2967E25769M9971k4680M216K5753M7766o0027o226J8813N520N3362J6823L7023
2955F94083J328n3898N4090M2604k6176P34L6493L230O2082R946J9791J446o0883
2942G84870M0984n988K153J3974L0891M6023O2560Q1003j6820l6178J7417M3605
2930A064494P3522K4269j9873K5780P7592N4880L7278L8815R0459M78O0631O7842
2918A596167P4900Q5849M0818R5647N1657P8643J18379J02318J29709O1093Q6947
$$ y = [408787, 395865, 449748, 434787, 414400, 419743, 426038, 429653, 421847, 406888, 374395, 411336, 390813, 406486, 427870, 427472, 450235, 435680, 448007, 467092, 498261, 483253, 465728, 465345, 465885, 518106, 530934, 497974, 560482, 521693, 505148, 558457, 526256, 491647, 487679, 499040, 515649, 525769, 575740, 551060, 555276, 581029, 628795, 568768, 562542, 581355, 586875, 640237, 657060, 694083, 695411, 641513, 695603, 738207, 712031, 712765, 749258, 752488, 814570, 824516, 844307, 845753, 784870, 825854, 819866, 822019, 835993, 866884, 912907, 975467, 1056470, 1039650, 1003472, 1020889, 1064494, 1138016, 1162285, 1142412, 1168192, 1245784, 1300664, 1337942, 1376757, 1467216, 1467694, 1528325, 1596167, 1671067, 1756916, 1797734, 1893381, 1945038, 2023681, 2142060, 2244378, 2374087, 2435180, 2522127]
2907B522127Q6037J62960J29359J76142J64790J54699J33354J26640K24016K12032
2897D092156K37403K46838K96136K73004L20421L54183M30204M85409N26332N67492
2887G829578O56570P50448Q64933R16466R91696J156529J196738J234271J178151
2878A6775380R91485O77033K31850j02265n29827r45979j058839j153435j132936
2869A3752467j115556j014123r76588q74115p22392o48532o11654m75692m21274
2860F892541m31256l53701l30618k90185k71827k76514k36037k86677k34464j74239
2850D007023k32378j81056j99268j69338j57620j00900j22851j20504o3339j31810
2840B527959q1042o3442j01334p2157r7464p4434p0084k0398r9913m3649p1954
$$ y = [2522127, 2608164, 2771124, 2900483, 3076625, 3241415, 3396114, 3529468, 3656108, 3880124, 4092156, 4329559, 4576397, 4872533, 5145537, 5465958, 5820141, 6250345, 6735754, 7262086, 7829578, 8486148, 9236596, 10101529, 11017995, 12009691, 13166220, 14362958, 15597229, 16775380, 17766865, 18443898, 18675748, 18573483, 18043656, 17097677, 16038838, 14885403, 13752467, 12636911, 11622788, 10646200, 9772085, 9049693, 8401161, 7789507, 7313815, 6892541, 6461285, 6107584, 5776966, 5486781, 5214954, 4938440, 4702403, 4415726, 4181262, 4007023, 3774645, 3593589, 3394321, 3224983, 3067363, 2966463, 2843612, 2723108, 2659769, 2527959, 2446917, 2383475, 2282141, 2209984, 2112520, 2038086, 1968002, 1947604, 1847691, 1804042, 1732088]
2829A732088r0926k7360m5066l9789j4231q4122j6158m3504K5015r1292l2937
2818A271718o6777n5461N2074n2507l2625m7558n1015j1172l4595K3252J0513
2807A005847n3793n0225l9767k9183l9019m0932n3252Q8587o6941l9353k8972
2796F52997O112m4865q86R228l5882k0104K8908j6117k937k7396j9683k2068J9073
2783E26380m6053k2415k025j9545N6201r545j8389o74m4785l5848m0390j7768
2771C25144K4033j8812M6149K2392q458j9488m1018j0013M9147M5384l4456n0039
2759C29965m0147r906O215p8293N5672K2483K4425J8714o1593m0491k7298L8007
2747B37753k3914J9100L6976Q694m3531P024j3330l7374n6111O7971L9920L9894
$$ y = [1732088, 1641162, 1613802, 1568736, 1528947, 1514716, 1430594, 1414436, 1370932, 1395947, 1304655, 1271718, 1204941, 1149480, 1201554, 1149047, 1116422, 1068864, 1017849, 1006677, 972082, 995334, 1005847, 952054, 901829, 862062, 832879, 793860, 752928, 699676, 788263, 721322, 681969, 652997, 659109, 614244, 613358, 622586, 586704, 566600, 595508, 579391, 576454, 549058, 529375, 507307, 526380, 480327, 457912, 455887, 436342, 492543, 482998, 464609, 463935, 419150, 383302, 342912, 325144, 349177, 330365, 376514, 398906, 390448, 370960, 329942, 319929, 369076, 414460, 380004, 329965, 289818, 279912, 286127, 207834, 263506, 285989, 310414, 329128, 267535, 227044, 199746, 237753, 213839, 232939, 269915, 278609, 235078, 242102, 228772, 191398, 135287, 203258, 243178, 283072]
2735B83072l101l2591Q947o141j8188k7900k9154K9395L8160N644L8299o9163
2723B17279j8870MJ0556j8126l682j1025J2244J1847L8911j153m741O721k2488
2710B17477l3248J7654l2232L1209K0855m772j1108k6124r708O9155m9406K3401
2698B13153O43q1691M8836k5318k1417M7128j2413o5n1407K1343L6M8543n896
2685A81475m7670K4019k6185m248K433J8525k7595m4787j4505N5939j5796P717
2673A09322l4388K8346L3556m2654j9728K5922q324j9608K8070O2764R13j2299
2661A51892o6256k3554J4703J5488l8621l2634N6714K7803K5551L5146l691j4920
2649A47621j1512P041l4126l3035K7392J7875m0526k8762K812O8616l3812K0237
$$ y = [283072, 279971, 247380, 256327, 250186, 231998, 204098, 174944, 204339, 242499, 248143, 286442, 217279, 198409, 198413, 208969, 190843, 187161, 176136, 188380, 200227, 239138, 237985, 233244, 239965, 217477, 184229, 201883, 169651, 200860, 221715, 216943, 205835, 179711, 170003, 239158, 189752, 213153, 213796, 132105, 180941, 155623, 134206, 181334, 168921, 168856, 117449, 138792, 138828, 187371, 181475, 133805, 157824, 131639, 127391, 129824, 148349, 120754, 75967, 61462, 117401, 101605, 109322, 74934, 103280, 136836, 94182, 74454, 100376, 92052, 72444, 100514, 163278, 164191, 151892, 85636, 62082, 76785, 92273, 53652, 21018, 77732, 105535, 131086, 166232, 162541, 147621, 136109, 143150, 109024, 75989, 103381, 121256, 80730, 51968, 54780, 123396, 89584, 109821]
2637A09821P492k9253k5887P022j2244n931R302L947k918j8243K5917N6215P71
2624A26011l9810j1104L3176j0550m1698J9929l188M9410M7897m4083n6224L1260
2612A01026j623J8751k7077j1517k2428J1890J5574L5023J9101j0989m5325M1271
2600A23677m2920Q722R434K9568K5579J7571j1364l1474M612j7116L6899L3807
2588A86995l9439k6228L9585K6289l9956k1219k180j3036m6877Q242l2158J9082
2576E9100K6094m501L0152k1211k1950k3536N1280l2826k8837K1881N2420n262
2564A02804l3960o0057r695L1748L8239j0142K3858q86P16k8405J906L7247J2161
2551A05534k1022m4716L2022j3589o9031L0634K2547J1660r717J6970L3452p401
$$ y = [109821, 117313, 88060, 62173, 69195, 56951, 51020, 60322, 64269, 61351, 43108, 69025, 125240, 126011, 86201, 75097, 108273, 97723, 56025, 75954, 72766, 122176, 170073, 125990, 69766, 101026, 99403, 118154, 91077, 79560, 57132, 69022, 84596, 119619, 138720, 127731, 82406, 123677, 80757, 89479, 98913, 128481, 154060, 171631, 160267, 128793, 133405, 116289, 153188, 186995, 147556, 121328, 160913, 187202, 147246, 126027, 123847, 110811, 63934, 72176, 40018, 59100, 85194, 80693, 110845, 89634, 67684, 44148, 95428, 62602, 33765, 55646, 108066, 102804, 68844, 8787, -908, 30840, 69079, 58937, 82795, 81909, 82625, 54220, 56126, 93373, 105534, 84512, 39796, 71818, 58229, -10802, 19832, 42379, 54039, 44322, 61292, 94744, 87343]
2539H7343L542n7144J96P5405m1941K2462J4523j3781j4250K5065j0859j0918
2527G9643p26J5141P412l4512k9475k8201k2328M2818L0659J9604q689k902m840
2514F3604K1240l949R102L72r0619q37R061N4773l6772j0826J961k3978M2312
2501C5444K8730J559O099k8593j255l0614K4367m8753N7789k0140N265L3053p778
2488E5173K2718J1596N864j5353J6850j1878K8033k8781l1207j3037n8594l973
2476b2589K3196k1799j7875J5694J4255J2313L5802L6812m4801Q820L881n3241
2464i532J9907L0041J9313K2976q0768l2524K8687k4222j9935O628Q1246M9970
2452I1787j8589l5254k584J5788m8443l1580L8470l037n731J4126k2397N6031
$$ y = [87343, 90885, 33741, 33937, 109342, 67401, 89863, 104386, 90605, 76355, 101420, 90561, 79643, 78917, 94058, 101470, 66958, 37483, 9282, -13046, 29772, 60431, 80035, 71346, 68444, 63604, 84844, 80895, 89997, 90369, -250, -1087, 7974, 62747, 25975, 15149, 17110, -6868, 35444, 64174, 65733, 71832, 43239, 41984, 11370, 35737, -13016, 44773, 24633, 29898, 62951, 55173, 77891, 89487, 95351, 79998, 96848, 84970, 113003, 84222, 53015, 39978, -18616, -22589, 607, -21192, -39067, -23373, -9118, 3195, 38997, 75809, 31008, 39828, 43709, -9532, 10375, 40416, 59729, 82705, 1937, -30587, -1900, -26122, -46057, -39429, 41817, 91787, 73198, 37944, 35360, 51148, 2705, -28875, 9595, 6558, 827, 14953, -7444, 48587]
2440D8587O7938n7857l7159j6395K6019J006j0078j5759N8318l522l433l5232
2428B2433j26K3693l0800Q624j6205l9721M528L1862l7898k4106J8503L9301L2838
2415C2926k4417K4763P132l8120K7854k4178j5739K1954k446J8490k1606k9224
2403b2611J791M7124J7684J6275l9545l600J6722j3782L366K104k6881j2587k0082
2390c4022m055L7100L7341J1810o0017K6076L816L451l6016O1538k188m2645n069
2377b880j1594R640J6773j5616l8023M5514l3684m403J8185N670K3835J1969R234
2364C4620L8818q55o8605N620n529J40m570j621k2522K092M8120J6222r616j3483
2350A8831k106R123k5703K0702k0113j2898r282M2265N165k740n596J2774J461
$$ y = [48587, 116525, 58668, 21509, 5114, 31133, 32139, 22061, 6302, 64620, 61098, 57665, 22433, 22307, 46000, 15200, 23824, 7619, -32102, -27574, 4288, -33610, -57716, -39213, 88, 32926, 8509, 33272, 40404, 2284, 30138, 5960, -9779, 12175, 9729, 28219, 6613, -22611, -20820, 26304, 43988, 60263, 20718, 17118, 33840, 20058, 23424, 25528, -1353, -13940, -34022, -38077, -977, 36364, 48174, -11843, 14233, 18049, 21500, -14516, 47022, 44834, 2189, -2880, -14474, -4834, 11939, -3677, -41700, 3814, -29870, -34273, -16088, -10418, 13417, 25386, 34620, 73438, 72583, 3978, 9598, 4069, 4209, -361, -1982, -24504, -22412, 25708, 41930, 32314, 18831, 16725, 25848, 145, 20847, 734, -12164, -21446, 20819, 25984, 23244, 17648, 30422, 31883]
2337C1883o2055K3158K9677k1877K993K6065n0391r97K3647n405j1121K8192K2317
2324C6086k4301q072N879J5947J5485n904n4211N7195j2172K948J1929l8743L017
2311E083l0382N8115O066j4940j4854k6799J831L4054j1840K588m1041J7713O0544
2298D6138J9242j9699R874l1781n8251J9632J5735m2686L5223L6771j834K4301
2286E2665j7643m5698j432M3164k4163k7143J6029r1478P5345O7428j3551m654
2274B8869p305R128o535l7300N583N8381k9842l8628j681L1038J7122p979k5587
2261d736j4343k0721L6749K4957K3923m0754O083M4982n069k5526p249k8840J6392
2248E848J5569k9581N6345k9556k3089K696J5954N815k3504J6755j7195n099k4651
$$ y = [31883, -30172, -7014, 22663, 786, 3779, 29844, -20547, -21544, 2103, -3302, -14423, 13769, 36086, 11785, 3713, 9592, 25539, 41024, 35120, -19091, 38104, 25932, 28880, 40809, 2066, 5083, -25299, 32816, 38882, 23942, 9088, -17711, -15880, 18174, 6334, 8922, -32119, -14406, 46138, 65380, 45681, 55555, 23774, -34477, -14845, 890, -41796, -6573, 30198, 28364, 52665, 35022, -10676, -12108, 31056, 6893, -20250, -4221, -95699, -20354, 47074, 33523, 28869, 21564, 30692, 24157, -13143, -7560, 50821, 20979, -17649, -19330, 11708, 28830, 20851, -4736, -19079, -39800, -3051, 21906, 45829, 5075, 11158, 56140, 51071, 25545, 18296, -10544, 5848, 21417, -8164, 48181, 18625, -4464, -1768, 14186, 20001, -3503, 13252, -3943, -9042, -33693]
2235c3693J7853j7170L6176K2641k1061K5971o240k938n3035j4428L6080L8192
2223B8348N546j876j9482L9919J0354j1016m7710J7005l628l0647K4088L6500
2211D7401p584j5525j5661K4208j7034l7953J9769q314L0086m0486j8044R563
2199b9574N755M428L1407j5162K6325j8717j5872k009J6890L8961j1671J0975
2187D1736K9570K6724j3326p5985K0326O7919l8354m5770J962j4500J2208N955
2175A8465j2170K6163m7925l610O090R664L1258k2090o48k3972j274n608j2280
2162c7937K5055l5211J2918L5063k6136m501M956k5134N9972K2050q22J6517K374
2149D9164m34r67m277n8229K0379k2217O0287J3263J3583r539j9403J5859k599
$$ y = [-33693, -15840, -33010, 3166, 25807, 4746, 30717, 24477, 21539, -31496, -45924, -9844, 28348, 33894, 32018, 12536, 52455, 62809, 51793, 4083, 21088, 17460, -13187, 10901, 47401, 39817, 24292, 8631, 32839, 15805, -22148, -2379, -10693, 19393, -21093, -39137, -29574, -23819, -19391, 12016, -3146, 23179, 4462, -11410, -13419, 3471, 42432, 30761, 41736, 71306, 98030, 84704, 8719, 29045, 96964, 58610, 12840, 14802, 302, 12510, 18465, 6295, 32458, -15467, -19077, -12987, -3323, 27935, 5845, 5197, -18775, -20049, -25657, -37937, -12882, -48093, -35175, -112, -26248, -30749, -25793, -50927, 9045, 31095, 30273, 46790, 49164, 48730, 47763, 43486, -14743, 5636, -16581, 43706, 56969, 70552, 61013, 41610, 57469, 54870]
2136E4870N940m3390J599J7019l1840M0688k3453j8423K0224k3884J6973L1664
2124D7987l1409L5475k3984O343M3395m5835J7915M7302k7317J4107m935J8163
2112I7207R267m1304J0016K3015n8581k632J8032n553J3986L7659M6612m4494
2100A03230M9486m3585o194O2602M522j4707K3719J8675J05848K2592N9190J16031
2088E01409J37779L30102J74654p0172j67109k05307j06156j26113r2674p1005
2078C05408l0242o7008l1097p7599L122j5471J4310l2238M1900J2918n524k1228
2066I7251m4488j16r58l432l4897J708k2106L1139K4554K965L1385L8180k7270
2053I3915n5806M0863K8707k6349J3643j8431M826j0206j3426R770P537j0740
$$ y = [54870, 60810, 17420, 19019, 36038, 4198, 44886, 21433, 3010, 23234, -650, 16323, 47987, 16578, 52053, 28069, 34412, 77807, 31972, 49887, 97189, 69872, 83979, 79044, 97207, 106474, 65170, 75186, 98201, 39620, 36988, 55020, 49467, 63453, 101112, 147724, 103230, 152716, 109131, 102937, 165539, 170061, 155354, 179073, 197748, 303596, 326188, 385378, 501409, 639188, 969290, 1143944, 1073772, 906663, 701356, 595200, 469087, 376413, 305408, 275166, 208158, 177061, 99462, 102584, 87113, 101423, 69185, 111085, 124003, 118479, 97251, 52763, 52647, 51689, 48257, 13360, 15068, -7038, 24101, 48655, 51620, 83005, 121185, 93915, 38109, 78972, 107679, 81330, 94973, 76542, 81368, 71162, 57736, 67506, 75043, 64303]
2041F4303O670l694o2249J2523K0833L169k4684l4653K3334j060K5527N402J9960
2028E5381k8485r245k2798J726K5163r554R879k7149N7033K9588n0986k991m3123
2015a5561K0117k6129L9876J8001l4990k8651M1508r229J0915k551p303K9740
2003C5743l3706j8430k2047L3794k0997K2812J2741j5606J2409k7490p981J00
1991b8658L8827M99L0750j512J666r093j5408k3022K6329M2252N112j561k8134
1978C8047k9460M023P3605m923r1494P489O2031Q761j6739R274l1191k2798k690
1965C935J7651J6550k1655M7785j0925l1195K3819n847l9669K9143l435R840j7499
1952A8498J0792j53J6255J1845n5160n5848J012k223K0360J4564k5207J3471K1726
$$ y = [64303, 70973, 67279, 5030, 17553, 38386, 41555, 16871, -17782, 5552, 4492, 30019, 35421, 55381, 26896, 17651, -5147, -3421, 21742, 12188, 22067, -5082, 51951, 81539, 30553, 27562, -15561, 4556, -21573, 18303, 36304, 1314, -27337, 14171, 4942, 15857, 13306, 6003, 35743, 2037, -16393, -38440, -4646, -25643, -2831, 9910, -5696, 6713, -20777, -28758, -28658, 10169, 10668, 41418, 39906, 41572, 32479, 17071, -5951, 20378, 62630, 67742, 66181, 38047, 8587, 12610, 86215, 81292, -10202, -2713, 59318, 68079, 51340, 60614, 29423, 6625, 3935, 21586, 38136, 16481, 64266, 53341, 22146, 45965, 40118, 449, 29592, 26157, 35997, 18498, 29290, 29137, 45392, 57237, 2077, -53771, -52759, -54982, -34622, -20058, -45265, -31794, -10068]
1939a0068K5018j6043J711J7461m418m7109L2163J3601j445k6344j1750N6627
1927B9404j5437N562k0038L3349m5914m4593J4520L6686O8595j9008P909m7124
1915C911K05J9974J2574m043p214j6380M6543k8142j7925j2088P396j7345M7022
$$ y = [-10068, 14950, -1093, 618, 18079, 13661, -33448, -1285, 12316, 10871, -15473, -27223, 29404, 13967, 19529, -509, 32840, -13074, -57667, -43147, -6461, 62134, 43126, 51035, 3911, 4116, 24090, 36664, 32621, 25407, 9027, 55570, 27428, 9503, -2585, 4811, -12534, 34488]
$$ [...]
##END NTUPLES=NMR SPECTRUM
##END=
