##TITLE=1H_EC-3299(IV-33)
 CDCl3
 8 sc, 
 5.9.2023
##JCAMPDX= 6.0         $$ Bruker NMR JCAMP-DX V2.0
##DATA TYPE= NMR SPECTRUM
##DATA CLASS= NTUPLES
##ORIGIN= UXNMR, Bruker Analytische Messtechnik GmbH
##OWNER= root
$$ XWIN-NMR		Version 3.5
$$ Tue Sep  5 14:11:38 2023 Russian Standard Time (UT+4h)  she@DPX200
##.OBSERVE FREQUENCY= 200.13135
##.OBSERVE NUCLEUS= ^1H
##.ACQUISITION MODE= SIMULTANEOUS
##.ACQUISITION SCHEME= undefined
##.AVERAGES= 8
##.DIGITISER RES= 18
##SPECTROMETER/DATA SYSTEM= spect
##.PULSE SEQUENCE= zg30
##.SOLVENT NAME= CDCl3
##.SHIFT REFERENCE= (INTERNAL, CDCl3, 0, 15.7326)
##AUDIT TRAIL= $$ (NUMBER, WHEN, WHO, WHERE, WHAT)
$$ ##TITLE= Audit trail, XWIN-NMR		Version 3.5
$$ ##JCAMPDX= 5.01
$$ ##ORIGIN= Bruker BioSpin GmbH
$$ ##OWNER= she
$$ F:/spectra/data/she/nmr/H-F/1/pdata/1/auditp.txt
$$ ##AUDIT TRAIL=  $$ (NUMBER, WHEN, WHO, WHERE, WHAT)
(   1,<2023-09-05 14:10:14.98 +0400>,<she>,<DPX200>,
      <created by zg, POWCHK disabled, PULCHK disabled
       configuration hash MD5:
       00 E9 B6 7A A2 85 ED C7 34 08 36 98 17 FE 4E 26
       data hash MD5: 16K
       1E F6 46 B0 7C B5 09 29 CB 87 14 EB 44 46 47 E3>)
(   2,<2023-09-05 14:10:17.39 +0400>,<she>,<DPX200>,
      <Start of raw data processing
       efp BC_mod = 2 LB = 0.24 FT_mod = 6 PKNL = 1 PHC0 = -21205.73 PHC1 = 9.25272 SI = 16K 
       data hash MD5: 16K
       81 E2 08 CD AB DB 88 1A 0D 7D D4 44 3F 5E 49 A3>)
(   3,<2023-09-05 14:10:44.90 +0400>,<she>,<DPX200>,
      <pk PHC0 = 158.816 PHC1 = 2 
       data hash MD5: 16K
       41 FE 91 75 22 22 80 E5 17 2E 52 7F E2 EB 39 D9>)
(   4,<2023-09-05 14:10:48.39 +0400>,<she>,<DPX200>,
      <abs ABSG = 5 
       data hash MD5: 16K
       5A 36 01 DD AB 34 75 7E A7 F3 4A 14 0A 5B 14 2B>)
$$ ##END=
$$ 
$$ hash MD5
$$ B5 93 3C 04 2F 6A C3 81 A5 E0 F5 F1 BD 85 55 2A
##$RELAX= 
##$RELAX= 
##$RELAX= 
##$RELAX= 
##$RELAX= 
##$RELAX= 
$$ Bruker specific parameters
$$ --------------------------
##$DU= <F:/spectra>
##$EXPNO= 1
##$NAME= <H-F>
##$PROCNO= 1
##$TYPE= <nmr>
##$USER= <she>
##$AMP= (0..31)
100 100 100 100 100 100 100 100 100 100 100 100 100 100 100 100 100 100 
100 100 100 100 100 100 100 100 100 100 100 100 100 100 
##$AQSEQ= 0
##$AQ_mod= 1
##$AUNM= <au_zg>
##$AUTOPOS= <>
##$BF1= 200.13
##$BF2= 200.13
##$BF3= 200.13
##$BF4= 200.13
##$BF5= 200.13
##$BF6= 200.13
##$BF7= 200.13
##$BF8= 200.13
##$BYTORDA= 1
##$CFDGTYP= 0
##$CFRGTYP= 5
##$CHEMSTR= <none>
##$CNST= (0..31)
1 1 145 1 1 1 1 1 1 1 1 1 1 1 1 1 1 1 1 1 1 1 1 1 1 1 1 1 1 1 1 1 
##$CPDPRG= <>
##$CPDPRG1= <>
##$CPDPRG2= <>
##$CPDPRG3= <>
##$CPDPRG4= <mlev>
##$CPDPRG5= <mlev>
##$CPDPRG6= <mlev>
##$CPDPRG7= <mlev>
##$CPDPRG8= <mlev>
##$CPDPRGB= <>
##$CPDPRGT= <>
##$D= (0..31)
0 1.2 0 0 0 0 0 0 0 0.06 0 0.03 0 0 0 0 0.0002 0 0 0 0 0 0 0 0 0 0 0 0 
0 0 0 
##$DATE= 1693908614
##$DBL= (0..7)
120 120 120 120 120 120 120 120 
##$DBP= (0..7)
150 150 150 150 150 150 150 150 
##$DBP07= 0
##$DBPNAM0= <>
##$DBPNAM1= <>
##$DBPNAM2= <>
##$DBPNAM3= <>
##$DBPNAM4= <>
$$ [...]
##$SUBNAM3= <"">
##$SUBNAM4= <"">
##$SUBNAM5= <"">
##$SUBNAM6= <"">
##$SUBNAM7= <"">
##$SUBNAM8= <"">
##$SUBNAM9= <"">
##$SW= 18.05172834244
##$SWIBOX= (0..15)
0 0 2 0 0 0 0 0 0 0 0 0 0 0 0 0 
##$SW_h= 3612.71676300578
##$TD= 16384
##$TD0= 1
##$TE= 0
##$TE2= 300
##$TE3= 300
##$TEG= 300
##$TL= (0..7)
0 120 120 120 120 120 120 120 
##$TP= (0..7)
150 150 150 150 150 150 150 150 
##$TP07= 0
##$TPNAME0= <>
##$TPNAME1= <>
##$TPNAME2= <>
##$TPNAME3= <>
##$TPNAME4= <>
##$TPNAME5= <>
##$TPNAME6= <>
##$TPNAME7= <>
##$TPOAL= (0..7)
0.5 0.5 0.5 0.5 0.5 0.5 0.5 0.5 
##$TPOFFS= (0..7)
0 0 0 0 0 0 0 0 
##$TUNHIN= 0
##$TUNHOUT= 0
##$TUNXOUT= 0
##$USERA1= <user>
##$USERA2= <user>
##$USERA3= <user>
##$USERA4= <user>
##$USERA5= <user>
##$V9= 5
##$VALIST= <valist>
##$VCLIST= <CCCCCCCCCCCCCCC>
##$VD= 0
##$VDLIST= <DDDDDDDDDDDDDDD>
##$VPLIST= <PPPPPPPPPPPPPPP>
##$VTLIST= <TTTTTTTTTTTTTTT>
##$WBST= 1024
##$WBSW= 4
##$XGAIN= (0..3)
0 0 0 0 
##$XL= 0
##$YL= 0
##$YMAX_a= 593650
##$YMIN_a= -513039
##$ZGOPTNS= <>
##$ZL1= 120
##$ZL2= 120
##$ZL3= 120
##$ZL4= 120
##$ABSF1= 15.71621
##$ABSF2= -2.335639
##$ABSG= 5
##$ABSL= 3
##$ALPHA= 0
##$AQORDER= 0
##$ASSFAC= 0
##$ASSFACI= 0
##$ASSFACX= 0
##$ASSWID= 0
##$AUNMP= <proc_1d>
##$AZFE= 0.1
##$AZFW= 0.1
##$BCFW= 0
##$BC_mod= 2
##$BYTORDP= 0
##$COROFFS= 0
##$CY= -3
##$DATMOD= 1
##$DC= 0
##$DFILT= <>
##$DTYPP= 0
##$F1P= 0
##$F2P= 0
##$FCOR= 1
##$FTSIZE= 16384
##$FT_mod= 6
##$GAMMA= 0
##$GB= 0
##$INTBC= 1
##$INTSCL= 3.70164e-10
##$ISEN= 128
##$LB= 0.24
##$LEV0= 0
##$LPBIN= 0
##$MAXI= 10000
##$MC2= 0
##$MEAN= 0
##$ME_mod= 0
##$MI= 1.114404
##$NCOEF= 0
##$NC_proc= -6
##$NLEV= 6
##$NOISF1= 3.799351
##$NOISF2= 2.8
##$NSP= 0
##$NTH_PI= 0
##$NZP= 0
##$OFFSET= 15.73257
##$PC= 1
##$PHC0= -21046.91
##$PHC1= 11.25272
##$PH_mod= 1
##$PKNL= yes
##$PPARMOD= 0
##$PSCAL= 0
##$PSIGN= 0
##$REVERSE= no
##$SF= 200.13000780041
##$SI= 16384
##$SIGF1= 3
##$SIGF2= 2
##$SINO= 5.538805
##$SIOLD= 16384
##$SREGLST= <1H.CDCl3>
##$SSB= 0
##$STSI= 16384
##$STSR= 0
##$SW_p= 3612.71676300578
##$SYMM= 0
##$S_DEV= 0
##$TDeff= 16384
##$TDoff= 0
##$TI= <>
##$TILT= no
##$TM1= 0
##$TM2= 0
##$TOPLEV= 0
##$USERP1= <user>
##$USERP2= <user>
##$USERP3= <user>
##$USERP4= <user>
##$USERP5= <user>
##$WDW= 1
##$XDIM= 16384
##$YMAX_p= 466764390
##$YMIN_p= -507748
$$ End of Bruker specific parameters
$$ ---------------------------------
##NTUPLES= NMR SPECTRUM
##VAR_NAME=  FREQUENCY,     SPECTRUM/REAL,   SPECTRUM/IMAG
##SYMBOL=    X,             R,               I
##VAR_TYPE=  INDEPENDENT,   DEPENDENT,       DEPENDENT
##VAR_FORM=  AFFN,          ASDF,            ASDF
##VAR_DIM=   16384,         16384,           16384
##UNITS=     HZ,            ARBITRARY UNITS, ARBITRARY UNITS
##FACTOR=    0.220516191357247, 1,           1
##FIRST=     3148.55929568459, 0,            0
##LAST=      -464.15746732119, 0,            0
##MIN=       -464.15746732119, -507748,      0
##MAX=       3148.55929568459, 466764390,    0
$$ Real data points
##PAGE= N=1
##DATA TABLE= (X++(R..R)), XYDATA
$$ [...]
5629B7487270N7742J22427J78295K06391M78427N38104M47592O15064O72539O39766
5619C1443617O73471O87895P47484N51949N27619N15323L84135K46411K04590
5610C5982494n641l74641m34234p45967q97511r30592p48466p31407p41555p23725
5600B9648755n97118m51010m08177l70012j13170j50529q2235J4124Q5835K16058
5590B7792521L19711M02746L51507N68430O87542Q29050J021816J015529J136917
5581C4125769J286737J388154J510576J386997J308634J197486R46411Q30487
5573D3981251L91159k28821o32926r67268j272124j522460j587241j473208j258343
5564C5430019j179638j121334j047429r68167o43468o53559n15065l97595m26031
$$ plain form
5629 27487270 27545012 27667439 27845734 28052125 28530552 29068656 29516248 30131312 30803851 31443617
5619 31443617 32117088 32804983 33552467 34104416 34632035 35147358 35531493 35777904 35982494
5610 35982494 35976853 35602212 35167978 34422011 33524500 32593908 31845442 31114035 30372480 29648755
5600 29648755 29051637 28600627 28192450 27822438 27709268 27558739 27476504 27490628 27576463 27792521
5590 27792521 28112232 28514978 28866485 29434915 30122457 30951507 31973323 32988852 34125769
5581 34125769 35412506 36800660 38311236 39698233 41006867 42204353 43150764 43981251
5573 43981251 44372410 44143589 43510663 42543395 41271271 39748811 38161570 36688362 35430019
5564 35430019 34250381 33129047 32081618 31113451 30469983 29816424 29301359 28903764 28477733
5555B8477733k68475k02310j19699j13785J40K94621J70590K29864L53082M68159
5545B9289920O25905N60886P30127P74613Q72626Q43054R49164R98750J048915
5536C6693960R55139R67983R69050R34887J001328Q33520P81175O64812O90418
5527D4492272O52175M31862K56185J67956J55107L5290P499j8314j29149L8831
5517D6089714Q453r7722k18610l81627n90372p91246p99450r18708q73248r12631
5507D0514553r95976r04052j001127j021363q92834j064571j009313p70479q88751
5498C1966087q97271p91565o39425o69922o54924n68801n98651n40238m57626
5489B6147664m00708n62670m11998l69138m30505m52671m09135l58714l36928
$$ plain form
5555 28477733 28209258 28006948 27887249 27773464 27773604 28068225 28238815 28468679 28821761 29289920
5545 29289920 29915825 30476711 31206838 31981451 32854077 33697131 34646295 35645045 36693960
5536 36693960 37649099 38617082 39586132 40521019 41522347 42355867 43137042 43801854 44492272
5527 44492272 45144447 45576309 45832494 46000450 46155557 46190847 46198346 46180032 46050883 46089714
5517 46089714 46098167 46000445 45781835 45400208 44809836 44018590 43219140 42300432 41427184 40514553
5507 40514553 39518577 38614525 37613398 36592035 35699201 34634630 33625317 32854838 31966087
5498 31966087 31068816 30277251 29637826 28967904 28312980 27744179 27145528 26605290 26147664
5489 26147664 25746956 25184286 24772288 24403150 23972645 23519974 23110839 22752125 22415197
5480B2415197m45058l39382k97300l44119j79902o2898k52280l01467j14809q6391
5470A9991591r8085j0069j78508k32076k08039j27890n1914j58518j17742k33773
5460A8574977l76215j96512j09940k34963j25682k00624j88196j49890o5095j20969
5450A6806891j06924j59028k07898o2311r5092o8274q0844j17306j09088J0269
5440A5810395p5169k39497L0811m3592o6209l4881j7996j5491N5748L5582J02511
5429A5542212J42382J0830N4389R4936J47047J11709R0539J01107J34597Q794
5419A6438542R1375J92089L5056J39338K37483J39352J02928K12650K31283J40144
5409A7960240k2675j15082j16010j6773j01814o1234m4996j5906N096O1832N6900
$$ plain form
5480 22415197 21970139 21630757 21333457 20989338 20809436 20746538 20494258 20192791 20077982 19991591
5470 19991591 19893506 19883437 19704929 19472853 19264814 19136924 19085010 18926492 18808750 18574977
5460 18574977 18198762 18002250 17892310 17657347 17531665 17331041 17142845 16992955 16927860 16806891
5450 16806891 16699967 16540939 16333041 16270730 16175638 16107364 16026520 15909214 15800126 15810395
5440 15810395 15735226 15495729 15526540 15482948 15416739 15381858 15363862 15348371 15404119 15439701 15542212
5429 15542212 15684594 15695424 15749813 15844749 15991796 16103505 16194044 16295151 16429748 16438542
5419 16438542 16529917 16722006 16757062 16896400 17133883 17273235 17376163 17588813 17820096 17960240
5409 17960240 17937565 17822483 17706473 17689700 17587886 17526652 17481656 17465750 17470846 17532678 17589578
5398A7589578p4012K02107J33811J84325J57354N2658O4899J47062K35851J74390
5388A8868023J09015J46255K30571L74337K18101K46345L04317L60050M50442
5379B1307456M45748K96442K63564K92592L34016N30278N88110N11932N81404
5370B5151542P66168P83914Q61813R12645R95868R09704O75461P56418O49703
5361C2463236L79462L25065J38467K0021k29779l66670l24646l21176k70281k76213
5351C1537486j04984o7235j08480J21751J91233J76595K56563L01739M09261N89852
5341C3303781N89351Q48316R04402J117830J298726J339379J498354J834077K145932
5332D4880148K383463K642305K877473L098238L198663L399730L360036L341160
$$ plain form
5398 17589578 17515566 17717673 17851484 18035809 18193163 18245821 18310720 18457782 18693633 18868023
5388 18868023 18977038 19123293 19353864 19728201 19946302 20192647 20496964 20857014 21307456
5379 21307456 21753204 22049646 22313210 22605802 22939818 23470096 24058206 24570138 25151542
5370 25151542 25917710 26701624 27563437 28476082 29471950 30381654 31057115 31813533 32463236
5361 32463236 32842698 33167763 33306230 33326251 33096472 32729802 32405156 32083980 31813699 31537486
5351 31537486 31432502 31365267 31256787 31378538 31569771 31746366 32002929 32304668 32713929 33303781
5341 33303781 33893132 34741448 35645850 36763680 38062406 39401785 40900139 42734216 44880148
5332 44880148 47263611 49905916 52783389 55881627 59080290 62480020 65840056 69181216
5324F9181216L262769L124425K718608K346489J717160P67079k87090j179123
5316H1651533j561220j823763j840509j680274j648380j604504j240150p58034
5308F9494699m00024j90786K38061M65083O90226P74903P33494N35909J14237
5299G2455802k75181o63120j139765j525117j759378j938088k170407k010442
5291F0974304k018175k009207j747170j626540j209862q64298n76103l50984m4940
5282E0527025K12438M45124P81880Q65959J037400J265875J191467J224222J140676
5273E8692066R74908O43869J70479j17039p19918j299383j568048j952661k181926
5264E2642347k360295k445339k461747k341093k304421k129618j997766j988497
$$ plain form
5324 69181216 72443985 75568410 78287018 80633507 82350667 83117746 82830656 81651533
5316 81651533 80090313 78266550 76426041 74745767 73097387 71492883 70252733 69494699
5308 69494699 69094675 68903889 69141950 69607033 70297259 71072162 71805656 72341565 72455802
5299 72455802 72180621 71517501 70377736 68852619 67093241 65155153 62984746 60974304
5291 60974304 58956129 56946922 55199752 53573212 52363350 51499052 50922949 50571965 50527025
5282 50527025 50739463 51184587 51966467 52832426 53869826 55135701 56327168 57551390 58692066
5273 58692066 59666974 60310843 60481322 60364283 59644365 58344982 56776934 54824273 52642347
5264 52642347 50282052 47836713 45374966 43033873 40729452 38599834 36602068 34613571
5256C4613571j819329j613860j448884j420288j238736j037138j126719q91845
5248B4016772p92445p73134o87145p71554n71854n70347m31341l37722m88701
5239A8592529l46554l29393l02871k21446k85980k32883j73765j31267k9995m9587
5229A6488788j08732j27689P3918j21119q8972R9980J185M5197K75813K80434
5219A6818803J97941K58018L53362L73375L68661L50293K59887L44265K25953
5210A9550558J27507O7863p7473j94646m00523m25703m61995o74103o35920n07814
5200A6367751n88978n80235n67048o14755n71644l38925l00138m50071l13458
5191A2042499j73368l21498k18229j43681k11016k75878j64450j25705j91029
$$ plain form
5256 34613571 32794242 31180382 29731498 28311210 27072474 26035336 24908617 24016772
5248 24016772 23224327 22451193 21764048 20992494 20420640 19850293 19418952 19081230 18592529
5239 18592529 18245975 17916582 17613711 17392265 17106285 16873402 16699637 16568370 16538375 16488788
5229 16488788 16380056 16252367 16326285 16205166 16116194 16216174 16217359 16262556 16538369 16818803
5219 16818803 17016744 17274762 17628124 18001499 18370160 18720453 18980340 19324605 19550558
5210 19550558 19678065 19745928 19668455 19473809 19073286 18647583 18185588 17511485 16875565 16367751
5200 16367751 15778773 15198538 14631490 14016735 13445091 13106166 12806028 12355957 12042499
5191 12042499 11869131 11547633 11329404 11185723 10974707 10698829 10534379 10408674 10217645
5182A0217645j47537j01441j40884j09109j3737j55490j08037q9091j10166K6454
5172I268607n150k52489q0858n1189j8653j7943n3572q0404l6509j02502j6311
5161H553027j03132o3566K7883l1930n5749Q9052m1374k1689q920J5483k1099
5150H337986n2146j1115n8714k3025j03437j44116r6156r4886k9360o0784j2744
5139G651503O183l8125p0054j4250n8953j18916M2522m264K8627j06167p0585
5128G247521j14641Q744N3632l8029m5352L8420l2049m1094M631m8155n7020Q72
5116F977480K9578m3446L5030k5304P803o4840n531r1388K9763O4195o8744k2779
5104F821817L3404k9594j46083J8759m4201N1440K3741k7278m1573M7464J3669
$$ plain form
5182 10217645 10070108 9968667 9827783 9718674 9704937 9549447 9441410 9352319 9242153 9268607
5172 9268607 9263457 9010968 8930110 8878921 8860268 8842325 8788753 8708349 8671840 8569338 8553027
5161 8553027 8449895 8386329 8414212 8382282 8326533 8415585 8374211 8352522 8343602 8359085 8337986
5150 8337986 8285840 8274725 8216011 8192986 8089549 7945433 7849277 7754391 7725031 7664247 7651503
5139 7651503 7657686 7619561 7549507 7535257 7476304 7357388 7399910 7395646 7424273 7318106 7247521
5128 7247521 7132880 7141624 7195256 7157227 7111875 7150295 7118246 7077152 7081783 7033628 6976608 6977480
5116 6977480 7007058 6963612 6998642 6973338 6981141 6916301 6910770 6819382 6849145 6913340 6844596 6821817
5104 6821817 6855221 6825627 6679544 6698303 6654102 6705542 6729283 6702005 6660432 6707896 6721565
5093F721565n2664Q2934O5439j33949p3008k2479k5949l9282k267j4059K4178
5082F530459P4569J23239k3952q1852o296R5726j035R683j28045n3880m2315r1652
5070F404649K7675q4410k9749J0938m2832l8781M611M807j475m6863n0091j3024
5058F145455r7405L9505Q6961p0311N2663O913r2036m167J153o631L2301M1466
5046F135867o1715J15369j3321j23908Q3467N7996J3145j7030J56488J67149l7097
5035F476410j0661K37108K7467Q5877O6436k7351p9758n8109L4955j43717n2534
5024F556123n9986j25782l7801l2737p8449j05064J01054j8588m829q0574j6814
5013F096553M3880n9376p6241K4890j19753l0600K7596o8368J2108q2500J0128
$$ plain form
5093 6721565 6668901 6751835 6817274 6683325 6610317 6587838 6561889 6522607 6520340 6506281 6530459
5082 6530459 6605028 6728267 6704315 6622463 6616167 6711893 6710858 6720541 6592496 6538616 6496301 6404649
5070 6404649 6432324 6347914 6318165 6329103 6286271 6247490 6252101 6256908 6255433 6208570 6158479 6145455
5058 6145455 6048050 6087555 6174516 6104205 6156868 6163781 6071745 6067578 6068731 6062100 6094401 6135867
5046 6135867 6074152 6189521 6176200 6052292 6135759 6193755 6206900 6189870 6346358 6513507 6476410
5035 6476410 6465749 6702857 6730324 6816201 6882637 6855286 6775528 6717419 6752374 6608657 6556123
5024 6556123 6496137 6370355 6332554 6299817 6221368 6116304 6217358 6198770 6193941 6113367 6096553
5013 6096553 6140433 6081057 6004816 6029706 5909953 5879353 5906949 5838581 5850689 5768189 5778317
5002E778317p8082j21698L1311J9329J397l2841o0335L7375J682J05680O1559
4991E743694j15458m2469J1035L4982O2410K8020j23900q8200j0736l1517k7874
4980E439987k0083K9047r5151Q716K6018O2302O7721o9372j16323j1079J2819
4969E334602j8749l8960J03154J00370o6901O10l8388n7058M4112j53153L1052
4958E240691N1672p2357J1240K1227q6848o6355Q5175p3679L3886K1223q1062
4947E084813l5077k6481N2824J14028l2867p1884q9194N6090k0944N4199Q707
4936E094214N7106l5443j9829L3851L760J9371n9947m9362J8282L4147N4414n8751
4924E091813l9940J30868m0941J12359Q0129j49447m7350K6654o6024J32079P6899
$$ plain form
5002 5778317 5700235 5578537 5609848 5629177 5630574 5597733 5537398 5574773 5576455 5682135 5743694
4991 5743694 5628236 5585767 5596802 5631784 5694194 5722214 5598314 5510114 5499378 5467861 5439987
4980 5439987 5419904 5448951 5353800 5362516 5388534 5450836 5518557 5449185 5332862 5321783 5334602
4969 5334602 5315853 5276893 5380047 5480417 5413516 5414126 5375738 5318680 5362792 5209639 5240691
4958 5240691 5292363 5220006 5231246 5252473 5165625 5099270 5184445 5110766 5144652 5165875 5084813
4947 5084813 5049736 5023255 5076079 5190107 5157240 5085356 4996162 5052252 5031308 5085507 5094214
4936 5094214 5151320 5115877 5096048 5129899 5133659 5153030 5093083 5043721 5062003 5096150 5150564 5091813
4924 5091813 5051873 5182741 5141800 5254159 5334288 5184841 5137491 5164145 5098121 5230200 5307099
4913E307099Q2410j33177M2072j0389j37548O3909l7294j10905n9120J32255J7244
4902E156556P838o4041n8236N9039n2232p8277J8579K8372K588j9610J6998O6830
4890E084404L0299k9681N3143j1081K5148O5870n681m094n2130O353j4820o0270
4878E087460J20528J44717k9805M4544J4421l1824J4055P8408R4560j491L6785
4867E572358J02339l6930o1386p1879K0377k3873q7742o2841J12769r6783J06184
4856E472593L4559m1770n6851m5943R5328J4529l6119j27817N9058j9738m3117
4845E304712j44118p445k7749K8723j0012j1617J27428n6551R4426R8182L4797
4834E430776J3815J16734O8320r4310Q8452L2463m1871Q9944K9678N2362J04547
$$ plain form
4913 5307099 5389509 5256332 5298404 5288015 5150467 5214376 5177082 5066177 5007057 5139312 5156556
4902 5156556 5164394 5100353 5042117 5101156 5048924 4970647 4989226 5017598 5020186 5000576 5017574 5084404
4890 5084404 5114703 5085022 5138165 5127084 5152232 5218102 5212421 5208327 5156197 5162550 5147730 5087460
4878 5087460 5207988 5352705 5322900 5367444 5381865 5350041 5364096 5442504 5537064 5535573 5572358
4867 5572358 5674697 5637767 5576381 5504502 5524879 5501006 5413264 5350423 5463192 5366409 5472593
4856 5472593 5507152 5465382 5408531 5362588 5457916 5472445 5436326 5308509 5367567 5347829 5304712
4845 5304712 5160594 5153149 5125400 5154123 5144111 5132494 5259922 5203371 5297797 5395979 5430776
4834 5430776 5444591 5561325 5629645 5535335 5623787 5656250 5614379 5704323 5734001 5786363 5890910
4823E890910r0256p8486J3866O3756k1005M6951l4253O6698j17188J19440J38887
4812E999320J52576J01023j54055k9670q356J18502J39481p5108j47624J10611
4802F206700J3591p1516M7356Q0445j17861k2884J07299m7034L7685M7262q5726
4791F195317j2017J07139J42316n9340J2582J84388P5148J0696k2223P9531L9981
4780F753518M5900J44854J65958l1876j34491M9373Q6515r7475J4527M8860j56523
4769F889140l4175n867j34701L1388J8194k2934q1892L2324j1021p5659N9235
4758F664032J2646L1540j7700j6787l7354L9044M6854R9018p896m6736N9060R8464
4746F924185R8025N8510m1964P5758N9384n9195J014J75546M4151J00259J58227
$$ plain form
4823 5890910 5800654 5722168 5736034 5799790 5778785 5825736 5791483 5858181 5740993 5860433 5999320
4812 5999320 6151896 6252919 6098864 6069194 6060838 6179340 6318821 6243713 6096089 6206700
4802 6206700 6220291 6148775 6196131 6276576 6158715 6135831 6243130 6196096 6233781 6281043 6195317
4791 6195317 6183300 6290439 6432755 6373415 6385997 6570385 6645533 6656229 6634006 6713537 6753518
4780 6753518 6799418 6944272 7110230 7078354 6943863 6993236 7079751 6982276 6996803 7045663 6889140
4769 6889140 6854965 6849098 6714397 6745785 6763979 6741045 6659153 6691477 6680456 6604797 6664032
4758 6664032 6676678 6708218 6690518 6673731 6636377 6675421 6722275 6821293 6813397 6766661 6825721 6924185
4746 6924185 7022210 7080720 7038756 7114514 7173898 7114703 7115717 7291263 7335414 7435673 7593900
4735G593900J8707J35515Q3673O6155J00325R693N1948L7661J01552J24804J17998
4724H441931J72623M6849J20509J10187L6572O5132J59897J00799J1888J16836
4714I383223J47249K32201R2404J09487K47962J29684J67591J94222K25375L71996
4704A1301394J84710J11179K47776K62468K54703J40708J46527K71663N104J41121
4694A3067353J51357K57898K79223J17185J51010K28676K39820K00472K72105
4685A4965099K70185L16125L03446L73475L13419L82627L53527K85164L94941
4676A7958008K81728K45046K21775J22107Q1669k3894J2795j7378p2943k17448
4666A8591465j16519j87654j75271k79444k33370K8384m346p0230n6700J59242
$$ plain form
4735 7593900 7612607 7748122 7831795 7897950 7998275 8007968 8059916 8097577 8199129 8323933 8441931
4724 8441931 8614554 8661403 8781912 8892099 8928671 8993803 9153700 9254499 9266387 9383223
4714 9383223 9530472 9762673 9855077 9964564 10212526 10342210 10509801 10704023 10929398 11301394
4704 11301394 11486104 11597283 11845059 12107527 12362230 12502938 12649465 12921128 12926232 13067353
4694 13067353 13218710 13476608 13755831 13873016 14024026 14252702 14492522 14692994 14965099
4685 14965099 15235284 15551409 15854855 16228330 16541749 16924376 17277903 17563067 17958008
4676 17958008 18239736 18484782 18706557 18828664 18910333 18886439 18899234 18881856 18808913 18591465
4666 18591465 18474946 18287292 18112021 17832577 17599207 17627591 17623245 17553015 17496315 17655557
4656A7655557K29157Q7588J60902K60864K91018K18898J23413Q6072J49437N3697
4646A9316603L4871J24174J40631J93494J41587Q8119N0121K20579K65829L7198
4636B0613206K08630J93945K68043L04529J36176K85111J95154K57611L59408
4627B2821813L09972J37102L9969K06561J94681O3353N8394J06769P8457J45836
4617B4162907K07880J84898K54757L32809L57857L44003M61441N22381M28731
4608B7257664N84355O96545N56664O06319N92010M82568M72697M60754K30670
4599C1940246J62464J00158m1911j82054l10933l10286m09506l58808m57268l18565
4589B9813537j73496k66961k30095j64623r3300M6449J93719J70368L10054L94753
$$ plain form
4656 17655557 17884714 17972302 18133204 18394068 18685086 18903984 19027397 19113469 19262906 19316603
4646 19316603 19351474 19475648 19616279 19809773 19951360 20039479 20089600 20310179 20576008 20613206
4636 20613206 20821836 21015781 21283824 21588353 21724529 22009640 22204794 22462405 22821813
4627 22821813 23131785 23268887 23308856 23515417 23710098 23773451 23831845 23938614 24017071 24162907
4617 24162907 24370787 24555685 24810442 25143251 25501108 25845111 26306552 26828933 27257664
4608 27257664 27842019 28538564 29095228 29701547 30293557 30776125 31248822 31709576 31940246
4599 31940246 32102710 32202868 32160957 31978903 31667970 31357684 30948178 30589370 30132102 29813537
4589 29813537 29640041 29373080 29142985 28978362 28885062 28931511 29125230 29295598 29605652 30000405
4579C0000405K83525M17164M75626N22472O83392N63371N91046N49587N22446
4570C4609034O37753O42784M77424M80215M65235L50032M31740L13710J72030
4561C8579957K54964J49517K06092K89974J36445J20822J13376J90869K09481
4552D0251497K19655L95713J80242L62550N29328N67601O11095Q16411R41195
4543D4875287R26449J178298J097080J179780J319337J264488J362691J372411
4535E4575821J519836J414559J560487J436109J111960Q77807M44105J20839m54657
4526F2606866q20934p67926m28695l95822j55039J33100M60494M53712M87341
4517F1573097P00224P01451O67375P87015O75939O70099O42740M91172K64494
$$ plain form
4579 30000405 30283930 30701094 31176720 31699192 32382584 32945955 33537001 34086588 34609034
4570 34609034 35246787 35889571 36366995 36847210 37312445 37662477 38094217 38407927 38579957
4561 38579957 38834921 38984438 39190530 39480504 39616949 39737771 39851147 40042016 40251497
4552 40251497 40471152 40866865 41047107 41409657 41938985 42506586 43117681 43934092 44875287
4543 44875287 45801736 46980034 48077114 49256894 50576231 51840719 53203410 54575821
4535 54575821 56095657 57510216 59070703 60506812 61618772 62496579 62940684 63061523 62606866
4526 62606866 61785932 61018006 60589311 60193489 60038450 60171550 60632044 61085756 61573097
4517 61573097 62273321 62974772 63642147 64429162 65105101 65775200 66417940 66909112 67173606
4508F7173606m2453k86117m19974n45022o55179p20075n84187n99692l98959l06040
4498F2615908j79174j4112K3743O8928o8112j97186l43826l62425l67876m53457
4488F0722411n86234m98039n21622k20726k36495q9890P9192K15441K13793L31671
4478E9409502L29698K54645K76650L61372L79009K56654M56976O32251O86387
4469F3043144P56735Q03064O71107O62786N48790M05314M41439P00128Q24865
4460F8857372Q41186J114957J310277J573021J513767J687705J886327J909618
4452H0694230K073062K084221K246272K437623K570134K492363K592733K627612
4444I9818250K483608K302226K160886J975327J599829J222700Q88302Q01629
$$ plain form
4508 67173606 67131153 66845036 66425062 65880040 65224861 64504786 63920599 63320907 62921948 62615908
4498 62615908 62436734 62422622 62446365 62515293 62447181 62249995 61906169 61543744 61175868 60722411
4488 60722411 60136177 59638138 59116516 58895790 58659295 58569405 58648597 58864038 59077831 59409502
4478 59409502 59739200 59993845 60270495 60631867 61010876 61267530 61724506 62356757 63043144
4469 63043144 63799879 64602943 65274050 65936836 66485626 66890940 67332379 68032507 68857372
4460 68857372 69698558 70813515 72123792 73696813 75210580 76898285 78784612 80694230
4452 80694230 82767292 84851513 87097785 89535408 92105542 94597905 97190638 99818250
4444 99818250 102301858 104604084 106764970 108740297 110340126 111562826 112451128 113252757
4436A13252757R15997k26487j366294j740236j384088j152174j119845r66865
4428A06212765j241803j124783j255988j302089j148518j209656j202893r97619
4420I6729416q20968q40698o78717n68338o09388p19595p83561p85490r32780
4411H9989881j251224j378332j492776j525775j532619j609406j366484j271919
4403G8561346j069082q50927o16501m63341l35608j90426Q0243K44888L33167
4394G5693759N28383N05475N57318M48864L24746J79546k09305o03379q93668
4385G6531739q41471p77956o32429n81419l79606k32497k25773j63684k84243
4376G2412661k62972m46588l81293k92399j80858M154J37384N61617Q90579J264196
$$ plain form
4436 113252757 114168754 113942267 112575973 110835737 109451649 108299475 107179630 106212765
4428 106212765 104970962 103846179 102590191 101288102 100139584 98929928 97727035 96729416
4420 96729416 95908448 95067750 94389033 93820695 93211307 92491712 91708151 90922661 89989881
4411 89989881 88738657 87360325 85867549 84341774 82809155 81199749 79833265 78561346
4403 78561346 77492264 76641337 76024836 75561495 75225887 75035461 75115704 75360592 75693759
4394 75693759 76222142 76727617 77284935 77733799 78058545 78238091 78028786 77425407 76531739
4385 76531739 75690268 74912312 74279883 73698464 73318858 73086361 72860588 72696904 72412661
4376 72412661 72149689 71703101 71321808 71029409 70848551 70852705 70990089 71551706 72442285 73706481
4366G3706481J599050J831257K274122K602791L036771L420263L806039M257289
4358I6534063M837643N630424O208853P376234Q463024Q936108Q632679P303672
4350A53922700L655681l195614r800875j3344226j3754012j2068382r836184p717566
4342H7861522o170877m956261m042185l362873k746380k409208k195940k139254
4334E9838544j894733j830942j817139j603454j562462j465239j551041j492302
4326D6621232j387768j410932j254385j366242j141709j024069j055275r37093
4318C7043759p49171p05368m94632l64330l87115l36235k95393j47354k23272
4309C3340889j29940k34173j81655l67973l35672l47731m60219m09611n07763
$$ plain form
4366 73706481 75305531 77136788 79410910 82013701 85050472 88470735 92276774 96534063
4358 96534063 101371706 107002130 113210983 120587217 129050241 137986349 146619028 153922700
4350 153922700 157578381 154382767 144581892 131237666 117483654 105415272 95579088 87861522
4342 87861522 81690645 76734384 72692199 69329326 66582946 64173738 61977798 59838544
4334 59838544 57943811 56112869 54295730 52692276 51129814 49664575 48113534 46621232
4326 46621232 45233464 43822532 42568147 41201905 40060196 39036127 37980852 37043759
4318 37043759 36294588 35589220 35094588 34730258 34343143 34006908 33711515 33564161 33340889
4309 33340889 33210949 32976776 32795121 32427148 32091476 31743745 31283526 30873915 30366152
4300C0366152m78390n18825m26045k86419k54926l18967k06341r3805j35249j54661
4290B7492524J2334r6081r5110M5638K78k4763L36469J94672R2482J06618K9921
4279B8094982J34217J44267J96085J95291J33253J18887L00434M04893M64641
4270C0186950L92862M28375M56906O04332O68072P15516P26643O91119P34169
4261C5604944P67951Q03142Q50898R29477R60226J104958J149563J140707J233280
4252D4545146J339360J356021J514008J686429J772709K085630K321955K778608
4244E9399866L055936L408279L792222M521978N142431N774862O717284P775920
4236I9588778Q850086R879466J0812462J1802033J2596969J2761405J2168628
$$ plain form
4300 30366152 29887762 29368937 28942892 28656473 28401547 28082580 27876239 27782434 27647185 27492524
4290 27492524 27504858 27408777 27313667 27359305 27359583 27334820 27671289 27865961 27958443 28065061 28094982
4279 28094982 28229199 28373466 28569551 28764842 28898095 29016982 29317416 29722309 30186950
4270 30186950 30579812 31008187 31465093 32069425 32737497 33453013 34179656 34870775 35604944
4261 35604944 36372895 37176037 38026935 38956412 39916638 41021596 42171159 43311866 44545146
4252 44545146 45884506 47240527 48754535 50440964 52213673 54299303 56621258 59399866
4244 59399866 62455802 65864081 69656303 74178281 79320712 85095574 91812858 99588778
4236 99588778 108438864 118318330 129130792 140932825 153529794 166291199 178459827
4229A78459827J0472123P284230K258072l791279r777717j3923843j5545063j5366625
4221A40069725j4179774j2499721j0824545r421559q115148o939076o071137n450485
4213F6568280m950214m311659l799555l335232l015290k753134k364224k122473
4205C9916499k057249j806557j606394j291230j128468j233110j132407q79113
4197B8781971p78581q44456n81431n38402n52187l88395l93894l14609m52523
4188B3937493l88080m20172m41855m46146m86367n27415l08363l63640l03459
4179B0251996l55247l74362m00179m28567m81760n25179n77920m00625m81107
4170A6227050m98477m43659m02895l40067m27213k66508k05786l22356k50071
$$ plain form
4229 178459827 188931950 196216180 198474252 194682973 184905256 170981413 155436350 140069725
4221 140069725 125889951 113390230 102565685 93144126 85028978 78089902 72018765 66568280
4213 66568280 61618066 57306407 53506852 50171620 47156330 44403196 42038972 39916499
4205 39916499 37859250 36052693 34446299 33155069 32026601 30793491 29661084 28781971
4197 28781971 28003390 27158934 26577503 26039101 25486914 25098519 24704625 24390016 23937493
4188 23937493 23549413 23129241 22687386 22241240 21754873 21227458 20919095 20555455 20251996
4179 20251996 19896749 19522387 19122208 18693641 18211881 17686702 17108782 16708157 16227050
4170 16227050 15728573 15284914 14882019 14541952 14114739 13848231 13642445 13320089 13070018
4161A3070018o9403j16577j09664o7137q0636L6034J55933N0689M44018L59523
4151A3672798K61114k85963p10419o82928n13133m50885m28992j41766j04558
4142A0615268j10270k1890j5746k02670o8026J02748q9145j17243p9291p4117
4132I939618j38279m5521j31915j75922j32761j13057n8834J2784k33066o0140
4122H862907j22887j42638k9263j52316R560K3607k83073N4800l9547o6978N1210
4111H165382j9748o8125l747J02119Q73j04066m589M5368l6898M600J554P7782
4099H160505N2564r6920o0137Q9951K5305p1162K3302L1370O5941M6721l532P6193
4087H340101J07968J53707J08563O7049O7246J36076J28647j7990J04997J69702
$$ plain form
4161 13070018 13000615 12884038 12774374 12707237 12626601 12662635 12818568 12869257 13313275 13672798
4151 13672798 13933912 13647949 12937530 12254602 11741469 11290584 10861592 10719826 10615268
4142 10615268 10504998 10483108 10467362 10264692 10196666 10299414 10210269 10093026 10013735 9939618
4132 9939618 9801339 9755818 9623903 9447981 9315220 9202163 9143329 9156113 8923047 8862907
4122 8862907 8740020 8597382 8568119 8415803 8425363 8448970 8165897 8220697 8181150 8114172 8165382
4111 8165382 8145634 8077509 8073762 8175881 8176754 8072688 8068099 8113467 8076569 8081169 8082723 8160505
4099 8160505 8213069 8116149 8056012 8145963 8171268 8100106 8123408 8154778 8220719 8267440 8263908 8340101
4087 8340101 8448069 8601776 8710339 8777388 8844634 8980710 9109357 9091367 9196364 9366066
4077I366066R8177K01423J3876J40084K13811L33441J52984K35868K73361L06884
4067A1335975L76860O20891O32765P82187R72316J259999J404552J042361P80702
4058A9208608L75093n54125j130237j271283j226129r58850m61771k93812r0041
4049A3597453O5231k6192J02402J75574R3552M8691J36438M5282N0399Q6509K03398
4038A4578737K16335R7383K19774K43971K00045K48692K65197K62441K58101K57712
4028A6848388K45623K34432K35300M7782J92916K89819J52373J71651K30613J64064
4018A8812961L43103L36607N44693M53045N01160N94163N88689N98914N71771
4009B3345106O31359O33928O24505O33511O01454M86863N26129O15059O96952
$$ plain form
4077 9366066 9464243 9665666 9679542 9819626 10033437 10366878 10519862 10755730 11029091 11335975
4067 11335975 11712835 12333726 12966491 13748678 14720994 15980993 17385545 18427906 19208608
4058 19208608 19583701 19029576 17899339 16628056 15401927 14443077 13981306 13687494 13597453
4049 13597453 13662684 13636492 13738894 13914468 14008020 14056711 14193149 14238431 14288830 14375339 14578737
4038 14578737 14795072 14892455 15112229 15356200 15556245 15804937 16070134 16332575 16590676 16848388
4028 16848388 17094011 17328443 17563743 17611525 17804441 18094260 18246633 18418284 18648897 18812961
4018 18812961 19156064 19492671 20037364 20490409 20991569 21585732 22174421 22773335 23345106
4009 23345106 23976465 24610393 25234898 25868409 26469863 26956726 27482855 28097914 28794866
4000B8794866P14125R01455Q70024R34408Q74104R56917P75405O31017M51548
3991C5903869M00933P2670J00407J17137K47664L80471L64651N88274M80213K60986
3981C8917275N37589K73895N3630j77052l21372n33953p37058p58975p54165o19582
3971C5880232n43462n66760n76860m90319m57452n61840p12979p74820r90472
3962C0205268j134202j211657j225806j014907r74997r46113r73365q91218p52272
3953B1080731q03562o18485o71628o09722p93530q31544q81863q56254p36129
3944A4278014o49023n21137o79985n79732n19039l54889m70782m27928m03647
3935I671852l50016l78140l09604j68051l80862k59197j61241r9261j74326k85608
$$ plain form
4000 28794866 29508991 30410446 31280470 32214878 33088982 34045899 34821304 35452321 35903869
3991 35903869 36304802 36377472 36477879 36595016 36842680 37223151 37587802 38176076 38656289 38917275
3981 38917275 39454864 39728759 39782389 39605337 39283965 38750012 38012954 37253979 36499814 35880232
3971 35880232 35336770 34770010 34193150 33702831 33245379 32683539 31970560 31195740 30205268
3962 30205268 29071066 27859409 26633603 25618696 24643699 23697586 22724221 21833003 21080731
3953 21080731 20277169 19658684 18987056 18377334 17583804 16752260 15870397 15014143 14278014
3944 14278014 13628991 13107854 12427869 11848137 11329098 10974209 10503427 10075499 9671852
3935 9671852 9321836 8943696 8634092 8466041 8085179 7825982 7664741 7565480 7391154 7105546
3925G105546j84812j14342j83695k33447k25713q6501j35148k62643k84936j9663
3915E374646j35270j65418j50839r2823q3670j95545j85966L1410L6617k08702
3905D224440r7697j59546m0793m4842k4288o9146p3223q5307j34743j879q9106
3894C403870n7641k415n2667m7776o9488q0201j00701l7999l1189l9759J6802
3883B900836J0809k5636q6451k7829k5671l800m3186p313q9793n7952o7385M9181
3871B525810Q0352K7131j45989l2160N792o3997j5790L6824p4614j5373L0465
3860B358451l8852q3171j06275J27682o8632q0903k4446P2986k4894J44678P0335
3849B346959q3652j59874J2102j0875q6357j178n1684J67889M5320P5791j5445
$$ plain form
3925 7105546 6920734 6806392 6622697 6389250 6163537 6077036 5941888 5679245 5394309 5374646
3915 5374646 5239376 5073958 4923119 4830296 4746626 4551081 4365115 4396525 4433142 4224440
3905 4224440 4126743 3967197 3926404 3881562 3857274 3788128 3714905 3629598 3494855 3492976 3403870
3894 3403870 3346229 3343814 3291147 3243371 3173883 3093682 2992981 2954982 2923793 2884034 2900836
3883 2900836 2911645 2886009 2799558 2771729 2746058 2742258 2699072 2691759 2601966 2544014 2476629 2525810
3871 2525810 2606162 2633293 2487304 2455144 2460936 2396939 2381149 2417973 2343359 2327986 2358451
3860 2358451 2319599 2236428 2130153 2257835 2189203 2108300 2083854 2156840 2131946 2276624 2346959
3849 2346959 2263307 2103433 2115535 2104660 2018303 2017125 1965441 2133330 2178650 2254441 2238996
3838B238996N2696q6028N5228L6786n3929J4858J9974n5903n9331r7750K5043
3827B090640k5855L2905p6347l7851r640p2222K1514l2868k0171M5188j0200k4437
3815A880656j3991q4557P9865l9977P4591P5584m1731J847n7971J15068k9547
3804A959837j00186m6985o7023l4020N9465k5155p5138J3060j22368M5669n719
3793A601437K3925o5882M0360q1063k9688J9798j2533k6043m7100j9777P5023
3782A478457K2766N0996o4253J9195l0697p4746J9341N3340l5655Q2265m3445
3771A477564p465M2359J8192q163l8969Q79J7110J454K4272m7726q4386l5177
3759A359944k6080N2421n8390m576k5599K7929J29954P5146k9931o9077J6154
$$ plain form
3838 2238996 2291692 2205664 2260892 2297678 2243749 2258607 2278581 2222678 2163347 2065597 2090640
3827 2090640 2064785 2097690 2021343 1983492 1973852 1901630 1923144 1890276 1870105 1915293 1905093 1880656
3815 1880656 1866665 1782108 1861973 1821996 1896587 1972171 1930440 1932287 1874316 1989384 1959837
3804 1959837 1859651 1812666 1745643 1711623 1771088 1745933 1670795 1683855 1561487 1607156 1601437
3793 1601437 1625362 1559480 1599840 1518777 1489089 1508887 1496354 1470311 1423211 1403434 1478457
3782 1478457 1501223 1552219 1487966 1507161 1476464 1401718 1421059 1474399 1438744 1521009 1477564
3771 1477564 1470099 1512458 1530650 1522487 1483518 1484397 1501507 1502961 1527233 1479507 1395121 1359944
3759 1359944 1333864 1386285 1327895 1323319 1297720 1325649 1455603 1530749 1500818 1431741 1447895
3748A447895l0376J6504l9645K4073K641l2887J26N1338K6820k3093P4992j48620
3736A369768Q929j09014M6995Q6677M6469o495j04698n21M4873K9395p3188k0113
3724A319077L1265N0622L5696q2708k0767M4489k612m6468L6074J344K5015Q6222
3712A477249k7052k7940l4233N103R8662m434n4019m0609J4999O5145l0593O2334
3700A504612J04288o9134n7790o0684J9054J01305L229M906j544p6564P934P2603
3688A552215O474p8209o9668J02457O1464J9329O7477j2881N0409n5452K4831
3677A668446p9050K5307K0540M2463J2938j19026J04080K1276Q113m4949L2051
3666A692189O0596r2317p1344o5107M1837O2955K7984k2156j1703N3619O9056
$$ plain form
3748 1447895 1417519 1434023 1394378 1418451 1421092 1388205 1388331 1439669 1466489 1443396 1518388 1369768
3736 1369768 1378697 1269683 1316678 1403355 1449824 1443329 1338631 1338110 1382983 1412378 1339190 1319077
3724 1319077 1350342 1400964 1436660 1353952 1333185 1377674 1375062 1328594 1364668 1366012 1391027 1477249
3712 1477249 1450197 1422257 1388024 1393127 1491789 1487355 1433336 1392727 1407726 1472871 1442278 1504612
3700 1504612 1608900 1539766 1481976 1421292 1440346 1541651 1544880 1549786 1548242 1471678 1479612 1552215
3688 1552215 1558689 1480480 1410812 1513269 1574733 1594062 1661539 1648658 1699067 1643615 1668446
3677 1668446 1589396 1614703 1635243 1677706 1690644 1571618 1675698 1696974 1705087 1660138 1692189
3666 1692189 1752785 1660468 1589124 1524017 1565854 1628809 1656793 1634637 1622934 1676553 1745609
3655A745609j6542q6972j04263K3489Q3748J29230J8671n1621n9085O8784m556
3644A746492m2834k9322l7175K0020n4278K6100J41773L7935n7583l674L357M0438
3632A791249M094J6743n5738R5882P620n9075J681l708L0320P5839L7588o1783
3620A880712K8954L7977o8330l0968P4271L4836n3712k0063M9294R4820K6386
3609B054177j32361o072Q3657R7309L5508m9148P873L9926O4359k9044k5538R6903
3597B237549r386M7151M3306J4660J25187J8129j7151q753L7042k7619l3525J25682
3585B552272K9414n7894P2059M9017k490j00907K0023P196P5339r3787O2223O2525
3573B674990k2806j8996L0127J9791Q1792Q3626O9213L6087P7637P7217r679p6063
$$ plain form
3655 1745609 1729067 1642095 1537832 1561321 1645069 1774299 1792970 1741349 1682264 1751048 1746492
3644 1746492 1703658 1674336 1637161 1657181 1602903 1629003 1770776 1808711 1751128 1747454 1750811 1791249
3632 1791249 1795343 1812086 1756348 1852230 1859850 1800775 1802456 1798748 1829068 1904907 1942495 1880712
3620 1880712 1909666 1947643 1879313 1848345 1922616 1957452 1903740 1883677 1932971 2027791 2054177
3609 2054177 1921816 1915744 1999401 2096710 2132218 2083070 2090943 2130869 2195228 2166184 2140646 2237549
3597 2237549 2228163 2275314 2318620 2333280 2458467 2476596 2459445 2450692 2487734 2460115 2426590 2552272
3585 2552272 2581686 2523792 2595851 2644868 2642378 2541471 2561494 2568690 2644029 2550242 2612465 2674990
3573 2674990 2652184 2633188 2663315 2683106 2764898 2848524 2917737 2953824 3031461 3108678 3098999 3022936
3561C022936N0479R341n6038N8056P6101L6135J01097J00373Q8129n2299l3447
3550C400863N8429J5878J50845L523n2704N7975J07291k0346L6396P6810L8575
3539C873535l5114m3775N9365M5408o9772Q4604Q1557k7288n3601J14613R2709
3528D122241l4564K3593N9523K6150K5353J32165O6935q3480j6679J37371R9471
3517D558079j6838O1372J5849P5185J34091N8636k5513M6182N2916q642q4802
3506D866515L8141N8728j20138m9412N0727m1926J33454m1820l6297J9482K5376
3495D902830m6804N4284M687j7924M5131p1856J06229K589J580l6329R0036L2981
3483E067434J8418m8372l1860J48735O1386N7135N4021j6701J6847L8830l9622
$$ plain form
3561 3022936 3073415 3082756 3026718 3084774 3160875 3197010 3298107 3398480 3486609 3434310 3400863
3550 3400863 3459292 3475170 3626015 3629538 3576834 3634809 3742100 3721754 3758150 3834960 3873535
3539 3873535 3838421 3794646 3854011 3899419 3829647 3914251 3995808 3968520 3914919 4029532 4122241
3528 4122241 4087677 4111270 4170793 4196943 4222296 4354461 4421396 4337916 4321237 4458608 4558079
3517 4558079 4541241 4602613 4618462 4693647 4827738 4886374 4860861 4907043 4959959 4951317 4866515
3506 4866515 4904656 4963384 4843246 4793834 4844561 4802635 4936089 4894269 4857972 4877454 4902830
3495 4902830 4856026 4910310 4914997 4897073 4942204 4870348 4976577 4979166 4980746 4944417 5034453 5067434
3483 5067434 5085852 5037480 5005620 5154355 5215741 5272876 5326897 5310196 5327043 5365873 5326251
3472E326251k1548J17088J64826l8908k9304L8092q387j6143o9842R9290J18328
3461E679743N9724M2614J7584L8943q694K9410k0795N8117J9092N6993J15245
3450F087976P0286M4038J86589J4664j7110M0948J97670O1185J4541M5914M9787
3439F796488R0249J09182P7377J12226J51551J57051R0885m776K07550Q1311N1338
3428G920432J30953J97139J78779J27837Q0349J69927J48780J86250K56162K44989
3418I641597J86394K25324K26767L32380K29476K72761K59560L01933K61544L30430
3408A2268166K06968J72617J30039J31318J04114J39048K13136N7426P3899J27242
3398A3623973J51900M0035J6945Q4378J33735J2910k6402k9590Q72M10j22426
$$ plain form
3472 5326251 5304703 5421791 5586617 5547709 5518405 5556497 5548110 5531967 5462125 5561415 5679743
3461 5679743 5739467 5782081 5799665 5838608 5829914 5859324 5838529 5896646 5915738 5972731 6087976
3450 6087976 6158262 6202300 6388889 6403553 6386443 6427391 6625061 6686246 6700787 6746701 6796488
3439 6796488 6886737 6995919 7073296 7185522 7337073 7494124 7585009 7580233 7787783 7869094 7920432
3428 7920432 8051385 8248524 8427303 8555140 8635489 8805416 8954196 9140446 9396608 9641597
3418 9641597 9827991 10053315 10280082 10612462 10841938 11114699 11374259 11676192 11937736 12268166
3408 12268166 12475134 12647751 12777790 12909108 13013222 13152270 13365406 13422832 13496731 13623973
3398 13623973 13775873 13815908 13832853 13917231 14050966 14063876 14037474 14007884 14008756 14009166 13886740
3387A3886740k7321m4399k12957q6590M1498J201p8357o2174J7354j5516N3762
3376A3473241k0780Q0936J10275k275J02969J65041O836J57737J89057P4411K12223
3365A4549671K18879J28035J38300J71811J97570J59588J69609J37396K42502
3356A6113361K70940J66046K27612K67786L23371K20283J92443K64572L99291
3347A8445705K72604L20322L39276M60759L48364L21152L91537L65626M33016
3338B1698361M08471M82110N13924M42912M15060L94245L86030M77670L89053
3329B5607836L96985M64322L24144M57272M92553N98849M93455L76591M87948
3320B9699955N33514L60890M85757O63743M97096N54616M79796N36505N80154
$$ plain form
3387 13886740 13859419 13815020 13602063 13515473 13556971 13558172 13479815 13417641 13434995 13419479 13473241
3376 13473241 13452461 13533397 13643672 13641397 13744366 13909407 13916243 14073980 14263037 14337448 14549671
3365 14549671 14768550 14896585 15034885 15206696 15404266 15563854 15733463 15870859 16113361
3356 16113361 16384301 16550347 16777959 17045745 17369116 17589399 17781842 18046414 18445705
3347 18445705 18718309 19038631 19377907 19838666 20187030 20508182 20899719 21265345 21698361
3338 21698361 22106832 22588942 23102866 23545778 23960838 24355083 24741113 25218783 25607836
3329 25607836 26004821 26469143 26793287 27250559 27743112 28341961 28835416 29212007 29699955
3320 29699955 30233469 30594359 31080116 31743859 32240955 32795571 33275367 33811872 34392026
3311C4392026M97608O41718O01559N30402O78846P27781P55985O55639O93215
3302D0174779P48788Q45957R78801R13986J053855J118798J080822J163298J267036
3293D9346120J360946J310813J454539J605830J619180J877966K033567K029995
3285F2638956K177180K250106K473669K770832K953971L121352L376403L621651
3277H5384120L603081L708969L573966L800023L817167L744557L719446L574984
3269A14926313L502993L353451L160918K870656K654732K357307K215912K166385
3261A37208667J922033J765816J676073J727134J754668J837061J750277J686480
3253A51328209J769784J695234J671799J673014J791455J874525K141355K516527
$$ plain form
3311 34392026 34889634 35531352 36132911 36663313 37342159 38069940 38825925 39481564 40174779
3302 40174779 40923567 41769524 42748325 43662311 44716166 45834964 46915786 48079084 49346120
3293 49346120 50707066 52017879 53472418 55078248 56697428 58575394 60608961 62638956
3285 62638956 64816136 67066242 69539911 72310743 75264714 78386066 81762469 85384120
3277 85384120 88987201 92696170 96270136 100070159 103887326 107631883 111351329 114926313
3269 114926313 118429306 121782757 124943675 127814331 130469063 132826370 135042282 137208667
3261 137208667 139130700 140896516 142572589 144299723 146054391 147891452 149641729 151328209
3253 151328209 153097993 154793227 156465026 158138040 159929495 161804020 163945375 166461902
3245A66461902K883421L211244L809777M326218M786063N459404O204809O355502
3237B03498340O800224P141354P122567P002040O527241N846436M979824L624767
3229B52542793J643989j654824m949366o266111n853118m763653l871578l172420
3221B23655712k857140l013390l425933m204850n177228o253348p183469q115039
3213A83425315q775054q949727r074245q908431q521199q002391p503861o861924
3205A16828483o233204n774536n262568m991710m598412m191600l945460l425405
3197G8405588l194938k963529k799159k525776k341340k143015k119566j998523
3189E8319742j817921j560899j503184j333602j136589j247386j085246j016609
$$ plain form
3245 166461902 169345323 172556567 176366344 180692562 185478625 190938029 197142838 203498340
3237 203498340 210298564 217439918 224562485 231564525 238091766 243938202 248918026 252542793
3229 252542793 254186782 252531958 247582592 241316481 235463363 230699710 226828132 223655712
3221 223655712 220798572 217785182 214359249 210154399 204977171 198723823 191540354 183425315
3213 183425315 174650261 165700534 156626289 147717858 139196659 131194268 123690407 116828483
3205 116828483 110595279 104820743 99558175 94566465 89968053 85776453 81830993 78405588
3197 78405588 75210650 72247121 69447962 66922186 64580846 62437831 60318265 58319742
3189 58319742 56501821 54940922 53437738 52104136 50967547 49720161 48634915 47618306
3181D7618306q86171p94648p45247o15718m86505m88726l68026k35249j22797
3172D2875219k01328n11974o45336o37950m39675k93840k29054j82424j32810
3163C9600828N5606O0062K40193J55982K29482K73709K72010N13677M12253N72422
3153D2386224O41219O63621P94668R25331Q18357Q96912J027452R46793J007772
3144E0108349J108966J015005Q87621Q27482Q58884O50483L76676L24582L23015
3135E6481063J56359J56537J23211k1648q3118q4878l8351k22519j22698j93446
3125E6150512j92291p7143j49044q7418J4371j11762J33645J94967J24489K40636
3115E6240962N4804K57014K50320L28124N00183L88040M50647P68652P06453Q25177
$$ plain form
3181 47618306 46732135 45937487 45192240 44576522 44090017 43601291 43233265 42998016 42875219
3172 42875219 42673891 42161917 41516581 40878631 40438956 40145116 39916062 39733638 39600828
3163 39600828 39656434 39716496 39956689 40112671 40342153 40615862 40887872 41401549 41813802 42386224
3153 42386224 43027443 43691064 44485732 45411063 46229420 47126332 48153784 49100577 50108349
3144 50108349 51217315 52232320 53119941 53947423 54806307 55456790 55833466 56158048 56481063
3135 56481063 56637422 56793959 56917170 56895522 56812404 56727526 56689175 56466656 56343958 56150512
3125 56150512 55958221 55881078 55732034 55644616 55658987 55547225 55680870 55875837 56000326 56240962
3115 56240962 56295766 56552780 56803100 57131224 57631407 58019447 58470094 59238746 59945199 60770376
3105F0770376J018031J200072J447181J540523J877969J944175K072621K158316
3097G4029264K592538K703835K789157K821053K976553L275271L185200L083044
3089I7455915L216064L226874L034020L038209L064493L174428K992010K948008
3081A22150021K989069K914824K994430K895351K798014K773411K884794K814401
3073A45214315K692476K567173K588982K521827K405225K169396J971875K187853
3065A64319122J833129J664558J645340J571512J528655J264232R91799N86849
3057A75405196J51602m86665j028754j621502k405816l112164l775929m359282
3049A58766686m667018m997108n151602n212045n170063m881783m654827m581134
$$ plain form
3105 60770376 61788407 62988479 64435660 65976183 67854152 69798327 71870948 74029264
3097 74029264 76621802 79325637 82114794 84935847 87912400 91187671 94372871 97455915
3089 97455915 100671979 103898853 106932873 109971082 113035575 116210003 119202013 122150021
3081 122150021 125139090 128053914 131048344 133943695 136741709 139515120 142399914 145214315
3073 145214315 147906791 150473964 153062946 155584773 157989998 160159394 162131269 164319122
3065 164319122 166152251 167816809 169462149 171033661 172562316 173826548 174818347 175405196
3057 175405196 175556798 175070133 174041379 172419877 170014061 166901897 163125968 158766686
3049 158766686 154099668 149102560 143950958 138738913 133568850 128687067 124032240 119451106
3041A19451106m448089m231327m180653l988733l884717l900622l759099l712976
3033H7344890l673267l657733l718976l569442l562617l177166l058023k786450
3025F0141216k488989k411381k266778k098830j842567j783029j581284j380963
3017D4287395j284439j071994r30859r36268p20058o80633n62761l88199k38935
3008C7473249j91000j07266M1353J25186P8441J57033J99317L02200L70559J63100
2998C8612172K44364K03263M7500o5890l4944j82815k21215k88342l55590l91113
2988C7567390l76066l99911n42077n11328n22161p01125o88405p43720q52155
2979C2230442q35090q64513r70178r14548r16733q56540q86484p84929o69387
$$ plain form
3041 119451106 115003017 110771690 106591037 102602304 98717587 94816965 91057866 87344890
3033 87344890 83671623 80013890 76294914 72725472 69162855 65985689 62927666 60141216
3025 60141216 57652227 55240846 52974068 50875238 49032671 47249642 45668358 44287395
3017 44287395 43002956 41930962 41000103 40063835 39343777 38663144 38100383 37712184 37473249
3008 37473249 37282249 37174983 37216336 37341522 37419963 37576996 37776313 38078513 38449072 38612172
2998 38612172 38856536 39059799 39107299 39041409 39006465 38823650 38602435 38314093 37958503 37567390
2988 37567390 37191324 36791413 36249336 35738008 35215847 34514722 33826317 33082597 32230442
2979 32230442 31395352 30530839 29560661 28646113 27729380 26872840 25986356 25201427 24532040
2970B4532040o79099o09659n57699m85917m24067l68525k86337l48141k93745
2961B0478851j93962j66195j69864j16093k48175j60835r6559j5258n3314n7602
2951A9200994o565l369P2018j08121J1435J29924J73915n6672J18335J09020K29585
2940A9870499J82037J27140K45432J70876K62446K30594L28931K24290L46290
2931B1988535L58340L33445L27453L21422K08550J45885J15715L00310L78244
2922B4477899R2886K75874L97478K47697K09982M49117K82994M16382L24135L86081
2912B7560525L61277N16569N64289N46003N98692O93423O10549Q10944P43920
2903C3006191P69326O98446O14536M02060K03338L51379L74072L87069L97527
$$ plain form
2970 24532040 23852941 23243282 22685583 22199666 21775599 21407074 21120737 20772596 20478851
2961 20478851 20284889 20118694 19948830 19832737 19584562 19423727 19327168 19311910 19258596 19200994
2951 19200994 19194429 19191060 19263078 19154957 19166392 19296316 19470231 19413559 19531894 19640914 19870499
2940 19870499 20052536 20179676 20425108 20595984 20858430 21089024 21417955 21642245 21988535
2931 21988535 22346875 22680320 23007773 23329195 23537745 23683630 23799345 24099655 24477899
2922 24477899 24570785 24846659 25244137 25491834 25701816 26150933 26433927 26850309 27174444 27560525
2912 27560525 27921802 28438371 29002660 29548663 30147355 30840778 31451327 32262271 33006191
2903 33006191 33775517 34473963 35088499 35490559 35693897 36045276 36419348 36806417 37203944
2894C7203944O58880P68565P76525P60924Q71376P86382R37359J097637J220830
2885D5082422J340584J384566J292474J492662J639809J657691J608820J694675
2877E7193703J841841J662531J780356J908541J934419J994114K102378K216071
2869G2633954K269508K425203K571853K819832L089806L244242L609358L960919
2861I6624675M259428M517062M974573N440959N899663O552697P147252P829354
2853A43245663Q767737R831599J0757748J1855960J3212442J4711232J6512681
2846B28895062J8903420K1443499K4261399K7215061L0001799L1675001L1698792
2839D14094033K8031533J9387125N251699j1591432k6485926l5284324l7178455
$$ plain form
2894 37203944 37862824 38631389 39407914 40168838 41040214 41826596 42763955 43861592 45082422
2885 45082422 46423006 47807572 49100046 50592708 52232517 53890208 55499028 57193703
2877 57193703 59035544 60698075 62478431 64386972 66321391 68315505 70417883 72633954
2869 72633954 74903462 77328665 79900518 82720350 85810156 89054398 92663756 96624675
2861 96624675 100884103 105401165 110375738 115816697 121716360 128269057 135416309 143245663
2853 143245663 152013400 161844999 172602747 184458707 197671149 212382381 228895062
2846 228895062 247798482 269241981 293503380 320718441 350720240 382395241 414094033
2839 414094033 442125566 461512691 466764390 455172958 428687032 393402708 356224253
2832C56224253l4913199l0762452k6769744k3378836k0353043j7568058j5322300
2825A87156621j3848521j2685720j1622641j0674242r834035r193566q518144
2818A10779752p738607o957977o235034n659149n078081m639938m244502l857239
2810F6369225l509919l095989k969526k712445k453305k309749j993819j844503
2802D5479970j775233j764783j582455j500020j277869j357943j390742j213062
2794C3617863j174971r62607q72801r94355q33962p14130q45340r10828o72536
2785B5636333o57835p74456p64552o84229o00592o05755o68474o82814n55120
2776A9642506n39018n18950n03500n47844l57253l20176n46848m39146m17613
$$ plain form
2832 356224253 321311054 290548602 263778858 240400022 220046979 202478921 187156621
2825 187156621 173308100 160622380 148999739 138325497 128491462 119297896 110779752
2818 110779752 103041145 96083168 89848134 84188985 79110904 74470966 70226464 66369225
2810 66369225 62859306 59763317 56793791 54081346 51628041 49318292 47324473 45479970
2802 45479970 43704737 41939954 40357499 38857479 37579610 36221667 34830925 33617863
2794 33617863 32442892 31480285 30607484 29613129 28779167 28065037 27219697 26308869 25636333
2785 25636333 24978498 24204042 23439490 22755261 22154669 21548914 20880440 20197626 19642506
2776 19642506 19103488 18584538 18081038 17533194 17175941 16855765 16308917 15869771 15452158
2767A5452158l89989m05137l59864l82577k90035l34137l28274l73397l35331
2758A2253417k23364j75478k98567j98680j43920j79268k21029j52614k51107
2749A0409390k50143r6321j32380k03548q0297p1909j82171j15364k21930k77729
2739H777598k38590j90057j50391j18602j77104j48004m2015j24891o9324k82806
2729G235814k20024j39755p9100j24825l08060j2389k5533j28989j17907r5502
2719E983730p2825j10149r7282j31106o333p0j95895o7130j6827j21940p7806
2708E086367m2339o1255q9603o5521o4031j45171j9583j06820o1354k7334j10794
2697D292562M9078r1157m8296j0605j19925o7163j36947J8308N0518r3674j52777
$$ plain form
2767 15452158 15062169 14657032 14297168 13914591 13624556 13290419 12962145 12588748 12253417
2758 12253417 12030053 11854575 11556008 11357328 11213408 11034140 10813111 10660497 10409390
2749 10409390 10159247 10062926 9930546 9726998 9646701 9574792 9392621 9277257 9055327 8777598
2739 8777598 8539008 8348951 8198560 8079958 7902854 7754850 7712835 7587944 7518620 7235814
2729 7235814 7015790 6876035 6796935 6672110 6364050 6351661 6326128 6197139 6079232 5983730
2719 5983730 5910905 5800756 5703474 5572368 5566035 5565965 5370070 5302940 5286113 5164173 5086367
2708 5086367 5044028 4982773 4893170 4827649 4763618 4618447 4598864 4492044 4430690 4403356 4292562
2697 4292562 4341640 4250483 4202187 4191582 4071657 4004494 3867547 3885855 3936373 3842699 3689922
2686C689922J01359l6183M9233k8161j75102j2782j13420m2885P3794p7137n4270
2675C374368P9523l9988J4092o9557K7904N3866O3542O8823J03462l1804J24302
2664C768533Q4059j46924q4153j4481n0814j41296q3791l4544j334l2179j46608
2653C116468j1443j06480o6064K7784j43416k3924o4682N7464r3829q2780j03599
2642B505499j06573l2566k6946m5129M2332n6236k7924j7812J6693k6933L6899
2631B261304j04764O494k688l7820M6539p6183L5068o7135l43j00154n8783R8301
2619A999836k1732k5046j81j18187J60503j31318j38027M1722O8917R307m812
2608A840982J9341J2635j2022p4843q2196j2949Q8372J960q4896O1398N1572q2822
$$ plain form
2686 3689922 3791281 3755098 3804331 3776170 3601068 3588286 3474866 3431981 3505775 3428638 3374368
2675 3374368 3453891 3413903 3427995 3358438 3386342 3440208 3503750 3572573 3676035 3644231 3768533
2664 3768533 3852592 3705668 3621515 3607034 3556220 3414924 3331133 3296589 3295255 3263076 3116468
2653 3116468 3105025 2998545 2932481 2960265 2816849 2792925 2728243 2785707 2691878 2609098 2505499
2642 2505499 2398926 2366360 2339414 2294285 2336617 2280381 2252457 2234645 2251338 2224405 2261304
2631 2261304 2156540 2163034 2160346 2122526 2169065 2092882 2127950 2060815 2060472 1960318 1901535 1999836
2619 1999836 1978104 1953058 1952877 1834690 1995193 1863875 1725848 1767570 1836487 1845794 1840982
2608 1840982 1860323 1872958 1860936 1786093 1703897 1690948 1779320 1781280 1696384 1757782 1809354 1726532
2596A726532R2425K4786k7749q0993M4333j3974r2596N5974N1429k863J0970l3246
2584A755028j86113l7784J4451N9809K6675K3104J11426K3741M2672N5623p1139
2573A817493Q4678M2713J266M664M2880J61639M3907L6095k0291J17613L9482
2562B372139J34975J83412R2196Q5850J49173O2065J78087N8214l6688q1078j30598
2551C067747o039j84868k86549r1999j37061p1014m2309j96206n8216o0331j31648
2540A801507q1546K58j40102j34991J8441m0523K6019K3511q4240r6671p3431
2529A218232K1046N5527p4565j30677L8859Q7917M992j36344k8487l9655k5287
2518I91558P3987o9838j96810L1102Q0895j08812K2749J83137l904l0774l8392
$$ plain form
2596 1726532 1818957 1843743 1815994 1735001 1779334 1765360 1672764 1728738 1780167 1777304 1788274 1755028
2584 1755028 1568915 1531131 1545582 1605391 1632066 1655170 1766596 1790337 1833009 1888632 1817493
2573 1817493 1902171 1944884 1946150 1950814 1993694 2155333 2199240 2235335 2215044 2332657 2372139
2562 2372139 2507114 2690526 2782722 2868572 3017745 3079810 3257897 3316111 3279423 3198345 3067747
2551 3067747 3061708 2876840 2590291 2498292 2361231 2290217 2247908 2051702 1993486 1933155 1801507
2540 1801507 1719961 1720219 1580117 1445126 1463567 1423044 1449063 1472574 1388334 1291663 1218232
2529 1218232 1239278 1294805 1220240 1089563 1128422 1216339 1221331 1084987 1056500 1016845 991558
2518 991558 1065545 995707 798897 829999 910894 802082 824831 1007968 1004064 973290 934898
2507I34898r2314p1033J01473j4346r6571M1899O1094P989n6415K464k7211o5037
2495G26890n8946J78357j822j51204O9701r9013j4852n0729K4463R6585K9054
2484G48484j53924q3619L3220O2889J071N9252K8275j07795J02376k4406j56181
2473E09642p6895N3645L6740n2442k3146J9737M1284L5247L7530k314m3390R0979
2461F26617n6993q5465n326O0231N9362p855q5732k4328R5341j2161N5545P8825
2449F98061p3842J9206r0955K7597O3143l8036K0627L824j02972m0229J31010
2438F17434m6677p5926j3268M966L4111O9592q2934N8910O9548j12482L1758j9924
2426E35108q7446k4752k3251k4502J18365M981O5648L8974p2392m1096L9876R1394
$$ plain form
2507 934898 842584 771551 873024 858678 762107 804006 865100 873089 816674 819138 791927 726890
2495 726890 667944 846301 844479 693275 762976 663963 649111 598382 622845 719430 748484
2484 748484 594560 510941 544161 607050 608121 667373 695648 587853 690229 665823 509642
2473 509642 432747 486392 523132 470690 447544 467281 508565 543812 581342 579028 535638 626617
2461 626617 569624 484159 478833 539064 598426 590571 504839 480511 575852 563691 619236 698061
2449 698061 624219 643425 552470 580067 643210 605174 625801 629625 526653 486424 617434
2438 617434 570757 494831 481563 486529 520640 590232 507298 566208 635756 523274 555032 535108
2426 535108 447662 422910 399659 375157 493522 498503 564151 603125 530733 489637 529513 620907
2414F20907L2155j24712q4708K5086J3781L4022n9486j6844J8170L3146p6946
2403D14571M0117m3176M3216J07194j13268l5959J45760j62552n5618K0434l749
2392C56970k064L9753K7962q9992J8031q5939K4628O3540K7529O2342o7844L3000
2380D07916Q3744k5023n553J15985l4947J1385k008l4518q9990L7135R9948n7032
2368E07042P967j87203J8060j1547K9184j30686M9681J27456P119n169m5324n5895
2356C10685L486p2150M7915k5799n5921k3129R4965R8579M8989L2450p4938p7125
2344C08007M7518L1892j11398p2367L5711P1642p19q0852J1450P3802K5496L3289
2332C73471Q3199j20461n0685o3321m5438J1687l2441J42994j1031k9057o020
$$ plain form
2414 620907 653062 528350 443642 468728 482509 516531 457045 440201 458371 491517 414571
2403 414571 454688 411512 454728 561922 448654 412695 558455 395903 340285 360719 356970
2392 356970 354906 394659 422621 332629 350660 264721 289349 352889 380418 442760 374916 407916
2380 407916 491660 466637 461084 577069 542122 553507 551499 516981 426991 464126 564074 507042
2368 507042 515009 327806 345866 334319 363503 232817 282498 409954 417073 411904 366580 310685
2356 310685 314171 242021 289936 264137 208216 185087 280052 378631 427620 460070 385132 308007
2344 308007 355525 387417 276019 203652 239363 311005 310286 229434 240884 314686 340182 373471
2332 373471 456670 336209 285524 222203 176765 188452 156011 299005 287974 258917 252897
2321B52897K1135L2980k9721K6121M2615j744p8778R4744j6860o2127L0547l9457
2309B72352m9818J7800J27919j6006q5893k8962j5806p738p379J33039L7996n7637
2297C19867Q8157q7437n4645r4014K8553N264K3347J9609N2156o9332l0725j7578
2285A83222Q9877k7512j6782n5392R1493P6001j12271K090k5693K2463L2551o315
2273B53732N646R643j9190l1535K2188j12187M2325M5360m0511m53J51764J4411
2261C41193j06130J03325Q7938l3300q3213l5764j5834q3261J64175K9147o0313
2250C07963L8872j3569N6785O9676p1296k3462J7218k4973j3342O4309l9267o0250
2238C08664k6450J8698P7547M5728o5429o1973Q5913l1581Q0853l1696J6147K3350
$$ plain form
2321 252897 274032 307012 277291 303412 346027 344283 265505 360249 343389 281262 311809 272352
2309 272352 222534 240334 368253 352247 266354 237392 221586 213848 206469 339508 377504 319867
2297 319867 408024 320587 265942 171928 200481 205745 229092 248701 300857 231525 200800 183222
2285 183222 273099 245587 228805 173413 264906 340907 228636 230726 205033 227496 260047 253732
2273 253732 259378 269021 249831 218296 240484 128297 170622 215982 175471 175018 326782 341193
2261 341193 235063 338388 426326 393026 309813 274049 258215 174954 339129 368276 307963
2250 307963 346835 333266 390051 459727 388431 364969 382187 357214 343872 408181 368914 308664
2238 308664 282214 300912 378459 424187 358758 296785 382698 351117 431970 400274 416421 439771
2226D39771k9931j3408n3150Q7155P2993p6687N2485q9592L9723K390K9341M848
2214D65938q1475m8525j2525N5835J10831n5151K0567N4448J5197p2798n712K8489
2202D75119J7368k2388r4864j5792K00652J10955J1212r1458K3197N6504j5200
2191F55305M2847j19759R7612M0107M0238J44721l6285q5643m3109K4243J5437
2180G75714J2437p7952K0709J28653K776k4792J3398J4607J04300Q3215j02146
2169I50919N1081r1948M7176M0614o2078P0944L0431Q038n4926J17076J59880
2158A267207l170o9536O0455K5262l1548Q7086J63693M1125J00921M1356J041
2147A683892J18411Q9973Q9025J05770l3879R8878K05525J41799n570Q92J55400
$$ plain form
2226 439771 409840 396432 343282 430437 503430 426743 479228 389636 429359 431749 461090 465938
2214 465938 384463 335938 323413 379248 490079 434928 455495 509943 525140 452342 446630 475119
2202 475119 492487 470099 375235 359443 560095 671050 682262 590804 614001 670505 655305
2191 655305 698152 578393 676005 716112 756350 901071 864786 779143 736034 760277 775714
2180 775714 788151 710199 730908 859561 862337 837545 850943 865550 969850 1053065 950919
2169 950919 1002000 910052 957228 997842 935764 1006708 1037139 1045177 990251 1107327 1267207
2158 1267207 1264037 1194501 1254956 1280218 1248670 1335756 1499449 1540574 1641495 1682851 1683892
2147 1683892 1802303 1892276 1981301 2087071 2053192 2152070 2357595 2499394 2493824 2494716 2650116
2136B650116M4187K8996J54655J04064K7937O7226K37346Q0313K15642J25901
2126C736383J89286J82639K26616K13312M20825L56414L86179K24662J77977L07770
2116F422063N75438Q25201J151867J350720J637344K121992K538171L161933M841910
2107B4626639O167267O390028M710641m693321q926204p328626n037427l095652
2099A2813345k076820j511502j146766q93515p61882m73607m42163k69269k35305
2090E002516k73108l93743l22177m14214l51162k92321k02344k56060k03818j38011
2080B155558j96980j71645k0898p3808l0514l3696P6691l5530j05380o0227j36580
2069A366991q9339K3876m9101Q117r0578j10164o3730Q437m366K226j11468O8538
$$ plain form
2136 2650116 2694303 2723299 2877954 2982018 3009955 3077181 3314527 3394840 3610482 3736383
2126 3736383 3925669 4108308 4334924 4548236 4969061 5325475 5711654 5936316 6114293 6422063
2116 6422063 6997501 7822702 8974569 10325289 11962633 14084625 16622796 19784729 24626639
2107 24626639 30793906 37183934 41894575 37201254 28275050 20946424 15908997 12813345
2099 12813345 10736525 9225023 8078257 7184742 6422860 5949253 5507090 5237821 5002516
2090 5002516 4729408 4335665 4013488 3599274 3248112 2955791 2753447 2497387 2293569 2155558
2080 2155558 1958578 1786933 1766035 1692227 1661713 1628017 1704708 1669178 1563798 1503571 1366991
2069 1366991 1277652 1301528 1252427 1260544 1169966 1059802 996072 1004509 1000143 1002369 890901 959439
2057I59439m7402j23490k1441J6352j4740j24033l9133l6367J2051r8200L3357
2046E16393Q0314k4572j7345J04620o4920p9918k9264P5939p5544k0724N656j0477
2034D60158J7634J4346k131j46616J5370m4614j3739K9789l6414l4087J16217
2023C75913j5890p4031N2481j8974l4826L9244N66O8834N6565l1430j13747r583
2011B95122k4758J9951m2900K3214K4310m029k9809l0554O1083k5502k3718J4176
1999B56586o8714k5917J02094J09805k3774j19097r3450k1861J2454Q5472m8696
1988A64902k5154K6285L2258J4470m5081J1479p5477M0885j1824Q148n2089q066
1976H0736O5347j6024p4164j178p4247o5330J2844Q6841J14038P7322k4471q9349
$$ plain form
2057 959439 912037 788547 767106 783458 768718 644685 605552 569185 581236 483036 516393
2046 516393 596707 572135 554790 659410 594490 514572 485308 561247 485703 464979 470635 460158
2034 460158 477792 492138 490007 343391 358761 314147 300408 330197 293783 259696 375913
2023 375913 360023 285992 338473 319499 284673 323917 324483 393317 449882 418452 304705 295122
2011 295122 270364 290315 247415 270629 294939 290910 261101 230547 291630 266128 242410 256586
1999 256586 187872 161955 264049 373854 350080 230983 137533 115672 128126 213598 164902
1988 164902 139748 166033 198291 212761 167680 179159 103682 144567 132743 140891 88802 80736
1976 80736 146083 130059 55895 54717 -19530 -84860 -72016 14825 128863 206185 181714 92365
1964I2365K6481j9231Q2861j1197K6556m2832k3290p985k7399p0731N2238l6526
1952D1310j024n279n160L8863k3949R5023J5812l7843L7557L1830p7413m4188
1940F5539m637j9174J2396K5520O3964M0761k4188K0090R170M9751P3113p2040
1928B40265m6116p7770L5528Q5018j1946l1581Q0057M1292j83830j6596n762J4770
1916A23329j4070J2825q7928j20907J12962J4001O781o0325k8144P0157n3358
1905b4677J1263J09694N4546M684m1454j1690J5348n8725N901k8919l0135K3582
1893B9418O4713m2268N0298k0696q803j6337J66661J7633l0676k5493l2328n2814
1881I9308M6989o3605L6220q6780O5834L0914j15506J09371q1499p013N0676j6950
$$ plain form
1964 92365 118846 99615 182476 171279 197835 155003 131713 123728 96329 25598 77836 41310
1952 41310 40286 35007 29847 68710 44761 139784 155596 117753 155310 187140 109727 65539
1940 65539 60902 41728 54124 79644 143608 184369 160181 180271 189441 239192 312305 240265
1928 240265 194149 116379 151907 236925 224979 193398 273455 314747 130917 114321 108559 123329
1916 123329 109259 122084 34156 -86751 26211 40212 46993 -13332 -41476 28681 -24677
1905 -24677 -13414 96280 150826 155510 114056 102366 117714 58989 64890 35971 5836 29418
1893 29418 94131 51863 102161 81465 72662 56325 222986 240619 209943 184450 152122 99308
1881 99308 146297 82692 118912 32132 97966 128880 13374 122745 41246 34233 84909 67959
1869F7959m4034o8348m7601L1987J23176N9378m709O1715N5568o3224n3865p4510
1857D3492o2509O7196j2746O7756J0844O1464K4243K3344r2109l7259k6111m4727
1845B2878q1546O8204J56169k8847j7191J9523j5969M4283k6512R8737L1536o9554
1833B01711O640l405j72727l0097J17848N0966J9461o3430K7922l804r734m5894
1821I5457p7035O8770n4608K0894O6631m7148r8551N5384Q2203m601l8869J9488
1809H8015o2541m9765N6109m3823O3105L2283j8012M3461L645q1854L537j44642
1797a10482Q0112J55170j8337r9241k5796K9809J8305r765J44289j45835o8035
1786d9806P4608J00693J9486l9266j08225K1085P6129l4930l1426K6447N2986
$$ plain form
1869 67959 23925 -44423 -92024 -60037 63139 122517 117808 179523 235091 171867 118002 43492
1857 43492 -19017 48179 35433 103189 114033 175497 199740 223084 130975 93716 67605 22878
1845 22878 -58668 9536 165705 136858 119667 139190 123221 167504 140992 239729 271265 201711
1833 201711 208351 204946 32219 2122 119970 170936 190397 126967 154889 151085 141351 95457
1821 95457 18422 87192 32584 53478 120109 72961 -25590 29794 111997 107396 68527 88015
1809 88015 25474 -24291 31818 -12005 51100 83383 65371 108832 112477 30623 34160 -110482
1797 -110482 -30370 124800 106463 7222 -18574 11235 29540 19775 164064 18229 -49806
1786 -49806 24802 125495 144981 105715 -2510 18575 94704 59774 28348 54795 107781
1775A07781j10222N2142j7639J7224M7338O727j15841M6924Q2543j03944k0887
1764g854P8394o2102k9830k993j5489m6171J08977j7052m1870L5280K2459q7881
1752f6132M2258N9081O575l1934j9513p2483R2136m3984k1958N3402J9691J6006
1740C3145j00201K988O060L6382K6129P4788q3821l7067n6216N7806N5877r4603
1728g8733Q3552O3083l0305j0682q932M1427J1576o891n8273J0008J3338L9656
1716F8824n2401k2216P8646L7713j02247o8894Q0834r250m6740o1572J04594N4928
1704F2219P4816R356l8265k7061p3894Q8394o35j46730l9886m0406N6775J00428
1692B5111L3932l916P9814o8273O037k0631j23563L1811P5313M2225l9239m5812
$$ plain form
1775 107781 -2441 49701 32062 49286 96624 103351 -12490 34434 116977 13033 -7854
1764 -7854 70540 8438 -21392 -24385 -39874 -86045 22932 5880 -35990 -710 21749 -66132
1752 -66132 -23874 35207 41782 9848 -9665 -82148 9988 -33996 -55954 -2552 17139 33145
1740 33145 -67056 -64068 -58008 -21626 4503 79291 -4530 -41597 -97813 -40007 15870 -78733
1728 -78733 4819 67902 37597 26915 17983 59410 70986 64095 5822 15830 29168 68824
1716 68824 16423 -5793 72853 110566 8319 -60575 20259 11009 -35731 -97303 7291 62219
1704 62219 137035 146391 108126 81065 7171 95565 94930 -51800 -91686 -132092 -75317 25111
1692 25111 59043 55127 134941 66668 72705 52074 -71489 -39678 35635 77860 38621 -7191
1680g191Q3321j490o6952K7789L5171P5076j10818K3897l3240M7988P353k2870
1668E8034j4730j75979J14561J11817k9356k3537q9333J5419j08731J07678k5588
1657e9745k3098O3075J6095p584l2605N5955m2309o0410P2495o420r84J6982O62
1644g891q073Q4014M8989j61050K1702J17692j20793m1792L3195m5920o8391R6942
1632e1376O8j5070M3056Q2280j3259j6291l9729L2492O3953q5210k6969M0729
1620A4674K428K81J13433r6911n1198N5138o816K142O6105J8047k5956q5251O4077
1607G0193l3l5684O0172k5548L4558j9189n7780J8565q1776N1867P276m8283l1202
1594e6864k7232M4122O5477M761J2629n5948N553k4318J281L2801Q1123O6539
$$ plain form
1680 -7191 76130 74640 7688 35477 70648 145724 34906 58803 25563 73551 80904 58034
1668 58034 43304 -132675 -18114 93703 64347 40810 -48523 -33104 -141835 -34157 -59745
1657 -59745 -82843 -19768 -3673 -11257 -43862 12093 -30216 -90626 -18131 -24551 -25535 -8553 -7891
1644 -7891 -15964 68050 117039 -44011 -22309 95383 -25410 -67202 -34007 -79927 -148318 -51376
1632 -51376 -51308 -66378 -23322 58958 45699 29408 -10321 22171 86124 914 -26055 14674
1620 14674 17102 17383 130816 33905 -17293 37845 31029 33171 99276 117323 91367 6116 70193
1607 70193 70160 34476 94648 69100 103658 84469 26689 45254 -36522 15345 22621 -25662 -56864
1594 -56864 -84096 -39974 25503 30264 42893 -13055 -7502 -31820 -30539 2262 83385 149924
1582A49924k3028p8797q6356L4042n3645m9782N9067M6708l9402K7084l0770q4404
1570a29359Q1181J63166N212n5204j5278j3073k2103p8661Q550k5449J17745L2028
1558F8755r4825J4311K7316K6393j8622m6623Q4895q6783p4727N4112N6829K0667
1546C1698m8801j6411K9676R989O158K2239j2639R826n0753l8211J80698k6113
1534I7356r7102M3100l3737k2442m7968j07216O2466J5929m8852J03122j2227
1523d7571n8558Q9839M9548N871n0435m196m7978l3467J40642j9738j24471k513
1511a03027J14721p1094k5063o9191M6781Q0962r0236L8083Q0119n3622n1137
1500a02704J09362J83480k8979p2982r3963J7198N1405n189j7046j8928q0100
$$ plain form
1582 149924 126896 48099 -38257 -4215 -57860 -107642 -48575 -1867 -41269 -14185 -44955 -129359
1570 -129359 -48178 114988 120200 64996 49718 36645 14542 -64119 -55569 -81018 36727 68755
1558 68755 -26070 -11759 15557 41950 23328 -23295 61600 -25183 -99910 -45798 11031 31698
1546 31698 -17103 -33514 -3838 6151 12309 34548 21909 31735 -19018 -57229 123469 97356
1534 97356 254 43354 9617 -12825 -60793 -168009 -105543 -89614 -138466 -35344 -47571
1523 -47571 -106129 -16290 33258 39129 -11306 -15502 -63480 -96947 43695 23957 -100514 -103027
1511 -103027 11694 -59400 -84463 -153654 -106873 -25911 -116147 -78064 2055 -51567 -102704
1500 -102704 6658 190138 161159 88177 -5786 11412 62817 57628 40582 21654 -58446
1489e8446L2457J8243o4877L1609n2094Q9798K9998L939p3718j4753L1944K9916
1477D016l7159m5777J1456M1813l0419m5063P7584O6190L2575j8765R165M6121
1465A11737l3990n579m1925l9470R8079k4000M5622j26564L7937P6457m9647L9711
1453H8368n1661l0755l1044L5579M6568k0936m2453p0126K6616K5269j2140O915
1441b9800P122k5495J4337M6921k2684j4074O1621m2163p7817l2716l285j5345
1429a33378O3594N8143J12882k1834o4834j2318O984n6984p3386J56745l89j14812
1417g9587p5729L1319M6368L882M7226L9448M4893p2876p6411O1876m0765K2895
1405d7461L2392j9920M5548l6196l8108R937J7753j0900N1938n9937R3425p932
$$ plain form
1489 -58446 -25989 -7746 -72623 -41014 -93108 -3310 26688 30627 -43091 -57844 -25900 4016
1477 4016 -33143 -78920 -67464 -25651 -56070 -101133 -23549 42641 75216 56451 65616 111737
1465 111737 77747 72168 30243 -9227 88852 64852 110474 -16090 21847 98304 48657 88368
1453 88368 36707 5952 -25092 10487 57055 36119 -6334 -76460 -49844 -24575 -36715 -29800
1441 -29800 -22678 -48173 -33836 13085 -9599 -23673 37948 -4215 -82032 -114748 -118033 -133378
1429 -133378 -69784 -11641 101241 79407 14573 2255 9239 -47745 -121131 35614 35225 -79587
1417 -79587 -155316 -123997 -77629 -73747 -26521 12927 57820 -15056 -91467 -29591 -70356 -47461
1405 -47461 -15069 -34989 10559 -25637 -63745 -53808 -36055 -46955 4983 -54954 38471 30539
1393C0539n4532j1849J1928M8178m5363l5506O0802L5733l9455Q6767Q637n0451
1381D5428n1874n56o6410O6739J0376M2833q6233J8000O8274n0967M0368p1284
1369c5306N0642l759o9975J8150J24616k442l271j1731p1453J1384n3146M8855
1357B564P1070r5980o1380L7030j03075L3536R1553o3559N3672j00707J2581J11741
1345a0954l6391L4318O183K0535O8636l9129j3060O9401o8883o0059N5479L2098
1333E8174j72341o138J69945J2600j66373k0934M2852L7952K1472P2979n729J390
1321D5849j2638m9387P3688O6410j00613N8276k9417K7739o0579r618P3470k2903
1309F0277M2644j09143l8241Q4155p3492K6989P521n1575J9800j7864P4325J2502
$$ plain form
1393 30539 -23993 -35842 -23914 24264 -21099 -56605 4197 39930 475 87242 95879 45428
1381 45428 -6446 -7002 -73412 -6673 3703 46536 -39697 -21697 46577 -4390 35978 -35306
1369 -35306 15336 11577 -58398 -40248 84368 81926 78655 66924 -4529 6855 -46291 2564
1357 2564 73634 -22346 -83726 -46696 -149771 -116235 -24682 -88241 -34569 -135276 -122695 -10954
1345 -10954 -47345 -13027 -6844 13691 82327 43198 30138 99539 30656 -29403 26076 58174
1333 58174 -114167 -120305 49640 62240 -104133 -125067 -82215 -44263 -22791 50188 44459 45849
1321 45849 33211 -16176 57512 123922 23309 81585 52168 79907 19328 9710 83180 60277
1309 60277 102921 -6222 -44463 39692 -33800 -6811 710 -50865 -31065 -48929 25396 37898
1297C7898O9592j8153n0585p382j77632O1343k5420P9023N7587m6868M9322m591
1285B4134k2102N771M6107m0532j17604M3954L2001j43654R0118O8387L6071o6424
1273d3773P8990l5496J554K8357o2167l1239l7936J00412N6139n9668O7936P591
1261G0700o9416m2752J0679m8048K1424L9550L6027p0317N0657n7821n5362R4246
1249b0433O1042k8551K2799r242j06640L6866L4676K3931N264j2015k7370j07590
1237a27263M7034Q9843n6824J2332K8021l0276o2991N0962L1378k9582P1550O1736
1225H5920K1018m5633o471k1409r9100R3957L119J1452N4830k8992J0115p6741
1213B065m0712m9481J38876n0566j8714J5878o7715K6943m0196k0324L4411k1980
$$ plain form
1297 37898 107490 89337 38752 31370 -146262 -84919 -110339 -31316 26271 -20597 28725 24134
1285 24134 2032 7803 53910 13378 -104226 -60272 -28271 -171925 -81807 -13420 22651 -43773
1273 -43773 35217 -279 1275 29632 -32535 -63774 -101710 -1298 54841 -4827 63109 70700
1261 70700 1284 -41468 -30789 -78837 -57413 -17863 18164 -52153 -1496 -59317 -114679 -20433
1249 -20433 40609 12058 34857 25615 -81025 -44159 -9483 14448 19712 7697 -19673 -127263
1237 -127263 -80229 9614 -47210 -34878 -6857 -37133 -100124 -49162 -17784 -47366 24184 85920
1225 85920 106938 61305 54834 33425 -65675 28282 31401 42853 97683 68691 78806 2065
1213 2065 -38647 -88128 50748 182 -18532 -2654 -70369 -43426 -83622 -103946 -69535 -91515
1201i1515Q3381r076l3999L9937j36242J18017L2767o6136j6112K7762K965O1288
1189A3037K4886o6312K3782o0695N9430j5321L4668K2578k2859l4281L6180N4724
1177F9817n3397j29106P660R9845K7987O5327L5260l0661m3514m454k4075l4759
1165a4070n651O6275K5640k0978n4231Q4792p7566j9676J9212o035J144k9401
1153c0545j5231j5586p3758L0254M7438K3670J7507K172n981k5568L5425J8165
1141G962m291j01633l1788Q7641q0975Q8074L1039M8187m4545k4504o2111k15
1129h7159P0877P3268o8266K5283R2529l6396q0318k1572k9951j8272J8352m135
1117f5760J15895L6211q2982R2890m7209j9090O1909j27543K8351L7608L4113
$$ plain form
1201 -91515 -8134 -17210 -51209 -11272 -147514 -29497 3270 -62866 -78978 -51216 -48251 13037
1189 13037 37923 -28389 -4607 -65302 -5872 -21193 13475 36053 13194 -21087 15093 69817
1177 69817 16420 -112686 -105026 -5181 22806 88133 123393 92732 49218 44764 20689 -14070
1165 -14070 -19721 46554 72194 51216 -3015 81777 4211 -15465 3747 -2288 -1144 -30545
1153 -30545 -45776 -61362 -135120 -104866 -57428 -33758 -16251 -14079 -20060 -45628 -10203 7962
1141 7962 3671 -97962 -129750 -42109 -123084 -35010 -3971 44216 -329 -24833 -86944 -87159
1129 -87159 -16282 56986 -11280 14003 106532 70136 -10182 -31754 -61705 -79977 -61625 -65760
1117 -65760 50135 86346 3364 96254 49045 29955 91864 -35679 -7328 30280 64393
1106F4393K8648p4910q2780J2721M5545n447K3766j8738m6335J37370l7979m0975
1094E279q1539L5382J10055l1113j0165j0594o2413j7665k0903R9667L4433J1011
1082F1435M689m2838j20110p0222P2429n7672J7395N2192N4358J04317n1820K0256
1070D4409P9645J1130j96178n2066M1150Q8322l3829M9136j7306j08385J7418
1059g6554R3606p043k0107K2966m7746m3125n9723j5824K7069P4316q1811N5649
1047g8327O855J6620M1051O7383L1742l6396m6205J1482j1890o1446N4204j1004
1035a5931k2888N1426p8939p8188P6215l070J15044p8883K6598Q8392o6322j29997
1023a16543L0679Q0960J017m9938J2435m8763M1182P5883o5817O6296k5866o1112
$$ plain form
1106 64393 93041 18131 -64649 -51928 -6383 -11830 11936 -6802 -53137 84233 46254 5279
1094 5279 -76260 -40878 69177 38064 27899 17305 -45108 -62773 -83676 15991 50424 61435
1082 61435 66124 23286 -96824 -167046 -94617 -152289 -134894 -82702 -28344 75973 24153 44409
1070 44409 124054 135184 -60994 -113060 -71910 16412 -17417 31719 14413 -93972 -76554
1059 -76554 17052 10009 -10098 12868 -34878 -78003 -137726 -153550 -126481 -52165 -133976 -78327
1047 -78327 -71472 -54852 -13801 53582 85324 48928 2723 14205 2315 -59131 -4927 -15931
1035 -15931 -38819 12607 -66332 -144520 -68305 -71375 43669 -35214 -8616 79776 13454 -116543
1023 -116543 -85864 -4904 -3887 -53825 -41390 -90153 -48971 26912 -38905 27391 1525 -59587
1011e9587m8318J29338M685j14071j0598N5056j29454O4177J0427K1535j3836
1000i0646K8078K7653L9451p3936p756P6670L5092K2530p607q30k0860k7521P721
987H039r0434q941Q7261J0365N8689j82686q0445N5064J36472O1665N2337k6660
975H0726m2505p7803P385m6507L5324L3720O2435l9174J40110O961q0020J593
963H2245n3593k8268j22175L0075J2305K3286m690k8723M997J17181L1996o1491
951C145R7742K2793p4248q7647j1665L4303O1515K4018j0193J0995L0118j51002
939e0126p9331P5261P1020J8094K9754q24j28976j4007M0403L7559k7433p1797
927a00403l290K7069j7075N7860q2860J04806n1702r3362J1794R0223n4157O6538
$$ plain form
1011 -59587 -107905 21433 26118 -87953 -98551 -43495 -172949 -108772 -98345 -76810 -90646
1000 -90646 -62568 -34915 4536 -69400 -77156 -486 34606 57136 49529 48699 27839 318 8039
987 8039 -82395 -91336 -4075 6290 64979 -117707 -198152 -143088 -6616 55049 107386 80726
975 80726 38221 -39582 -32197 -78704 -43380 -9660 52775 13601 153711 160672 80652 82245
963 82245 28652 384 -121791 -91716 -79411 -56125 -60815 -89538 -84541 32640 64636 3145
951 3145 100887 123680 49432 -38215 -49880 -15577 45938 69956 59763 70758 100876 -50126
939 -50126 -129457 -54196 16824 34918 64672 63848 -65128 -79135 -38732 -1173 -28606 -100403
927 -100403 -103693 -76624 -93699 -35839 -118699 -13893 -65595 -158957 -147163 -56940 -111097 -44559
915d4559o869l7059j1807O3957Q0078o2655q0614O3198L1259K9484O2841o3069
903B4185q4596L4490M9681j01665O9414M2496q0059K2176R2407j1800m6810P2955
891H2874l4848r7771P0220k9584j11085P1256M0452m7669K966R4067P5441q1684
879C4635m6733n4653j7218O5974R0570j3859J02207j34375k1999J00923j15460
868i988k803K2789k8291r1360K4325P081k596O1566J4694P6547j8301r7230Q982
855c4585L5137j1065p0354K7552M2606K3761J37908j9954l8610J6523q8593j01057
843h0731P6332l731L3432J698L6683P2266j35314n4183r272R652J8536J5767J9268
830D03l2975Q7351R794L2344O5214j02096K0302l0724l5170K0167p4188k5639
$$ plain form
915 -44559 -51428 -88487 -100294 -36337 43741 -18914 -99528 -36330 -5071 24413 87254 24185
903 24185 -60411 -25921 23760 -77905 -8491 34005 -46054 -23878 68529 56729 9919 82874
891 82874 48026 -49745 20475 -9109 -120194 -48938 -8486 -56155 -53189 40878 116319 34635
879 34635 -12098 -66751 -83969 -17995 72575 58716 160923 26548 4549 105472 -9988
868 -9988 -12791 9998 -18293 -109653 -85328 -78247 -80843 -19277 -4583 71964 53663 -43567 -34585
855 -34585 552 -10513 -80867 -53315 -10709 13052 150960 131006 92396 108919 20326 -80731
843 -80731 -4399 -8130 25302 27000 63683 135949 635 -53548 -62820 -53168 -34632 -18865 403
830 403 -32572 54779 64573 96917 162131 60035 80337 49613 14443 34610 -39578 -65217
818f5217j4844Q0437j2842j4416R9367j1579K648p0206j03330P2503P9376Q134
806E0031o0064J2255m878k7283n4224m2316K3782j7377J2903J09700j6928p8852
794i3251q3344Q7182L4494K423N4514M2568r1232j10124J6791J66470K6280j59413
782a06642L4566O2520l5389M8216J18758q6505k1856k1061j9416Q2235K6886m5226
770C7086L4634l9975P255j43459R093J8057J28355m1207p6315p0870L4572J31993
758B9219J31095o2885j59016J9526l8333L6349k3137L3297K1768q2031K2648O2506
746h994k5676j018J0466J1607j4980P8517o327R4572p314p1619n8316k039L8552
733C7431j5471J9751m3017L6435O43q4581J043P9004p8791j14911M8112o7304
$$ plain form
818 -65217 -80061 376 -12466 -26882 72485 60906 63554 -6652 -109982 -37479 41897 50031
806 50031 -10033 2222 -2656 -29939 -84163 -126479 -102697 -120074 -107171 2529 -14399 -93251
794 -93251 -176595 -89413 -54919 -52496 2018 44586 -46646 -156770 -139979 26491 52771 -106642
782 -106642 -72076 -9556 -44945 3271 122029 35524 13668 -7393 -26809 55426 82312 37086
770 37086 71720 31745 39000 -104459 -95366 -77309 51046 9839 -66476 -137346 -102774 29219
758 29219 160314 97429 -61587 -42061 -80394 -44045 -67182 -33885 -12117 -94148 -71500 -8994
746 -8994 -34670 -35688 -25222 -13615 -28595 49922 43595 138167 130853 59234 918 -1121 37431
733 37431 21960 41711 -1306 35129 35772 -48809 -47766 31238 -47553 -162464 -114352 -181656
721a81656J16309J40878r0575r674M6143K6996m2784j7241k4846J03978K5338
710I2866q3194K3226j5305j28314n185L8947l4028Q6119O6638q0844J0416M076
698b4582p6915M9119K143Q6352o7254N8323j8792J0193j0677p9672N0849R82n3755
685g3686j7495N2357k8528M1797j7063J7585M8765l1963M0849k201K8337j1533
673D7221o6555p3093M9564Q1225j31397j9128M0244Q4045j7084m5027n1930R5717
661f198q995N456O3961n9104L084R947L7373j35696n9037J28099K9842m6789P1263
648C3206L0769j11381m2828J5857P9972q7733K646M4432j834K9577j2421o6033
636h5771M0598o5356J0146J03168p4542O4029L9003q0233K8459o4746j7635K5996
$$ plain form
721 -181656 -65347 75531 -15044 -24718 21425 48421 5637 -11604 -36450 67528 92866
710 92866 9672 32898 17593 -110721 -115906 -76959 -110987 -24868 41770 -39074 -28658 -24582
698 -24582 -101497 -52378 -50235 36117 -31137 27186 8394 18587 7910 -71762 -20913 -19931 -73686
685 -73686 -91181 -38824 -67352 -25555 -42618 -25033 23732 -8231 32618 30417 58754 47221
673 47221 -19334 -92427 -42863 38362 -93035 -112163 -71919 12126 -4958 -49985 -101915 -6198
661 -6198 -15193 -9737 54224 -4880 -1796 8151 45524 -90172 -149209 -21110 8732 -38057 33206
648 33206 63975 -47406 -90234 -74377 5595 -82138 -79492 -35060 -36894 -7317 -19738 -85771
636 -85771 -45173 -110529 -100383 2785 -71757 -7728 31275 -48958 -20499 -85245 -102880 -76884
624g6884K6250L9624k8342J10697R0820j00729q7426J31620K783r6204q9423q7134
612a64348K6627P2103l1075l0154O5260k4275Q3081k1244o2586R8959O322m3876
600b5206r1557R3522N4402K1657K2325o2395j2575O3119N5356o8357r9533o3542
588a12784J13397J13862m2128J6263k1612n4430m4234Q4932o2880r7664R1475
577a5803J3263L0778J2949k2146J3608p2921J4923m5734L7051Q0893p309j8783
565B0769N6444m5416O0022m522n0581M0590n6185j4242P6589k2002j8593l413
553C9460L0511o6946j2146j2758N6605M0555j40784n8342J11707N4207l7882Q3698
541H7885k4908K2361j7553P6080J884O3119j18181m8436m5908j8263J0620N8107
$$ plain form
624 -76884 -50634 -11010 -39352 71345 162165 61436 -25990 105630 108413 12209 -77214 -164348
612 -164348 -137721 -65618 -96693 -126847 -61587 -85862 -2781 -24025 -86611 12348 18670 -25206
600 -25206 -116763 -23241 31161 52818 75143 12748 173 63292 118648 50291 -49242 -112784
588 -112784 613 114475 72347 88610 66998 12568 -31666 53266 -9614 -107278 -15803
577 -15803 -2540 28238 41187 19041 32649 -40272 -25349 -71083 -34032 46861 39552 20769
565 20769 77213 31797 91819 87297 36716 77306 21121 6879 83468 61466 42873 39460
553 39460 69971 3025 -9121 -21879 34726 75281 -65503 -123845 -12138 42069 4187 87885
541 87885 62977 85338 67785 143865 145749 208868 90687 42251 -3657 -21920 -11300 46807
529D6807m471q1904R5757j8481n5895K3240n8935Q7065n9178p3080J09863r671
517A117o4257m9892M1854O5343p7062r6479Q1225N7784j5950o9028O5548M2921
505a6876l814O231R2124j15635j5272k302J01498P5369j24243q5617J18902p1623
493d1258m1490P5744N4415O1677j53224K8179k7488R1701m9436K7363P3661n4900
481D4944j27747Q888L884M8062j7729J8408n248J583m0123J01248k6667q4546
469g5043O0737k273Q6870n2685m7001J3703M882J37555j6454o3665L6390q6791
457c775J03064K3329q2597j4729p6091j15650J15611N957L5466O17J900L7791
445C0893p1637O7265l7148j7635O2369J0770n2590p7948M4444m3771J9227P9096
$$ plain form
529 46807 42336 -39568 56189 37708 -18187 5053 -53882 33183 -25995 -99075 10788 1117
517 1117 -63140 -113032 -71178 -5835 -82897 -179376 -98151 -40367 -56317 -125345 -59797 -16876
505 -16876 -20690 -14459 77665 -37970 -53242 -55544 45954 121323 -2920 -88537 30365 -41258
493 -41258 -82748 -7004 47411 109088 -44136 -15957 -43445 48256 -1180 26183 99844 44944
481 44944 -82803 -73915 -70031 -21969 -39698 -21290 -26538 -24955 -65078 36170 9503 -75043
469 -75043 -14306 -16579 70291 17606 -29395 -15692 -10810 126745 110291 46626 83016 -3775
457 -3775 99289 122618 40021 25292 -50799 -166449 -50838 -44881 -9415 -8798 -6898 30893
445 30893 -40744 26521 -10627 -28262 34107 44877 -7713 -85661 -41217 -84988 -65761 13335
433A3335R439P075Q3731l3178M0699j8157m6068q1055M766P8008l6224m5787J45912
420A22496j92943j49813K34809j3115K0334N32l9176m7583o928j7493N7965O1656
408C0741N543K6018p756K1472n2440l6792J872J6238O8737j17417k437o0867l5141
395a42229N1793K1258K1243L5513Q8150m0703p9918K6991M4869j8517M8773j26244
383f9021k6174J61189k7335J8537R470m9762K7243m435P5021K1178r4178k650
371C9083l2860J2688M8122q4956j27221M8013M0933p6877O0631J09283Q5702o9155
359E3386J606O2333j44579O6340K4686J3970o2476l6487j2065K0523N3587M42
347D1266O5947K8121m3300j58983N2078M1035Q534N8439m8213l1880n610r7769
$$ plain form
433 13335 22774 29849 113580 80402 121101 102944 56876 -24179 -19413 58595 22371 -23416 122496
420 122496 -70447 -220260 14549 1434 21768 22300 -16876 -64459 -71387 -88880 -30915 30741
408 30741 36284 62302 54546 76018 23578 -13214 -11342 4896 73633 -43784 -46221 -107088 -142229
395 -142229 -90436 -69178 -47935 -12422 75728 35025 -44893 -17902 26967 8450 57223 -69021
383 -69021 -95195 65994 38659 57196 66666 16904 44147 39712 114733 135911 41733 39083
371 39083 6223 18911 67033 -17923 -145144 -97131 -56198 -133075 -72444 36839 122541 53386
359 53386 54992 117325 -27254 39086 63772 77742 15266 -21221 -33286 -12763 40824 41266
347 41266 107213 135334 92034 -66949 -14871 26164 34698 93137 44924 13044 7434 -90335
335i0335k8862K8377M7670j2569j9467Q7936p998M6275q2792l3206K5902j3150
323e2219O5183j8048n311P4370J8217M449k9382l5830K7070k3507J685N2490l7535
310D1632j2959m2885p5853J24663j15264m92J06844L987n757o7231K1964M7749
298B6398L5084j3204k381O9714r1937J8034l8129r5080M8020L1805M5449k0887
286A2886o4339j2635L5805J9193n4845J19205j3894n6962R1906m5734m696M7002
274G2892n7567K4345J9051k1091N8558n6585n2802k0020L8592N1316m7927N2938
262F1700J01359k6850j62217O9525N263j01117Q7596O7509n3077p7070L8283K8904
250C9808j9441P089L5364m0830k8640j634k131m368L8511m6850L402L3157j1196
$$ plain form
335 -90335 -119197 -90820 -43150 -55719 -75186 12750 4752 51027 -31765 -64971 -39069 -52219
323 -52219 12964 -5084 -10395 63975 82192 86641 57259 21429 48499 24992 26677 79167 41632
310 41632 28673 -14212 -90065 34598 -80666 -81158 25686 29673 23916 -43315 -21351 26398
298 26398 61482 48278 45897 115611 23674 41708 3579 -91501 -43481 -11676 33773 12886
286 12886 -51453 -64088 -28283 -9090 -63935 55270 41376 -15586 76320 30586 25890 72892
274 72892 15325 39670 58721 37630 96188 39603 -13199 -33219 5373 56689 8762 61700
262 61700 163059 136209 -26008 43517 48780 -52337 35259 102768 49691 -27379 10904 39808
250 39808 20367 27456 62820 21990 -6650 -8284 -10415 -14783 23728 -23122 -19720 13437 2241
237B241o8679Q3540K8381r7278k3332J06387K177J0930m8101J8493q297N6222
225F2684P830k5694j01212Q9105j477r3956R7173N1743j1990M7773N270q3518
213D3731k3183j841O0771n6946n6840K1186M371l1325L8072K2571o0369O420M7145
200A3763O2087J5781k0725k1352n8608M7726o2110l3498j2965R2925m6346J485
188b1837N2197K6880n1397r06n3532O8392o6658M2549J23599k3537q3209O348
176A8889O8776r0124N7738L6589j9071J9005K9549k1184n359l9282m6428r3094
164h3996j1223J73016k7162k5385R114o217j1091n0411n4218k1752M3340L1581
152c4404J1169J1718m8684L0832J95535J5618l0839q8914k6959L5119o6229L7592
$$ plain form
237 2241 -66438 17102 45483 -51795 -75127 31260 33437 44367 -3734 14759 6462 62684
225 62684 70514 44820 -56392 32713 31236 -62720 34453 86196 74206 121979 127249 43731
213 43731 20548 18707 79478 22532 -34308 -13122 -8751 -40076 -2004 20567 -39802 -33382 13763
200 13763 75850 91631 70906 49554 -9054 38672 -23438 -56936 -69901 23024 -23322 -21837
188 -21837 30360 57240 5843 4937 -48595 19797 -46861 -4312 119287 95750 12541 18889
176 18889 87665 -2459 55279 91868 72797 91802 121351 100167 94808 55526 9098 -83996
164 -83996 -95219 77797 50635 25250 34364 28147 17056 -33355 -87573 -109325 -65985 -34404
152 -34404 -23235 -11517 -60201 -29369 166166 181784 150945 62031 35072 70191 3962 41554
140D1554M212J0387k1466r0826Q8581K9577l3916N464k6760L5495J03094r4266
128E1130l7657K6224k5539K0509q5473J8837M3571J4201m3810o1070R4742j9349
116c684j2001J0361N055O7880Q6367m7748l6942l3955l1165J4719m1590L4812
104A2109L4686Q9846n1883o7747L1667N3547K185l8577n6013m6685J40605l5134
92F8606l1637n7473o43m3231J4417M2780Q384n4266j3962O6467P1939L6444l5754
79G2071o3638k2461K3987O0542k390k1440K0010n4275O2987K3102n0727K4960
67G2728m7733j4567L3713n55N5166m7236n3857l2960J3660L3268J2306n1847J3206
54a4708N3068k4943j4404M496J2416p19j3424O62L5511K7571o169K3218p7888
$$ plain form
140 41554 45766 56153 34687 -56139 32442 62019 28103 33567 6807 42302 145396 51130
128 51130 13473 39697 14158 34667 -50806 -31969 11602 25803 -18007 -79077 15665 -3684
116 -3684 -15685 -5324 -269 67611 153978 106230 69288 35333 4168 18887 -22703 12109
104 12109 46795 136641 84758 17011 48678 102225 104410 65833 9820 -36865 103740 68606
92 68606 36969 -20504 -21147 -64378 -49961 -7181 1203 -53063 -67025 -558 71381 107825 72071
79 72071 8433 -14028 9959 70501 68111 46671 66681 12406 75393 98495 47768 72728
67 72728 24995 10428 44141 43586 98752 51516 -2341 -35301 -21641 11627 23933 -27914 -14708
54 -14708 38360 13417 -987 3509 15925 15206 1782 2444 37955 65526 59357 82575 4687
41D687m019K8532j688L8515J4231r4908L4519n1799L7899J2505k8318J18744k2069
28H6831k1158K2879r721o6411j3717M7682J685r357J442j4992L1921N3419J6369
15A26872J2659m9154o9659J2463P6470j4935n2323n8707l1787j4602N921j9602
3g6384O3934Q7275o00
0G4225
$$ plain form
41 4687 668 29200 27512 66027 80258 -14650 19869 -31930 5969 18474 -9844 108900 86831
28 86831 65673 88552 78831 12420 -1297 46385 48070 38713 40155 25163 57084 110503 126872
15 126872 139531 90377 20718 33181 109651 94716 42393 -16314 -48101 -62703 -56782 -76384
3 -76384 -12450 74825 74225
0 74225
$$ Imaginary data points
##PAGE= N=2
##DATA TABLE= (X++(I..I)), XYDATA
16383b952776O6072J9338M1522J4915O0697J50932J7104m1159Q2702L4374N6891
16372b449388K8990L1391K4866M6330k6085L0768J08434P6075J4777j1738L2857
16361b092723J76280P41J0926J2667K7340O3356O4893J02557M3579M0882n5545
16350a605047N6959n43M6840M7132O4593N6619N175N8458N0886L7278M6943q552
16338a143259P7586o896N6463K0858r873O8315P6250N3740P0558n5619L8095M1647
16326g12135N5223M8889N08J460O3502R4226N4753Q8598Q459L7442J7928O0133
16314a81014N3714J3938m0211L3648O5968j4499J0065J17588K0667k5917O9147
16303A23094J01815Q0346j9608L3291K4620Q510J2888L9850Q6211J0735p415J9382
$$ plain form
16383 -2952776 -2886704 -2867366 -2825844 -2810929 -2750232 -2599300 -2582196 -2623355 -2540653 -2506279 -2449388
16372 -2449388 -2420398 -2389007 -2364141 -2317811 -2343896 -2313128 -2204694 -2128619 -2113842 -2125580 -2092723
16361 -2092723 -1916443 -1915702 -1904776 -1892109 -1864769 -1801413 -1736520 -1633963 -1590384 -1549502 -1605047
16350 -1605047 -1548088 -1548631 -1501791 -1454659 -1390066 -1333447 -1328272 -1269814 -1218928 -1181650 -1134707 -1143259
16338 -1143259 -1065673 -1072569 -1016106 -995248 -1005121 -936806 -860556 -806816 -736258 -791877 -753782 -712135
16326 -712135 -656912 -608023 -607515 -606055 -542553 -448327 -393574 -304976 -296517 -259075 -241147 -181014
16314 -181014 -127300 -113362 -153573 -119925 -53957 -68456 -58391 59197 79864 53947 123094
16303 123094 224909 305255 285647 318938 343558 352068 364956 404806 491017 501752 494337 513719
16291E13719K4606L3394P1148L7213M5145L9605R2673P868l8758O1366K3332N360
16279I16671J8426J20106n2380r622Q6937O9092R207K2350K08897m2088q8679
16268A258917l80k1096N6850R7602J4700j6404o937J5075L8824M5909J23791M225
16256A611076m0886R2772m2316J7714Q9220K6223k1366O9479K1886o0726n089
16245A757987Q51K7614M8371J25136O5602m9548p31o4768K9717J00043N3737K0096
16233B114107J37090o1342O4791k3767K1460K1600M382J1502j1420j8097Q9675
16222B349981O3019r2097L5843N4593K6281J0732P405m0140N5908K1005N9918
16211B552448k6353m4425N4358L7086m4224P8321j12237K5838O2133K9093o1417
$$ plain form
16291 513719 538325 571719 642867 680080 725225 764830 857503 865371 826613 887979 911311 916671
16279 916671 935097 1055203 1002823 993201 1080138 1149230 1158437 1180787 1389684 1347596 1258917
16268 1258917 1258537 1237441 1294291 1391893 1406593 1390189 1383252 1398327 1437151 1483060 1606851 1611076
16256 1611076 1570190 1662962 1620646 1638360 1727580 1753803 1732437 1801916 1823802 1763076 1757987
16245 1757987 1758838 1786452 1834823 1959959 2025561 1976013 1975282 1910514 1940231 2040274 2094011 2114107
16233 2114107 2251197 2189855 2254646 2230879 2252339 2273939 2278321 2289823 2278403 2260306 2349981
16222 2349981 2413000 2320903 2356746 2411339 2437620 2448352 2455757 2415617 2471525 2492530 2552448
16211 2552448 2526095 2481670 2536028 2573114 2528890 2607211 2494974 2520812 2582945 2612038 2550621
16200B550621P5302J6891k2509N6848J48688k3050o0091r64J41617J4788o3722
16189B834419L3611o2680J5485M6557K250J09270J2850P0814P4568r7912j1399
16178C027833m039n51M8631r8756O2305m9674L3803N1077Q5679n4420J6513P3012
16166C191413l9791j1362m108J25403j2904o3238j3671M1371l6401J02704P5209
16155C354625m3987r1646L7227P5530j4327j10108P184J0105M0147K656l0103
16144C237303l3064J06149K0560q9003p4890J42780l1381Q2920p815j6883n9383
16133C277293j6456L4782L4139O7189M9103P833J4971p5676K2450m8178Q3475
16122C450925M8151J8278M0633p9239M5755o7562L3189K1060p7856O0393j5698
$$ plain form
16200 2550621 2625923 2642814 2620305 2677153 2825841 2802791 2742700 2741736 2883353 2898141 2834419
16189 2834419 2868030 2805350 2820835 2867392 2869642 2978912 2991762 3062576 3137144 3039232 3027833
16178 3027833 3023794 3023243 3071874 2973118 3035423 2985749 3019552 3070629 3156308 3101888 3118401 3191413
16166 3191413 3151622 3140260 3136152 3261555 3248651 3185413 3171742 3213113 3176712 3279416 3354625
16155 3354625 3310638 3218992 3256219 3331749 3317422 3207314 3214498 3224603 3264750 3267406 3237303
16144 3237303 3204239 3310388 3330948 3241945 3167055 3309835 3278454 3361374 3353559 3336676 3277293
16133 3277293 3260837 3295619 3329758 3396947 3446050 3453883 3468854 3393178 3415628 3367450 3450925
16122 3450925 3499076 3517354 3557987 3478748 3524503 3456941 3490130 3511190 3433334 3493727 3478029
16111C478029n7657Q9154M9528m9249R9013J03196r6218j17641o5278J7133l3172
16100C416838j0294K5795N140L9144p665p5497J07024R8962L2392j2376M5818
16089C665281j9485q0359j6384K6344l271p3941J0017K6270j4869Q8744o148q12
16077C601387M4055K7056P552j14005O355j9106j6979N756n6107P0890o4896K779
16065C494737J73975Q3483j37900m8426M5072L8759K2704m6518m8538P4471k9373
16054C622446m5407N0124p085j9125o1057l713N5901O9583N224l3864K8862M3625
16042C705514l1577j37433J1931J9050L0615q837l9766K5867j0170P5414k1467
16031C619141L043N5718m8162k1390k9161J01072j6095J4226K8102N7897k5164
$$ plain form
16111 3478029 3420372 3509526 3559054 3509805 3608818 3712014 3615796 3498155 3432877 3450010 3416838
16100 3416838 3406544 3432339 3437479 3476623 3468958 3393461 3500485 3599447 3631839 3619463 3665281
16089 3665281 3645796 3565437 3549053 3575397 3572126 3498185 3508202 3534472 3519603 3608347 3602199 3601387
16077 3601387 3645442 3672498 3680050 3566045 3572400 3553294 3536315 3542071 3485964 3556854 3491958 3494737
16065 3494737 3668712 3752195 3614295 3565869 3610941 3649700 3672404 3625886 3577348 3651819 3622446
16054 3622446 3577039 3627163 3620078 3600953 3539896 3536183 3592084 3661667 3666891 3633027 3661889 3705514
16042 3705514 3673937 3536504 3548435 3567485 3598100 3589263 3549497 3575364 3565194 3640608 3619141
16031 3619141 3622184 3677902 3629740 3608350 3579189 3680261 3664166 3678392 3706494 3764391 3739227
16020C739227q7611l4134L1216n3485O0681l4626l3276J7911K6651j9908l2610
16009C580036L6630k0200j9425j3893P7140K5797N1883k2876j36304M1795M854
15998C605437J5100L8515l5099j28620l1106R9161J04049M0816j2631k0065Q3950
15987C759507l6353m6835R0222j8862m3334L6800N0013j44954j9179k4669O3833
15976C666189j4131K6441o478J9017p5422R5684O5675m3977J1688J8982n8245
15965C705423N5344K0548q4422R272K0146k7639K2830m4166m2670J36248n3200
15954C717714j28141K1312K4556M3799j1033Q7699m130m7519J9731n0677q2960
15943C590351P2635j4855m7066M5510L4921r4874m542K6463O5368K2240q4385
$$ plain form
16020 3739227 3651616 3617482 3648698 3595213 3655894 3621268 3587992 3605903 3632554 3612646 3580036
16009 3580036 3616666 3596466 3577041 3563148 3640288 3666085 3717968 3695092 3558788 3600583 3605437
15998 3605437 3620537 3659052 3623953 3495333 3464227 3563388 3667437 3708253 3695622 3675557 3759507
15987 3759507 3723154 3676319 3766541 3747679 3704345 3741145 3791158 3646204 3627025 3602356 3666189
15976 3666189 3652058 3678499 3672021 3691038 3615616 3711300 3776975 3732998 3744686 3763668 3705423
15965 3705423 3760767 3781315 3696893 3706165 3726311 3698672 3721502 3677336 3634666 3770914 3717714
15954 3717714 3589573 3610885 3635441 3679240 3668207 3755906 3751776 3704257 3723988 3673311 3590351
15943 3590351 3662986 3648131 3601065 3646575 3681496 3586622 3582080 3608543 3673911 3696151 3611766
$$ [...]
##END NTUPLES=NMR SPECTRUM
##END=
