##TITLE=1H_EC-3299(IV-32)x1y
 DMSO
 8 sc, 
 7.9.2023
##JCAMPDX= 6.0         $$ Bruker NMR JCAMP-DX V2.0
##DATA TYPE= NMR SPECTRUM
##DATA CLASS= NTUPLES
##ORIGIN= UXNMR, Bruker Analytische Messtechnik GmbH
##OWNER= root
$$ XWIN-NMR		Version 3.5
$$ Thu Sep  7 14:13:50 2023 Russian Standard Time (UT+4h)  she@DPX200
##.OBSERVE FREQUENCY= 200.13135
##.OBSERVE NUCLEUS= ^1H
##.ACQUISITION MODE= SIMULTANEOUS
##.ACQUISITION SCHEME= undefined
##.AVERAGES= 8
##.DIGITISER RES= 18
##SPECTROMETER/DATA SYSTEM= spect
##.PULSE SEQUENCE= zg30
##.SOLVENT NAME= DMSO
##.SHIFT REFERENCE= (INTERNAL, DMSO, 0, 15.7678)
##AUDIT TRAIL= $$ (NUMBER, WHEN, WHO, WHERE, WHAT)
$$ ##TITLE= Audit trail, XWIN-NMR		Version 3.5
$$ ##JCAMPDX= 5.01
$$ ##ORIGIN= Bruker BioSpin GmbH
$$ ##OWNER= she
$$ F:/spectra/data/she/nmr/H-F/1/pdata/1/auditp.txt
$$ ##AUDIT TRAIL=  $$ (NUMBER, WHEN, WHO, WHERE, WHAT)
(   1,<2023-09-07 14:12:08.00 +0400>,<she>,<DPX200>,
      <created by zg, POWCHK disabled, PULCHK disabled
       configuration hash MD5:
       00 E9 B6 7A A2 85 ED C7 34 08 36 98 17 FE 4E 26
       data hash MD5: 16K
       40 28 1A 4F F9 63 91 48 B9 4F 78 EF F8 E4 90 5E>)
(   2,<2023-09-07 14:12:10.71 +0400>,<she>,<DPX200>,
      <Start of raw data processing
       efp BC_mod = 2 LB = 0.24 FT_mod = 6 PKNL = 1 PHC0 = -21204.37 PHC1 = 8.25271 SI = 16K 
       data hash MD5: 16K
       19 91 AB 8E 34 C8 37 FF 04 19 AB A7 4F 26 D0 3D>)
(   3,<2023-09-07 14:12:36.14 +0400>,<she>,<DPX200>,
      <pk PHC0 = 157.1588 PHC1 = 0.1999999 
       data hash MD5: 16K
       3A 5F 67 61 84 CF FA 69 76 50 CB DD 06 89 06 40>)
(   4,<2023-09-07 14:12:40.37 +0400>,<she>,<DPX200>,
      <abs ABSG = 5 
       data hash MD5: 16K
       5F F1 59 7C AD 77 01 15 7C D0 22 16 79 32 AA B1>)
$$ ##END=
$$ 
$$ hash MD5
$$ 14 83 CC 6F 00 2C E2 F0 E5 A5 A3 5F 97 88 8F 94
##$RELAX= 
##$RELAX= 
##$RELAX= 
##$RELAX= 
##$RELAX= 
##$RELAX= 
$$ Bruker specific parameters
$$ --------------------------
##$DU= <F:/spectra>
##$EXPNO= 1
##$NAME= <H-F>
##$PROCNO= 1
##$TYPE= <nmr>
##$USER= <she>
##$AMP= (0..31)
100 100 100 100 100 100 100 100 100 100 100 100 100 100 100 100 100 100 
100 100 100 100 100 100 100 100 100 100 100 100 100 100 
##$AQSEQ= 0
##$AQ_mod= 1
##$AUNM= <au_zg>
##$AUTOPOS= <>
##$BF1= 200.13
##$BF2= 200.13
##$BF3= 200.13
##$BF4= 200.13
##$BF5= 200.13
##$BF6= 200.13
##$BF7= 200.13
##$BF8= 200.13
##$BYTORDA= 1
##$CFDGTYP= 0
##$CFRGTYP= 5
##$CHEMSTR= <none>
##$CNST= (0..31)
1 1 145 1 1 1 1 1 1 1 1 1 1 1 1 1 1 1 1 1 1 1 1 1 1 1 1 1 1 1 1 1 
##$CPDPRG= <>
##$CPDPRG1= <>
##$CPDPRG2= <>
##$CPDPRG3= <>
##$CPDPRG4= <mlev>
##$CPDPRG5= <mlev>
##$CPDPRG6= <mlev>
##$CPDPRG7= <mlev>
##$CPDPRG8= <mlev>
##$CPDPRGB= <>
##$CPDPRGT= <>
##$D= (0..31)
0 1.2 0 0 0 0 0 0 0 0.06 0 0.03 0 0 0 0 0.0002 0 0 0 0 0 0 0 0 0 0 0 0 
0 0 0 
##$DATE= 1694081527
##$DBL= (0..7)
120 120 120 120 120 120 120 120 
##$DBP= (0..7)
150 150 150 150 150 150 150 150 
##$DBP07= 0
##$DBPNAM0= <>
##$DBPNAM1= <>
##$DBPNAM2= <>
##$DBPNAM3= <>
##$DBPNAM4= <>
$$ [...]
##$SUBNAM3= <"">
##$SUBNAM4= <"">
##$SUBNAM5= <"">
##$SUBNAM6= <"">
##$SUBNAM7= <"">
##$SUBNAM8= <"">
##$SUBNAM9= <"">
##$SW= 18.05172834244
##$SWIBOX= (0..15)
0 0 2 0 0 0 0 0 0 0 0 0 0 0 0 0 
##$SW_h= 3612.71676300578
##$TD= 16384
##$TD0= 1
##$TE= 0
##$TE2= 300
##$TE3= 300
##$TEG= 300
##$TL= (0..7)
0 120 120 120 120 120 120 120 
##$TP= (0..7)
150 150 150 150 150 150 150 150 
##$TP07= 0
##$TPNAME0= <>
##$TPNAME1= <>
##$TPNAME2= <>
##$TPNAME3= <>
##$TPNAME4= <>
##$TPNAME5= <>
##$TPNAME6= <>
##$TPNAME7= <>
##$TPOAL= (0..7)
0.5 0.5 0.5 0.5 0.5 0.5 0.5 0.5 
##$TPOFFS= (0..7)
0 0 0 0 0 0 0 0 
##$TUNHIN= 0
##$TUNHOUT= 0
##$TUNXOUT= 0
##$USERA1= <user>
##$USERA2= <user>
##$USERA3= <user>
##$USERA4= <user>
##$USERA5= <user>
##$V9= 5
##$VALIST= <valist>
##$VCLIST= <CCCCCCCCCCCCCCC>
##$VD= 0
##$VDLIST= <DDDDDDDDDDDDDDD>
##$VPLIST= <PPPPPPPPPPPPPPP>
##$VTLIST= <TTTTTTTTTTTTTTT>
##$WBST= 1024
##$WBSW= 4
##$XGAIN= (0..3)
0 0 0 0 
##$XL= 0
##$YL= 0
##$YMAX_a= 231547
##$YMIN_a= -311359
##$ZGOPTNS= <>
##$ZL1= 120
##$ZL2= 120
##$ZL3= 120
##$ZL4= 120
##$ABSF1= 15.73367
##$ABSF2= -2.318179
##$ABSG= 5
##$ABSL= 3
##$ALPHA= 0
##$AQORDER= 0
##$ASSFAC= 0
##$ASSFACI= 0
##$ASSFACX= 0
##$ASSWID= 0
##$AUNMP= <proc_1d>
##$AZFE= 0.1
##$AZFW= 0.1
##$BCFW= 0
##$BC_mod= 2
##$BYTORDP= 0
##$COROFFS= 0
##$CY= -3
##$DATMOD= 1
##$DC= 0
##$DFILT= <>
##$DTYPP= 0
##$F1P= 0
##$F2P= 0
##$FCOR= 1
##$FTSIZE= 16384
##$FT_mod= 6
##$GAMMA= 0
##$GB= 0
##$INTBC= 1
##$INTSCL= 3.70164e-10
##$ISEN= 128
##$LB= 0.24
##$LEV0= 0
##$LPBIN= 0
##$MAXI= 10000
##$MC2= 0
##$MEAN= 0
##$ME_mod= 0
##$MI= 1.114404
##$NCOEF= 0
##$NC_proc= -6
##$NLEV= 6
##$NOISF1= 3.799351
##$NOISF2= 2.8
##$NSP= 0
##$NTH_PI= 0
##$NZP= 0
##$OFFSET= 15.76782
##$PC= 1
##$PHC0= -21047.21
##$PHC1= 8.45271
##$PH_mod= 1
##$PKNL= yes
##$PPARMOD= 0
##$PSCAL= 0
##$PSIGN= 0
##$REVERSE= no
##$SF= 200.130000743702
##$SI= 16384
##$SIGF1= 3
##$SIGF2= 2
##$SINO= 5.538805
##$SIOLD= 16384
##$SREGLST= <1H.CDCl3>
##$SSB= 0
##$STSI= 16384
##$STSR= 0
##$SW_p= 3612.71676300578
##$SYMM= 0
##$S_DEV= 0
##$TDeff= 16384
##$TDoff= 0
##$TI= <>
##$TILT= no
##$TM1= 0
##$TM2= 0
##$TOPLEV= 0
##$USERP1= <user>
##$USERP2= <user>
##$USERP3= <user>
##$USERP4= <user>
##$USERP5= <user>
##$WDW= 1
##$XDIM= 16384
##$YMAX_p= 367913804
##$YMIN_p= -803901
$$ End of Bruker specific parameters
$$ ---------------------------------
##NTUPLES= NMR SPECTRUM
##VAR_NAME=  FREQUENCY,     SPECTRUM/REAL,   SPECTRUM/IMAG
##SYMBOL=    X,             R,               I
##VAR_TYPE=  INDEPENDENT,   DEPENDENT,       DEPENDENT
##VAR_FORM=  AFFN,          ASDF,            ASDF
##VAR_DIM=   16384,         16384,           16384
##UNITS=     HZ,            ARBITRARY UNITS, ARBITRARY UNITS
##FACTOR=    0.220516191357247, 1,           1
##FIRST=     3155.61390002841, 0,            0
##LAST=      -457.102862977371, 0,           0
##MIN=       -457.102862977371, -803901,     0
##MAX=       3155.61390002841, 367913804,    0
$$ Real data points
##PAGE= N=1
##DATA TABLE= (X++(R..R)), XYDATA
$$ [...]
12810 -24494 65026 58152 -38625 -109618 -94061 -91205 -133580 -163770 -44808 26875 -41854 -56467
12798 -56467 -133615 -130146 -135575 -20750 92234 104730 76347 -7205 30100 -37005 -53900 -33748
12786 -33748 -47087 -20401 73441 -10251 -45009 -16256 -39703 -37797 -103495 -63141 -67445 -98459
12774 -98459 -24292 84977 1918 -95285 -110221 -124423 -107900 -13277 -9275 -18068 -34026 -28894
12762 -28894 -52318 -128824 -3152 -64722 -28786 33847 -22237 9049 11625 2237 16632 27199
12750 27199 -88686 -72453 6331 49149 17781 16353 79031 -54861 -53036 -76806 -52700 19612
12738 19612 -50087 12940 -28679 -33925 3419 10324 -73479 19429 41233 -28630 -67518 46816
12726 46816 -55137 -33077 -35366 -85412 -6798 7034 95245 40271 41865 27047 -27154 -1565
12714 -1565 -4334 39502 49587 -9432 -36148 -912 -86562 -95446 -66264 -38012 -35398 -57518
12702 -57518 -87627 -110521 -91069 -92016 -5934 -15720 17637 43869 -27738 17836 -65691 -48823
12690 -48823 57234 24862 -18583 -48603 -39840 -87770 1425 -13269 -24479 -37717 -1624 20543
12678 20543 4197 14123 103577 -38854 16075 30678 -32721 -87009 -115637 -23029 5368 -14308
12666 -14308 -93932 38169 -36199 -68631 -34050 -23991 106994 6404 -112127 -100743 56347
12655 56347 -18856 -84981 3318 -36150 -114201 -17264 111617 -30244 -138099 -64984 -117268
12644 -117268 -131232 -103456 -42520 -87860 -15885 19 29810 54839 19322 24293 26439 33366
12632 33366 -38958 -31336 -31730 -24075 50217 7521 -85213 -85397 -100282 -72485 -39032 21343 -57391
12619 -57391 -111057 -84926 -40798 -117264 -82328 -23715 -59391 -53055 -102642 -152846 -127932 -89633
12607 -89633 -47554 24399 46918 89190 79277 -7569 17809 -73121 -160082 -58454 -24631 -101863
12595 -101863 -157043 -172469 -111602 -32925 9014 28556 65505 -42346 -53213 -56834 -74302
12584 -74302 -124483 -99508 -59057 21462 -5830 -17400 25492 -34402 -121279 -21208 -60726
12573 -60726 19034 68125 62099 -36024 -4820 39835 -26457 -22874 -47104 73790 45744 -41155
12561 -41155 -44294 -1686 -71380 -82014 -3895 -17398 -179363 -75040 -4212 -74265 -160410
12550 -160410 -43499 35913 55598 30799 -21715 3010 76173 85075 88372 55171 17196 -23236
12538 -23236 21393 -74696 -69704 -28736 48369 125210 64364 84048 -12616 -90870 -47041 -72581
12526 -72581 -32642 76205 85972 119144 93805 -67443 -43521 -36059 -13638 34963 125409 81901
12514 81901 -43128 41728 71422 88485 38871 25266 -11840 -47797 10390 39826 -14530
12503 -14530 33961 53098 51939 26065 -34587 -60904 -5154 -11555 -32401 -6214 -55174 -73317
12491 -73317 -58538 -19906 114108 119256 96665 71094 -52563 -16414 -83775 -116250 -110690 -94238
12479 -94238 -56195 -59796 -75524 -17831 22979 -54284 -25542 -14625 -6635 -95912 -25699 44685
12467 44685 25615 -51500 -2087 16849 60516 100345 42505 -37197 -133876 -93185 -102210 -82726
12455 -82726 -1959 10478 52 -27644 -50453 -56498 -38210 4689 -19496 -27761 -81744 -96876
12443 -96876 52045 106880 -8268 -8996 -59008 -73778 -37665 -98982 3736 23907 53429
12432 53429 45784 15236 51768 -38037 -43743 -44296 -8579 19417 29472 -13751 -48821 -36299
12420 -36299 -20660 -89076 -16990 38882 -21608 3407 15722 -3915 11294 34265 -5711 40163
12408 40163 -24013 -100105 -20171 -37521 -2015 4233 29224 -40971 -88976 -108364 -86185 -80345
12396 -80345 -100449 -30435 26408 132242 150611 40967 31175 71818 73931 84764 18808 -13643
12384 -13643 -85832 -126543 -39831 80177 15610 -6121 8463 97548 9336 19999 21792 57987
12372 57987 -8944 -17296 66925 63101 -3279 16146 63713 10405 -25383 -42284 85782 75967
12360 75967 78035 31055 7726 118245 33176 -6869 28670 -24585 69267 74235 -4683 -28427
12348 -28427 -81019 -107375 16471 73761 115873 102730 98051 11760 3214 4276 4164 -229 30864
12335 30864 7545 -81493 -61921 73764 -5970 -4737 -9971 54967 49093 9169 32101 71233
12323 71233 90190 138979 126914 98144 137220 73906 31967 47242 125374 54085 -135005
12312 -135005 -90524 17885 9933 58337 -18507 8737 94279 129632 -21330 4007 62978
12301 62978 68063 41983 -48992 -22075 4642 -12708 -40722 -11224 -5171 -95555 -23643 105277
12289 105277 124387 36643 -34767 -204494 -98113 -67490 -124806 -25325 49446 -27278 40327
12278 40327 22669 -89837 -165534 -69153 -42621 -63880 -35582 8147 35173 39083 12945 -74527
12266 -74527 92924 90850 -9565 -55555 78740 30201 -90704 -48910 29892 31577 -35510
12255 -35510 -135273 -57116 -54230 -65277 -48159 -74716 30318 -37065 -34472 76245 89418 77436
12243 77436 86513 4705 35994 104846 26361 -7439 40151 176898 110125 94376 -1206 -40115
12231 -40115 -14124 -14469 17030 60219 20080 22182 69121 30821 -20380 -30120 -17833 -18698 75762
12218 75762 95892 100905 85183 6968 6752 72140 67745 29811 -4695 29520 -66085 -37152
12206 -37152 -54376 21075 77402 42341 -1988 82331 80136 8015 14421 61338 99829 -689
12194 -689 47134 4789 4979 112716 63987 -61450 -103052 -27543 86912 26623 94179 95569
12182 95569 111192 78360 41990 13767 95602 43191 -25081 29502 43333 48954 43269 63855
12170 63855 -24971 -32754 -6874 35196 73263 136799 101610 63741 63669 15568 6861 49347 11012
12157 11012 -30422 -108456 -715 75488 78590 -7328 -60253 3354 -29063 6289 -6907 -16728
12145 -16728 -2132 84634 52251 121402 127037 24555 -61723 38238 149772 96317 -52715
12134 -52715 1807 80533 21080 36931 143299 191273 192833 158867 129393 220033 234650 198448
12122 198448 195710 195043 61395 111997 57810 12020 127539 153798 235752 176245 120371 96468
12110 96468 91968 101768 18692 103754 154358 210298 237563 239245 199972 202913 236952 291947
12098 291947 213460 155826 301028 331636 316977 229535 256568 305756 247356 190074 286013
12087 286013 419016 385845 340138 258919 273980 299158 247186 371109 355523 405210 371988
12076 371988 259647 401015 393669 412092 375588 441935 442181 528785 466235 503081 557517 487215
12064 487215 458912 592181 707196 686412 685870 723679 753802 676000 681772 732649 718660 684358
12052 684358 692732 672306 765672 887403 851779 807708 811101 898796 928000 887483 915647 954173
12040 954173 916145 934228 989140 987254 998910 1008900 1066930 1092391 1066865 995487 1052998 1123229
12028 1123229 1198333 1219315 1313660 1336822 1319485 1363839 1325063 1234405 1285803 1223940 1221997
12017 1221997 1241123 1309106 1345957 1446812 1521707 1401130 1330204 1310598 1335821 1346733 1366900
12006 1366900 1334399 1312472 1323454 1346567 1306555 1260135 1294688 1303507 1408162 1379177 1316113
11995 1316113 1321813 1369575 1308921 1402892 1452178 1354027 1260951 1193891 1154986 1165859 1235446
11984 1235446 1244268 1138152 1123837 1195451 1172058 1119675 1164154 1241621 1152267 1060867 1068915
11973 1068915 1099947 1031517 1092364 1056115 1040740 1107779 1035936 924660 932487 1018644 886191
11962 886191 830483 822284 718000 801383 773122 685310 677900 737169 655633 621071 654480 705677
11950 705677 634370 623561 633036 612290 576231 520878 539503 510367 461262 458831 540962 585017
11938 585017 604012 582915 564403 546571 495761 521793 475320 501786 414028 382362 465557
11927 465557 458277 512287 436755 389352 446741 467294 437088 342062 287074 338103 371877 255538
11915 255538 245729 212364 260530 367384 280778 322282 351609 350875 358710 296186 322500 308943
11903 308943 296792 300316 330875 364910 328854 279429 234811 214538 221699 244797 305033 291989
11891 291989 332475 329199 356212 360582 339334 290574 308722 500790 521739 440022 362813 329213
11879 329213 344648 368853 288139 371473 374768 422215 492869 498744 463374 521360 502984 513211
11867 513211 659301 680217 658553 587852 539892 526212 551510 533331 545734 597812 639943
11856 639943 752160 695918 631016 736366 760347 741170 742610 686268 732045 756214 861722
11845 861722 799989 796861 709986 721081 835957 875429 918659 873138 881284 947385 971789 986380
11833 986380 1045162 989079 1061242 1072399 1071830 1076192 1011030 1086980 1107833 1057065 1042670 1059006
11821 1059006 1156671 1124897 1106159 1035387 1123553 1156303 1228512 1263514 1210131 1184979 1164412
11810 1164412 1183818 1172731 1234248 1166094 1148063 1196416 1164029 1113261 1109202 1133174 1282746
11799 1282746 1254813 1117696 1139404 1166360 1241060 1167406 1099134 1166203 1151149 1118910 1073491
11788 1073491 1074549 1019388 926777 984118 971932 1022168 1025211 941950 892147 905796 931171 959932
11776 959932 1004267 938030 852406 818116 776068 850375 916745 914759 824727 791700 844472 869016
11764 869016 868299 748636 727530 769504 834002 803716 744980 733623 679988 650245 656016 635175
11752 635175 540798 494041 487129 524877 540806 502623 479122 449342 394131 345838 416852 465067
11740 465067 317139 340078 341209 353748 420633 349069 404434 387653 295544 370616 318532
11729 318532 263534 312507 277179 274460 190577 186612 177022 135075 112922 134361 210865 206734
11717 206734 229992 226514 133841 119816 153275 55993 150455 169432 103616 127534 141963 91890
11705 91890 15916 14864 7389 138556 193687 111871 59178 71447 35566 28482 95504 115161
11693 115161 56912 31929 -23378 19011 16069 -16244 3037 159984 35804 -37576 -88253
11682 -88253 -21994 66500 35141 95306 92826 6174 29873 97172 -19092 -30081 17468 -20334
11670 -20334 -119266 -80508 380 34354 7296 -4029 5647 -80244 -71534 54343 14894 132085
11658 132085 201349 124038 -12665 -121768 -76148 -56945 -35541 42600 21750 22574 3894
11647 3894 -17619 -27493 -30452 -109321 -75846 -86413 -5511 32568 -47951 -53463 73476 98383
11635 98383 49899 96477 27382 -30596 18657 -40067 -56580 -63968 -24480 23450 14947 80565
11623 80565 -5800 -13285 -88074 -24100 -99740 -96023 -124222 -144451 -85708 -137836 -150291 -139649
11611 -139649 -78000 -76836 -38852 -73772 -139563 -155712 -133431 -78013 -67704 -1684 79585 38155
11599 38155 -31296 -103348 -54763 -3105 -71170 -25462 12709 -56024 -71726 -93167 -105129 -50949
11587 -50949 -60745 -50482 7013 24465 45793 68171 66737 -8810 45329 4610 -16786 -33180
11575 -33180 -97637 -89792 -120290 -144539 -137367 -7426 13096 8049 100409 135466 15469 -46794
11563 -46794 37347 125912 4435 -57427 -3754 70244 73811 26131 -15719 37046 39128 -32291
11551 -32291 -15522 -95471 41339 47150 21129 -33388 -2472 -62885 -123106 -1586 2772 -66258
11539 -66258 -104458 -163767 -6208 101446 27466 52428 -27509 -5266 -77166 -54703 24717
11528 24717 29376 8299 11511 -31272 -73087 -169857 -163042 -114812 -97645 -14429 44843 53439
11516 53439 -58390 -27973 41275 -70916 -84963 -77171 -47264 -143552 -138685 -124098 -86818 -84078
11504 -84078 -147800 -74798 -139612 21039 78965 -42122 -106845 -10633 -36226 -57914 -113349
11493 -113349 -86160 -7713 -4192 -131067 -106855 -104265 -152498 -170639 -153106 -79081 -121814 -18018
11481 -18018 -100755 -141262 -69889 40416 -6137 -84360 -15997 -22817 -19477 -3635 -46234 -49018
11469 -49018 -106752 -64708 -33983 18420 98171 84108 -858 -120125 -35030 30791 -19928
11458 -19928 10307 23830 98777 73216 -4389 -87053 -120511 -100857 -18457 -176568 -180513 -89405
11446 -89405 -89271 -62420 -60594 -55488 -80217 -77981 -3382 69755 12265 -139615 -105976 -49441
11434 -49441 -59290 -40691 -51163 -56951 -122445 -82332 -32803 -19275 -11135 -10831 50237 -6741 -142295
11421 -142295 -67156 -16427 -28858 -111798 -27696 19035 22292 4882 73682 6212 2609 -35658
11409 -35658 -75367 -83730 -25278 -8759 -51008 -47645 -110311 -124846 -176045 -124760 -141318 -145907
11397 -145907 -144791 -189882 -97398 -137974 -56742 -76035 -136724 -192633 -113388 -80151 -239390
11386 -239390 -287293 -248476 -202273 -133098 -75881 -80690 -85389 -99712 -201670 -130419 917
11375 917 -69207 65281 34176 -15441 -3468 3879 10992 -34215 -47716 -76256 17736 -118383
11363 -118383 -146053 -73848 -120730 -101326 -158234 -200677 -47120 10400 -37120 -32105 -78156
11352 -78156 -10601 -26194 -43640 -126682 -111961 -191830 -142965 -139753 -108482 -109449 -149293 -159957
11340 -159957 -73613 -83762 -88470 16189 -44995 -116196 -46282 -91451 27191 26347 -55349 -72418
11328 -72418 -74426 -40942 -69143 -31554 -825 15109 -48806 -48934 -109326 -74446 -78928 -29922
11316 -29922 12562 -6982 -105159 -57674 -53535 -42943 -51570 -138864 16626 56545 26723 14729
11304 14729 -27932 -50626 -64331 -57874 -36718 -29292 -60207 -69531 -50639 97448 47819 -86347
11292 -86347 -74252 -104623 -35661 22677 30826 89478 -23672 -99043 -147583 -63226 -100844 -192992
11280 -192992 -108206 -121225 -1332 -86184 -26226 -62972 -30643 16699 -50977 -125422 -91823
11269 -91823 -100365 -152089 -218997 -235043 -81392 -54611 -139001 -209431 -125121 -138880 -112117 -91976
11257 -91976 4807 4387 -118840 -79894 -12819 -42003 -57402 -110699 -117465 -188534 -271732 -202008
11245 -202008 -157723 -192259 -194065 -75758 -22930 -99388 -44042 130780 30730 -132152 -175766
11234 -175766 -166214 -107222 -101706 -68975 -47512 101519 40713 113328 56517 -40624 -16288 -3491
11222 -3491 3989 -16729 7572 -98666 -102327 53142 -6681 -70866 -156530 -95037 -138226 -179730
11210 -179730 -132603 -22824 -30576 -80591 -74522 -126625 -149397 -130754 -106378 -188693 -236085 -111368
11198 -111368 -65600 -62444 -10076 -6263 47720 22116 110450 -28002 -71763 -68639 -65810 -150522
11186 -150522 -123958 -109348 -166971 -111095 -165065 -151029 -163139 -174466 -146896 -107876 24066
11175 24066 29946 -9508 4250 -15484 -54014 -70880 -53182 -126288 -125075 -59513 -61868 -15193
11163 -15193 -23974 -19022 -92239 -143693 -218775 -141638 -89156 -53891 -46815 -130943 -83597 -59433
11151 -59433 -159112 -164587 -94706 45569 83031 91207 -75121 -116207 -41904 -142950 -113256
11140 -113256 -212184 -147671 -54564 -92314 -42242 4594 -33409 -48571 -23884 25259 -29117
11129 -29117 -18143 -27512 -38810 -125987 -122766 -63519 -91587 -51090 -101910 -122462 -174905 -134620
11117 -134620 -58068 -18108 -108549 -140721 -157396 -116191 -80393 -73170 -63937 -65579 -88126 -63384
11105 -63384 -71148 -44812 -40969 -115337 -120032 -113449 -66351 -103327 -111332 -9419 -45719 -119842
11093 -119842 -130236 56757 23846 -84075 -48807 -57936 -101663 -96752 -95768 -60898 -31155 -13725
11081 -13725 38343 -59190 -57614 -108366 -128380 -138976 -108257 -114049 -71225 -131616 -113382 -106709
11069 -106709 -41413 -85530 -99950 -95895 -76780 -37687 -81614 -37515 -62045 -116023 -113825 -120750
11057 -120750 -177411 -66040 -27027 -60419 -97140 -52820 30387 -97675 -99569 -143134 -181483
11046 -181483 -73935 25548 -49509 -81288 -73274 -77522 -75374 -111118 -159201 -175413 -123744 -94289
11034 -94289 -37102 -27945 -105928 -72031 -94837 -131837 -85864 -84778 -136103 -134509 -51091 -112154
11022 -112154 -120415 -109541 -81320 -29727 -17537 -54856 -47350 -62385 -82327 -122394 -142698 -70921
11010 -70921 -62741 -9100 -102945 -10559 13865 -42777 -94037 -73479 -18219 -88176 -99501 -55921
10998 -55921 -2956 24314 38483 -20806 -86405 19016 81567 111843 9629 -30099 -36381
10987 -36381 -80957 -378 51356 -73987 -99400 -69704 -78370 -75129 -87233 -51951 -48144 -73610
10975 -73610 -86362 -61914 -95503 -95990 -105498 -81698 -166497 -94817 -105472 -45323 3406 -39465
10963 -39465 -119687 -123980 -118049 -141460 -43270 42877 -43770 -13337 -102170 -23026 -40111 -46918
10951 -46918 -113681 -146325 -90697 -34518 -63313 -37450 62252 96397 26084 -49154 -5483 -10979
10939 -10979 -30427 -63275 -153707 -88874 -119981 -147108 -35424 -59585 -120095 -62661 -80827
10928 -80827 -28201 -64888 -148462 -122058 -110186 -40962 -123507 -58795 -97079 -76263 42206
10917 42206 28149 -35007 8322 97014 45230 -115894 -133310 -28479 -13139 -43970 -4855
10906 -4855 -25872 -33256 -14158 100503 134787 54876 -68582 -78314 -125922 -137795 -175847 -173966
10894 -173966 -175512 -64758 -29143 -55459 -37433 -104421 -48678 -6998 -112465 -62534 -21211
10883 -21211 20146 119609 108224 -11744 -10005 -80286 -96429 -61967 -57067 -4190 43941 108607
10871 108607 31455 -27152 52863 -10525 -46135 -43326 -79146 -44576 -22205 -54593 -45837 -32221
10859 -32221 -99126 -21285 -19930 -118393 -94630 -66824 -112476 -89982 -28953 -57952 -55327 -58234
10847 -58234 -207316 -134300 -29658 -72460 -39387 -48288 -26181 43797 63439 16341 5869
10836 5869 -98477 -88403 -143534 -119848 7247 10119 34344 41633 101192 13681 -33926 -54094
10824 -54094 -95446 -86005 -94746 -20972 -16672 -6721 65245 140184 16304 -44070 -41113 -38366 -61362
10811 -61362 -104076 -97695 -144721 -135094 -31688 85657 -56010 106317 103685 -37636 -38655
10800 -38655 -26794 -97779 -143674 -143086 -164582 -185523 -69643 -78142 -105811 -97580 -145830 -116368
10788 -116368 -111686 -51338 -16005 58407 -2723 -126026 -35142 60972 64245 -37335 -158493
10777 -158493 -84741 26196 -27804 13700 28656 -26945 -17494 -5121 -34582 -31171 -34748 -36002
10765 -36002 -48326 -134976 -104128 -65207 -33823 -62957 2502 46009 25303 26801 -91756 -101884
10753 -101884 -111401 -21330 -53048 -123881 -8438 -366 -74016 -41149 22075 9819 -26070 -73519
10741 -73519 -71285 -14561 -85757 6308 -1989 -4157 85270 54791 32548 69884 20795 -124348
10729 -124348 -113705 -53898 -34678 -30136 -132657 -45355 -34772 -29474 -43590 -60094 -92053 -33117
10717 -33117 28366 6680 -18892 -46580 -49735 -110820 -103554 -159343 -153793 -168225 -182634 -171500
10705 -171500 -88187 -46326 -9156 -133970 -98443 -98357 -67507 -108500 -65681 -83411 -126072 -138414
10693 -138414 -156368 -169879 -138847 -27426 24845 -81404 10550 13140 -105658 -124911 -47100
10682 -47100 -53470 -10221 -99978 -79851 35558 38176 -30805 24210 9241 -64769 -122017 -94419
10670 -94419 -38433 -118493 -117925 -94703 -80942 -141905 -9894 -57728 -155769 -98486 -71415 -74319
10658 -74319 -2037 -63944 -44449 295 49873 59116 83861 27295 -77750 -33079 17164 13855
10646 13855 -152272 -109046 30318 81814 70180 51095 -43228 -112598 -29905 -22145 33336
10635 33336 49530 -6699 -67608 -7526 72130 44505 -136363 -136379 -46386 -36943 -126656 -175258
10623 -175258 -200664 -106524 -104495 -81577 -142964 -84374 -103319 -157154 -159341 -19005 1808 56260
10611 56260 89261 15880 22472 18102 -97990 -102200 -34644 -136211 -93783 -59210 -43149 -106710
10599 -106710 -106772 -90818 -15402 -82078 -85693 -145855 -4148 7910 -29206 -126439 -182426 -96041
10587 -96041 -109191 -89579 -46243 -2507 -41842 -31461 32747 20543 -32387 -79280 -199824
10576 -199824 -108087 -114007 -101252 -41938 -75629 8274 8691 -5949 -56388 -123655 -120709 -175121
10564 -175121 -176115 -90058 -33855 -7255 -11073 -32942 -50026 24163 95624 78776 7293 92212
10552 92212 52355 -76539 -66462 -98618 -74823 -15058 -14259 -735 73484 84733 45309 35867
10540 35867 -7227 -125999 -149230 -114034 -12607 -49346 -12523 -40095 -167998 -79739 -6822
10529 -6822 -52925 -52123 108118 78971 -42662 -35069 1640 30135 19424 101862 58751 76461
10517 76461 27836 6678 74745 88954 169150 84827 -23417 -58207 53325 135178 98000
10506 98000 36992 43335 66252 -5566 12767 17859 24742 5475 4155 69404 12288 -116567
10494 -116567 -63167 70767 63771 -960 -11235 106484 62210 78169 43711 20256 54563
10483 54563 97453 94436 185054 83445 57689 39367 -50542 19955 41666 -7599 18174 133291
10471 133291 116655 122388 115770 67296 108680 122770 89247 28977 29835 105842 134559 117148
10459 117148 -14540 13478 73148 106406 155825 165658 190284 137894 164944 145203 128102
10448 128102 208216 212364 153660 78862 63382 75099 95266 184493 206416 182565 199027 185891
10436 185891 199002 106578 190442 211341 130144 194265 173500 123011 51311 20524 74080
10425 74080 83153 87269 206773 131287 66907 135891 94293 82718 169384 232707 247019 236885
10413 236885 162964 142669 139387 182936 248738 190489 177285 224889 221046 231975 283791 245805
10401 245805 218739 284856 275733 230485 217582 225196 270003 265835 170519 114955 127334 166101
10389 166101 201749 328200 275939 225526 262198 219298 159931 137571 163689 225647 175707
10378 175707 224572 183484 256623 239677 162202 176287 205482 255876 304270 271648 217936
10367 217936 209717 311753 399935 431597 442230 394411 465264 421041 446227 462040 302948
10356 302948 278325 420579 466372 476100 439523 498512 429731 305985 374332 395193 437733
10345 437733 509250 436641 487698 453496 471673 572912 563829 612810 556412 632637 778472
10334 778472 786921 674492 580475 571504 670379 681829 790328 788529 741464 663507 708083 796501
10322 796501 908147 980674 887778 928323 959524 1002494 914862 977251 1028190 1078579 1123728
10311 1123728 1174320 1215535 1260073 1187246 1263919 1231335 1376365 1426807 1445396 1396945 1338559
10300 1338559 1462258 1469423 1535587 1617389 1606104 1639731 1728310 1680951 1664874 1609760 1558221
10289 1558221 1588225 1656323 1667158 1590330 1687034 1703528 1736417 1783526 1816373 1851103 1706549
10278 1706549 1805993 1784997 1733247 1777140 1732870 1762162 1840022 1971798 2067952 2037764 2113000
10267 2113000 2110323 2105020 2075476 2112156 2113247 2158157 2198272 2102287 2263894 2335484 2300085 2260597
10255 2260597 2275696 2314884 2388344 2240744 2208482 2374451 2392420 2348764 2382216 2381714 2238763
10244 2238763 2184037 2190751 2318642 2302714 2299899 2300427 2170957 2194147 2234925 2137220 2078406 2044914
10232 2044914 2015001 1978213 1963227 1993923 2051737 2085724 1923083 1904375 1966097 1885151 1751988
10221 1751988 1845841 1899768 1811987 1850506 1845392 1784946 1801657 1866260 1838811 1784535 1749509
10210 1749509 1748057 1666226 1584446 1660287 1696094 1568571 1543859 1590393 1543037 1480654 1527129
10199 1527129 1472001 1507875 1529635 1475494 1480262 1522125 1450289 1267887 1195576 1234318 1190622
10188 1190622 1182301 1121558 1151193 1086019 1071686 1031023 943073 963191 974212 922749 890334
10177 890334 923695 846765 811279 795953 673739 683257 671483 621718 671895 653042 603076
10166 603076 664077 582931 590713 573861 555703 568680 581665 549274 518267 511534 354911 396675
10154 396675 367246 375809 358378 322504 490792 513427 435868 291973 260889 311408 296661
10143 296661 297660 321279 326834 208526 246415 288538 430574 412632 450768 408872 398997 352285
10131 352285 308271 373133 274211 340318 398131 357844 260172 302853 356897 411246 393945
10120 393945 355504 392131 369346 352361 318244 316176 270432 311381 207658 217834 179065
10109 179065 258051 281741 364488 262160 265542 313108 266907 171784 186795 190156 139991 97639
10097 97639 178510 256682 264094 241172 288812 220118 196706 225195 280977 275693 278463 301638
10085 301638 227232 351453 286572 381267 315338 290167 282413 299333 290996 356440 419254 374860
10073 374860 282499 301659 375279 398699 291903 310585 351239 350128 330409 317733 284309
10062 284309 247031 275887 248821 258168 414233 337808 221035 187875 307285 459098 485915
10051 485915 424008 388977 397239 488253 452291 281165 240218 254962 263356 305630 322893 380889
10039 380889 356912 422210 389381 430637 515518 543221 470507 411361 425992 422347 414891 420225
10027 420225 555774 554114 512933 553357 617083 590167 551730 667001 723328 712746 786564
10016 786564 707616 649855 680181 726469 782233 801333 724287 828148 780312 802633 851221
10005 851221 922666 854152 860223 929848 974560 1051926 977566 896668 1014990 1070808 1005146
9994 1005146 964437 981650 1101778 1081106 1075871 1155273 1264105 1217004 1213061 1093334 1120235
9983 1120235 1278377 1217373 1155934 1071942 1060894 1145616 1231985 1257577 1309319 1326888 1402974
9972 1402974 1369460 1346628 1383269 1416900 1441947 1465713 1307445 1314278 1489848 1583309 1515025
9961 1515025 1470128 1605849 1636314 1819460 1852245 1714049 1712656 1759271 1859821 1808065 1797204
9950 1797204 1896541 1762958 1786112 1759761 1873525 1953514 1904287 1934402 2028367 2060344 1959587
9939 1959587 1934111 2007670 1997973 1950336 1920196 1900694 1973975 1965408 1853020 1946639 1873236 1795552
9927 1795552 1870208 1841706 1842262 1835496 1913069 1919264 1897349 1925689 1879630 1979207 1935320 1948611
9915 1948611 1934608 1886774 1925284 1920987 1940814 1879493 1834005 1848976 1860386 1781195 1825689 1910092
9903 1910092 1953532 1912278 2006378 2003713 1884567 1903380 1984474 1989705 1979322 1930472 1850967 1809048
9891 1809048 1785311 1780024 1807585 1771177 1738790 1794889 1723683 1667232 1609304 1603595 1665610 1686515
9879 1686515 1679659 1595194 1515710 1370810 1346388 1411377 1416276 1333116 1329137 1281363 1259608 1222432
9867 1222432 1217216 1194592 1156744 1067741 1018997 1032990 1051737 1126632 1140918 1117002 1091331 990404
9855 990404 977398 1028871 1096244 1062063 1020104 971764 970682 1014578 917445 930139 922618 877250
9843 877250 914878 917970 793890 671167 684474 703956 767031 792318 786463 769700 692161 617911
9831 617911 594474 632233 649696 617374 576010 605208 497351 562588 619041 633821 508067
9820 508067 443077 393439 328472 358994 393020 357305 332518 282095 284085 334426 383539 430428
9808 430428 431560 348950 303263 335342 244562 337055 404603 298211 241457 168664 185015 235729
9796 235729 280339 296611 317327 267825 296773 311914 209195 150978 139084 182613 156591
9785 156591 140420 53927 154417 197338 158872 159698 104067 72133 123864 108736 16064 90094
9773 90094 15773 -68788 24764 23278 13311 101406 88097 113220 157471 129398 129776 52850 19977
9760 19977 14709 2193 121805 69958 -8138 42048 7262 -30676 29471 23431 83527 87756
9748 87756 70615 59032 132497 46829 13184 -40823 57215 202323 154799 207631 199488 198096
9736 198096 160274 144174 96791 43256 31271 87513 105831 51274 95843 98620 -12408 -29557
9724 -29557 -5244 69721 92749 35214 19416 71163 87838 51541 28316 86939 139959 -41930
9712 -41930 -93252 24424 -4800 87766 -23084 -10610 43874 111370 19910 -23783 42487
9701 42487 66770 102115 30368 -94598 -39771 899 47022 120226 137924 103824 99168 90409
9689 90409 65858 50802 -6689 -18866 136701 73814 83906 90942 105648 154823 274079 277851
9677 277851 101762 73195 35744 64735 38101 1122 70218 119406 152784 133852 101009
9666 101009 198651 95785 23769 43056 8082 27760 38232 79284 111676 63354 6167
9655 6167 26887 182811 149517 163568 183770 271560 218341 195328 129337 127005 126631 239258
9643 239258 258878 288237 372689 404245 458451 501807 657055 843483 1019605 1204686 1465618
9632 1465618 1821686 2186022 2196962 1831082 1342112 890770 708868 522727 539672 478464
9622 478464 332565 249942 249828 296679 237212 218052 225295 135225 72788 137266 108102 7846
9610 7846 17288 73678 101048 96155 113052 110099 76039 61903 40874 156625 118366 59370
9598 59370 -45178 148271 146892 76502 -1057 -25265 -8537 -114186 -78603 23560 4440
9587 4440 41858 86866 15528 -36418 -34781 -47140 -71637 -22878 -17453 -8871 -21707 -20128 -21548
9574 -21548 -20621 -95036 -84340 -79674 -50736 -49773 -114512 -102478 -17180 36914 59434 -2713 -75640
9561 -75640 -53534 -105739 -62402 -29557 -26388 26750 3929 -76461 -109089 -59284 -36356 20088
9549 20088 13864 17625 48843 102877 114547 82369 -26650 -26267 -108809 -164226 -58068 -71757
9537 -71757 -51758 -98283 10963 37598 -80431 -110511 -34734 24110 67862 9857 -6111
9526 -6111 9052 72960 76314 -12481 -586 -79225 -88697 -55884 24695 133136 57527 47665
9514 47665 -2821 -41667 -21335 -69046 -62863 -129054 -134133 -98085 42702 118299 26499 -68017
9502 -68017 -5803 110602 94254 33137 -64091 -47007 13748 31174 -41256 9606 -13093 -56127
9490 -56127 -82943 -33444 -116796 -132982 -119251 -75801 -6306 -40027 -95802 -88733 -46600 -65982
9478 -65982 -40306 -26545 -55164 -70435 -26131 -67517 -96246 -130052 -157645 -160180 -103133 -103201 -41962
9465 -41962 -28451 -39154 -31595 -82631 -94280 -9815 -59779 -26722 29036 63575 67848 11836
9453 11836 -55645 -132177 -139348 -119251 -98687 -60860 -75914 -85804 -81331 -57346 -102326 26900
9441 26900 -42040 -175510 -137500 -18979 14862 -62183 61175 82187 53402 -6514 68908
9430 68908 83615 17160 -3487 -42482 -80774 -150036 -57535 -55752 -113237 18568 -5817 -70258
9418 -70258 -61818 2786 52563 131267 106800 -30904 -70108 -25203 56358 29040 17457 9118
9406 9118 21082 124239 60411 -60656 -45553 -152151 -59156 -65935 -88208 -89358 -60322 -31479
9394 -31479 -22881 -49716 22056 102883 122934 171116 95435 64275 -42628 -99073 -20267 33844
9382 33844 -34559 4984 -23904 33433 159425 144379 16310 32907 -21476 -31828 -63668
9371 -63668 48406 146438 229489 112423 54878 94557 72584 123698 174276 91296 93241 89028
9359 89028 28173 -19449 89695 77929 90782 96364 -46884 40629 51813 103751 48458 105421
9347 105421 41795 -20200 51431 232960 228452 47264 70124 141751 80694 71453 104059 139559
9335 139559 68671 83453 111476 119601 45742 110149 184309 194842 178194 182302 212809 283170
9323 283170 156855 102982 135171 91369 148110 118742 97249 52170 88197 98414 -20647
9312 -20647 -41987 -27292 18642 191970 63476 108813 113446 111305 105540 24723 26303 31892
9300 31892 65894 -13877 -9658 64204 57239 36806 99319 9111 -53448 20999 -50728 7666
9288 7666 -30531 -84832 3135 42547 19411 -34486 4362 -24145 28778 -15975 -151451 -158998
9276 -158998 -56919 -11389 14167 73767 42494 59785 9916 -80513 -58485 22672 72357
9265 72357 92925 447 -6165 29938 -24284 -78326 -18122 14394 28007 27059 -13119 19598
9253 19598 -21104 37547 -9355 -44336 -45993 -37789 161 -33256 13969 -138986 -193305 -55067
9241 -55067 -53414 -151949 -93796 -31485 14966 63600 -11841 -127861 -77941 -23205 97195 170686
9229 170686 129506 -26514 -149724 -26552 9914 4469 41959 49541 -171745 -89866 38235
9218 38235 -57026 -65528 -30070 64432 36085 37275 -17099 -72854 19414 46975 43794 76355
9206 76355 -2027 -18136 -22640 16939 85139 -86138 -141567 -15541 110242 -16423 -56576
9195 -56576 26245 28287 23069 -11409 -6713 35040 72261 12097 -96073 -28364 974 9701
9183 9701 40497 55409 68096 20283 -49162 -35366 -21691 -47840 -88815 20413 105712 182542
9171 182542 110037 138496 96511 90323 124242 73752 87635 93596 86652 42266 87540 43587
9159 43587 42063 68781 76574 37902 42352 80736 94303 69273 100970 115376 27976 95682
9147 95682 170673 181805 232819 246693 154330 243957 210421 175719 153967 94640 125335 97042
9135 97042 167616 126035 141023 245252 233817 64338 123643 129361 113877 164480 142352 160355
9123 160355 208598 181643 191409 182631 127978 155873 185680 199492 204970 184271 263095 352368
9111 352368 335858 347392 399145 358512 371282 290476 383157 326251 319998 250877 257595 321330
9099 321330 382079 405192 445951 496254 491529 516447 482799 517127 580895 512734 413749 395005
9087 395005 436616 534396 557947 579334 657198 714462 623463 621653 596501 544622 581215 650264
9075 650264 670883 618775 557199 545675 673798 668367 741322 756599 701818 806896 845079
9064 845079 893444 857870 952615 1021064 1064834 1080488 1092883 1127571 1128021 1179579 1225134 1318543
9052 1318543 1411962 1367411 1421629 1492018 1591082 1667615 1644737 1627830 1828186 1840093 1946893
9041 1946893 2054549 2178571 2251249 2394557 2656367 2847425 3076364 3436993 3817592 4164011
9031 4164011 4607076 4985723 5316020 5658120 5801624 5880717 5777730 5397501 4939646 4604825
9021 4604825 4207257 3802586 3543672 3186767 2932381 2759946 2695873 2660653 2590420 2529564
9011 2529564 2524863 2478728 2534183 2502011 2591850 2642763 2598392 2634795 2619823 2791819 2858119
9000 2858119 3000435 3184699 3385470 3615348 3808294 4081219 4426440 4807544 5323436 5885804
8990 5885804 6329811 6718658 6941034 7085076 6955074 6703533 6388702 5885900 5328016 4887672
8980 4887672 4557665 4078910 3785531 3546351 3376547 3321703 3167648 3044590 3032636 2916886
8970 2916886 2934599 2956250 3004880 2955993 2890432 2968543 3086914 3115084 3178404 3398858 3619902
8959 3619902 3847495 4068185 4412501 4779722 5252541 5810988 6508876 6983246 7484997 7917167
8949 7917167 8116680 8359098 8685875 9070513 9328911 9425862 9604271 9495611 8991530 8622137
8939 8622137 8154891 7722862 7380330 6996755 6553576 5908984 5263858 4665315 4171842 3643837
8929 3643837 3232120 2906042 2734923 2532833 2315784 2034411 1935089 1778033 1660820 1565454
8919 1565454 1517849 1413161 1329300 1272124 1266626 1229935 1102877 1066315 1019170 941243 952895
8908 952895 942781 1008576 866616 821017 821380 697119 730676 773132 697694 690021 692895 546616
8896 546616 630839 706870 649249 544344 596171 514697 584175 585944 556061 582299 498490 495860
8884 495860 416822 484490 549297 423712 438653 459907 505282 475108 411237 506676 501462 437877
8872 437877 338047 294848 256141 179276 265615 296303 326136 325390 328403 198765 253006 323244
8860 323244 322876 219312 151085 180750 178723 187737 141922 117380 103172 99384 80626 113783
8848 113783 117271 192629 213069 134561 127072 168792 198605 159366 21412 47424 166088 188575
8836 188575 197894 86308 127015 208320 246157 200297 182704 65056 110105 150418 239249
8825 239249 248171 213300 267002 270387 189771 125205 23046 31708 119925 10148 23179 143389
8813 143389 171787 122058 137753 151187 141970 133447 128386 95829 39443 108439 80447 72186
8801 72186 145425 148983 144714 230584 149535 90941 61816 22514 14764 -384 59742 66222 30064
8788 30064 16168 23391 123580 161371 144132 153202 142744 155792 116064 160532 135504 148378
8776 148378 166496 70981 54036 112848 81622 23361 20568 146241 159400 134475 97171 158686
8764 158686 155458 99451 -49380 -44618 98368 140759 131258 73743 69404 158079 125604 172243
8752 172243 130786 127137 209726 226970 117017 79843 119509 88776 105061 139776 145771 97307
8740 97307 19809 137370 137523 79530 149749 226925 208694 181545 218424 256757 207069 270950
8728 270950 229208 181524 156360 128017 81326 88651 199418 237965 225391 131760 195396 152613
8716 152613 107238 301606 281380 305668 313725 238045 311842 300366 295856 352944 308286 328236
8704 328236 444859 386416 321542 341830 361770 379365 443586 396338 320276 424371 494106
8693 494106 436161 380018 338924 427705 427811 412117 502939 490486 456292 505387 516999 702673
8681 702673 617464 585004 654894 640873 637719 662903 587380 543849 607423 558603 552175 556689
8669 556689 626576 621443 634637 646869 674123 701905 635408 774192 788333 824926 862149 919557
8657 919557 1018628 996878 984565 1088923 1194454 1227731 1198210 1297147 1352745 1385718 1400583
8646 1400583 1549396 1691018 1762387 1864864 1924973 2037097 2063597 2135041 2404867 2673451
8636 2673451 2920662 3301167 3655460 3964925 4287106 4461359 4524985 4704831 4825246 5000020
8626 5000020 5133035 5077254 5145586 5206305 5164120 4979519 4763152 4522698 4352949 4244042
8616 4244042 4031364 3721146 3427053 3144385 2834904 2702525 2592523 2505363 2385573 2237973
8606 2237973 2144334 2214624 2272137 2223072 2230771 2324310 2466950 2462289 2484009 2681998 2976575
8595 2976575 3240261 3440131 3666352 3915180 4054268 4108505 4028159 4142455 4227451 4265125
8585 4265125 4338927 4192367 4094749 4043860 3906996 3804553 3555729 3321256 3357680 3049879
8575 3049879 2715073 2408144 2118743 1902733 1635745 1448212 1401119 1266355 1109761 1044515
8565 1044515 1001129 1084094 1078479 989691 899041 844150 808972 657135 670649 637029 677746
8554 677746 758050 619250 558693 504512 429687 511971 483287 500470 477457 530343 547309
8543 547309 501846 388551 365085 290054 366334 412306 390343 309840 367029 341315 284843
8532 284843 239320 235720 316335 273744 184889 139038 234573 243399 225683 275692 244900 96191
8520 96191 83268 79907 255587 262744 261396 137210 101230 155520 163416 154114 55676 124436
8508 124436 249362 119964 139256 98691 113111 158682 133989 62191 116543 173809 110271
8497 110271 31938 174103 165270 99722 48537 -52723 104243 141581 183941 199368 152332
8486 152332 36945 34828 121633 180523 215000 151648 117384 166675 227365 134300 144407 105936
8474 105936 129710 225514 120453 107563 69690 143406 110272 157974 83351 93791 210922
8463 210922 158867 134206 147215 144540 249581 258333 170624 137889 96452 79074 99766 125370
8451 125370 177930 246213 203827 209892 168092 96992 171539 179738 123055 130046 113497 127703
8439 127703 73368 83857 69484 99346 27259 38109 87911 153265 125740 63212 52606 65916
8427 65916 38856 12265 125784 54673 91872 70816 -16978 -52249 -72633 -11038 -63007 -113882
8415 -113882 -26875 5401 -1079 58406 92507 -15702 -51050 -43662 43536 41040 78585 165750
8403 165750 116261 141761 86992 45427 58371 118460 137954 141450 179829 157836 146103 183636
8391 183636 126276 151327 78002 -14631 -70095 -63093 15802 99475 65462 21839 -51355 -30737
8379 -30737 34418 33067 37621 -41503 69441 135840 99549 84019 32246 84682 70398 -81753
8367 -81753 -96039 -88942 -81974 -79533 -85306 -75662 -54229 22461 -26224 -55486 -21593 6121 -30117
8354 -30117 -97149 -38516 -50658 -39515 32914 -36875 -70951 -22628 -31134 25676 100440 107881
8342 107881 32665 18341 99370 75526 -12847 31137 -32488 -48442 42537 8445 -381 46771
8330 46771 65153 11734 44438 34659 -81653 -67293 22495 43501 -43777 -13532 -46488 -39101
8318 -39101 -98078 20057 32216 -98055 -153958 -89440 -78957 -75078 -27884 80063 87469 -48512
8306 -48512 -47911 -52157 -7497 -12418 -61855 -30883 -94461 -59420 -5621 22235 17888 73820 106261
8293 106261 75508 3621 -90914 -39082 -41148 -6962 8339 21825 -104202 -23219 -36840 -78792
8281 -78792 29228 53418 16009 -2420 -15422 -44130 -94092 -114232 -73697 -76824 -31874 29308
8269 29308 32882 35373 8951 75554 -45094 -77346 -105751 -27587 51944 2610 -105491 -133623
8257 -133623 55623 51575 51718 -45213 -18690 -54964 -75019 -52222 -23898 -62783 -19252 -36339
8245 -36339 -49729 886 -41729 -24662 33614 91156 35723 10996 11530 -54431 -137086 55238
8233 55238 1768 -82425 -70639 -20718 -36052 -37406 42328 43977 -44494 -79513 -104761 -105576 -6337
8220 -6337 -2705 -44838 -40722 41794 67069 117840 203383 86410 -92656 -136225 -82447 -49649
8208 -49649 64935 -6924 66823 76473 -17749 -164016 -43565 98684 28715 -65695 -92629
8197 -92629 -111716 -158502 -262795 -295639 -524725 -803901 -256266 3987 -33234 -86897 -1178
8186 -1178 -38927 -15016 -11494 -50012 -18503 18718 -9198 -56259 7883 173993 87268 119228
8174 119228 119837 93660 67850 -87474 17602 89687 15192 63105 20595 20108 56041 56475
8162 56475 21107 -10172 46720 27276 -4776 -12383 -48818 -42729 27061 73408 156380 109764
8150 109764 98515 -10483 21391 70591 6495 -79318 -4584 -27264 -46704 -17167 17410
8139 17410 32787 -18647 -18538 34091 75298 60305 -25305 -21531 -54349 -72781 -111944 -130233
8127 -130233 -91489 -52410 16596 -11128 -24536 12614 28206 25061 33206 -20985 -22610 -10325
8115 -10325 -57217 -33131 110702 101349 84430 45962 98577 163100 -2175 28445 21531 83142
8103 83142 67637 82317 108531 14499 10104 -72790 -66312 -79108 -116917 -108840 -3395 -15991
8091 -15991 -44978 -54991 -24433 -55404 4963 33793 66744 4253 37840 59078 -2766 -146459
8079 -146459 12757 77582 48121 19590 -9692 -54110 -51257 -4293 -6111 25762 -4706 31171
8067 31171 52266 -68059 -126320 -23305 50523 107067 71971 57826 70569 -2444 -52110
8056 -52110 -17078 8123 9090 -73253 -58114 -2269 28167 32084 53313 -7224 -37412 14490
8044 14490 114329 373 -45137 74145 148950 60428 5614 -34880 -77221 -39713 1982
8033 1982 -44185 97720 46927 38345 62893 50276 69355 44073 48960 54536 30281 22667 -32306
8020 -32306 -21055 -43144 -20041 31678 76424 97058 -20411 -47856 29892 -3603 90258 31708
8008 31708 -47215 23546 68841 63850 103739 148440 128556 171121 85529 149574 88166 68248
7996 68248 -89534 -97120 -14460 93699 88266 20715 138526 92233 12698 10110 96807 183174
7984 183174 177068 230050 144991 86161 106217 74004 46553 -57255 78329 81528 66411 180977
7972 180977 173458 72857 137824 188449 93535 16158 29940 -95185 -116702 72398 71639 109003
7960 109003 53649 10996 38243 54989 86888 146247 199510 89265 -73940 -40825 -21146
7949 -21146 -32175 42156 32926 47732 41929 -39111 23025 168669 234916 174601 127147 20038
7937 20038 -12104 72197 182219 110249 51592 -39413 129993 133590 118471 156340 114491 122039
7925 122039 21710 28757 -51499 -64878 -18861 -20025 -11308 -16687 82397 147405 134064 66038
7913 66038 102059 17787 -13454 5299 15593 61428 83567 95182 113853 148187 115901 81315
7901 81315 74210 145560 152360 194112 103853 114158 164858 152568 162105 208539 98593 57139
7889 57139 39113 87209 143259 117126 105405 140090 137310 138934 78653 64298 61214 83594
7877 83594 93055 147639 201689 168509 190462 193817 118677 53351 79171 129794 83509 58187
7865 58187 52008 36456 134912 121023 126525 62915 25086 11466 82203 109258 24806 73302
7853 73302 33994 7795 40240 39486 43720 98677 38170 402 48067 36834 139840 165144
7841 165144 221183 174129 221693 179568 224641 228609 110392 66551 27570 3436 123491
7830 123491 124872 89230 118057 -12884 15547 104978 106706 65468 209236 173550 151335 201555
7818 201555 90376 51238 86024 195828 284629 227639 271886 242718 211765 259520 346550
7807 346550 41436 74425 178445 143772 94090 65206 138693 241341 199679 72373 128961
7796 128961 186686 242710 277212 219772 119576 108420 126413 194897 173477 202586 160013
7785 160013 87654 128454 164684 98787 107753 146826 293142 268062 153495 90398 182579
7774 182579 217133 198810 147095 98701 140326 190478 284899 145230 116098 100380 98854 166072
7762 166072 189841 199742 197533 295924 273475 203686 178682 70664 141977 200217 218830 169108
7750 169108 171915 235025 226049 176504 203364 199418 158829 167969 290321 382812 375097 390618
7738 390618 208050 287404 236043 201574 107706 78505 158118 218127 269314 223279 134923
7727 134923 172761 266094 161220 200074 240317 273892 134259 209014 232901 312793 358936
7716 358936 339613 386564 281711 211934 233834 281385 293770 321977 342647 349687 242684
7705 242684 257077 306283 355461 249237 327154 357396 414539 436916 519131 409917 360901
7694 360901 328030 345010 344339 426481 363582 408612 367948 307941 383985 396946 329541 297616
7682 297616 297009 307223 389250 271493 341589 350932 402843 427705 439665 417417 454847 411230
7670 411230 422057 369487 354281 366443 410001 328008 355057 323011 402643 361237 337114 354265
7658 354265 374976 407784 443180 530676 561681 611112 470319 401183 388640 344591 312133
7647 312133 412110 485797 508260 553266 555766 462610 409578 493779 494725 559962 551858 527245
7635 527245 504657 581107 524978 510121 598547 605320 604654 534656 492195 571239 542049 571748
7623 571748 649562 604359 540543 411406 492550 598272 612252 581105 584135 580920 635138 641666
7611 641666 645815 800552 792179 751145 710464 606285 597203 717971 678571 643303 660265 656057
7599 656057 734781 807659 873960 839149 734550 774680 795877 817246 844518 863231 847699
7588 847699 768775 740522 739909 750688 753090 681442 711858 820936 829759 841957 937054 963786
7576 963786 903285 950013 984431 1040002 1059070 1031784 982547 975406 942323 1095072 1067685 1013145
7564 1013145 969741 975773 965970 970660 953591 1039661 1084869 1096207 1188627 1150081 1076724 973819
7552 973819 989402 1059821 954186 999399 1077314 1116559 1191171 1211201 1193664 1151251 1158275 1127632
7540 1127632 1125191 1155685 1160905 1130506 1208503 1249621 1223588 1202036 1213905 1296529 1211755 1248466
7528 1248466 1323323 1264329 1219377 1159733 1197218 1312512 1296865 1309363 1387162 1363423 1363316 1471782
7516 1471782 1472548 1383579 1440129 1330715 1431899 1503923 1410135 1401921 1435163 1478200 1540286 1508275
7504 1508275 1482190 1439768 1437675 1519238 1524107 1542698 1516800 1458184 1564543 1625956 1619438 1618062
7492 1618062 1674287 1624022 1590690 1533625 1564367 1562160 1417605 1517485 1655883 1668249 1664593
7481 1664593 1682577 1720372 1732287 1723064 1743580 1632220 1705923 1703998 1855958 1792273 1772501
7470 1772501 1746955 1718260 1716865 1800933 1915546 1805546 1724844 1756178 1930608 1970378 1896632
7459 1896632 1891680 1850972 1817661 1840022 1873956 1905801 1911310 1990161 2016354 2052618 2036518 2077483
7447 2077483 2064395 2118706 2081261 2008773 2113433 2131155 2171695 2197453 2177763 2320053 2383749
7436 2383749 2295728 2205085 2312559 2416076 2300610 2242921 2381236 2353046 2457868 2503225
7426 2503225 2492715 2524468 2637430 2699404 2679153 2617682 2688342 2651829 2615771 2672565 2640549
7415 2640549 2690924 2783366 2847442 2902382 2963942 2979998 3059731 3067202 3067054 3061428 3011996 3117594
7403 3117594 3120577 3054318 3086497 3137006 3173783 3203542 3345343 3386416 3299737 3367987 3335299
7392 3335299 3378202 3447693 3420999 3463959 3476980 3560642 3651713 3715490 3592761 3590337 3682002
7381 3682002 3704281 3761433 3859959 3847055 3883034 3929068 3957228 3937422 4032471 4069094 4201921
7370 4201921 4211923 4342824 4399955 4306989 4354523 4376336 4453711 4527443 4612141 4594040 4607114
7359 4607114 4623653 4656055 4697916 4772069 4849863 4889435 4931343 4989062 5102021 5135425 5159346
7348 5159346 5183099 5154162 5252352 5222781 5236994 5404216 5496063 5527228 5505487 5582749 5658602
7337 5658602 5656799 5735734 5866188 5890520 5941378 6107981 6206284 6227752 6212381 6376580 6495046
7326 6495046 6570395 6650409 6617806 6781855 6840320 6942879 7017284 7006914 7107510 7221555 7318598
7315 7318598 7379209 7466985 7648930 7673352 7707046 7825239 7951861 8051676 8213356 8289088 8412584
7304 8412584 8604955 8592821 8655111 8740260 8862093 9082402 9292312 9310108 9495780 9614439
7294 9614439 9683001 9770238 9823108 10016907 10138093 10228753 10374942 10580127 10749637 10909223
7284 10909223 11122561 11280146 11422364 11564071 11760372 11884544 12176077 12369461 12513112
7275 12513112 12819530 13006330 13214457 13418112 13653649 13817296 13930078 14285084 14635868
7266 14635868 14946561 15227583 15562611 15813283 16129240 16399272 16655373 17062303 17428934
7257 17428934 17719459 18174505 18611283 18909531 19233257 19584374 20099735 20541142 20988870
7248 20988870 21502872 22063625 22557311 23081207 23561358 24169586 24737235 25357708 25953783
7239 25953783 26454008 27157690 27794721 28567326 29407665 30190356 30964777 31722252 32574546
7230 32574546 33360138 34228887 35150172 36115533 37152666 38192088 39194541 40352795 41441184
7221 41441184 42564969 43806220 44981188 46131358 47361865 48535812 49780453 51038395
7213 51038395 52237544 53479431 54789697 56201894 57519420 58867065 60266045 61727009
7205 61727009 63206989 64778912 66500634 68206037 69886616 71648899 73513443 75455595
7197 75455595 77412572 79484793 81663969 83880011 85999938 88358100 90870409 93366607
7189 93366607 96108504 98760014 101539839 104532244 107435724 110493206 113621153 116848661
7181 116848661 120271230 123644358 127052652 130538188 134000704 137595190 141086353 144668798
7173 144668798 148314544 151972615 155711884 159511909 163457915 167677361 171942616 176345110
7165 176345110 180938019 185694162 190550526 195692174 200956248 206211024 211709943 217298550
7157 217298550 223079516 228953938 235006889 241087878 247290348 253636232 259916794 266563684
7149 266563684 273490378 280770568 288447618 296615129 305058321 313859404 322631489 331007896
7141 331007896 338971530 346233418 352502279 357708891 361755373 364681591 366577216 367583274
7133 367583274 367913804 367592171 366935974 365851067 364321413 362272939 359797822 356639326
7125 356639326 352786780 347959203 342058885 334972001 326719080 317157591 306388290 294871423
7117 294871423 282490136 269473122 256353031 243325393 230414025 217793716 205770640
7110 205770640 194416841 183630023 173371404 163985733 155179676 146936703 139256961 131999340
7102 131999340 125284416 119137384 113444659 108021735 103020309 98497957 94161520 90034772
7094 90034772 86111575 82608966 79315557 76172038 73252045 70357213 67781567 65255904
7086 65255904 62920806 60703754 58669007 56766658 54861703 53024984 51224436 49594524
7078 49594524 48053327 46433371 45040214 43822023 42507429 41282318 40088335 38930170
7070 38930170 37948293 36964306 35857140 34871329 34010643 33068640 32197643 31403747 30595999
7061 30595999 29782508 28963685 28253829 27505803 26793507 26179703 25519303 24838433 24254437
7052 24254437 23707046 23206482 22667283 22132864 21542677 20973411 20549478 20038630 19579679
7043 19579679 19223549 18741762 18257552 17738198 17389710 17060819 16759865 16337779 16037499
7034 16037499 15707775 15365666 15077380 14793759 14562659 14210203 13905667 13625161 13378512
7025 13378512 13155359 12945429 12617062 12442689 12273541 12058619 11830494 11715450 11522174
7016 11522174 11225349 11097548 10856922 10620716 10498410 10356489 10252516 10035480 9716415
7007 9716415 9584554 9577063 9388810 9387317 9282594 9095931 8824022 8648990 8578451 8470806
6997 8470806 8443454 8335983 8204192 7995324 7798194 7768062 7729354 7682078 7610907 7445552
6987 7445552 7370354 7286446 7174395 7089101 6975351 6921371 6839083 6754232 6631460 6547743 6417744
6976 6417744 6362668 6329786 6207059 6099877 5988814 5897710 5876716 5746206 5625647 5697081
6966 5697081 5662783 5500117 5431985 5489502 5399499 5237036 5170691 5078192 5063156 5021853 4946377
6955 4946377 4911727 4939042 4766141 4629602 4520352 4522554 4566038 4358837 4300155 4261191 4203345
6944 4203345 4193007 4049735 3938679 3897344 3898539 3916449 3765375 3752332 3675237 3688703 3616473
6933 3616473 3585386 3516418 3442861 3424303 3352267 3345489 3265440 3204208 3165153 3202432 3061108
6922 3061108 3030458 3027213 3025407 3010437 2974017 2969684 2902758 2922243 2885795 2769747 2678864 2685884
6910 2685884 2670483 2616162 2602413 2545419 2522426 2503541 2406268 2482806 2475049 2376624 2381212 2380343
6898 2380343 2279693 2315349 2397729 2365255 2338663 2328078 2307191 2212139 2078657 2185152 2228903
6887 2228903 2129469 2048825 1929435 2002939 2078719 2138611 2125637 2063925 2021944 2013043 2075239
6876 2075239 1993440 1994743 1982568 1919799 1872509 1845178 1925526 1894929 1804401 1746769 1672633 1836524
6864 1836524 1955444 1877067 1827166 1848869 1788601 1727855 1726774 1735281 1739685 1740628 1784568 1807579
6852 1807579 1653688 1601334 1549783 1697805 1658269 1539202 1545237 1494584 1522459 1542276 1519033
6841 1519033 1570097 1574555 1528066 1543359 1473135 1410518 1464271 1477871 1461376 1437055 1415651 1424455
6829 1424455 1385526 1349621 1378312 1307222 1347707 1376839 1240061 1234575 1284688 1284688 1231467 1240584
6817 1240584 1325187 1383067 1322210 1331365 1306845 1234318 1136237 1192211 1161621 1171306 1155087 1113158
6805 1113158 1156750 1181841 1151190 1105630 1034220 1047011 1107649 1187962 1104184 1031074 999314
6794 999314 924223 892376 873506 972657 1017774 972482 970949 899665 862176 996962 980656 857678
6782 857678 1054974 1038414 1106498 973799 847595 955186 963173 871947 864707 796003 844274
6771 844274 845565 828628 898676 911260 841175 952409 945475 941005 894550 866921 837558 784547
6759 784547 786101 740199 827695 743002 791885 808488 845520 834099 850565 770029 697311 785569
6747 785569 699339 617808 742471 688578 662329 689934 723079 720493 753486 711067 656463 567722
6735 567722 628788 679955 620540 555186 547821 618807 669585 608347 627698 572425 562183 609972
6723 609972 592218 598133 597239 645006 748415 647804 641420 630417 624159 520909 508625 510341
6711 510341 574680 600617 510540 522606 504552 491637 456324 432121 413505 523174 572934
6700 572934 630544 639599 572957 586741 606928 650378 583429 437552 500843 512967 470897 402028
6688 402028 456608 508440 477668 499224 506013 543181 492229 389306 448220 498858 505434 547478
6676 547478 519736 460369 426535 522925 640231 676659 599612 463547 499889 405085 417189
6665 417189 367833 311530 433753 424839 598662 527182 471320 473104 432308 510029 423894 512604
6653 512604 482584 480683 444381 404977 465996 482261 513617 488980 466667 380451 394606 519894
6641 519894 507857 452821 499026 499443 496552 508869 475997 492079 529937 523045 450359 410461
6629 410461 410478 314826 436922 516480 339440 275961 361961 406312 368930 331664 413893 421732
6617 421732 420255 383623 327136 409757 394401 451713 442098 411085 403276 423977 417763 534692
6605 534692 424570 365524 345754 284118 328999 362860 340838 381053 352002 311262 451853
6594 451853 419185 380973 348013 493865 464571 420799 407235 430446 396246 473635 481903 336128
6582 336128 331474 298362 335430 294008 318724 350059 338767 319702 260622 218712 191144 220423
6570 220423 376245 344021 320160 315977 332345 304444 298810 394395 365040 230116 235783 334606
6558 334606 282133 362606 406573 395746 403279 345799 332848 386376 388211 352523 302085 324214
6546 324214 375765 423285 331288 347912 294356 278031 277908 256351 281729 187227 209625 242954
6534 242954 330731 401249 395409 361821 307591 307357 294055 279994 317050 265945 255255 270551
6522 270551 334612 271567 256298 231098 319056 330665 321520 298919 246841 334719 305728 239116
6510 239116 177492 160266 188649 286041 261082 318849 236122 222885 295344 310743 235015 253774
6498 253774 376322 378811 320131 303313 177248 199050 286383 302686 368322 339247 292297
6487 292297 278344 237803 256834 285698 292250 256082 228524 198397 194074 188209 143505 185356
6475 185356 182452 285147 373880 395859 381111 328421 244105 236372 219683 208213 106131 84045
6463 84045 168665 281094 326298 409516 296316 295805 359416 405423 379777 287969 254064 222239
6451 222239 202012 153806 141466 216434 258901 345959 389712 264681 258393 245766 192319 217559
6439 217559 178452 123695 162813 120816 153156 222049 251546 233950 293585 253282 261902 328750
6427 328750 343932 236912 331969 321883 365798 424327 306323 278560 392035 414885 395567
6416 395567 339392 261753 300522 274467 280609 384909 275151 240223 341217 291085 305940
6405 305940 297283 299314 354150 358022 345507 384782 321252 308793 376396 350706 315889 343898
6393 343898 414111 369946 389835 440017 402088 316404 345782 419756 330479 429179 412722 356705
6381 356705 348088 379146 434695 496613 453379 393119 416650 486358 441184 448134 399110 450306
6369 450306 518455 524279 446832 470552 575766 623048 544799 461486 614338 587795 509422
6358 509422 530796 528170 559058 661308 678469 610085 580071 644805 650833 718227 668154 719964
6346 719964 703204 654798 733113 766336 720205 722061 734867 683088 655359 686294 717387 776909
6334 776909 698030 707994 791572 798321 901421 880659 918808 977922 1060674 1185570 1136549 1017459
6322 1017459 1047916 1119589 1003977 1093984 1253896 1192474 1163447 1221174 1286994 1325443 1400756
6311 1400756 1461789 1534997 1615670 1666010 1768539 1827935 1794604 1847729 1875158 1969852 2053586
6300 2053586 2127812 2211131 2240225 2436460 2376539 2379365 2524699 2566880 2668177 2634968 2655303
6289 2655303 2633175 2712072 2691655 2746924 2801608 2750204 2819272 2779426 2708585 2612785 2621507 2511987
6277 2511987 2427143 2477951 2500467 2548491 2477416 2410438 2294926 2136867 2144913 2085444 2040810
6266 2040810 2140865 2066840 2069685 2017143 1928129 1859970 1839998 1805074 1746890 1808144 1810342 1840511
6254 1840511 1930044 1929296 1983558 1884383 1873536 1973142 2055392 2079663 2105862 2197490 2125744 2236848
6242 2236848 2357321 2466141 2603381 2615380 2661019 2785070 2809804 2889808 3038695 3141959
6232 3141959 3132564 3188431 3170797 3284586 3406002 3406063 3540937 3616977 3602201 3652915 3626346 3658993
6220 3658993 3719651 3627086 3571072 3520083 3453906 3436471 3303487 3199569 3070122 3104095 2989814
6209 2989814 2874076 2709268 2577136 2517697 2418220 2340898 2120684 2040763 1913478 1822107
6199 1822107 1812410 1835672 1743872 1680345 1644493 1646821 1550742 1381435 1352843 1309597 1312764 1289566
6187 1289566 1225595 1149359 1086986 1160767 1112200 1080171 1038950 1050005 1073356 992230 907779
6176 907779 809011 841766 1030185 993498 937980 960555 863057 841653 819620 848302 863095
6165 863095 870807 870223 806258 882905 837240 856809 889744 833247 769449 753287 851725 909031
6153 909031 854857 719573 679754 683112 728912 738524 753472 808047 757090 588608 652948 721225
6141 721225 722912 732024 714573 694174 668857 754498 753498 721503 721134 917295 901909 856416
6129 856416 795611 698602 812750 764595 773945 876897 839177 697173 781824 924319 981778
6118 981778 968976 949497 915750 913428 977071 917565 851080 856653 848953 844574 940896 902040
6106 902040 956778 1025469 1039250 1039454 990174 998396 961637 1027878 1119516 1120272 1090121 1065888 1203168
6093 1203168 1266840 1320817 1282643 1210799 1248629 1224562 1137804 1240798 1400423 1360366 1363689
6082 1363689 1406370 1476380 1518794 1526079 1525296 1514441 1560801 1780237 1755849 1804389 1748613 1763676
6070 1763676 1886496 1891196 1895823 1968520 2068224 2194419 2193596 2193076 2326264 2360395 2399225 2500274
6058 2500274 2574960 2579357 2588997 2607379 2632739 2737116 2631982 2671968 2759750 2672888 2736470
6047 2736470 2700223 2647762 2714695 2737384 2792705 2897681 2952388 2915513 2932727 2956928 2945279
6036 2945279 2972932 2943341 3003229 2906120 2895860 2944368 2937462 2953318 2905069 2791143 2722398
6025 2722398 2667774 2683616 2888460 2971834 2963638 3043296 2955122 2942841 2979241 3104853 3246068
6014 3246068 3234181 3304044 3493731 3600276 3713231 3809972 3916975 4002136 4073177 4088971 4267801
6003 4267801 4392181 4490627 4626559 4744692 4811403 4956567 5042451 5061337 5041834 5154839
5993 5154839 5333698 5345386 5421051 5421359 5447384 5467859 5464441 5481651 5523919 5494457 5416507 5341746
5981 5341746 5382062 5268718 5137408 5043612 4957484 4791986 4718275 4639918 4576175 4580838 4451564
5970 4451564 4419114 4373675 4345310 4309610 4209219 4121898 4110494 4089230 4310760 4492855 4481786
5959 4481786 4358495 4333287 4338544 4253928 4280281 4294978 4201165 4139135 4090855 4073500 4060690
5948 4060690 4072369 3964885 3847335 3817763 3641505 3719111 3616811 3413114 3325375 3364674
5938 3364674 3323903 3377405 3289699 3206147 3260878 3296247 3279587 3315184 3249880 3250545 3334034 3367549
5926 3367549 3321276 3365807 3388006 3356772 3399343 3372716 3266857 3341967 3222498 3083915 3185289
5915 3185289 3153764 3185703 3098887 3166982 3148911 3216538 3147477 3031948 3068490 3123771 3187120
5904 3187120 3164111 3133661 3149799 3127521 3212729 3282686 3367662 3363284 3429143 3510145 3536288 3583706
5892 3583706 3553178 3606878 3653653 3749927 3635512 3645972 3691770 3642451 3550206 3582134 3547555
5881 3547555 3511704 3542810 3622865 3589412 3438967 3435482 3291867 3346503 3447516 3446350 3502229
5870 3502229 3383695 3302577 3329929 3373542 3486265 3542641 3530987 3589528 3690130 3705508 3720593
5859 3720593 3778666 3857431 4008132 4234348 4388147 4531057 4643488 4700731 4759201 4814309
5849 4814309 4953821 5111698 5283148 5358093 5524798 5634853 5821564 5856061 5909718 6011119
5839 6011119 6042900 6090013 6069952 6261975 6272242 6443243 6515385 6560402 6615989 6692184 6755672
5828 6755672 6896911 7005212 7039717 7108232 7081800 7047820 7034333 7008264 7120102 7118814 7025718
5817 7025718 6975170 6913524 6831017 6796084 6657088 6523465 6413178 6230277 5997676 5811723
5807 5811723 5626945 5433044 5286613 5065669 4755655 4561221 4427485 4333385 4196932 4063471
5797 4063471 3910182 3782415 3669546 3489736 3463925 3460963 3272313 3135902 3141044 3125711 3073887
5786 3073887 2995672 2909958 2941313 2964888 2885327 2881294 2842552 2937066 3004368 3021595 3021074 3113129
5774 3113129 3129797 3174351 3197111 3215758 3230605 3242466 3119352 3017182 2931644 2851997 2671363
5763 2671363 2453632 2413960 2364109 2243479 2260555 2116815 2034498 1969700 1815732 1729548 1673148
5752 1673148 1766738 1774662 1577981 1492784 1473033 1475289 1582235 1524942 1501541 1464532 1501165
5741 1501165 1587737 1491144 1511443 1470213 1465168 1465328 1450217 1509823 1387398 1290786 1304739 1400375
5729 1400375 1428319 1398114 1312292 1257585 1127105 1037873 1038738 1056723 1093151 1209313 1119476
5718 1119476 1002256 900196 835338 862733 948602 939153 759116 807936 787331 779252 667634
5707 667634 695426 813912 712865 692397 643618 635719 603437 535583 572952 696752 782620
5696 782620 649264 567950 700629 590266 485548 576267 535059 458373 480202 540249 495336
5685 495336 484015 507604 544991 528596 409829 467552 487224 415717 510090 498068 478823
5674 478823 505470 474062 463552 469441 477396 474553 407105 420743 424109 400008 329654 391367
5662 391367 419525 435236 527434 532581 534461 508620 510565 356309 330277 452625 488444 426634
5650 426634 397141 394901 355578 408601 418338 406848 316083 389165 390480 289997 255342 348128
5638 348128 351124 432682 418178 412154 512995 489883 426191 349826 418200 410461 449549 413181
5626 413181 380324 391034 399020 491666 477792 392239 429257 426333 451002 453605 481293 506680
5614 506680 411590 368676 418362 447322 549639 501730 537971 597024 619493 519836 513610 551163
5602 551163 518788 471137 436531 440689 585413 546396 544363 514113 570742 576642 530495 517253
5590 517253 503144 630196 716904 613385 626436 725452 795025 818686 778217 779549 786790 818690
5578 818690 854335 841714 842449 828864 841195 929338 855703 918827 927192 959450 1064375 1137348
5566 1137348 1104553 1118840 1148644 1174412 1231786 1293983 1351921 1326101 1386207 1408828 1444100
5555 1444100 1508135 1513127 1626212 1552596 1476089 1488939 1581678 1646449 1674684 1714161 1829363
5544 1829363 1894771 1938017 1836459 1897505 2013722 1954423 1935950 2113328 2113138 2012851 1997408
5533 1997408 2121093 2134039 2050304 2226610 2381840 2350321 2211803 2259450 2283887 2321855 2372610
5522 2372610 2360744 2521385 2461102 2449444 2544251 2503851 2492750 2513727 2566623 2624677 2621557
5511 2621557 2533719 2572776 2540477 2588124 2641784 2609944 2620896 2597278 2635469 2542907 2569378
5500 2569378 2644055 2655138 2645630 2584818 2572117 2733950 2727712 2723482 2844459 2818512 2831804 2891542
5488 2891542 2925595 2901943 2843561 2842302 2865294 2835225 2804703 2750030 2764288 2678453 2669585 2649845
5476 2649845 2761489 2847269 2768874 2730261 2662031 2761335 2723357 2601791 2602062 2588096 2660659
5465 2660659 2598261 2528886 2500300 2420267 2354132 2388271 2374680 2316939 2312401 2144148 2019503
5454 2019503 1975805 1917741 1882589 1789147 1722356 1695404 1593026 1588912 1569915 1541476 1469582
5443 1469582 1478799 1466290 1329754 1245569 1165719 1254841 1202694 1052438 1073669 1052256 982765
5432 982765 935727 886489 968547 902539 916348 903849 819393 766946 792192 849453 776709 711417
5420 711417 729379 691381 738256 741030 706930 777902 803780 735537 663439 601842 641474 637007
5408 637007 590960 567472 596615 648586 601422 686297 669316 686767 672664 657972 752951 672736
5396 672736 649128 622311 494756 572370 694778 627126 596733 613511 630747 567700 514222
5385 514222 503300 471628 516882 505693 576966 549334 573335 554422 555827 471729 448259 486262
5373 486262 527645 588445 659404 712049 565942 546755 534230 604489 724847 705678 630699
5362 630699 495409 413549 467213 413420 476906 570725 536297 568922 616585 680157 696972
5351 696972 627384 668022 682617 637914 606649 723830 688044 726747 707124 729566 728229 728553
5339 728553 786264 715367 795006 810020 817285 783871 790542 753221 796177 902636 978435 947061
5327 947061 921565 951195 922318 954410 957926 1007355 1120628 1103186 1137388 1078274 1130358 1197480
5315 1197480 1159978 1121730 1187053 1302713 1316975 1297322 1398975 1382788 1350155 1402329 1500890
5304 1500890 1483298 1485031 1482124 1418146 1481382 1535538 1535635 1490349 1577693 1684471 1717736 1699170
5292 1699170 1752529 1764838 1769072 1942354 1951052 1918515 2012870 2037129 2086072 2113062 2101155 2070774
5280 2070774 2061731 2040173 2129135 2132822 2125394 2279912 2278387 2274714 2298062 2385010 2463882 2508963
5268 2508963 2550652 2485029 2514781 2549497 2490750 2486541 2532277 2460871 2503446 2490396 2494145 2651552
5256 2651552 2655529 2569649 2562465 2665893 2719289 2634188 2618643 2633999 2636839 2672586 2759602 2800898
5244 2800898 2740100 2803572 2893995 2834066 2723060 2703248 2715457 2794740 2752370 2721869 2651617
5233 2651617 2604367 2600599 2567650 2645881 2616017 2603494 2623343 2740285 2740922 2659534 2593573 2597956
5221 2597956 2652643 2655998 2541080 2510279 2665755 2739194 2735582 2662908 2588967 2563615 2553603
5210 2553603 2514654 2452031 2355131 2297902 2395089 2403411 2317276 2257730 2274085 2345589 2437705 2389469
5198 2389469 2259105 2144957 2167440 2250201 2175291 2191904 2174099 2171888 2143569 2185674 2133571
5187 2133571 2057633 2141429 2198739 2241404 2202790 2125416 2023333 2014196 2015485 1987433 1970165 1939950
5175 1939950 1916844 1864187 1887059 1923224 1908420 1802002 1734153 1730204 1807938 1870339 1808906
5164 1808906 1827228 1803419 1866745 1922112 1839819 1875732 1802945 1848000 1846957 1833646 1821129 1698327
5152 1698327 1667298 1759317 1755682 1714926 1677901 1674994 1714061 1641033 1627136 1693077 1773208 1708276
5140 1708276 1718557 1666095 1678093 1647060 1642258 1777051 1742388 1632006 1632728 1668942 1692097 1705035
5128 1705035 1703214 1575066 1593196 1682877 1678771 1658052 1686735 1722491 1663001 1631646 1708136 1694775
5116 1694775 1672790 1719462 1637545 1655595 1666162 1616934 1734993 1747438 1698750 1739421 1713415
5105 1713415 1801916 1869030 1767664 1834537 1868952 1822984 1893071 1918087 1960978 2109832 2090064
5094 2090064 2006604 2030499 2097912 2239272 2243681 2251133 2410002 2409362 2340709 2510581 2581882 2602787
5082 2602787 2628688 2591777 2621792 2702368 2764315 2850654 2961648 3037574 3105239 3096688 3180371
5071 3180371 3293601 3321610 3263782 3238432 3399918 3505899 3496019 3575891 3613056 3607770 3730297
5060 3730297 3772633 3798090 3822189 3841920 3962933 4089902 4022206 4047924 4214296 4271257 4282598
5049 4282598 4387058 4481100 4434662 4515830 4731854 4811411 4888330 5032572 5114851 5140184 5355167
5038 5355167 5343695 5401384 5511939 5592102 5824721 5932346 5994564 6077823 6329346 6416324 6403544
5027 6403544 6593579 6628787 6744850 6845464 6810481 6879923 6863301 6888955 7003406 7037613 7081227
5016 7081227 7186670 7260766 7374938 7431473 7373047 7254883 7328488 7335598 7363971 7471053 7634085
5005 7634085 7598824 7583387 7584058 7647145 7719841 7671279 7620446 7620328 7594368 7525683 7531664 7469571
4993 7469571 7472892 7376849 7339477 7325978 7317013 7320001 7365394 7277845 7240185 7273710 7144792 7165059
4981 7165059 7245080 7142939 7010451 6947501 6915499 6866753 6745089 6622835 6573768 6585002 6585353
4970 6585353 6448666 6434246 6370840 6310167 6245902 6166639 6033004 5981552 5867786 5675690 5514735
4959 5514735 5474978 5390814 5328658 5318390 5172153 4999643 4946455 4897401 4771555 4524016 4425215
4948 4425215 4429275 4319909 4327151 4250701 4270244 4156937 3974610 3911638 3888131 3790340 3715039
4937 3715039 3543488 3603342 3578437 3464152 3246045 3097909 3172596 3182866 3115106 3042105 2916875
4926 2916875 2972825 2871386 2819589 2800991 2806072 2769636 2646654 2593422 2570056 2613479 2513522
4915 2513522 2545543 2520986 2404594 2502352 2567750 2530505 2502406 2446622 2408921 2324546 2313031
4904 2313031 2342021 2323587 2321012 2383349 2330296 2327498 2208335 2152821 2260992 2330833 2277703
4893 2277703 2280187 2341076 2271906 2179604 2196230 2223685 2145375 2147412 2167616 2047600 2082607 2158388
4881 2158388 2220109 2195953 2134390 2088571 2069646 2111297 2008558 1999007 1975921 2040377 2063274
4870 2063274 2087694 2171085 2138079 2032988 2019065 2058667 2096125 2085676 2116715 2207035 2232028
4859 2232028 2264011 2271397 2196389 2215537 2215032 2220348 2285175 2295837 2311994 2433180 2518445 2513036
4847 2513036 2531549 2537917 2474300 2467239 2594915 2685075 2619606 2588583 2717603 2703799 2757918
4836 2757918 2768378 2753309 2838744 2983193 3036114 3107105 3189075 3125759 3200790 3272289 3370854
4825 3370854 3493766 3573954 3636982 3789819 3919564 3833281 3992361 4128372 4311358 4398193
4815 4398193 4506009 4614425 4826694 4996245 5058771 5224807 5393276 5578177 5774644 5972726
4805 5972726 6246196 6536064 6743488 6925660 7311144 7569554 7860261 8119329 8359405 8721807
4795 8721807 9092264 9716062 10170208 10602470 11162400 11885929 12481488 13016546 13637046 14283671
4785 14283671 14924504 15461172 15979795 16416180 16792729 17025685 17242861 17489669 17566539 17504985
4775 17504985 17384321 17325440 17207350 17126321 17090442 17143270 17250755 17220140 17186380 17242547 17253223
4764 17253223 17207433 17079354 16934193 16778598 16463969 15981934 15490436 15034003 14459867 13882254
4754 13882254 13206024 12518696 11823658 11199990 10675145 10167179 9792951 9384620 8855268
4745 8855268 8490421 8112809 7760607 7518282 7259259 6963290 6863568 6727076 6459557 6321401
4735 6321401 6126774 6059347 5944899 5765767 5684116 5560834 5361541 5312239 5202636 5098810
4725 5098810 4880208 4725361 4667993 4564791 4529052 4518020 4458389 4489411 4406427 4269408 4157933
4714 4157933 4182027 4056087 4055699 4060237 4008413 3997134 3896269 3762255 3673243 3586916 3557594
4703 3557594 3483411 3453902 3524905 3469959 3362709 3306144 3297037 3264254 3182946 3082265 3093151
4692 3093151 2965190 2925275 2919889 2820163 2798132 2913095 2881831 2792458 2785916 2690276 2652724
4681 2652724 2672231 2628544 2588869 2550706 2474245 2459583 2477134 2563317 2547288 2447405 2392148
4670 2392148 2329480 2284720 2224076 2240340 2170801 2140222 1996281 2057567 2017900 1960629 2088835
4659 2088835 2032959 2059588 1882453 1872638 1910120 1976070 2000690 1900075 1799121 1715573 1732319
4648 1732319 1802414 1854408 1792935 1653865 1701364 1679287 1492701 1574412 1562110 1513135 1553617
4637 1553617 1556951 1475784 1421516 1256206 1284161 1339096 1296223 1307782 1375907 1352894 1294855
4626 1294855 1265616 1315646 1248098 1173551 1209230 1232312 1225041 1153065 1176485 1208328 1066243
4615 1066243 1109327 1140435 1161890 1184112 1227006 1213819 1133884 1127816 1042817 989592 917768 1048837
4603 1048837 1073986 992723 997579 976130 892495 876014 992559 932285 935514 975491 998440 932273
4591 932273 875487 885721 942556 943576 850047 844049 895067 954308 937043 933849 883128 855364
4579 855364 788666 691674 677292 705648 893536 888601 885554 813756 813980 791969 815831 718614
4567 718614 694734 836620 851952 759039 757634 778508 754611 803571 681321 740650 684738
4556 684738 656830 645874 732737 729790 661879 738036 675998 563454 590953 537570 454881 489668
4544 489668 596221 662743 658530 613310 591535 548305 572342 556023 604383 615695 576418 565793
4532 565793 493915 456108 569715 547599 577787 505630 519895 539245 582715 511806 516225 568545
4520 568545 489090 418587 502103 485585 494050 530666 582304 570867 527601 542066 624326 656992
4508 656992 564899 595147 595301 669643 693628 683075 694801 649593 585602 631629 576379 603957
4496 603957 655920 636321 656393 720439 749583 676460 712138 709415 680413 682267 650843 673725
4484 673725 743783 802845 725236 751448 670179 629115 719622 715011 789279 921116 907990 794260
4472 794260 838724 848187 788062 833249 859541 820577 794995 851785 853089 864246 809581 930339
4460 930339 993747 1030979 1112932 1224321 1156710 1078431 1037606 1141620 1186353 1063789 1090303
4449 1090303 1225229 1176893 1282544 1308669 1378326 1362786 1359282 1412759 1459336 1492345 1536492
4438 1536492 1648813 1650324 1692761 1709344 1781919 1754372 1744985 1762953 1888543 2018975 1999368
4427 1999368 1988390 1952697 1902495 2022057 2081395 2168607 2249435 2276422 2298328 2382301 2370961
4416 2370961 2446038 2469577 2717474 2786661 2813936 2833800 2849213 3021050 3167315 3361843 3403729
4405 3403729 3516449 3640461 3828761 3942423 4018026 4030064 4188424 4413528 4703436 4909934
4395 4909934 5113414 5322649 5480155 5795744 6109980 6630890 6991121 7289427 7788027 8429300
4385 8429300 9126921 10087199 11063328 12254204 13363754 14219495 14972269 15502316 16164273
4376 16164273 17012341 18227807 19604493 21144327 22488985 23216298 23325664 23147144 23181748
4367 23181748 23758789 24761397 25952295 27090623 27574155 26833242 25368571 23864256 22810911
4358 22810911 22247831 21971370 21931236 21703577 20818558 19296185 17642718 16136837 15055150
4349 15055150 14233323 13460694 12804835 12090689 11080508 9945251 8905915 7862918 6968403
4340 6968403 6371403 5886372 5447068 5047677 4596152 4361414 4137435 3789623 3477169 3355523
4330 3355523 3222649 3103844 2952426 2825716 2804208 2764589 2575765 2436778 2395950 2277958
4320 2277958 2300429 2241643 2105675 1990965 1965614 1881736 1752111 1764758 1662979 1694524 1801874
4309 1801874 1712357 1604672 1463595 1473571 1523429 1414835 1378372 1364284 1313606 1259931 1136788
4298 1136788 1196900 1201929 1155124 1084145 1131118 1086495 993296 978029 948559 893455 938401 992538
4286 992538 919662 851533 976094 962119 938564 993645 964431 959061 815391 670520 749134
4275 749134 759132 740780 607113 624492 645066 605765 650171 612203 611537 635524 653829 628410
4263 628410 712212 752509 734515 728016 689510 565401 515724 547404 619211 588361 580284 591031
4251 591031 669268 732786 638829 582760 505953 505236 466241 417937 450127 467187 492520 397085
4239 397085 360238 441824 444369 474929 546698 491643 439186 489524 507614 459605 484244 447659
4227 447659 466792 410015 347190 424135 487729 504172 611229 625024 552310 609433 612029 647487
4215 647487 716596 694096 656284 596894 580096 556933 492865 547944 520493 428043 463877 465371
4203 465371 483764 398296 376750 324818 461821 460633 446910 541466 593377 386786 410113
4192 410113 474369 376539 456823 519814 613744 520673 486333 506287 568712 509529 529614 597808
4180 597808 630382 589034 590195 507324 477546 548660 541760 548299 501106 591316 580375 533173
4168 533173 544986 609859 631445 564812 518157 505607 456669 596029 738502 753615 815381
4157 815381 802880 695379 647309 630807 627715 664349 650000 719575 785991 821834 856939 824745
4145 824745 788273 819031 787034 758196 831380 798332 766903 928017 911170 887363 999005
4134 999005 1083130 1058503 1011355 1035348 1124119 1091389 1079737 1133254 1241096 1258649 1269483
4123 1269483 1220605 1258278 1363188 1411289 1357614 1431039 1543416 1615845 1744039 1655456 1683927
4112 1683927 1718755 1773952 1901548 2004339 2150697 2171569 2210765 2347463 2485362 2537703
4102 2537703 2618229 2712846 2826722 2935094 3085390 3211938 3322162 3508211 3572186 3676850
4092 3676850 3844929 3943073 4076259 4175820 4273342 4380281 4561352 4727060 4759458 4785753
4082 4785753 4832126 4940767 5048541 5045598 5222642 5281509 5256809 5299775 5376553 5468665 5485264
4071 5485264 5481735 5538031 5421088 5511208 5374140 5337413 5358595 5284390 5246527 5168205 5194078
4060 5194078 5058873 5027515 4892504 4815996 4712159 4652626 4524901 4349979 4296817 4230365
4050 4230365 4073206 3902331 3848830 3756087 3553979 3503449 3492361 3356438 3357318 3268451 3078425
4039 3078425 3121743 3036796 2882382 2855673 2814732 2610816 2460344 2389498 2483111 2376334 2260502
4028 2260502 2218592 2231459 2197490 2184850 2072429 2081083 2080090 1975395 1952236 1973010 1897397 1925970
4016 1925970 2023090 1989942 1994941 2089164 2027305 2071736 2106158 2173318 2170973 2279936 2410311
4005 2410311 2530425 2554340 2642713 2710129 2718670 2792478 2844901 2893028 2991694 3067911 3104516
3994 3104516 3216253 3307837 3323515 3487569 3729863 3905736 4187047 4307318 4515965 4781662
3984 4781662 5045876 5533762 5948936 6529250 7339170 8295699 9629883 11400445 13683165
3975 13683165 16885633 21029139 26111981 29072438 25906816 20003241 15331601 12390670
3967 12390670 10128253 8401306 7105150 6209136 5449848 4905416 4435728 4153562 3919085
3958 3919085 3621250 3287499 3083878 2862551 2672765 2507662 2403714 2273914 2145695 2100277
3948 2100277 2013192 1844404 1789563 1772583 1655760 1649375 1645069 1551424 1478572 1464653 1469699 1410959
3936 1410959 1421242 1487225 1375478 1232930 1213762 1251211 1180840 1051481 1066208 1014918 1050709
3925 1050709 994052 946274 987096 907564 901315 771728 914772 960606 925737 790144 835570
3914 835570 840582 761329 744683 862985 846658 776119 805290 716621 746483 717572 724909 807978
3902 807978 762689 611884 663090 730362 624029 511078 511689 535912 549327 552363 580845 572667
3890 572667 620335 516953 525559 562659 628818 573959 459543 455575 539874 455879 344477
3879 344477 495812 489808 474550 495559 503396 515179 539388 562251 488849 626075 646530 488557
3867 488557 443084 518820 546535 525507 498649 480055 619822 570580 557729 524790 591626
3856 591626 577404 517794 455591 575368 477813 503398 523737 537751 476987 479631 540378 545688
3844 545688 623699 476454 437359 621314 637599 596897 619363 692748 663101 616531 607978
3833 607978 596704 563155 544892 607976 537013 525763 581351 586002 700692 735824 734362 691885
3821 691885 730143 716120 711789 737817 703875 753351 836431 774639 769549 800571 750213 780602
3809 780602 838952 712751 713461 825492 776576 778868 830911 813280 757935 821203 734043 763141
3797 763141 805913 802576 764758 848464 849323 942778 953394 996810 952510 948044 1018759 1006777
3785 1006777 998312 961900 1015745 1024232 974029 978187 1043633 1001137 983863 999377 1020688 1006363
3773 1006363 1090037 1130338 1056133 1092295 1172437 1218433 1251528 1262665 1238085 1361195 1406234
3762 1406234 1320335 1376222 1385982 1371483 1442848 1484842 1442057 1498375 1598362 1626468 1621161 1585847
3750 1585847 1739000 1757794 1765790 1804188 1777365 1793405 1874049 1902289 2024504 2156715 2234223
3739 2234223 2232130 2227229 2255055 2325530 2300434 2246095 2316416 2441116 2512247 2534262 2563540 2606621
3727 2606621 2613666 2771606 2779983 2755928 2811045 2805412 2764644 2785385 2874689 2865784 2938768 2930225
3715 2930225 3034588 3071969 3100688 3123005 3179016 3287086 3338831 3437953 3458518 3525819 3626143
3704 3626143 3733541 3817822 3988287 4037143 4140018 4252499 4412428 4574954 4721744 4981942
3694 4981942 5111592 5326326 5578407 5770113 5957562 6076754 6275929 6569010 6748789 6903348
3684 6903348 7126745 7274102 7424914 7560628 7574068 7702952 7869569 8134124 8205117 8209263
3674 8209263 8251952 8362937 8423873 8497272 8678532 8735683 8666017 8591277 8586607 8621450 8515787
3663 8515787 8346567 8320777 8308395 8122775 8037020 7893809 7830493 7805611 7598751 7352017
3653 7352017 7246041 7200325 7097113 6972021 6793701 6652026 6619555 6387902 6169204 6029614
3643 6029614 5833013 5591049 5394353 5227210 5042774 4947080 4774505 4601829 4435461 4299810
3633 4299810 4185859 3947940 3822921 3762646 3753762 3691264 3693791 3691983 3532178 3439503 3437672
3622 3437672 3384140 3346231 3367216 3352672 3318085 3264321 3294820 3344507 3233648 3287049 3307148
3611 3307148 3342590 3272724 3224772 3368083 3399473 3315489 3356398 3298940 3282304 3389389 3324495
3600 3324495 3357156 3312033 3235310 3286302 3288515 3269734 3337952 3353956 3368822 3249562 3301933
3589 3301933 3287223 3340608 3354624 3259575 3218716 3376419 3385364 3402767 3468931 3443291 3511561
3578 3511561 3631013 3729659 3845262 3925214 3954767 4038954 4139487 4210204 4344651 4502445
3568 4502445 4459388 4552212 4670012 4665527 4777206 4777928 4774195 4742679 4784150 4790684 4827855 4680938
3556 4680938 4603811 4678077 4673332 4791168 4744535 4757996 4792556 4829244 4783297 4810095 4884589
3545 4884589 4971853 5034514 5030818 5077233 5218004 5399088 5431117 5498652 5659100 5779824 5849603
3534 5849603 6034683 6261705 6427330 6624121 6714466 6827544 6996061 7175230 7451482 7683876
3524 7683876 7863294 8195803 8537492 8841210 9166409 9506764 9840308 10226164 10591227 10813027
3514 10813027 11115888 11458904 11720850 11986747 12280296 12513721 12805434 13024813 13270111
3505 13270111 13449985 13791452 14071050 14355020 14648301 14993956 15271633 15552755 15813153
3496 15813153 16004148 16376926 16554848 16843917 17020982 16987336 17024457 17119003 17098647 16937596
3486 16937596 16733442 16284591 15900894 15479293 15248087 15007218 14598757 14243675 13859676
3477 13859676 13542172 13159940 12831687 12547566 12357684 12090496 11799187 11398314 11142726
3468 11142726 10891865 10568175 10269195 9875443 9593958 9245046 8887299 8633923 8314596
3459 8314596 8035095 7749203 7499482 7242611 6963484 6597365 6433609 6238187 6126447 5910331
3449 5910331 5754320 5577608 5521432 5344441 5142194 5030103 4841592 4756469 4751973 4651386
3439 4651386 4514986 4523553 4425744 4237848 4202983 4208166 4158708 4215763 4127218 4138742 4112665
3428 4112665 4125859 4054693 4036561 4124928 4165589 4148815 4068304 4106809 4097918 4162954 4082380 4040352
3416 4040352 4081037 4010419 3879082 3857285 3778060 3715982 3633556 3513701 3500404 3382505 3331643
3405 3331643 3219222 3178102 3112037 3114752 3042271 2938224 2881759 2881642 2834580 2705055 2618850
3394 2618850 2663249 2631881 2598365 2647040 2570470 2626118 2558025 2488140 2469479 2428234 2418913 2541269
3382 2541269 2579695 2457945 2557463 2539536 2516180 2411030 2423574 2441314 2523476 2488657 2528390
3371 2528390 2404060 2302171 2339058 2357979 2521614 2589014 2609897 2590621 2615325 2604532 2672116
3360 2672116 2703812 2635624 2743623 2787038 2707733 2781019 2874589 2851631 2836988 2942005 3051727
3349 3051727 3173536 3203534 3193676 3208540 3251366 3352785 3280167 3323482 3475181 3503777 3594814
3338 3594814 3577953 3691827 3728345 3735616 3836284 3982217 4109135 4182595 4181036 4272784 4366107
3327 4366107 4466692 4544200 4639749 4855237 4976240 5044491 5056400 5206943 5362627 5371547 5477580
3316 5477580 5628141 5834371 5941246 6117695 6412161 6609507 6766258 6939522 7088868 7310367
3306 7310367 7674041 7953212 8107524 8404435 8744278 9068616 9465454 9807566 10285305 10702330
3296 10702330 11138618 11686460 12204747 12696857 13229628 13855503 14539273 15235875 15870238
3287 15870238 16526033 17202589 17917964 18605407 19250210 19800697 20378325 20831806 21169253
3278 21169253 21591800 21984782 22232860 22340495 22352253 22333909 22348310 22281826 22129609 21888421
3268 21888421 21613380 21335121 20939026 20432664 19854676 19261399 18691912 17888413 17215318
3259 17215318 16668396 15971848 15191920 14523913 13929337 13228053 12516042 11991882 11492198
3250 11492198 10965858 10380883 9932795 9490451 9063460 8700984 8480312 8189250 7871242
3241 7871242 7639910 7347750 7179248 6921291 6695470 6383986 6247463 6082651 5861519 5724280
3231 5724280 5635579 5586189 5364742 5259892 5107319 5026151 4971956 4868607 4770810 4678801 4662019
3220 4662019 4575922 4543047 4555118 4471948 4451797 4382806 4373878 4364605 4282512 4207567 4198824 4203956
3208 4203956 4159614 4169329 4153627 4148629 4145081 4100463 4133327 4160791 4120949 4211610 4202687 4197041
3196 4197041 4159208 4215654 4317752 4264502 4164844 4136244 4051613 4166135 4053171 4000632 4106718
3185 4106718 4100590 3971641 3993965 4027507 3965216 3833849 3753991 3779117 3809123 3872490 3862844
3174 3862844 3852694 3760494 3815256 3740424 3732856 3747431 3751486 3814533 3813087 3828644 3908694 4023319
3162 4023319 4141820 4159655 4308435 4323619 4443119 4468680 4594661 4734450 4851745 5094368
3152 5094368 5297225 5361200 5440845 5525327 5630880 5858713 6093693 6393710 6509969 6770797
3142 6770797 7063740 7322200 7631835 8041128 8324204 8590332 9044581 9394483 9681178 9955629
3132 9955629 10106993 10377018 10609742 10887700 10997276 11069640 11113493 11163220 11268058 11255412
3122 11255412 11184645 11168994 11089669 11052434 11002307 10813947 10654561 10419506 10140432 9873951
3112 9873951 9530478 9222977 8751458 8379306 8095699 7758899 7418318 7043426 6645065 6294928
3102 6294928 6107518 5960777 5674380 5335186 5123416 4915908 4789228 4558017 4387000 4257165
3092 4257165 4133612 3869375 3669149 3540924 3416167 3327572 3360571 3396630 3196975 3075695
3082 3075695 3073581 2953346 2887220 2899932 2838983 2745103 2665261 2676410 2720501 2807842 2718832
3071 2718832 2628709 2470008 2451265 2517715 2523643 2696160 2631226 2465083 2533532 2590318 2551357
3060 2551357 2619909 2626250 2478437 2441161 2509093 2397519 2268708 2117088 2131630 2241935 2153013
3049 2153013 2101040 2002578 1896285 1890213 1872941 1880589 1779396 1768618 1756954 1768202 1702851
3038 1702851 1633105 1598300 1661628 1577974 1566912 1585209 1590333 1473722 1496831 1507254 1550547
3027 1550547 1512669 1503606 1537332 1510778 1439601 1449580 1367384 1335687 1541128 1614022 1547831 1472841
3015 1472841 1545318 1535858 1536325 1503950 1528016 1457433 1411451 1468653 1582131 1543216 1490624 1435647
3003 1435647 1497711 1562800 1553628 1481125 1511454 1627507 1745181 1594778 1506950 1592465 1665157
2992 1665157 1708891 1768609 1718048 1797883 1727644 1698332 1709220 1762749 1754477 1661690 1756184 1742279
2980 1742279 1886549 1931046 1952438 1965601 1959726 2039300 2027918 2070613 1995239 2041899 2096257
2969 2096257 2209390 2133306 2087719 2079956 2102160 2276558 2257775 2358486 2355511 2401816 2451548
2958 2451548 2563526 2683668 2761227 2758251 2858620 2896985 2871499 2935117 2995997 3045717 3047100
2947 3047100 3096493 3237365 3308045 3343318 3408523 3404457 3460152 3637933 3769759 3792619 3808640
2936 3808640 3895693 4065453 4144102 4223570 4197125 4217930 4324149 4517979 4708901 4797426 4864382
2925 4864382 4967402 5093952 5244136 5343869 5430735 5725785 5924679 6032112 6100504 6237735
2915 6237735 6455582 6628121 6896027 6994835 7252362 7618689 7860861 8118882 8490735 8795466
2905 8795466 9124727 9417390 9708102 10160290 10523034 10999437 11461841 11937091 12506683 12978858
2895 12978858 13517447 14203112 14859152 15575079 16368925 17218461 18157709 19103757 20146398
2886 20146398 21320806 22752812 24258993 25695384 27592236 29580719 31738960 34266013
2878 34266013 36857064 39535414 42485830 45387369 48085571 50539686 52224460 52971333
2870 52971333 52710220 51379010 49231879 46418315 43398756 40299931 37195003 34268369
2862 34268369 31710246 29399675 27290327 25375700 23592421 22021207 20495187 19147379
2854 19147379 17917060 16887775 15861628 14927458 14151110 13300685 12594332 11997717 11554184
2845 11554184 11055164 10478994 9997246 9650502 9213962 8774516 8399228 8122202 7794242
2836 7794242 7572774 7260208 6893042 6667241 6355279 6125163 5904326 5712881 5562018 5460442
2826 5460442 5211347 5086987 4922952 4752549 4661883 4398444 4232844 4191277 4124536 3961519
2816 3961519 3790797 3706990 3571907 3573959 3534451 3407080 3287803 3226746 3169325 2955241 2928040
2805 2928040 2777930 2624074 2613218 2613950 2595241 2487775 2402222 2303927 2222877 2160173 2076429
2794 2076429 2088342 2053387 2063982 1999910 1915121 1909438 1861685 1797319 1720338 1844714 1819484
2783 1819484 1733142 1680759 1606379 1628365 1582449 1452411 1313465 1377226 1306124 1216504 1210124
2772 1210124 1270407 1311627 1301837 1163148 1132442 1143004 1217851 1181538 1134623 1175152 1167117 1113760
2760 1113760 1000936 952613 1009537 1074243 956756 959660 887349 947361 941453 937167 915827 899418
2748 899418 889757 860685 805448 801747 947775 999188 927996 932441 768066 759531 806318 835693
2736 835693 793055 839700 854519 858482 779036 736096 742193 705879 747557 623831 638158 721465
2724 721465 672494 659240 661397 571170 549686 604133 628564 634339 647054 607874 602346 666627
2712 666627 674134 688033 669231 574112 561731 581885 534799 531868 458770 475827 473666 451550
2700 451550 416870 533776 502414 505916 564417 543396 430836 441402 501301 383248 414460
2689 414460 453382 414050 323489 353068 398288 419333 358538 408605 364385 362073 425373 382579
2677 382579 336937 336851 370404 356865 285019 354496 280318 204214 258089 322070 257880 382216
2665 382216 319052 299567 317947 364098 404196 296491 261951 225092 244314 294645 315063
2654 315063 269702 291072 325057 234767 224702 231624 258527 293049 326101 302150 313421 346217
2642 346217 331001 405449 332306 277904 214350 254877 403233 301312 228044 296044 272305
2631 272305 181034 203513 211816 244284 247635 202307 169800 198918 170368 204241 279462 254754
2619 254754 278178 239046 184281 151882 91499 214911 215670 90257 180686 244731 177163 115874
2607 115874 156022 258939 342203 248163 377564 315140 348445 418893 423336 412324 381673
2596 381673 323869 330849 323962 416134 497688 394444 447576 434767 402928 480943 435178 245386
2584 245386 247068 417223 421931 382982 347527 286063 349471 417197 358981 258171 246602 251693
2572 251693 291328 269733 302805 248393 191067 186243 190875 188929 241409 253437 264062 215858
2560 215858 166770 177836 266297 265478 304756 263083 303308 289524 203561 239090 243610 234187
2548 234187 211130 180873 166803 167626 92611 108577 87295 34925 68621 114090 99340 110096
2536 110096 109840 108686 150055 168276 161983 169675 115975 194841 151893 199712 284280 228749 175105
2523 175105 153675 128012 120569 127938 100205 59078 74687 124191 100828 43125 81313 202497
2511 202497 153397 70970 35028 -30485 42917 64993 12042 35887 139978 132664 109028 112270
2499 112270 139689 108896 4029 -2930 -42694 15531 96969 82948 6122 106954 56396
2488 56396 55271 83819 12632 41932 32392 128446 1391 -76625 -96044 -131982 -33239 12498
2476 12498 29633 73018 8144 59411 89646 44120 34895 81709 161926 171967 105490 96647
2464 96647 14909 -19217 83582 237342 185061 172322 188000 184447 217329 208309 167931 152164
2452 152164 116947 133902 83136 12764 22153 21315 32646 35252 34806 -59464 47321 21740 103803
2439 103803 57449 607 -68623 27042 169413 45075 83490 107658 71332 -30982 30521
2428 30521 22383 -32604 32832 101602 122892 92369 91820 10300 60041 136246 135617 168087 139588
2415 139588 95430 11689 -49588 -59665 -33053 -42705 -26903 43465 60390 29142 34112 74106
2403 74106 83204 106909 -68072 1563 2276 18433 168073 129616 97765 81308 52326 -12245
2391 -12245 29523 -1389 11008 39487 -6598 110520 145288 195386 208818 151824 35816
2380 35816 58685 24062 31922 69229 92486 128666 225434 132944 106178 87012 27538 88271
2368 88271 26648 83606 71312 73589 49834 44065 124835 161175 153166 130287 130486 119769 167668
2355 167668 181753 134369 36905 23067 101307 152076 66198 101865 -59444 -69857 -407
2344 -407 -33380 15481 75361 25622 -28519 89411 85562 102595 71472 -32797 -76762 23421
2332 23421 6377 97112 76300 66501 56003 65825 82008 50855 87280 52733 26071 68469
2320 68469 50316 41817 -77603 -28548 140133 128579 67140 -71124 -71035 -4375 25377 23671
2308 23671 -34457 -55561 -65308 -21470 1185 18515 71251 45537 44683 17769 -100718 -139668
2296 -139668 -62575 27980 -7450 45818 37872 -7076 -23430 16308 50886 41959 25991 48580
2284 48580 -30528 -24801 14769 -22097 -104859 -102106 -48044 -118733 -86542 -50869 -124129 -85391
2272 -85391 -107956 -35848 -31207 8707 3085 20062 48124 -4916 13043 94291 86187 59520
2260 59520 -5831 31942 -14305 -18826 116134 143455 49015 107145 25587 19547 28512 -18128
2248 -18128 32212 86302 80498 22561 128720 123627 88292 -94608 1406 -8238 -10876 28682
2236 28682 83221 62622 21542 -56491 -24910 16591 -47448 70443 123394 79965 114588 116896
2224 116896 42617 -16900 68028 -8538 49455 40381 11998 32487 115918 73591 61268 67052
2212 67052 29990 54796 56274 -11542 -54142 -15747 -63637 -30115 18234 -18257 -48736 51730
2200 51730 38173 32548 -6952 -16600 -2988 -51260 -86248 -156792 -103834 -7839 45968 70133
2188 70133 104877 -6923 50788 123113 60476 44666 -61246 16647 92464 116216 99625
2177 99625 94002 65463 57736 -5206 38124 81284 -53917 -39186 -1216 43770 122578 114623
2165 114623 47389 14308 17437 130570 180262 149775 133027 81479 -54736 -43314 -29452
2154 -29452 20943 47452 21542 41804 78273 23472 805 -8431 -25991 52745 53680 74832
2142 74832 9111 -32065 -40404 -34821 36654 36329 82888 87673 -3055 63203 131957 -35200 -34074
2129 -34074 60905 122928 132423 177898 134730 106985 54607 58729 36410 -20896 21998 74677
2117 74677 29875 69550 123426 103415 176842 110768 112181 8741 16561 122393 191965 150806
2105 150806 122486 136974 125267 146758 109427 75898 131371 58297 202182 206515 256783 287292
2093 287292 272187 305259 313607 334442 347861 382462 451899 489303 447184 423587 504440 553049
2081 553049 632985 678276 724630 984797 1164332 1425391 1828682 2310735 2581304 2285719
2071 2285719 1763718 1366944 1105357 885820 697421 715571 597886 551214 488155 376732
2061 376732 286526 264035 463311 447992 308129 242753 211058 235467 298286 207994 79428
2050 79428 -7053 76742 83479 83192 104956 224345 173380 150359 167472 103941 125750 116738
2038 116738 55685 44823 126075 60182 13300 45061 118189 117420 77099 110960 177325 173649
2026 173649 23125 -72913 -72732 43266 93149 147299 130941 54020 -4390 -2797 34047 41594
2014 41594 20162 13532 81955 71616 25466 -60981 -58479 -671 68267 54204 -102283 -103277
2002 -103277 84560 -14843 -16945 2713 -14043 -34883 -7807 -10856 -27735 105070 54522 73869
1990 73869 121360 94630 324 -69538 19704 77284 148209 29531 -74350 -12754 -63051
1979 -63051 -37992 106021 67762 -20135 -43723 24663 -9961 83559 92947 8129 -91546 44821
1967 44821 -11061 -22420 98542 -34832 -31463 50075 24169 3188 89457 41356 7284 -34582
1955 -34582 -14161 49142 89529 55196 -4143 -34930 -15172 63519 91653 91926 58487 -494
1943 -494 8150 -23751 -16810 25470 -23812 15769 -48760 -4924 105110 66621 -13162 -6506 6335
1930 6335 77868 102014 24843 -40916 -85750 -71535 -18636 37541 -39387 -18400 -46322 -83286
1918 -83286 -7319 -25779 16665 2912 6185 122220 64947 16391 86793 69150 80227 69836
1906 69836 45874 32093 60564 21341 -60513 2021 5558 15583 72798 38900 -61769 -6142
1894 -6142 -17281 -9870 27614 -42797 -49561 -110451 -75000 4771 16938 -19192 82248 147499
1882 147499 70425 88088 60821 67903 29743 31232 74039 26413 -17173 -74330 -32409 6087
1870 6087 28075 92000 49995 19061 28907 29683 40127 -5126 44984 22056 -49275 -27200 -62933
1857 -62933 -42255 -94679 -98879 -195809 -125122 -100147 -23076 35388 51376 245 8085 79055
1845 79055 -20127 -59265 17237 50808 -17070 -24139 -4635 24015 43303 -6386 -4265 947
1833 947 1377 141 -59731 -76846 -86062 -131183 11577 -14109 32892 -24432 7915 5852 62476
1820 62476 9721 -66311 50342 -750 105195 87405 12704 33595 31307 35343 30783 -81930
1808 -81930 -97201 -73990 -31179 58077 30850 -20786 18167 3736 3039 -14276 -126188 -136437
1796 -136437 -139606 -93820 -62649 46523 68801 -682 3805 89244 -6933 -92242 -90046 -14121
1784 -14121 91432 -49840 -29640 -27714 -32061 -48884 -4984 -1332 50824 24327 26156 60632
1772 60632 97985 34541 -6977 -481 -17994 -90655 -6393 39362 2331 -80863 -47927 -7105
1760 -7105 -55494 66619 159106 109443 106330 -16088 -10657 -45598 -58614 1184 27085 67631
1748 67631 -7261 -76181 -56238 -82214 -64728 -33350 -23881 -12115 -63039 -96487 -23703 -78635
1736 -78635 -98168 -38386 -65954 -88134 -104496 -153266 -78375 16797 20524 38892 -14323 -52160
1724 -52160 8763 51658 -40424 -78222 -80379 -23075 57167 -28645 -2235 111262 206855 100320
1712 100320 23166 29080 8388 9267 -29070 -54579 70643 43792 -36631 -66575 -108831 102680
1700 102680 97408 -100921 -60267 -147875 -133626 51121 -42051 14308 54803 -92920 -209752
1689 -209752 -88348 -113082 -41874 -42974 -19268 -776 62404 12492 2296 79562 133968 16797
1677 16797 11240 18579 24807 74765 -15885 -1462 -59291 89247 46800 -12205 -21925 7156
1665 7156 16209 -50405 21009 -24403 -75291 -41087 -73940 -36671 18273 -3489 40826 92647
1653 92647 10768 -84623 15379 -60439 -151145 -144392 -22750 -6856 -46476 -17504 -43465 -46986
1641 -46986 -27997 -23127 48597 -20583 -124817 -73941 -77719 -83373 -114691 -72212 -81432 22827
$$ [...]
##END NTUPLES=NMR SPECTRUM
##END=
