##TITLE=1H_EC-3299(IV-32)x1
 DMSO
 8 sc, 
 6.9.2023
##JCAMPDX= 6.0         $$ Bruker NMR JCAMP-DX V2.0
##DATA TYPE= NMR SPECTRUM
##DATA CLASS= NTUPLES
##ORIGIN= UXNMR, Bruker Analytische Messtechnik GmbH
##OWNER= root
$$ XWIN-NMR		Version 3.5
$$ Wed Sep  6 15:36:15 2023 Russian Standard Time (UT+4h)  she@DPX200
##.OBSERVE FREQUENCY= 200.13135
##.OBSERVE NUCLEUS= ^1H
##.ACQUISITION MODE= SIMULTANEOUS
##.ACQUISITION SCHEME= undefined
##.AVERAGES= 8
##.DIGITISER RES= 18
##SPECTROMETER/DATA SYSTEM= spect
##.PULSE SEQUENCE= zg30
##.SOLVENT NAME= DMSO
##.SHIFT REFERENCE= (INTERNAL, DMSO, 0, 15.7535)
##AUDIT TRAIL= $$ (NUMBER, WHEN, WHO, WHERE, WHAT)
$$ ##TITLE= Audit trail, XWIN-NMR		Version 3.5
$$ ##JCAMPDX= 5.01
$$ ##ORIGIN= Bruker BioSpin GmbH
$$ ##OWNER= she
$$ F:/spectra/data/she/nmr/H-F/1/pdata/1/auditp.txt
$$ ##AUDIT TRAIL=  $$ (NUMBER, WHEN, WHO, WHERE, WHAT)
(   1,<2023-09-06 15:34:56.53 +0400>,<she>,<DPX200>,
      <created by zg, POWCHK disabled, PULCHK disabled
       configuration hash MD5:
       00 E9 B6 7A A2 85 ED C7 34 08 36 98 17 FE 4E 26
       data hash MD5: 16K
       55 F6 2C 48 EA C2 12 29 6A 72 EC 6D F8 73 D4 A9>)
(   2,<2023-09-06 15:35:00.14 +0400>,<she>,<DPX200>,
      <Start of raw data processing
       efp BC_mod = 2 LB = 0.24 FT_mod = 6 PKNL = 1 PHC0 = -21049.14 PHC1 = 18.25271 SI = 16K 
       data hash MD5: 16K
       6D 22 F4 44 81 2F C5 80 CD 2B 2F A8 62 2F 6C E2>)
(   3,<2023-09-06 15:35:16.85 +0400>,<she>,<DPX200>,
      <pk PHC0 = 1.769455 PHC1 = -2.2 
       data hash MD5: 16K
       58 D4 66 2C 79 40 4C 0E B1 5D AD A1 35 2D 16 0D>)
(   4,<2023-09-06 15:35:20.23 +0400>,<she>,<DPX200>,
      <abs ABSG = 5 
       data hash MD5: 16K
       01 5E 6B C3 8F 12 D4 BF 9D F5 82 15 9E C7 EB D0>)
$$ ##END=
$$ 
$$ hash MD5
$$ 64 85 EF D8 68 83 2F 09 0C 19 81 A1 40 2C 24 36
##$RELAX= 
##$RELAX= 
##$RELAX= 
##$RELAX= 
##$RELAX= 
##$RELAX= 
$$ Bruker specific parameters
$$ --------------------------
##$DU= <F:/spectra>
##$EXPNO= 1
##$NAME= <H-F>
##$PROCNO= 1
##$TYPE= <nmr>
##$USER= <she>
##$AMP= (0..31)
100 100 100 100 100 100 100 100 100 100 100 100 100 100 100 100 100 100 
100 100 100 100 100 100 100 100 100 100 100 100 100 100 
##$AQSEQ= 0
##$AQ_mod= 1
##$AUNM= <au_zg>
##$AUTOPOS= <>
##$BF1= 200.13
##$BF2= 200.13
##$BF3= 200.13
##$BF4= 200.13
##$BF5= 200.13
##$BF6= 200.13
##$BF7= 200.13
##$BF8= 200.13
##$BYTORDA= 1
##$CFDGTYP= 0
##$CFRGTYP= 5
##$CHEMSTR= <none>
##$CNST= (0..31)
1 1 145 1 1 1 1 1 1 1 1 1 1 1 1 1 1 1 1 1 1 1 1 1 1 1 1 1 1 1 1 1 
##$CPDPRG= <>
##$CPDPRG1= <>
##$CPDPRG2= <>
##$CPDPRG3= <>
##$CPDPRG4= <mlev>
##$CPDPRG5= <mlev>
##$CPDPRG6= <mlev>
##$CPDPRG7= <mlev>
##$CPDPRG8= <mlev>
##$CPDPRGB= <>
##$CPDPRGT= <>
##$D= (0..31)
0 1.2 0 0 0 0 0 0 0 0.06 0 0.03 0 0 0 0 0.0002 0 0 0 0 0 0 0 0 0 0 0 0 
0 0 0 
##$DATE= 1694000095
##$DBL= (0..7)
120 120 120 120 120 120 120 120 
##$DBP= (0..7)
150 150 150 150 150 150 150 150 
##$DBP07= 0
##$DBPNAM0= <>
##$DBPNAM1= <>
##$DBPNAM2= <>
##$DBPNAM3= <>
##$DBPNAM4= <>
$$ [...]
##$SUBNAM3= <"">
##$SUBNAM4= <"">
##$SUBNAM5= <"">
##$SUBNAM6= <"">
##$SUBNAM7= <"">
##$SUBNAM8= <"">
##$SUBNAM9= <"">
##$SW= 18.05172834244
##$SWIBOX= (0..15)
0 0 2 0 0 0 0 0 0 0 0 0 0 0 0 0 
##$SW_h= 3612.71676300578
##$TD= 16384
##$TD0= 1
##$TE= 0
##$TE2= 300
##$TE3= 300
##$TEG= 300
##$TL= (0..7)
0 120 120 120 120 120 120 120 
##$TP= (0..7)
150 150 150 150 150 150 150 150 
##$TP07= 0
##$TPNAME0= <>
##$TPNAME1= <>
##$TPNAME2= <>
##$TPNAME3= <>
##$TPNAME4= <>
##$TPNAME5= <>
##$TPNAME6= <>
##$TPNAME7= <>
##$TPOAL= (0..7)
0.5 0.5 0.5 0.5 0.5 0.5 0.5 0.5 
##$TPOFFS= (0..7)
0 0 0 0 0 0 0 0 
##$TUNHIN= 0
##$TUNHOUT= 0
##$TUNXOUT= 0
##$USERA1= <user>
##$USERA2= <user>
##$USERA3= <user>
##$USERA4= <user>
##$USERA5= <user>
##$V9= 5
##$VALIST= <valist>
##$VCLIST= <CCCCCCCCCCCCCCC>
##$VD= 0
##$VDLIST= <DDDDDDDDDDDDDDD>
##$VPLIST= <PPPPPPPPPPPPPPP>
##$VTLIST= <TTTTTTTTTTTTTTT>
##$WBST= 1024
##$WBSW= 4
##$XGAIN= (0..3)
0 0 0 0 
##$XL= 0
##$YL= 0
##$YMAX_a= 217572
##$YMIN_a= -236710
##$ZGOPTNS= <>
##$ZL1= 120
##$ZL2= 120
##$ZL3= 120
##$ZL4= 120
##$ABSF1= 15.75571
##$ABSF2= -2.29614
##$ABSG= 5
##$ABSL= 3
##$ALPHA= 0
##$AQORDER= 0
##$ASSFAC= 0
##$ASSFACI= 0
##$ASSFACX= 0
##$ASSWID= 0
##$AUNMP= <proc_1d>
##$AZFE= 0.1
##$AZFW= 0.1
##$BCFW= 0
##$BC_mod= 2
##$BYTORDP= 0
##$COROFFS= 0
##$CY= -3
##$DATMOD= 1
##$DC= 0
##$DFILT= <>
##$DTYPP= 0
##$F1P= 0
##$F2P= 0
##$FCOR= 1
##$FTSIZE= 16384
##$FT_mod= 6
##$GAMMA= 0
##$GB= 0
##$INTBC= 1
##$INTSCL= 3.70164e-10
##$ISEN= 128
##$LB= 0.24
##$LEV0= 0
##$LPBIN= 0
##$MAXI= 10000
##$MC2= 0
##$MEAN= 0
##$ME_mod= 0
##$MI= 1.114404
##$NCOEF= 0
##$NC_proc= -5
##$NLEV= 6
##$NOISF1= 3.799351
##$NOISF2= 2.8
##$NSP= 0
##$NTH_PI= 0
##$NZP= 0
##$OFFSET= 15.7535
##$PC= 1
##$PHC0= -21047.37
##$PHC1= 16.05271
##$PH_mod= 1
##$PKNL= yes
##$PPARMOD= 0
##$PSCAL= 0
##$PSIGN= 0
##$REVERSE= no
##$SF= 200.130003610974
##$SI= 16384
##$SIGF1= 3
##$SIGF2= 2
##$SINO= 5.538805
##$SIOLD= 16384
##$SREGLST= <1H.CDCl3>
##$SSB= 0
##$STSI= 16384
##$STSR= 0
##$SW_p= 3612.71676300578
##$SYMM= 0
##$S_DEV= 0
##$TDeff= 16384
##$TDoff= 0
##$TI= <>
##$TILT= no
##$TM1= 0
##$TM2= 0
##$TOPLEV= 0
##$USERP1= <user>
##$USERP2= <user>
##$USERP3= <user>
##$USERP4= <user>
##$USERP5= <user>
##$WDW= 1
##$XDIM= 16384
##$YMAX_p= 392066852
##$YMIN_p= -210628
$$ End of Bruker specific parameters
$$ ---------------------------------
##NTUPLES= NMR SPECTRUM
##VAR_NAME=  FREQUENCY,     SPECTRUM/REAL,   SPECTRUM/IMAG
##SYMBOL=    X,             R,               I
##VAR_TYPE=  INDEPENDENT,   DEPENDENT,       DEPENDENT
##VAR_FORM=  AFFN,          ASDF,            ASDF
##VAR_DIM=   16384,         16384,           16384
##UNITS=     HZ,            ARBITRARY UNITS, ARBITRARY UNITS
##FACTOR=    0.220516191357247, 1,           1
##FIRST=     3152.74800883174, 0,            0
##LAST=      -459.968754174043, 0,           0
##MIN=       -459.968754174043, -210628,     0
##MAX=       3152.74800883174, 392066852,    0
$$ Real data points
##PAGE= N=1
##DATA TABLE= (X++(R..R)), XYDATA
$$ [...]
$$ plain form
8635 1785106 1866112 1957790 2021207 2106486 2200610 2228239 2287361 2315192 2277096 2295741 2266782
8624 2266782 2207247 2124899 2047222 1993834 1891337 1856909 1777032 1623793 1539081 1475913 1381162
8613 1381162 1329545 1251317 1193146 1159725 1117071 1054520 1037121 1039351 1079714 1127866 1158173 1145657
8601 1145657 1242345 1332109 1340277 1426327 1538246 1603136 1664635 1742824 1809905 1803170 1839249 1838045
8589 1838045 1865520 1884374 1872619 1824742 1781169 1740873 1640387 1529259 1444687 1373673 1267503
8578 1267503 1084101 1048279 1036316 921591 837287 773257 715088 639159 590116 534739 491533
8567 491533 439848 420389 398394 387128 375857 338743 299009 279788 275917 265375 257832 288675
8555 288675 248599 213890 184854 180364 184585 198345 194435 187918 157438 170294 198264 169819
$$ packed form
8635A785106Q1006R1678O3417Q5279R4124K7629N9122K7831l8096J8645k8959
8624B266782n9535q2348p7677n3388j02497l4428p9877j53239q4712o3168r4751
8613A381162n1617p8228n8171l3421m2654o2551j7399K230M0363M8152L0307j2516
8601A145657R6688Q9764Q168Q6050J11919O4890O1499P8189O7081o735L6079j204
8589A838045K7475J8854j1755m7877m3573m0296j00486j11128q4572p1014j06170
8578A267503j83402l5822j1963j14725q4304o4030n8169p5929m9043n5377m3206
8567D91533n1685j9459k1995j1266j1271l7114l9734j9221l871j0542p543L0843
8555B88675m0076l4709k9036m490M221J3760l910o517l0480J2856K7970k8445
$$ plain form
8543 169819 173818 198335 174992 193153 206861 177653 144183 156508 186229 157553 163399 139516
8531 139516 120840 125826 80044 53543 60726 47082 52468 35719 53791 127529 137794 120208
8519 120208 54340 39424 50682 62127 69805 68949 41774 45447 56019 88921 48719 24906
8507 24906 4901 -8018 53723 65018 30641 17931 6377 94 52456 39327 29852 30702 43855
8494 43855 51527 76813 45097 38511 48442 -5609 -2775 18311 55827 70023 60720 48140 21879
8481 21879 8467 59149 46785 22016 24232 -7474 -170 14134 6359 12787 38637 28036 12703
8468 12703 -12771 50137 64194 54290 -22693 -32110 -9774 34454 16026 -3205 10654 -27349
8456 -27349 3074 16541 77777 23759 8877 15307 17048 39189 8083 -32708 -23816 3093
$$ packed form
8543A69819L999K4517k3343J8161J3708k9208l3470J2325K9721k8676N846k3883
8531A39516j8676M986m5782k6501P183j3644N386j6749J8072P3738J0265j7586
8519A20208o5868j4916J1258J1445P678q56k7175L673J0572L2902m0202k3813
8507B4906k0005j2919O1741J1295l4377j2710j1554o283N2362j3129r475Q50J3153
8494D3855P672K5286l1716o586R931n4051K834K1086L7516J4196r303j2580k6261
8481B1879j3412N0682j2364k4769K216l1706P304J4304p775O428K5850j0601j5333
8468A2703k5474O2908J4057r904p6983r417K2336M4228j8428j9231J3859l8003
8456b7349L0423J3467O1236n4018j4882O430J741K2141l1106m0791Q892K6909
$$ plain form
8444 3093 4752 23585 5520 37184 82636 32855 28982 37440 23557 51829 29235 -28110 -71928
8431 -71928 -19177 -31173 1960 9235 23794 10536 -1807 -6918 20746 34797 -2570 -24471
8419 -24471 -74704 -62401 -31117 -25976 -37047 -51657 -43699 -17894 -48785 -18747 -28368 -26402 14333
8406 14333 25926 -6797 -85739 -69923 -28841 -43597 -34586 -85022 -37279 228 -19148 -28929
8394 -28929 -16424 -24623 9472 3269 -47070 -40592 -11091 -19198 -14106 -54698 -42948 -9094 -32788
8381 -32788 -48514 -79304 -72389 -79327 -81975 -64148 -95801 -44043 -39386 -35226 -26644 -59442 -56807
8368 -56807 -84668 -85791 -55990 -31855 -52946 -38432 -32158 -70687 -61003 -1364 -42570 -30433
8356 -30433 -72268 -93497 -76448 -79093 -36940 -20453 -67437 -61391 -38393 -49578 -33927 -17906
$$ packed form
8444C093J659J8833j8065L1664M5452m9781l873Q458j3883K8272k2594n7345m3818
8431g1928N2751j1996L3133P275J4559j3258j2343n111K7664J4051l7367k1901
8419b4471n0233J2303L1284N141j1071j4610P958K5805l0891L0038r621J966M0735
8406A4333J1593l2723p8942J5816M1082j4756R011n0436M7743L7507j9376r781
8394b8929J2505q199L4095o203n0339O478K9501q107N092m0592J1750L3854k3694
8381c2788j5726l0790O915o938k648J7827l1653N1758M657M160Q582l2798K635
8368e6807k7861j123K9801K4135k1091J4514O274l8529R684N9639m1206J2137
8356c0433m1835k1229J7049k645M2153J6487m6984O046K2998j1185J5651J6021
$$ plain form
8344 -17906 -22547 -52614 -49998 -40822 -38285 -47184 -25106 -28920 -53652 -46646 -81728 -59026 -85108
8331 -85108 -63879 -45651 -34737 -19340 -15469 -36433 -40359 -40465 -78514 -51053 -50876 -84209 -113346
8318 -113346 -105305 -70299 -64376 -87887 -117369 -89586 -118531 -115684 -79289 -64794 -78437 -56583
8306 -56583 -55738 -123841 -124728 -112089 -83812 -93177 -100250 -130259 -102346 -58277 -39726 -60311 -56107
8293 -56107 -77067 -42234 -26864 -87924 -112091 -28756 -2732 -50723 -96098 -90527 -72950 -71080
8281 -71080 -68060 -37995 -40683 -62745 -93046 -102044 -90507 -46187 -38388 -69843 -81245 -131902 -121925
8268 -121925 -95194 -105674 -103100 -125836 -80506 -47041 -54430 4917 1559 -27364 -76030 -51084
8256 -51084 -39342 -35553 -31292 -23287 -37349 -28242 -45132 -74965 -88157 -106747 -122301 -75606 -44596
$$ packed form
8344a7906m641l0067K616R176K537q899K2078l814k4732P006l5082K2702k6082
8331h5108K1229J8228J0914J5397L871k0964l926j06l8049K7461J77l3333k9137
8318a13346Q041L5006N923k3511k9482K7783k8945K847L6395J4495j3643K1854
8306e6583Q45o8103q87J2639K8277r365p073l0009K7913M4069J8551k0585M204
8293e6107k0960L4833J5370o1060k4167Q3335K6024m7991m5375N571J7577J870
8281g1080L020L0065k688k2062l0301q998J1537M4320P799l1455j1402n0657R977
8268a21925K6731j0480K574k2736M5330L3465p389N9347l358k8923m8666K4946
8256e1084J1742L789M261Q005j4062R107j6890k9833j3192j8590j5554M6695L1010
$$ plain form
8243 -44596 -69007 -76588 -25674 -26654 -30791 -9070 -10109 -27211 -21732 -18325 -73755 -40144 -20680
8230 -20680 -38418 -35495 -23801 -24226 -30242 -24479 -57823 -48780 -38987 -42588 -30924 -28525 -58223 -45931
8216 -45931 -31501 -33896 -58159 -35190 -33052 -71290 -84880 -66202 -53578 -79456 -81524 -96762
8204 -96762 -78435 -77299 -82146 -102018 -61566 -36372 -55237 -105988 -140451 -175479 -141031 -210628
8192 -210628 39029 137912 1559 77403 37772 -13253 -47642 -45336 -21990 -39974 -36698 -34163
8180 -34163 -79960 -80823 -76136 -41189 -57559 -47824 -43766 -51698 -71865 -83511 -55599 -51161 -89851
8167 -89851 -106646 -80266 -70233 -96361 -82050 -35906 -13205 -40207 -93569 -65746 -42612 -73302
8155 -73302 -60236 -27096 -59530 -48633 -48821 -41914 -16097 -65454 -34667 -44412 -89737 -84409 -45076
$$ packed form
8243d4596k4411p581N0914r80m137K1721j039j7102N479L407n5430L3611J9464
8230b0680j7738K923J1694m25o016N763l3344R043R793l601J1664K399k9698J2292
8216d5931J4430k395k4263K2969K138l8238j3590J8678J2624k5878k068j5238
8204i6762J8327J136m847j9872M0452K5194j8865n0751l4463l5028L4448o9597
8192b10628K49657R8883j36353P5844l9631n1025l4389K306K3346j7984L276K535
8180c4163m5797q63M687L4947j6370R735M058p932k0167j1646K7912M438l8690
8167h9851j6795K6380J0033k6128J4311M6144K2701k7002n3362K7823K3134l0690
8155g3302J3066L3140l2434J0897j88O907K5817m9357L0787r745m5325N328L9333
$$ plain form
8142 -45076 -26426 4666 24946 -24525 -55524 -69889 -67523 -76313 -65938 894 -20757 -25305
8130 -25305 -6139 2127 -31823 -25152 -49050 3807 -18344 -32467 -34066 -40642 -29502 -92392 -33364
8117 -33364 21730 17 -44377 -49382 -80225 -50209 -86306 -78227 -26471 -6778 -78557 -81830
8105 -81830 -89454 -84274 -60994 -90537 -87385 -49051 -84363 -37000 -10273 -37191 -36134 -94791 -75207
8092 -75207 -49251 -59892 -80399 -75974 -68049 -25200 -24783 -94007 -75054 -17501 -41585 -21559 -24901
8079 -24901 -59062 -7982 -31369 -40596 -34093 -65417 -65664 -69635 -53303 -87201 -100905 -79163 -64365
8066 -64365 -28793 -9201 -3825 -45991 -41133 -23550 -23710 -20934 -21900 -332 -9920 35029 25136 -22830
8052 -22830 -68678 -50837 -59887 -24656 -22384 -76449 -43765 -56902 -28525 -44314 -57996 -60167
$$ packed form
8142d5076J8650L1092K0280m9471l0999j4365K366q790J0375O6832k1651m548
8130b5305J9166Q266l3950O671k3898N2857k2151j4123j599o576J1140o2890N9028
8117c3364N5094k1713m4394n005l0843L0016l6097Q079N1756J9693p1779l273
8105h1830p624N180K3280k9543L152L8334l5312M7363K6727k6918J057n8657J9584
8092g5207K5956j0641k0507M425P925M2849M17o9224J8953N7553k4084K0026l342
8079b4901l4161N1080k3387r227O503l1324k47l971J6332l3898j3704K1742J4798
8066f4365L5572J9592N376m2166M858J7583j60K776r66K1568r588M4949r893m7966
8052b2830m5848J7841r050L5231K272n4065L2684j3137K8377j5789j3682k171
$$ plain form
8040 -60167 -91889 -80716 -53442 -48595 -79070 -66130 -37095 -52095 -35869 -49015 -17514 -8057
8028 -8057 -54372 -64004 -83755 -55647 -14255 -24679 6555 -7571 -14499 -4976 7637 38474 16727
8015 16727 23086 5218 -21693 -21733 -14001 -28046 -54934 -58802 -12742 -17588 -33855 3322 14148
8002 14148 -11283 -46574 -40363 -33509 -50059 -65799 -64744 -67542 -83179 -42481 -16828 5136 19053
7989 19053 15602 -69827 -50615 -31086 -58464 -44041 -24965 -21963 -43397 -119598 -124212 -72904
7977 -72904 -67987 -90044 -89721 -76778 -80845 -70686 -75394 -42829 -40672 -42850 -75901 -53919 -10263
7964 -10263 -46545 -25382 -4565 -18171 -61480 -41013 -72109 -92678 -45252 -55809 -51884 -34977
7952 -34977 -16455 -46249 -44009 -69797 -60245 -78869 -29916 14342 24320 20483 -4802 -15778 -11810
$$ packed form
8040f0167l1722J1173K7274M847l0475J2940K9035j5000J6226j3146L1501R457
8028h057m6315r632j9751K8108M1392j0424L1234j4126o928R523J2613L0837k1747
8015A6727O359j7868k6911m0P732j4045k6888l868M6060m846j6267L7177J0826
8002A4148k5431l5291O211O854j6550j5740J055k798j5637M0698K5653K1964J3917
7989A9053l451q5429J9212J9529k7378J4423J9076L002k1434p6201m614N1308
7977g2904M917k2057L23J2943m067J0159m708L2565K157k178l3051K1982M3656
7964a0263l6282K1163K0817j3606m3309K0467l1096k0569M7426j0557L925J6907
7952c4977J8522k9794K240k5788R552j8624M8953M4258R978l837k5285j0976L968
$$ plain form
7939 -11810 -41631 -41517 -14152 -15085 -12432 -178 7982 5029 -4444 -37817 -12495 -28292 -12673
7926 -12673 -61398 -58447 -25050 -34156 -23180 -23118 -21420 -35463 -9878 -1918 -3836 -19698 -8918
7913 -8918 -27555 -27907 -57159 -66376 -39061 -40464 -62313 -44452 -53559 -29604 -12068 -94 -15895
7900 -15895 -29884 -15467 18497 33997 2629 24157 22107 -28874 -57877 -11253 -29905 -41707
7888 -41707 -35149 35331 -3998 -42110 -19480 -13641 18825 14784 -4095 -35032 -26167 -40292 -45380
7875 -45380 -25648 -8670 -30717 -52080 -32117 -4238 32620 3615 -37167 -3788 24799 -18659
7863 -18659 -47082 -11332 16990 5712 43261 42230 33315 6366 44301 22250 -11729 -26155
7851 -26155 -26656 37324 32375 49785 58425 1541 29525 29234 43684 42393 69429 107725 37134
$$ packed form
7939a1810k9821J14K7365r33K653J2254Q160k953r473l3373K5322j5797J5619
7926a2673m8725K951L3397r106J0976O2J698j4043K5585P960j918j5862J0780
7913h918j8637l52k9252r217K7315j403k1849J7861r107K3955J7536J1974j5801
7900a5895j3989J4417L3964J5500l1368K1528k050n0981k9003M6624j8652j1802
7888d1707O558P0480l9329l8112K2630N839L2466m041j8879l0937Q865j4125n088
7875d5380J9732J6978k2047k1363J9963K7879L6858k9005m0782L3379K8587m3458
7863a8659k8423L5750K8322j1278L7549j031q915k6949L7935k2051l3979j4426
7851b6155n01O3980m949J7410Q640n6884K7984k91J4450j291K7036L8296p0591
$$ plain form
7838 37134 12971 -17006 -7975 -29920 -13980 -5893 32550 48654 34474 8858 5657 13292 33207
7825 33207 4039 20506 818 7785 54740 31355 42062 58261 49284 36717 14315 -4900
7813 -4900 35827 39972 15955 15361 47565 98223 2233 -147953 -100820 -60155 -9680 -11530 -60109
7800 -60109 -55100 -10541 -14150 -26727 -65945 -21643 -7577 -28053 -24332 -18095 -6679 12633 37850
7787 37850 21393 5710 -4576 1351 6989 -8918 -35617 -14148 -10031 32833 4013 -6092
7775 -6092 -28702 41901 53325 24102 -4511 -17904 16357 18305 31103 21698 13712 43301 33063
7762 33063 -27324 -39536 -20177 -9731 21203 4691 -20128 -18441 11095 51540 53447 76256
7750 76256 4957 -22428 -58373 -21495 -65140 -78030 -28244 -17181 10722 -10022 -32541 -29808
$$ packed form
7838C7134k4163k9977R031k1945J5940Q087L8443J6104j4180k5616l201P635J9915
7825C3207k9168J6467j9688O967M6955k3385J0707J6199q977j2567k2402j9215
7813d900M0727M145k4017n94L2204N0658r5990j50186M7133M0665N0475j850m8579
7800f0109N009M4559l609j2577l9218M4302J4066k0476L721O237J1416J9312K5217
7787C7850j6457j5683j0286N927N638j5907k6699K1469M117M2864k8820j0105
7775f092k2610P0603J1424k9223k8613j3393L4261J948J2798r405p986K9589j0238
7762C3063o0387j2212J9359J0446L0934j6512k4819J687K9536M0445J907K2809
7750G6256p1299k7385l5945L6878m3645j2890M9786J1063K7903k0744k2519K733
$$ plain form
7738 -29808 -22661 -30053 -4063 10225 -24139 50009 58774 57896 35762 -37473 -57689 -66515 -39638
7725 -39638 -25948 -36972 -40569 19477 -18702 -29523 -10616 -37899 -28127 2439 -44563 -49519
7713 -49519 -1347 -18671 2221 39495 -1877 -20946 -3607 17516 32302 70295 58282 33981
7701 33981 40166 37381 53454 4450 -22160 -19312 -57694 -6141 81276 48600 11131 -12188
7689 -12188 -18375 7503 64913 69012 74600 60643 86669 30357 5368 35311 7338 -28872
7677 -28872 7525 22446 -20270 -32344 -67905 -24506 27614 34351 -501 -14939 -10743 -2088
7665 -2088 -21831 5899 -44599 -7565 -53823 -64599 -46569 -60444 -19201 39028 33874 -18698
7653 -18698 -9722 -19992 19556 -5425 398 29165 5501 -6796 -7238 20187 51321 16959 -43068
$$ packed form
7738b9808P147p392K5990J4288l4364P4148Q765q78k2134p3235k0216q826K6877
7725c9638J3690j1024l597O0046l8179j0821J8907k7283R772L0566m7002m956
7713d9519M8172j7324K0892L7274m1372j9069J7339K1123J4786L7993j2013k4301
7701C3981O185k785J6073m9004k6610K848l8382N1553Q7417l2676l7469k3319
7689a2188o187K5878N7410M099N588j3957K6026n6312k4989K9943k7973l6210
7677b8872L6397J4921m2716j2074l5561M3399N2120O737l4852j4438M196Q655
7665b088j9743K7730n0498L7034m6258j0776J8030j3875M1243N8229n154n2572
7653a8698Q976j0270L9548k4981N823K8767k3664j2297m42K7425L1134l4362o0027
$$ plain form
7640 -43068 -17118 -5269 25672 62972 88725 114176 120386 46206 -3648 9252 42507 48982
7628 48982 36174 -41477 -20904 6667 -35276 -11423 -2585 -11896 -1273 -7735 5213 27405
7616 27405 10676 -4249 -24586 24931 2898 -4461 42957 516 -10285 5391 -32360 6292
7604 6292 16927 68198 87391 49984 7250 46668 93219 96899 66880 13584 13347 12517 -28927
7591 -28927 11186 25203 28993 42283 63176 21637 7391 -467 -9725 46122 52562 67266 57018
7578 57018 431 -13174 14175 39038 61835 53016 80562 89526 63933 80657 82672 134908
7566 134908 135744 79064 58581 38985 56938 52057 84607 96132 118656 116518 80341 116226
7554 116226 103799 103639 101822 101924 106400 126154 150474 104875 94055 82584 58652 114152 114112
$$ packed form
7640d3068K5950J1849L0941L7300K5753K5451O210p4180m9854J2900L3255O475
7628D8982j2808p7651K0573K7571m1943K3853Q838r311J0623o462J2948K2192
7616B7405j6729j4925k0337M9517k2033p359M7418m2441j0801J5676l7751L8652
7604F292J0635N1271J9193l7407m2734L9418M6551L680l0019n3296k37q30m1444
7591b8927M0113J4017L790J3290K0893m1539j4246p858r258N5847O440J4704j0248
7578E7018n6587j3605K7349K4863K2797q819K7546Q964k5593J6724K015N2236
7566A34908Q36n6680k0483j9596J7953m881L2550J1525K2524k138l6177L5885
7554A16226j2427j60j817J02M476J9754K4320m5599j0820j1471k3932N5500m0
$$ plain form
7541 114112 87877 87868 91330 129586 123972 129060 129489 125957 112419 81529 70864 104291 162981 158018
7527 158018 153405 162355 152895 125380 139532 156136 137772 174308 197870 189706 166856 172362 191389
7514 191389 204496 175438 170788 181648 186156 226079 250209 196695 203608 207915 216502 170413 164664
7501 164664 164318 206969 221317 252297 283858 292721 289271 286662 244880 232455 239251 237240 268712
7488 268712 273339 289429 263302 301696 329337 354567 360614 329361 347498 355490 329480 333108
7476 333108 330349 367612 411373 423629 416062 460979 468069 430444 448284 503755 484906 524363
7464 524363 535547 554665 522139 564135 514805 489612 545060 585558 629070 613704 661046 718451
7452 718451 709504 717869 733725 761322 749558 755370 747711 708873 745587 779174 803583 846893
$$ packed form
7541A14112k6235rL462L8256n614N088M29l532j3538l0890j0665L3427N8690m963
7527A58018m613Q950r460k7515J4152J6604j8364L6536K3562q164k2850N506J9027
7514A91389J3107k9058m650J0860M508L9923K4130n3514O913M307Q587m6089n749
7501A64664l46M2651J4348L0980L1561Q863l450k609m1782j2425O796k011L1472
7488B68712M627J6090k6127L8394K7641K5230O047l1253J8137P992k6010L628
7476C33108k759L7263M3761J2256p567M4917P090l7625J7840N5471j8849L9457
7464E24363J1184J9118l2526M1996m9330k5193N5448M0498M3512j5366M7342N7405
7452G18451q947Q365J5856K7597j1764N812p659l8838L6714L3587K4409M3310
$$ plain form
7440 846893 895348 919971 908736 892115 945312 960906 1021789 1023641 1034510 1029013 970790 944942
7428 944942 976567 989751 956530 1004804 1019494 992632 1026946 1023381 1016542 1008808 933967 932103
7416 932103 973959 967071 988561 988386 1013047 991075 1007758 985989 952565 943316 949231 978254 975357
7403 975357 919401 857937 897436 913909 924399 921657 886872 903852 911550 889557 877016 869847
7391 869847 878205 905816 882360 869712 867363 865063 877371 881151 865795 832672 790683 804089
7379 804089 853999 908081 890914 890803 889098 887831 871508 833082 898948 913230 889385 883819 900870
7366 900870 893298 898867 863708 821101 853593 877537 862543 863336 852868 825522 800591 786565
7354 786565 749865 746160 768927 769568 750899 759960 753659 707287 675758 684128 696105 678503 624083
$$ packed form
7440H46893M8455K4623j1235j6621N3197J5594O0883J852J0869n497n8223k5848
7428I44942L1625J3184l3221M8274J4690k6862L4314l565o839p734p4841j864
7416I32103M1856o888K1490j75K4661k1972J6683k1769l3424r249N915K9023k897
7403I75357n5956o1464L9499J6473J0490k742l4785J6980P698k1993j2541p169
7391H69847Q358K7611k3456j2648k349k300J2308L780j5356l3123m1989J3406
7379H04089M9910N4082j7167j11j705j267j6323l8426O5866J4282k3845n566J7051
7366I00870p572N569l5159m2607L2492K3944j4994P93j0468k7346k4931j4026
7354G86565l6700l705K2767O41j8669R061o301m6372l1529Q370J1977j7602n4420
$$ plain form
7341 624083 590852 600144 606374 595793 614773 612381 561126 542143 512986 544817 507083 477599
7329 477599 456441 452637 452629 457979 479627 465565 457030 428524 412436 401962 438616 452250 447109
7316 447109 393905 374294 380364 346320 349957 359362 340183 341868 297529 311068 324922 290056
7304 290056 293513 292270 280471 248098 204429 219736 183257 183678 236045 224576 183985 192012 145711
7291 145711 152812 160330 142990 183434 172511 123656 147057 176454 155665 144137 160138 168245
7279 168245 161512 128724 119567 200415 204465 147313 130791 101449 142228 116680 76782 122476
7267 122476 112571 101894 98057 100753 77495 109683 118603 95622 97579 99130 88314 90481 97299
7254 97299 123529 95453 100112 94383 68159 38501 52971 62823 99409 94405 86739 74627 11136
$$ packed form
7341F24083l3231R292O230j0581J8980k392n1255j8983k9157L1831l7734k9484
7329D77599k1158l804qN350K1648j4062q535k8506j6088j0474L6654J3634n141
7316D47109n3204j9611O070l4044L637R405j9179J685m4339J3539J3854l4866
7304B90056L457j243j1799l2373m3669J5307l6479M21N2367j1469m0591Q027m6301
7291A45711P101P518j7340M0444j0923m8855K3401K9397k0789j1528J6001Q107
7279A68245o733l2788r157Q0848M050n7152j6522k9342M0779k5548l9898M5694
7267A22476r905j0677l837K696k3258L2188Q920k2981J957J551j0816K167O818
7254I7299K6230k8076M659n729k6224k9658J4470R852L6586n004p666j2112o3491
$$ plain form
7241 11136 68626 108332 70031 50561 58620 34685 31096 -387 56411 53362 66446 41939
7229 41939 -21390 50179 37159 41378 52664 28865 95490 82292 61253 65716 38208 51534
7217 51534 -11564 31239 48354 23271 44799 90207 68531 40587 69745 59183 14542 10449
7205 10449 16197 14416 23694 32481 35648 26322 59882 71688 60594 60135 87754 75333 57843
7192 57843 38425 25937 27430 7789 -1005 -9945 30981 47821 86372 40484 25697 16342 65301
7179 65301 66929 7820 28499 37936 1443 -13450 -28132 -14979 -34999 -50988 16583 -19601
7167 -19601 -25290 -8287 -8134 -34215 -5337 39424 13512 -788 -42175 24925 86356 73337
7155 73337 70734 31524 52954 37240 36575 37330 29476 -16792 -6831 72435 -4049 -30870 23948
$$ packed form
7241A1136N7490L9706l8301j9470Q059k3935l589l1483N6798l049J3084k4507
7229D1939o3329P1569j3020M219J1286k3799O6625j3198k1039M463k7508J3326
7217E1534o3098M2803J7115k5083K1528M5408k1676k7944K9158j0562m4641m093
7205A0449N748j781R278Q787L167r326L3560J1806j1094m59K7619j2421j7490
7192E7843j9418j2488J493j9641q794q940M0926J6840L8551m5888j4787r355M8959
7179F5301J628n9109K0679R437l6493j4893j4682J3153k0020j5989O7571l6184
7167a9601n689J7003J53k6081K8878M4761k5912j4300m1387O7100O1431j3019
7155G3337k603l9210K1430j5714o65P55p854m6268R961P9266p6484k6821N4818
$$ plain form
7142 23948 8099 19923 -27315 7659 27193 -32132 -12415 12313 32289 -21671 -8851 49742
7130 49742 57454 74053 23444 8369 11132 -43945 -42421 -640 37441 4931 -9993 20069
7118 20069 14563 18628 -16119 9276 11564 -51207 -49142 37954 77283 66633 -4716 -5099 32027
7105 32027 494 1691 47599 71683 30549 19543 11317 -19370 41015 45094 17232 3987
7093 3987 -674 -4352 -2155 69102 99825 34823 33991 -26094 -49568 10240 25759 3627 5047
7080 5047 22866 55584 45813 10192 -22917 -14362 -22124 -11557 30998 52164 63718 80431 67001
7067 67001 54283 65054 68667 23423 -12956 -25311 18702 23037 36605 23273 -34000 -29076
7055 -29076 -43426 -5034 -7046 23501 -24309 -39402 6596 61645 6598 -30899 -11604 32915
$$ packed form
7142B3948j5849J1824m7238L4974J9534n9325J9717K4728J9976n3960J2820N8593
7130D9742P712J6599n0609j5075K763n5077J524M1781L8081l2510j4924L0062
7118B0069n506M065l4747K5395K288o2771K065Q7096L9329j0650p1349l83L7126
7105C2027l1533J197M5908K4084m1134j1006q226l0687O0385M079k7862j3245
7093C987m661l678K197P1257L0723o5002q32o0085k3474N9808J5519k2132J420
7080E047J7819L2718r771l5621l3109Q555p762J0567M2555K1166J1554J6713j3430
7067F7001j2718J0771L613m5244l6379j2355M4013M335J3568j3332n7273M924
7055b9076j4350L8392k012L0547m7810j5093M5998N5049n5047l7497J9295M4519
$$ plain form
7043 32915 17772 10559 -8833 1285 23171 -21837 -2666 -2900 -30170 -47399 -24279 -18534 -8878
7030 -8878 11148 29687 50012 30590 8473 -19540 -19388 18499 18731 -27431 -48973 -54824 -19962
7017 -19962 -6040 -11506 -54449 19243 3938 -11957 47624 12542 -50174 -58454 -14225 2866
7005 2866 20022 20524 5818 -24682 -46441 -20386 7753 13434 -15919 7069 16665 20696 -5484
6992 -5484 -24795 -20751 7543 13500 -37837 -25676 45615 50819 -1752 -21291 8904 -9733 -14202
6979 -14202 4658 23159 4343 -36702 41260 -3505 -24781 -15116 -32839 12469 -5740 -7844
6967 -7844 3054 19547 69144 83370 48238 62151 50730 25114 51629 15279 20073 14315
6955 14315 15185 59965 57894 4395 -8201 -8493 -14981 24719 52744 31833 57306 43538 39792
$$ packed form
7043C2915j5143p213j9392J0118K1886m5008J9171k34k7270j7229K3120N745R656
7030h878K0026J8539K0325j9422k2117k8013J52L7887K32m6162k1542n851L4862
7017a9962J3922n466m2943P3692j5305j5895N9581l5082o2716q280M4229J7091
7005B866J7156N02j4706l0500k1759K6055K8139N681k9353K2988R596M031k6180
6992e484j9311M044K8294N957n1337J2161P1291N204n2571j9539L0195j8637m469
6979a4202J8860J8501j8816m1045P7962m4765k1276R665j7723M5308j8209k104
6967g844J0898J6493M9597J4226l5132J3913j1421k5616K6515l6350M794n758
6955A4315Q70M4780k071n3499j2596k92o488L9700K8025k0911K5473j3768l746
$$ plain form
6942 39792 -40155 -15707 11554 -8806 17647 20454 185 -25457 -23826 5947 35347 58170
6930 58170 83444 94181 53836 19052 -7152 -28771 26738 31476 55852 52496 11847 -5982
6918 -5982 38136 15954 -10053 -13948 1848 44539 57649 45834 14863 50556 6702 -41130
6906 -41130 -39589 9196 -4144 -20601 4036 55265 29806 -10777 -23071 28406 108333 37243
6894 37243 18060 20745 32951 75414 44619 17431 14618 -21236 -16974 37074 49636 33372
6882 33372 37622 20339 -27473 50426 75724 84772 46646 19408 18938 -15630 -22125 22507 46655
6869 46655 17132 6223 -31757 46423 70884 54640 13760 -17879 13826 49697 47361 112517
6857 112517 81275 50466 74502 22428 8905 23183 91088 34626 -4935 11772 14772 22007
$$ packed form
6942C9792p9947K4448K7261k0360K6453K807k0269k5642J631K9773K9400K2823
6930E8170K5274J0737m0345l4784k6204k1619N5509M738K4376l356m0649j7829
6918e982M4118k2182k6007l895J5796M2691J3110j1815l0971L5693m3854m7832
6906d1130J541M8785j3340j6457K4637N1229k5459m0583j2294N1477P9927p1090
6894C7243j9183K685J2206M2463l0795k7188k813l5854M262N4048J2562j6264
6882C3372M250j7283m7812P7899K5298R048l8126k7238m70l4568o495M4632K4148
6869D6655k9523j0909l7980P8180K4461j6244m0880l1639L1705L5871k336O5156
6857A12517l1242l0809K4036n2074j3523J4278O7905n6462l9561J6707L000P235
$$ plain form
6845 22007 42408 44544 59406 31854 49495 30800 27122 36510 19216 -18835 13078 78795
6833 78795 74202 61565 67416 86267 15274 39908 36520 53385 57008 32073 17584 -23886 -14683
6820 -14683 38826 27678 48808 1726 6401 -35949 -4208 44245 20174 14706 755 14119
6808 14119 -10617 22456 24335 49792 62504 16690 31113 59301 49011 22658 66007 34286
6796 34286 -4430 14447 -7616 12379 -6823 3879 42388 53957 29883 31003 52898 44142
6784 44142 21802 3358 44501 -1979 -46103 -27305 4298 -2296 31730 13906 -8926 15687
6772 15687 53518 -11640 -25324 -23844 21481 28785 29790 54292 5121 9791 23737 4898 -5906
6759 -5906 15337 -5256 2386 4625 35955 15148 58556 73637 24386 28180 61197 31806 -12245
$$ packed form
6845B2007K0401K136J4862k7552J7641j8695l678R388j7294l8051L1913O5717
6833G8795m593j2637N851J8851p0993K4634l388J6865L623k4935j4489m1470R203
6820a4683N3509j1148K1130m7082M675m2350L1741M8453k4071n468j3951J3364
6808A4119k4736L3073J879K5457J2712m5814J4423K8188j0290k6353M3349l1721
6796C4286l8716J8877k2063J9995j9202J0702L8509J1569k4074J120K1895q756
6784D4142k2340j8444M1143m6480m4124J8798L1603o594L4026j7824k2832K4613
6772A5687L7831o5158j3684J480M5325P304J005K4502m9171M670J3946j8839j0804
6759e906K1243k0593P642K239L1330k0807M3408J5081m9251L794L3017k9391m4051
$$ plain form
6746 -12245 -3486 52699 15947 14083 50131 72095 6179 33996 73855 36765 -7623 16652
6734 16652 36069 -12913 23794 53534 66117 4344 -23612 -3643 58012 40035 15389 7888
6722 7888 48591 128231 85545 61461 42460 15128 30619 27473 50494 34276 -11077 -16406
6710 -16406 14648 46564 12934 14316 44073 30921 -9446 31338 787 -1351 32018 41863
6698 41863 44846 31459 81137 52370 21735 50197 75127 61838 73061 133062 91272 40909
6686 40909 39611 50389 6070 40765 68080 29150 32805 49888 58305 73347 36075 -14331
6674 -14331 -113 28412 47299 68601 64874 51625 47634 54298 28209 -4803 3866 29376 69246
6661 69246 51144 76526 85970 47642 27343 12912 43072 16004 28984 63416 55789 27390
$$ packed form
6746a2245Q759N6185l6752j864L6048K1964o5916K7817L9859l7090m4388K4275
6734A6652J9417m8982L6707K9740J2583o1773k7956J9969O1655j7977k4646p501
6722G888M0703P9640m2686k4084j9001k7332J5491l146K3021j6218m5353n329
6710a6406L1054L1916l3630J382K9757j3152m0367M0784l0551k138L3369R845
6698D1863K983j3387M9678k8767l0635K8462K4930j3289J1223O0001m1790n0363
6686D0909j298J0778m4319L4695K7315l8930L655J7083Q417J5042l7272n0406
6674a4331J4218K8525J8887K1302l727j3249l991O664k6089l3012Q669K5510L9870
6661F9246j8102K5382R444l8328k0299j4431L0160k7068J2980L4432p627k8399
$$ plain form
6649 27390 12375 69555 78061 66007 71854 104056 42511 -10096 27677 21556 32238 22250 26497
6636 26497 47171 36395 55486 65236 26457 40138 62521 50327 19184 13629 64739 82695
6624 82695 80440 87327 45706 50973 47437 51202 46747 64850 98138 54649 24799 -40204 71955
6611 71955 65057 81245 114540 118690 111523 119822 112643 122397 69941 53472 41030 26656 96535
6598 96535 24669 34127 26294 -14823 -32885 19332 71490 38417 69687 125893 77401 51139
6586 51139 89111 103549 87507 98867 105128 76530 67337 74892 64763 68771 85869 71904 35776
6573 35776 75019 115882 126845 127596 87936 103478 131470 61499 38749 20947 76033 116924
6561 116924 86218 111603 10903 6538 41422 99817 106373 110423 141976 74620 85878 89328
$$ packed form
6649B7390j5015N7180Q506j2054N847L2202o1545n2607L7773o121J0682r988M247
6636B6497K0674j0776J9091R750l8779J3681K2383j2194l1143n555N1110J7956
6624H2695k255O887m1621N267l536L765m455J8103L3288m3489k9850o5003J12159
6611G1955o898J6188L3295M150p167Q299p179R754n2456j6469j2442j4374O9879
6598I6535p1866R458p833m1117j8062N2217N2158l3073L1270N6206m8492k6262
6586E1139L7972J4438j6042J1360O261k8598r193P555j0129M008J7098j3965l6128
6573C5776L9243M0863J0963P51l9660J5542K7992o9971k2750j7802N5086M0891
6561A16924l0706K5385j00700m365L4884N8395O556M050L1553o7356J1258L450
$$ plain form
6549 89328 114650 108217 94487 70229 71753 48851 52787 49667 9231 87540 96268 71434 67479
6536 67479 67152 55240 23215 67826 81083 45197 73710 75679 43284 33393 91811 95649 45370
6523 45370 76034 58807 96869 114215 83517 65471 76675 84589 55427 69071 65400 108016
6511 108016 58174 32661 86883 147803 125725 69597 8344 58204 120884 109829 100958 66595
6499 66595 49298 24658 14744 16718 89424 118646 78220 111945 109602 88031 94522 108650 53004
6486 53004 51634 98854 82671 109369 56436 86141 74612 35122 77487 111291 82884 108077
6474 108077 122999 90376 108466 101611 75443 46958 43902 76816 61936 102977 121286 75440
6462 75440 105511 127180 167647 133720 109816 161315 131705 141336 150716 179483 148161 138311
$$ packed form
6549H9328K5322o433j3730k4258J524k2902L936l120m0436P8309Q728k4834l955
6536F7479l27j1912l2025M4611J3257l5886K8513J969l2395r891N8418L838n0279
6523D5370L0664j7227L8062J7346l0698j8046J1204P914k9162J3644l671M2616
6511A08016m9842k5513N4222O0920k2078n6128o1253M9860O2680j1055q871l4363
6499F6595j7297k4640r914J974P2706K9222m0426L3725k343k1571O491J4128n5646
6486E3004j370M7220j6183K6698n2933K9705j1529l9490M2365L3804k8407K5193
6474A08077J4922l2623J8090o855k6168k8485l056L2914j4880M1041J8309m5846
6462G5440L0071K1669M0467l3927k3904N1499k9610R631R380K8767l1322r850
$$ plain form
6450 138311 154958 148176 149125 114299 127654 152690 139386 121506 105980 99712 150823 183945
6438 183945 179109 136310 104637 115689 150901 178255 148621 131243 156970 153701 92400 107179
6426 107179 98156 126793 112879 98519 134626 166247 117267 82918 151402 149910 151374 129327
6414 129327 153132 136981 122555 111738 102009 138489 148199 176158 171811 153997 149536 191904
6402 191904 201934 212799 186336 138048 152078 194311 208406 150937 171937 169926 181954 175148
6390 175148 183131 143981 144899 174214 212541 245678 233890 211755 181560 219451 241154 187925
6378 187925 202726 194514 152262 170346 172007 241422 221477 212663 279939 242768 214942 229486
6366 229486 223947 263078 241374 250255 250810 250252 269555 263976 249220 257944 275207 261399 240610
$$ packed form
6450A38311J6647o782R49l4826J3355K5036j3304j7880j5526o268N1111L3122
6438A83945m836m2799l1673J1052L5212K7354k9634j7378K5727l269o1301J4779
6426A07179r023K8637j3914j4360L6107L1621m8980l4349O8484j492J464k2047
6414A29327K3805j6151j4426j0817r729L6480R710K7959m347j7814m461M2368
6402A91904J0030J0865k6463m8288J4030M2233J4095n7469K1000k011J2028o806
6390A75148P983l9150R18K9315L8327L3137j1788k2135l0195L7891K1703n3229
6378A87925J4801q212m2252J8084J661O9415j9945q814O7276l7171k7826J4544
6366B29486n539L9131k1704Q881N55n58J9303n579j4756Q724J7263j3808k0789
$$ plain form
6353 240610 226710 304705 351755 314259 282443 305315 303021 327689 344926 309005 306649 316290
6341 316290 306058 351040 355500 416579 370762 356175 352019 302347 322181 358943 371194 338892
6329 338892 335038 380557 374700 349661 361094 378413 427787 399214 460008 510431 488120 500823
6317 500823 501782 505124 505365 491508 522582 524970 530300 538177 563158 611383 628866 666199 662010
6304 662010 672389 690550 694730 695516 743171 764468 777233 772846 832857 857744 910641 899635
6292 899635 891537 936863 968461 1001333 1025229 1017841 1039048 1063022 1104279 1174412 1144814 1197569
6280 1197569 1232762 1256452 1251451 1243452 1245851 1273230 1301742 1294498 1237229 1262888 1242642 1204953
6268 1204953 1264607 1243438 1201342 1249022 1235031 1216615 1229879 1246402 1189518 1148122 1143511 1172655
$$ packed form
6353B40610j3900P7995M7050l7496l1816K2872k294K4668J7237l5921k356R641
6341C16290j0232M4982M460O1079m5817j4587m156m9672J9834L6762J2251l2302
6329C38892l854M5519n857k5039J1433J7319M9374k8573O0794N0423k2311J2703
6317E00823R59L342K41j3857L1074K388N330P877K4981M8225J7483L7333m189
6304F62010J0379J8161M180P86M7655K1297J2765m387O0011K4887N2897j1006
6292H99635q098M5326L1598L2872K3896p388K1207K3974M1257P0133k9598N2755
6280A197569L5193K3690n001p999K399K7379K8512p244n7269K5659k0246l7689
6268A204953N9654k1169m2096M7680j3991j8416J3264J6523n6884m1396m611K9144
$$ plain form
6256 1172655 1170213 1135683 1109212 1147260 1116477 1077150 1030456 1024897 1052669 1058655 1027344 1017457
6244 1017457 1014178 1014680 987465 1000388 1020227 1037493 1060543 1056364 1106636 1112931 1085026 1094023 1187522
6231 1187522 1244773 1292733 1259620 1268531 1311752 1328831 1344098 1391796 1398382 1405336 1463075 1485765
6219 1485765 1531446 1502259 1513911 1574082 1616606 1603615 1586811 1621858 1665947 1660277 1647724 1632270
6207 1632270 1653952 1657914 1623705 1620572 1620129 1560583 1523985 1496376 1460209 1476248 1484612 1499559
6195 1499559 1451068 1408611 1321707 1293604 1254151 1233633 1184331 1143240 1106078 1059456 1058467 1037809
6183 1037809 989997 965200 949750 937072 917038 892155 841189 858852 831097 771338 762532 808906
6171 808906 772660 735049 740276 687745 675293 657120 660032 643956 621679 636517 625831 650988
$$ packed form
6256A172655k442l4530k6471L8048l0783l9327m6694n559K7772N986l1311r887
6244A017457l279N02k7215J2923J9839J7266K3050m179N0272O295k7905Q997R3499
6231A187522N7251M7960l3113Q911M3221J7079J5267M7698O586O954N7739K2690
6219A485765M5681k9187J1652O0171M2524j2991j6804L5047M4089n670j2553j5454
6207A632270K1682L962l4209l133m43n9546l6598k7609l6167J6039Q364J4947
6195A499559m8491m2457q6904k8103l9453k0518m9302m1091l7162m6622r89k0658
6183A037809m7812k4797j5450j2678k0034k4883n0966J7663k7755n9759q806M6374
6171H08906l6246l7611N227n2531j2452j8173K912j6076k2277J4838j0686K5157
$$ plain form
6159 650988 661357 633374 628718 605365 601339 588984 589321 600617 573212 545860 587772 587343 606510
6146 606510 631634 595969 551112 532387 548389 523178 519237 532536 571328 597432 571927 631829
6134 631829 615019 574547 595230 586986 581161 606624 570090 543113 581397 587963 608025 609764
6122 609764 576741 611116 649928 620051 605163 632623 677615 628250 636258 651551 680942 676675
6110 676675 700244 731846 718855 683824 710900 708100 765353 776393 790065 783171 782600 789368 768029
6097 768029 813296 777060 794517 837868 875992 855379 859472 838913 878093 901375 925878 963870
6085 963870 984635 969730 1017163 1074326 1078053 1069340 1091511 1143363 1186429 1221766 1261646 1261221
6073 1261221 1275458 1285595 1278102 1276099 1361857 1400945 1406005 1356559 1373991 1365569 1365205 1403590 1399342
$$ packed form
6159F50988J0369k7983m656k3353m026j2355L37J1296k7405k7352M1912m29J9167
6146F06510K5124l5665m4857j8725J6002k5211l941J3299L8792K6104k5505N9902
6134F31829j6810m0472K0683q244n825K5463l6534k6977L8284O566K0062J739
6122F09764l3023L4375L8812k9877j4888K7460M4992m9365Q008J5293K9391m267
6110F76675K3569L1602j2991l5031K7076k800N7253J1040J3672o894n71O768k1339
6097G68029M5267l6236J7457M3351L8124k0613M093k0559L9180K3282K4503L7992
6085I63870K0765j4905M7433N7163L727q713K2171N1852M3066L5337L9880m25
6073A261221J4237J0137p493k003Q5758L9088N060m9446J7432q422l64L8385m248
$$ plain form
6060 1399342 1400189 1392321 1404830 1420147 1455392 1453677 1451909 1455151 1509055 1517290 1478305 1489622 1488109
6047 1488109 1512040 1539373 1501892 1513731 1504828 1528795 1533118 1494953 1484701 1464116 1420158 1433764
6035 1433764 1467341 1478361 1502559 1467192 1468110 1543319 1526964 1515072 1553110 1568321 1639155 1657478
6023 1657478 1645598 1690088 1698640 1754578 1823330 1840954 1877558 1954649 1969851 2009678 1979597 1978138
6011 1978138 1992561 2029377 2098097 2127134 2106471 2132312 2158157 2181785 2171420 2156977 2179581
6000 2179581 2224361 2281505 2314379 2335595 2357363 2333231 2361320 2351952 2330810 2374803 2330239 2346338
5988 2346338 2322801 2339044 2342820 2352977 2375351 2347794 2312790 2362775 2317210 2298122 2285341 2224471
5976 2224471 2158156 2205890 2232381 2251850 2220057 2156945 2147659 2187750 2179987 2162309 2167922 2128661
$$ packed form
6060A399342Q47p868J2509J5317L5245j715j768L242N3904Q235l8985J1317j513
6047A488109K3931K7333l7481J1839q903K3967M323l8165j0252k0585m3958J3606
6035A433764L3577J1020K4198l5367R18P5209j6355j1892L8038J5211P0834J8323
6023A657478j1880M4490Q552N5938O8752J7624L6604P7091J5202L9827l0081j459
6011A978138J4423L6816O8720K9037k0663K5841K5845K3628j0365j4443K2604
6000B179581M4780N7144L2874K1216K1768k4132K8089r368k1142M3993m4564J6099
5988B346338k3537J6243L776J0157K2374k7557l5004M9985m5565j9088j2781o0870
5976B224471o6315M7734K6491J9469l1793o3112r286M0091p763j7678N613l9261
$$ plain form
5964 2128661 2121771 2108949 2094420 2099505 2092157 2094857 2099002 2097105 2126283 2142420 2196838 2129241 2102916
5951 2102916 2136976 2170994 2141410 2068391 2088313 2065590 2043599 1997659 1985634 2023094 2004849
5940 2004849 2027235 1978617 1962154 1952086 1943658 1933282 1917715 1859815 1852270 1887824 1886607 1862722
5928 1862722 1898033 1921479 1932296 1969975 1952049 1932071 1946298 1982036 1978978 2006399 1978185 1959205
5916 1959205 2011067 1979876 1988736 2039071 2075838 2049390 2048609 2048931 2060746 2099933 2104034 2080796 2101412
5903 2101412 2139950 2132111 2154519 2159047 2154468 2177560 2202085 2228632 2254238 2248217 2262706 2301482
5891 2301482 2329831 2298959 2279837 2340798 2388144 2410440 2469737 2447700 2420452 2442551 2465667
5880 2465667 2481795 2542620 2561215 2517372 2586126 2667238 2618916 2646309 2632763 2652097 2695362
$$ packed form
5964B128661o890j2822j4529N085p348K700M145j897K9178J6137N4418o7597k6325
5951B102916L4060L4018k9584p3019J9922k2723k1991m5940j2025L7460j8245
5940B004849K2386m8618j6463j0068q428j0376j5567n7900p545L5554j217k3885
5928A862722L5311K3446J0817L7679j7926j9978J4227L5738l058K7421k8214j8980
5916A959205N1862l1191Q860N0335L6767k6448p81L22J1815L9187M101k3238K0616
5903B101412L8538p839K2408M528m579K3092K4525K6547K5606o021J4489L8776
5891B301482K8349l0872j9122O0961M7346K2296N9297k2037k7248K2099K3116
5880B465667J6128O0825J8595m3843O8754Q1112m8322K7393j3546J9334M3265
$$ plain form
5869 2695362 2683716 2646582 2676651 2733066 2766412 2790978 2784441 2770728 2792628 2812469 2798517 2844887
5857 2844887 2878788 2896849 2949380 2980810 2968844 3003666 3046184 3096732 3118052 3206482 3284544
5846 3284544 3305736 3354179 3395796 3404214 3404627 3348691 3392771 3426485 3472753 3447280 3399423 3423523
5834 3423523 3446336 3407058 3328452 3253147 3209689 3138001 3079682 2976338 2874202 2784878 2644944
5823 2644944 2600882 2554997 2466112 2391070 2357650 2303999 2209688 2106957 2077725 2040287 1985039
5812 1985039 1944458 1893259 1842350 1788435 1753644 1709546 1692262 1685736 1687369 1692232 1687578 1698685
5800 1698685 1608370 1597971 1597011 1590951 1569649 1602393 1607404 1562304 1569927 1583880 1637987 1640025 1619015
5787 1619015 1656990 1664358 1640646 1616499 1625186 1597118 1571161 1532352 1544182 1536499 1513219 1454823
$$ packed form
5869B695362j1646l7134L0069N6415L3346K4566o537j3713K1900J9841j3952M6370
5857B844887L3901J8061N2531L1430j1966L4822M2518N0548K1320Q8430P8062
5846C284544K1192M8443M1617Q418M13n5936M4080L3714M6268k5473m7857K4100
5834C423523K2813l9278p8606p5305m3458p1688n8319j03344j02136q9324j39934
5823B644944m4062m5885q8885p5042l3420n3651r4311j02731k9232l7438n5248
5812A985039m0581n1199n0909n3915l4791m4098j7284o526J633M863m654J1107
5800A698685r0315j0399r60o060k1302L2744N011m5100P623J3953N4107K038k1010
5787A619015L7975P368k3712k4147Q687k8068k5957l8809J1830p683k3280n8396
$$ plain form
5775 1454823 1376474 1339749 1322800 1286784 1261568 1197302 1159489 1174627 1155437 1167375 1126881
5764 1126881 1090069 1078383 1051115 1018573 1025291 1030621 994716 951473 966424 988976 971761 980544
5752 980544 1003354 996812 1007514 989478 1011070 986544 1009931 1008334 1011441 982983 925674 917431
5740 917431 870073 895758 836097 851605 880069 838548 797216 806428 741331 724436 743239 737199
5728 737199 716140 714671 738432 668649 702230 658645 649536 659325 598933 612856 645113 606081
5716 606081 614253 595600 636380 624879 642577 650359 648316 630252 613590 651885 653624 650444 612157
5703 612157 650986 590086 588045 603274 583550 593607 599355 631445 585346 578487 580808 566956
5691 566956 603406 552241 545758 559408 567848 578464 563264 556691 538866 539557 574619 555757 570754
$$ packed form
5775A454823p8349l6725j6949l6016k5216o4266l7813J5138j9190J1938m0494
5764A126881l6812j1686k7268l2542O718N330l5905m3243J4951K2552j7215Q783
5752I80544K2810o542J0702j8036K1592k4526K3387j597L107k8458n7309q243
5740I17431m7358K5685n9661J5508K8464m1521m1332R212o5097j6895J8803o040
5728G37199k1059j469K3761o9783L3581m3585r109R789o0392J3923L2257l9032
5716F06081Q172j8653M0780j1501J7698P782k043j8064j6662L8295J739l180l8287
5703F12157L8829o0900k041J5229j9724J0057N748L2090m6099o859K321j3852
5691E66956L6450n1165o483J3650Q440J0616j5200o573j7825O91L5062j8862J4997
$$ plain form
5678 570754 586081 596230 604922 605489 595654 604489 648725 632006 624346 581507 554021 585716 609984
5665 609984 585250 554486 616148 655191 687616 651611 614052 601417 590749 632178 617157 578096
5653 578096 577632 634382 602328 606308 642223 638578 618228 640144 607250 625980 655992 693893
5641 693893 706656 708366 702653 660580 660588 656833 670051 692061 669724 666689 647370 657805 657664 646602
5627 646602 686976 646428 644317 680332 738832 708070 671660 685773 667323 699744 677307 714483
5615 714483 746545 698764 745776 817480 786798 834476 815735 762720 820695 829278 868414 836389
5603 836389 829272 840569 867892 879219 849583 839457 846081 868300 882116 903824 927348 927859
5591 927859 934066 924824 918543 938568 921674 953552 916957 930216 973373 981031 996859 1011288
$$ packed form
5678E70754J5327J0149Q692N67r835Q835M4236j6719p660m2839k7486L1695K4268
5665F09984k4734l0764O1662L9043L2425l6005l7559j2635j0668M1429j5021l9061
5653E78096m64N6750l2054L980L5915l645k0350K1916l2894J8730L0012L7901
5641F93893J2763J710n713m2073Ql755J3218K2010k2337l035j9319J0435j41j1062
5627F46602M0374m0548k111L6015N8500l0762l6410J4113j8450L2421k2437L7176
5615G14483L2062m7781M7012P1704l0682M7678j8741n3015N7975Q583L9136l2025
5603H36389p117J1297K7323J1327k9636j0126O624K2219J3816K1708K3524N11
5591I27859O207r242o281K0025j6894L1878l6595J3259M3157P658J5828J4429
$$ plain form
5579 1011288 1004161 1005119 1037415 1042373 1067152 1092598 1086136 1075063 1112319 1137490 1166023 1181394
5567 1181394 1137815 1142262 1161345 1160693 1188203 1155783 1188772 1195947 1244525 1266477 1295125 1249774
5555 1249774 1279860 1331611 1324376 1336563 1326901 1389733 1442283 1410621 1407731 1415913 1442529 1492865
5543 1492865 1549112 1532211 1582866 1640563 1613354 1598371 1638824 1713895 1735045 1745563 1744592 1757903
5531 1757903 1777126 1795503 1838436 1842319 1865042 1909213 1945039 1991511 2014292 2047746 2076427 2061523
5519 2061523 2077896 2100041 2114257 2148461 2148702 2202586 2256119 2222867 2220578 2242791 2249776 2300221
5507 2300221 2300549 2304862 2292936 2313277 2369924 2373586 2362283 2381872 2343424 2374399 2379919 2467887
5495 2467887 2477002 2435137 2436152 2430411 2457330 2509102 2485225 2485987 2541331 2584748 2619264 2609695 2622480
$$ packed form
5579A011288p127R58L2296M958K4779K5446o462j1073L7256K5171K8533J5371
5567A181394m3579M447J9083o52K7510l2420L2989P175M8578K1952K8648m5351
5555A249774L0086N1751p235J2187r662O2832N2550l1662k890Q182K6616N0336
5543A492865N6247j6901N0655N7697k7209j4983M0453P5071K1150J0518r71J3311
5531A757903J9223J8377M2933L883K2723M4171L5826M6472K2781L3454K8681j4904
5519B061523J6373K2145J4216L4204K41N3884N3533l3252k289K2213O985N0445
5507B300221L28M313j1926K0341N6647L662j1303J9589l8448L0975N520Q7968
5495B467887R115m1865J015n741K6919N1772k3877P62N5344M3417L4516r569J2785
$$ plain form
5482 2622480 2639991 2665172 2723498 2742668 2730932 2692801 2710167 2756071 2761484 2831611 2838797 2865496
5470 2865496 2841156 2859103 2882265 2901464 2921892 2934922 2923763 2926823 2962499 2928196 2969519 2970864
5458 2970864 3002553 2998822 2981313 2951620 2858333 2895869 2921800 2883236 2851463 2887758 2925497 2882772
5446 2882772 2933553 2953885 2911532 2858116 2860211 2853819 2791083 2804783 2799367 2785973 2804959 2835368
5434 2835368 2832756 2801736 2827906 2847337 2886171 2945587 2933389 2883903 2886234 2925805 2932906 2919518
5422 2919518 2942437 2940636 2931602 2952314 2940419 2973692 3045785 3063397 3054984 3091944 3110722 3106137
5410 3106137 3069753 3060823 3067569 3050056 3036187 3055156 3041190 3015053 3001345 2997896 2984193 3003977
5398 3003977 3039138 3058601 3099304 3131318 3191235 3222389 3247273 3317299 3376177 3404192 3459670
$$ packed form
5482B622480J7511K5181N8326J9170j1736l8131J7366M5904N413P0127P186K6699
5470B865496k4340J7947K3162J9199K0428J3030j1159L060L5676l4303M1323J345
5458B970864L1689l731j7509k9693r3287L7536K5931l8564l1773L6295L7739m2725
5446B882772N0781K0332m2353n3416K095o392o2736J3700n416j3394J8986L0409
5434B835368k612l1020K6170J9431L8834N9416j2198m9486K331L9571P101j3388
5422B919518K2919j801r034K0712j1895L3273P2093J7612q413L6960J8778m585
5410C106137l6384q930O746j7513j3869J8969j3966k6137j3708l449j3703J9784
5398C003977L5161J9463M0703L2014N9917L1154K4884P0026N8878K8015N5478
$$ plain form
5387 3459670 3519551 3534919 3561498 3589636 3657921 3712402 3695433 3706464 3728305 3801609 3835840
5376 3835840 3870407 3949347 4006816 4070041 4159682 4258608 4311001 4394056 4454094 4535101 4632995
5365 4632995 4713141 4772990 4820372 4874839 4930214 4968719 5023370 5043904 5054334 5176601 5235188
5354 5235188 5275214 5329019 5392541 5497951 5562797 5624388 5711417 5826556 5906392 5959308 6048344
5343 6048344 6126161 6270106 6338622 6391494 6494694 6631399 6755176 6816637 6899450 6989629 7074370
5332 7074370 7137505 7250306 7289589 7352773 7436521 7538596 7675968 7808972 7896093 7993845 8111650
5321 8111650 8250865 8358731 8454466 8639275 8804009 8903916 9091395 9264256 9424313 9603041
5311 9603041 9820622 10062263 10270130 10489609 10698632 10882484 11102515 11318124 11468698 11660311
$$ packed form
5387C459670N9881J5368K6579K8138O8285N4481j6969J1031K1841P3304L4231
5376C835840L4567P8940N7469O3225Q9641R8926N2393Q3055O0038Q1007R7894
5365D632995Q0146N9849M7382N4467N5375L8505N4651K0534J0430J22267N8587
5354E235188M0026N3805O3522J05410O4846O1591Q7029J15139P9836N2916Q9036
5343F048344P7817J43945O8516N2872J03200J36705J23777O1461Q2813R0179Q4741
5332G074370O3135J12801L9283O3184Q3748J02075J37372J33004Q7121R7752J17805
5321H111650J39215J07866R5735J84809J64734R9907J87479J72861J60057J78728
5311I603041K17581K41641K07867K19479K09023J83852K20031K15609J50574J91613
$$ plain form
5301 11660311 11875911 12073274 12262306 12466055 12660647 12908693 13195570 13524193 13911309
5292 13911309 14283301 14645827 15034050 15475471 15945893 16438621 16970130 17509589 18006664
5283 18006664 18483427 18958033 19463619 20000851 20530400 21078929 21649739 22224170 22853220
5274 22853220 23345060 23888494 24519093 25121444 25785952 26425526 27106857 27792770 28507669
5265 28507669 29196180 29921464 30703996 31495443 32230021 33048248 33930173 34802185 35744660
5256 35744660 36810621 37934119 39069443 40279880 41585090 43007193 44514150 46125571
5248 46125571 47893539 49771667 51790081 53937866 56197258 58560856 61005712 63498880
5240 63498880 66123376 68875257 71868919 75132786 78670961 82545725 86784879 91389876
$$ packed form
5301A1660311K15600J97363J89032K03749J94592K48046K86877L28623L87116
5292A3911309L71992L62526L88223M41421M70422M92728N31509N39459M97075
5283A8006664M76763M74606N05586N37232N29549N48529N70810N74431O29050
5274B2853220M91840N43434O30599O02351O64508O39574O81331O85913P14899
5265B8507669O88511P25284P82532P91447P34578Q18227Q81925Q72012R42475
5256C5744660J065961J123498J135324J210437J305210J422103J506957J611421
5248D6125571J767968J878128K018414K147785K259392K363598K444856K493168
5240F3498880K624496K751881K993662L263867L538175L874764M239154M604997
$$ plain form
5232 91389876 96574121 102433970 108997169 116517785 125131400 135010529 146437477 159882236
5224 159882236 175885413 195188844 218500420 245980113 277200736 311004453 345347950
5217 345347950 375270131 392066852 388587846 366682207 334810420 300283452 266914665
5210 266914665 236598372 209996775 186975519 167106633 149897836 134968628 121968636
5203 121968636 110825231 101258013 93024029 85890186 79700990 74290303 69542607 65301715
5195 65301715 61462685 57969550 54770710 51925644 49323026 46903987 44694009 42640777
5187 42640777 40733215 38976369 37315398 35771683 34300314 32909146 31620457 30352705
5179 30352705 29168003 28072642 27082475 26077084 25106133 24279127 23514758 22761331 22045756
$$ packed form
5232I1389876N184245N859849O563199P520616Q613615R879129J1426948J3444759
5224A59882236J6003177J9303431K3311576K7479693L1220623L3803717L4343497
5217C45347950K9922181J6796721l479006k1905639l1871787l4526968l3368787
5210B66914665l0316293k6601597k3021256j9868886j7208797j4929208j2999992
5203A21968636j1143405r567218q233984p133843o189196n410687m747696m240892
5195F5301715l839030l493135l198840k845066k602618k419039k209978k053232
5187D2640777j907562j756846j660971j543715j471369j391168j288689j267752
5179C0352705j184702j095361r90167j005391r70951q27006p64369p53427p15575
$$ plain form
5170 22045756 21328416 20778677 20238461 19707755 19210439 18661667 18175387 17684358 17213042
5161 17213042 16781915 16354131 15911098 15486752 15035268 14585675 14144849 13711591 13390699
5152 13390699 13027031 12698004 12333276 12008651 11726042 11455633 11189904 10961752 10677668
5143 10677668 10477549 10236280 10005179 9901809 9615525 9389616 9183374 8962339 8708848
5134 8708848 8541031 8330540 8101976 7958283 7747884 7520774 7369938 7168738 7067667 6939875
5124 6939875 6782036 6660327 6548492 6500679 6464981 6350080 6251736 6201701 6119650 6022892 5990253
5113 5990253 5895018 5799086 5737797 5631997 5549224 5447047 5341644 5235647 5227685 5228499 5132990
5102 5132990 4997493 4912403 4870498 4848794 4759449 4739448 4711167 4692733 4650956 4571688 4571901 4580245
$$ packed form
5170B2045756p17340n49739n40216n30706m97316n48772m86280m91029m71316
5161A7213042m31127m27784m43033m24346m51484m49593m40826m33258l20892
5152A3390699l63668l29027l64728l24625k82609k70409k65729k28152k84084
5143A0677668k00119k41269k31101j03370k86284k25909k06242k21035k53491
5134H708848j67817k10491k28564j43693k10399k27110j50836k01200j01071j27792
5124F939875j57839j21709j11835m7813l5698j14901r8344n0035q2051r6758l2639
5113E990253r5235r5932o1289j05800q2773j02177j05403j05997p962Q14r5509
5102E132990j35497q5090m1905k1704q9345k0001k8281j8434m1777p9268K13Q344
$$ plain form
5090 4580245 4545425 4580587 4555752 4533992 4540858 4518528 4478853 4486113 4493098 4498978 4481485 4477665
5078 4477665 4427718 4366342 4336588 4290152 4287051 4206702 4176475 4153225 4118787 4082918 4020514 4083511
5066 4083511 4084189 4051562 4052652 4054832 4115089 4130863 4168252 4195715 4200042 4221130 4238568 4230004 4315015
5053 4315015 4329067 4324646 4299510 4324136 4288496 4272123 4316493 4324952 4317559 4333272 4344752 4398969
5041 4398969 4426165 4468912 4490729 4504788 4495947 4567320 4619609 4576335 4600749 4591386 4577370 4596207
5029 4596207 4648887 4632381 4613521 4591804 4587756 4574110 4493297 4509646 4521125 4451013 4436711 4376732
5017 4376732 4445156 4487017 4515928 4533471 4492329 4441493 4488280 4528888 4494130 4495233 4527538 4491561
5005 4491561 4442658 4426746 4382732 4373986 4400008 4386086 4342741 4330791 4300208 4279214 4263007 4242955
$$ packed form
5090D580245l4820L5162k4835k1760O866k2330l9675P260O985N880j7493l820
5078D477665m9947o1376k9754m6436l101q0349l0227k3250l4438l5869o2404O2997
5066D083511O78l2627J090K180O0257J5774L7389K7463M327K1088J7438q564Q5011
5053D315015J4052m421k5136K4626l5640j6373M4370Q459p393J5713J1480N4217
5041D398969K7196M2747K1817J4059q841P1373N2289m3274K4414r363j4016J8837
5029D596207N2680j6506j8860k1717m048j3646q0813J6349J1479p0112j4302n9979
5017D376732O8424M1861K8911J7543m1142n0836M6787M0608l4758J103L2305l5977
5005D491561m8903j5912m4014q746K6022j3922m3345j1950l0583k0994j6207k0052
$$ plain form
4993 4242955 4194463 4144665 4077101 4068297 4092574 4077707 4039387 4013300 3943616 3924433 3910319 3859012
4981 3859012 3863263 3822474 3798791 3808599 3783765 3729963 3667481 3626694 3542006 3517048 3531820 3460622
4969 3460622 3408535 3397684 3327992 3254337 3247905 3233371 3185138 3144511 3126319 3099521 3039138 2992605
4957 2992605 2917643 2861246 2854562 2812112 2775820 2741973 2688432 2677983 2617392 2578446 2578453 2525824
4945 2525824 2467156 2453191 2439931 2376958 2337237 2302340 2252750 2237619 2182318 2107122 2129549
4934 2129549 2113483 2101807 2083672 2075691 2040014 2092155 2061252 2009421 2038272 1975076 1960040 1954382
4922 1954382 1904003 1908636 1883945 1830507 1815877 1810490 1817341 1817867 1809982 1752940 1738787 1734146 1712946
4909 1712946 1700326 1694141 1725663 1708846 1703837 1651778 1616414 1604471 1572416 1571402 1547560 1528237
$$ packed form
4993D242955m8492m9798o7564q804K4277j4867l8320k6087o9684j9183j4114n1307
4981C859012M251m0789k3683R808k4834n3802o2482m0787q4688k4958J4772p1198
4969C460622n2087j0851o9692p3655o432j4534m8233m0627j8192k6798o0383m6533
4957B992605p4962n6397o684m2450l6292l3847n3541j0449o0591l8946Pn2629
4945B525824n8668j3965j3260o2973l9721l4897m9590j5131n5301p5196K2427
4934B129549j6066j1676j8135p981l5677N2141l0903n1831K8851o3196j5036n658
4922A954382n0379M633k4691n3438j4630n387O851N26p885n7042j4153m641k1200
4909A712946j2620o185L1522j6817n009n2059l5364j1943l2055j014k3842j9323
$$ plain form
4897 1528237 1559004 1539267 1528799 1553159 1493212 1471666 1481903 1472678 1455862 1460933 1461151 1411141
4885 1411141 1329537 1361215 1355892 1322645 1278451 1278040 1314963 1312023 1283145 1300483 1285127 1266410
4873 1266410 1309404 1227231 1190429 1244663 1233560 1252254 1256796 1244347 1242424 1174742 1211161 1218527
4861 1218527 1244053 1225938 1197244 1241248 1231909 1199439 1214430 1259994 1241672 1226992 1295150 1274709
4849 1274709 1252736 1255577 1275594 1326133 1356475 1323227 1327949 1298230 1286234 1288275 1318726 1359243
4837 1359243 1404562 1460426 1504860 1526186 1502137 1515259 1561701 1596173 1584287 1588987 1581183 1657743
4825 1657743 1655760 1719183 1787997 1830043 1840412 1845984 1920886 1961724 1977263 2033984 2047154 2090182
4813 2090182 2135048 2181601 2231263 2278928 2275357 2368336 2422573 2481655 2546047 2587691 2642069 2705390
$$ packed form
4897A528237L0767j9737j0468K4360n9947k1546J0237r225j6816N071K18n0010
4885A411141q1604L1678n323l3247m4194m11L6923k940k8878J7338j5356j8717
4873A266410M2994q2173l6802N4234j1103J8694M542j2449j923o7682L6419P366
4861A218527K5526j8115k8694M4004r339l2470J4991M5564j8322j4680O8158k0441
4849A274709k1973K841K0017N0539L0342l3248M722k9719j1996K041L0451M0517
4837A359243M5319N5864M4434K1326k4049J3122M6442L4472j1886M700p804P6560
4825A657743j983O3423O8814M2046J0369N572P4902M0838J5539N6721J3170M3028
4813B090182M4866M6553M9662M7665l571R2979N4237N9082O4392M1644N4378O3321
$$ plain form
4801 2705390 2770923 2863808 2924058 2974102 3047170 3126144 3226410 3347186 3495173 3603616 3701727
4790 3701727 3776592 3876895 4074883 4179395 4308430 4491090 4670895 4892219 5065724 5296001
4780 5296001 5470165 5717382 5944050 6173876 6382937 6600294 6835224 7079754 7275685 7437533
4770 7437533 7596548 7853766 8003955 8086168 8229628 8314100 8362381 8391363 8399339 8412909 8431653
4759 8431653 8387150 8354980 8312556 8228243 8145815 8018076 7970670 7847030 7707440 7600184 7448717
4748 7448717 7182590 6972942 6749908 6568941 6354311 6127901 5911747 5635241 5424538 5180875
4738 5180875 4967144 4748848 4594083 4390450 4219320 4120123 3950535 3741021 3625757 3520314
4728 3520314 3445375 3334013 3228670 3106145 3025622 2952162 2855136 2781335 2742845 2744238 2640415
$$ packed form
4801B705390O5533R2885O0250N0044P3068P8974J00266J20776J47987J08443R8111
4790C701727P4865J00303J97988J04512J29035J82660J79805K21324J73505K30277
4780E296001J74164K47217K26668K29826K09061K17357K34930K44530J95931J61848
4770G437533J59015K57218J50189Q2213J43460Q4472M8281K8982P976J3570J8744
4759H431653m4503l2170m2424q4313q2428j27739m7406j23640j39590j07256j51467
4748G448717k66127k09648k23034j80967k14630k26410k16154k76506k10703k43663
4738E180875k13731k18296j54765k03633j71130r9197j69588k09514j15264j05443
4728C520314p4939j11362j05343j22525q0523p3460r7026p3801l8490J393j03823
$$ plain form
4717 2640415 2613274 2529155 2489293 2433627 2358850 2304691 2264215 2281027 2215781 2135631 2078558
4706 2078558 2070198 2061023 2036728 1965109 1930184 1942955 1923662 1845284 1804354 1781778 1699193 1678608
4694 1678608 1673995 1678364 1663856 1598888 1625576 1589703 1586919 1546694 1518110 1526136 1498026 1471782
4682 1471782 1426751 1380879 1403003 1385774 1371508 1314282 1322374 1297391 1267798 1261362 1309256 1276533
4670 1276533 1179104 1119612 1123586 1114393 1127241 1119027 1115113 1119815 1061596 1084274 1004394 990116
4658 990116 1008818 1002197 945001 902234 917729 915651 943439 934591 877832 881493 832879 813044
4646 813044 833691 842519 823388 853576 808122 761672 747452 705370 719617 764097 753767 751118
4634 751118 705935 685830 645442 623090 623213 614317 654334 671621 606605 602196 592444 576491 597261
$$ packed form
4717B640415k7141q4119l9862n5666p4777n4159m0476J6812o5246q0150n7073
4706B078558q360r175k4295p1619l4925J2771j9293p8378m0930k2576q2585k0585
4694A678608m613M369j4508o4968K6688l5873k784m0225k8584Q026k8110k6244
4682A471782m5031m5872K2124j7229j4266n7226Q092k4983k9593o436M7894l2723
4670A276533r7429n9492L974r193J2848q214l914M702n8219K2678p9880j4278
4658I90116J8702o621n7196m2767J5495k078K7788q848n6759L661m8614j9835
4646H13044K0647Q828j9131L0188m5454m6450j4220m2082J4247M4480j0330k649
4634G51118m5183k0105m0388k2352J23q896M0017J7287o5016m409r752j5953K0770
$$ plain form
4621 597261 612286 619464 613691 588260 608473 653046 620701 575360 564978 571381 565065 545710
4609 545710 557668 534899 538464 526507 515743 554395 534797 532045 558289 539194 501793 506398
4597 506398 497852 496684 516387 507077 528370 557326 528075 497277 441507 434979 460874 518272
4585 518272 506346 472280 441581 427739 411905 433656 418701 402160 385234 391776 450870 426167
4573 426167 436176 426036 412373 476008 484358 455232 465222 484040 456745 408064 418296 392163
4561 392163 421626 411364 386377 363362 319077 320338 360440 355526 343785 359908 386286 385404
4549 385404 370718 355402 353012 367158 324205 321783 316215 296969 311619 321236 301957 318540
4537 318540 363983 388855 322807 331253 306862 282798 271860 294613 287945 361299 377425 347166
$$ packed form
4621E97261J5025P178n773k5431K0213M4573l2345m5341j0382O403o316j9355
4609E45710J1958k2769L565j1957j0764L8652j9598k752K6244j9095l7401M605
4597E06398q546j168J9703r310K1293K8956k9251l0798n5770o528K5895N7398
4585E18272j1926l4066l0699j3842j5834K1751j4955j6541j6926O542N9094k4703
4573D26167J0009j0140j3663O3635Q350k9126R990J8818k7295m8681J0232k6133
4561C92163K9463j0262k4987k3015m4285J261M0102m914j1741J6123K6378q82
4549C85404j4686j5316k390J4146m2953k422n568j9246J4650R617j9279J6583
4537C18540M5443K4872o6048Q446k4391k4064j0938K2753o668P3354J6126l0259
$$ plain form
4525 347166 320165 332963 341395 327707 312330 277986 267629 279285 333355 354476 309341 303038
4513 303038 335159 377097 403785 356172 311810 340121 348955 283295 318402 351877 335553 366164
4501 366164 348180 308860 347895 346723 371222 379712 343389 397351 426847 388285 403917 386683
4489 386683 367364 329907 349699 357515 352945 345654 366834 409402 427534 413740 418154 371508
4477 371508 391917 420368 482086 449698 454372 488071 424786 399755 371520 451674 498101 490387
4465 490387 482981 476936 553481 537200 540301 554348 542269 577684 569191 598655 614887 576590
4453 576590 523695 593584 655159 607174 567444 622208 652483 696733 725134 733262 780234 802694
4441 802694 814051 797617 778516 835331 825844 786527 851194 905620 902431 926205 944821 946080
$$ packed form
4525C47166k7001J2798Q432j3688j5377l4344j0357J1656N4070K1121m5135o303
4513C03038L2121M1938K6688m7613m4362K8311Q834o5660L5107L3475j6324L0611
4501C66164j7984l9320L9035j172K4499Q490l6323N3962K9496l8562J5632j7234
4489C86683j9319l7457J9792P816m570p291K1180M2568J8132j3794M414m6646
4477C71508K0409K8451O1718l2388M674L3699o3285k5031k8235Q0154M6427p714
4465D90387p406o045P6545j6281L101J4047j2079L5415q493K9464J6232l8297
4453E76590n2895O9889O1575m7985l9730N4764L0275M4250K8401Q128M6972K2460
4441H02694J1357j6434j9101N6815r487l9317O4667N4426l189K3774J8616J259
$$ plain form
4429 946080 971267 1007814 1029202 1039580 1095250 1126003 1169013 1225168 1187108 1157380 1212316 1273210
4417 1273210 1300413 1339243 1363791 1382770 1411739 1473567 1488195 1501013 1586746 1637989 1728177
4406 1728177 1785617 1805102 1861048 1930874 2008011 2085661 2159059 2196090 2264352 2349418 2445707
4395 2445707 2534450 2712041 2823023 2942195 3148112 3276722 3513964 3752599 3985508 4298937
4385 4298937 4620410 4949092 5408485 5864980 6202962 6571652 6874751 7180306 7551375 7977632
4375 7977632 8499280 9087272 9619389 10016786 10277788 10414189 10551131 10722137 10965991 11268347
4365 11268347 11638392 11894324 11824413 11546611 11189030 10849406 10548119 10317657 10142118 9963402
4355 9963402 9695073 9226138 8681673 8180575 7655984 7229877 6798788 6440519 6092404 5649405
$$ packed form
4429I46080K5187L6547K1388J0378N5670L0753M3010N6155l8060k9728N4936O0894
4417A273210K7203L8830K4548J8979K8969O1828J4628J2818Q5733N1243R0188
4406A728177N7440J9485N5946O9826P7137P7650P3398L7031O8262Q5066R6289
4395B445707Q8743J77591J10982J19172K05917J28610K37242K38635K32909L13429
4385D298937L21473L28682M59393M56495L37982L68690L03099L05555L71069M26257
4375G977632N21648N87992N32117L97397K61002J36401J36942J71006K43854L02356
4365A1268347L70045K55932o9911k77802l57581l39624l01287k30462j75539j78716
4355I963402k68329m68935n44465n01098n24591m26107m31089l58269l48115m42999
$$ plain form
4345 5649405 5225108 4782270 4427570 4008265 3640423 3343592 3096458 2931497 2703299 2507888
4335 2507888 2369459 2230696 2108953 1973120 1881035 1792460 1713668 1633364 1571392 1502641 1408744
4324 1408744 1368565 1299970 1258895 1229931 1181923 1175562 1084490 1047321 1029323 997831 978062 941656
4312 941656 890472 899343 893227 859273 791046 719148 734654 754774 727543 695656 644523 635113
4300 635113 647613 654673 625147 648772 643699 654915 610202 579780 629833 576545 551175 521252
4288 521252 523340 546584 524375 494692 514148 453942 482868 483578 465698 446732 417721 425598
4276 425598 442347 400163 386673 355028 275239 332097 421524 402112 387637 411482 368982 381527
4264 381527 418009 374364 367040 338514 335779 332878 323529 320279 386661 348690 299406 275857 324273
$$ packed form
4345E649405m24297m42838l54700m19305l67842k96831k47134j64961k28198j95411
4335B507888j38429j38763j21743j35833r2085q8575p8792q0304o1972o8751r3897
4324A408744m0179o8595m1075k8964m8008o361r1072l7169j7998l1492j9769l6406
4312I41656n1184Q871o116l3954o8227p1898J5506K0120k7231l1887n1133r410
4300F35113J2500P060k9526K3625n073J1216m4713l0422N0053n3288k5370k9923
4288E21252K088K3244k2209k9683J9456o0206K8926P10j7880j8966k9011P877
4276D25598J6749m2184j3490l1645p9789N6858Q9427j9412j4475K3845m2500J2545
4264C81527L6482m3645p324k8526k735k901r349l250O6382l7971m9284k3549M8416
$$ plain form
4251 324273 346251 323139 291474 307040 304656 267882 263253 265566 289635 312146 286146 258415
4239 258415 262421 294367 282421 205983 241329 292613 271150 276879 266001 251951 278195 279295
4227 279295 271311 232793 219349 221477 258283 230814 240220 268581 278301 285975 273914 223165 241014
4214 241014 231448 250790 260430 314045 256183 196429 215012 189145 215258 253302 300530 271757
4202 271757 245718 248785 304276 328057 308152 292248 250275 298496 311304 281524 285429 276443
4190 276443 297685 342404 288347 247408 259553 270427 257221 266806 312118 300588 269216 277433
4178 277433 277591 252962 294262 311221 323821 270968 293319 312548 285666 303371 316445 291150
4166 291150 292389 306313 263206 268129 328230 352357 312429 353063 326874 313705 328606 356360
$$ packed form
4251C24273K1978k3112l1665J5566k384l6774m629K313K4069K2511k6000k7731
4239B58415M006L1946j1946p6438L5346N1284k1463N729j0878j4050K6244J100
4227B79295p984l8518j3444K128L6806k7469R406K8361R720P674j2061n0749J7849
4214B41014r566J9342R640N3615n7862n9754J8583k5867K6113L8044M7228k8773
4202B71757k6039L067N5491K3781j9905j5904m1973M8221J2808k9780L905q986
4190B76443K1242M4719n4057m0939J2145J0874j3206R585M5312j1530l1372Q217
4178B77433J58k4629M1300J6959J2600n2853K2351J9229k6882J7705J3074k5295
4166B91150J239J3924m3107M923O0101K4127l9928M0634k6189j3169J4901K7754
$$ plain form
4154 356360 366549 403942 403980 401623 348527 358847 389212 427323 459585 474039 417518 408354 472491
4141 472491 483477 459531 458831 468816 490477 553548 508323 502016 554016 581378 629962 607459
4129 607459 572022 560146 555386 594247 669735 672612 627718 636721 709434 784533 782551 748513
4117 748513 812100 881668 897071 941356 907325 952319 1020639 1071642 1120827 1167202 1167963 1193714
4105 1193714 1258598 1347914 1390725 1412078 1450492 1507757 1526614 1577447 1660751 1701642 1740385
4094 1740385 1817115 1820190 1878854 1990642 2029599 2081359 2148214 2181239 2236232 2242605 2307259 2325420
4082 2325420 2302642 2307040 2382729 2435852 2481409 2499112 2514717 2508501 2503398 2476288 2519454 2504417
4070 2504417 2502139 2502538 2464191 2491166 2530643 2462689 2394745 2387788 2355448 2341801 2305483 2253823
$$ packed form
4154C56360J0189L7393L8k357n3096J0320L0365L8111L2262J4454n6521r164O4137
4141D72491J0986k3946p00R985K1661O3071m5225o307N2000K7362M8584k2503
4129F07459l5437j1876m760L8861P5488K877m4894R003P2713P5099j982l4038
4117G48513O3587O9568J5403M4285l4031M4994O8320N1003M9185M6375P61K5751
4105A193714O4884Q9316M2811K1353L8414N7265J8857N0833Q3304M0891L8743
4094A740385P6730L075N8664J11788L8957N1760O6855L3025N4993O373O4654J8161
4082B325420k2778M398P5689N3123M5557J7703J5605o216n103k7110M3166j5037
4070B504417k278L99l8347K6975L9477o7954o7944o957l2340j3647l6318n1660
$$ plain form
4058 2253823 2234443 2188454 2087332 2021614 1977448 1964494 1978092 1942581 1842705 1795933 1767608
4047 1767608 1726968 1687007 1667348 1635821 1609677 1551300 1508363 1463962 1439017 1388295 1376211
4036 1376211 1370320 1309999 1297364 1270363 1256393 1222100 1214194 1199488 1186888 1219703 1148064 1182372
4024 1182372 1175341 1206565 1187828 1161865 1117059 1158404 1189892 1213353 1227116 1248230 1311749 1324876
4012 1324876 1394917 1420782 1421430 1462437 1510035 1515035 1502153 1566228 1601781 1667433 1753206 1763970
4000 1763970 1849126 1910592 1982822 2074516 2232840 2393733 2535140 2710985 2906183 3139999
3990 3139999 3399547 3808134 4379126 5096031 5867400 6787684 8027582 9423050 10325541
3981 10325541 9922054 8646637 7446095 6351960 5467910 4747085 4205018 3661120 3276992
$$ packed form
4058B253823j9380m5989j01122o5718m4166j2954J3598l5511r9876m6772k8325
4047A767608m0640l9961j9659l1527k6144n8377m2937m4401k4945n0722j2084
4036A376211n891o0321j2635k7001j3970l4293p906j4706j2600L2815p1639L4308
4024A182372p031L1224j8737k5963m4806M1345L1488K3461J3763K1114O3519J3127
4012A324876P0041K5865O48M1007M7598N000j2882O4075L5553O5652Q5773J0764
4000A763970Q5156O1466P2230R1694J58324J60893J41407J75845J95198K33816
3990C139999K59548M08587N70992P16905P71369R20284J239898J395468R02491
3981A0325541m03487j275417j200542j094135q84050p20825n42067n43898l84128
$$ plain form
3972 3276992 2920754 2592265 2340158 2128657 1999374 1916926 1785942 1614865 1504237 1396087
3962 1396087 1317203 1228025 1218269 1166396 1106999 1046822 1025299 1018089 968339 926369 910142 872378
3950 872378 830809 756390 742588 715705 695093 641290 641547 652595 649972 594705 615977 621899
3938 621899 563804 550228 574982 561462 528565 517190 503754 490486 459419 393037 445418 495668
3926 495668 481096 464306 409196 421187 424549 379191 384475 373048 397870 414391 381183 424313
3914 424313 418699 382752 354876 381045 354512 338766 326635 334417 316739 276933 311599 281267
3902 281267 287766 318821 304402 286932 308530 361829 335971 260245 249018 236311 298795 298361
3890 298361 289897 296478 323158 333749 289383 281621 237744 282861 312460 346702 302814 262074
$$ packed form
3972C276992l56238l28489k52107k11501j29283q2448j30984j71077j10628j08150
3962A396087p8884q9178r756n1873n9397o0177k1523p210m9750m1970j6227l7764
3950H72378m1569p4419j3802k6883k0612n3803K57J1048k623n5267K1272N922
3938F21899n8095j3576K4754j3520l2897j1375j3436j3268l1067o6382N2381N0250
3926D95668j4572j6790n5110J1991L362m5358N284j1427K4822J6521l3208M3130
3914D24313n614l5947k7876K6169k6533j5746j2131P782j7678l9806L4666l0332
3902B81267O499L1055j4419j7470K1598N3299k5858p5726j1227j2707O2484m34
3890B98361q464O581K6680J0591m4366p762m3877M5117K9599L4242m3888m0740
$$ plain form
3878 262074 250093 280748 282903 290186 277460 284651 259759 273517 320567 291169 284488 326931
3866 326931 344163 331672 309732 279083 279145 266798 271765 244685 264619 240246 269932 311537
3854 311537 296161 282305 268300 311670 331593 291382 314356 287737 301846 311355 373156 351754
3842 351754 322230 312282 334910 304514 297015 320348 286869 285267 260128 281680 325094 324112 307727
3829 307727 307085 312025 331029 334770 357334 340140 380772 417796 426825 357948 339321 391266 349193
3816 349193 348328 395062 388325 355563 358758 371879 402151 410062 378137 368581 345565 420382 446139
3803 446139 433042 458998 489287 517453 510277 502488 486176 472219 500304 522568 535314 502163
3791 502163 468742 471257 517588 566168 493499 579445 583367 545815 561171 550418 556340 488158
$$ packed form
3878B62074j1981L0655K155P283j2726P191k4892J3758M7050k9398o681M2443
3866C26931J7232j2491k1940l0649O2j2347M967k7080J9934k4373K9686M1605
3854C11537j5376j3856j4005M3370J9923m0211K2974k6619J4109R509O1801k1402
3842C51754k9524r948K2628l0396p499K3333l3479j602k5139K1552M3414r82j6385
3829C07727o42M940J9004L741K2564j7194M0632L7024R029o8877j8627N1945m2073
3816C49193q65M6734o737l2762L195J3121L0272P911l1925r556k3016P4817K5757
3803D46139j3097K5956L0289K8166p176p789j6312j3957K8085K2264J2746l3151
3791E02163l3421K515M6331M8580p2669Q5946L922l7552J5356j0753N922o8182
$$ plain form
3779 488158 511819 512702 590982 619880 664816 647722 618905 639924 683180 661578 672698 678176
3767 678176 663932 722154 737115 769492 794748 796530 844304 881815 862120 855028 839202 875367
3755 875367 958027 973013 978242 1001468 1034827 1012479 1020703 1101669 1152484 1128505 1120991 1161123
3743 1161123 1197781 1184755 1174391 1205754 1255062 1307972 1275675 1289829 1258385 1326615 1351492
3732 1351492 1364006 1372318 1380016 1427913 1399495 1380361 1442158 1477372 1481666 1517313 1547806 1569251
3720 1569251 1600153 1607428 1655524 1724272 1757976 1811154 1799114 1835954 1896773 1973565 2055056 2129150
3708 2129150 2218307 2255426 2283531 2321609 2426207 2567877 2659850 2714771 2777302 2902736 3002007
3697 3002007 3060173 3149550 3241972 3290121 3320737 3439911 3484081 3514772 3574136 3669361 3720626
$$ packed form
3779D88158K3661Q83P8280K8898M4936j7094k8817K1019M3256k1602J1120N478
3767F78176j4244N8222J4961L2377K5256J782M7774L7511j9695p092j5826L6165
3755H75367Q2660J4986N229K3226L3359k2348Q224Q0966N0815k3979p514M0132
3743A161123L6658j3026j0364L1363M9308N2910l2297J4154l1444O8230K4877
3732A351492J2514Q312P698M7897k8418j9134O1797L5214M294L5647L0493K1445
3720A569251L0902P275M8096O8748L3704N3178j2040L6840O0819P6792Q1491P4094
3708B129150Q9157L7119K8105L8078J04598J41670R1973N4921O2531J25434R9271
3697C002007N8166Q9377R2422M8149L0616J19174M4170L0691N9364R5225N1265
$$ plain form
3686 3720626 3767982 3846673 3901236 3916125 3915462 3974111 4012535 4022199 4021279 4028834 4036342 4064516 3998891
3673 3998891 3953466 3922438 3875548 3804819 3775935 3761947 3713757 3674994 3635124 3557066 3412344
3662 3412344 3403288 3393476 3318413 3217273 3149780 3063146 2979868 2896937 2823657 2774145 2659917
3651 2659917 2579373 2493218 2445238 2347717 2314349 2180925 2170544 2112336 2051787 2032417 1953904
3640 1953904 1882004 1854349 1818064 1807843 1830904 1722727 1748799 1720876 1686838 1662362 1713696
3629 1713696 1677999 1692442 1682273 1657830 1648513 1648585 1658279 1629768 1666581 1731008 1690606 1702850
3617 1702850 1691198 1696761 1703913 1680068 1666196 1654796 1635588 1661003 1627278 1608492 1625134 1592179
3605 1592179 1618789 1628113 1648704 1676488 1661826 1697667 1735617 1693918 1690960 1715758 1758639 1761161
$$ packed form
3686C720626M7356P8691N4563J4889o63N8649L8424R664r20P555P508K8174o5625
3673C998891m5425l1028m6890p0729k8884j3988m8190l8763l9870p8058j44722
3662C412344r056r812p5063j01140o7493q6634q3278q2931p3280m9512j14228
3651B659917q0544q6155m7980r7521l3368j33424j0381n8208o0549j9370p8513
3640A953904p1900k7655l6285j0221K3061j08177K6072k7923l4038k4476N1334
3629A713696l5697J4443j0169k4443r317P2R694k8511L6813O4427m0402J2244
3617A702850j1652N563P152k3845j3872j1400j9208K5415l3725j8786J6642l2955
3605A592179K6610R324K0591K7784j4662L5841L7950m1699k958K4798M2881K522
$$ plain form
3593 1761161 1785146 1788348 1772612 1814667 1877764 1916649 1906551 1926499 2020506 2020181 2066825 2115509
3581 2115509 2152807 2166600 2169459 2182229 2194457 2223430 2283980 2262142 2274542 2314678 2307011 2377120
3569 2377120 2396543 2384578 2346468 2335992 2374906 2364977 2410108 2439918 2458885 2455989 2453197 2500043
3557 2500043 2485339 2539791 2580497 2581328 2679139 2723673 2744615 2822435 2837950 2867264 3012308 3092054
3545 3092054 3138922 3221678 3299833 3388514 3480407 3590333 3679914 3793860 3919762 4020125 4144637
3534 4144637 4282745 4443791 4527960 4652386 4834736 4971428 5057231 5199172 5292302 5389928
3524 5389928 5525842 5674054 5784271 5879401 6012552 6139502 6214287 6364047 6444991 6568753
3514 6568753 6699858 6838115 6985441 7031797 7170018 7292095 7455922 7533019 7590120 7655935
$$ packed form
3593A761161K3985L202j5736M2055O3097L8885j0098J9948R4007l25M6644M8684
3581B115509L7298J3793K859J2770J2228K8973O0550k1838J2400M0136p667P0109
3569B377120J9423j1965l8110j0476L8914r929M5131K9810J8967k896k792M6846
3557B500043j4704N4452M0706Q31R7811M4534K0942P7820J5515K9314J45044P9746
3545C092054M6868Q2756P8155Q8681R1893J09926Q9581J13946J25902J00363J24512
3534D144637J38108J61046Q4169J24426J82350J36692Q5803J41941R3130R7626
3524E389928J35914J48212J10217R5130J33151J26950P4785J49760Q0944J23762
3514F568753J31105J38257J47326M6356J38221J22077J63827P7097N7101O5815
$$ plain form
3504 7655935 7639936 7666137 7651959 7608346 7555980 7454228 7320884 7197494 7083330 6960489
3494 6960489 6829603 6660543 6499293 6346083 6220447 6089894 5934370 5872893 5744626 5594027
3484 5594027 5524217 5425194 5312765 5178636 5090095 4971121 4803892 4695925 4558088 4381763
3474 4381763 4233072 4069708 3927558 3786478 3673884 3558353 3462564 3330096 3234401 3120272
3464 3120272 3052322 2968244 2882205 2790311 2783699 2707799 2661184 2603575 2562518 2491967 2362026
3453 2362026 2310083 2270243 2263025 2281020 2205111 2184467 2126839 2119431 2071191 2001204 2042929 2049977
3441 2049977 2030507 1996418 1974620 1948066 1967284 2022393 1964160 1939747 1965633 1969142 2028778 2014218
3429 2014218 1951972 1912947 1949594 1926387 1896287 1840274 1781829 1759881 1721537 1701436 1699013 1636485
$$ packed form
3504G655935j5999K6201j4178m3613n2366j01752j33344j23390j14164j22841
3494F960489j30886j69060j61250j53210j25636j30553j55524o1477j28267j50599
3484E594027o9810r9023j12429j34129q8541j18974j67229j07967j37837j76325
3474D381763j48691j63364j42150j41080j12594j15531r5789j32468r5695j14129
3464C120272o7950q4078q6039r1894o612p5900m6615n7609m1057p0551j29941
3453B362026n1943l9840p218J7995p5909k0644n7628p408m8240o9987M1725P048
3441B049977j9470l4089k1798k6554J9218N5109n8233k4413K5886L509N9636j4560
3429B014218o2246l9025L6647k3207l0100n6013n8445k1948l8344k0101k423o2528
$$ plain form
3417 1636485 1563179 1511336 1509219 1502239 1472457 1462171 1421490 1383302 1371342 1369256 1355265 1331675
3405 1331675 1315287 1282859 1303365 1243534 1253222 1242382 1223635 1235220 1220529 1181607 1154391 1178640
3393 1178640 1231228 1168445 1176847 1174742 1178178 1225236 1234612 1157000 1119033 1151775 1189020 1161321
3381 1161321 1136487 1186511 1162198 1194556 1192461 1185300 1208128 1193024 1236065 1245409 1200521 1227812
3369 1227812 1248368 1243746 1254710 1288079 1247149 1270461 1276295 1278900 1312239 1337141 1408557 1421443
3357 1421443 1415590 1406387 1441316 1426584 1410840 1424074 1519931 1587465 1580152 1614528 1632547 1650894
3345 1650894 1665472 1714351 1775663 1717364 1744461 1805971 1843496 1890283 1913435 1977178 2047285
3334 2047285 2091235 2105739 2158405 2196826 2254661 2337367 2334075 2346036 2433390 2481379 2539882 2610277
$$ packed form
3417A636485p3306n1843k117o980k9782j0286m0681l8188j1960k086j3991k3590
3405A331675j6388l2428K0506n9831R688j0840j8747J1585j4691l8922k7216K4249
3393A178640N2588o2783Q402k105L436M7058R376p7612l7967L2742L7245k7699
3381A161321k4834N0024k4313L2358k095p161K2828j5104M3041R344m4888K7291
3369A227812K0556m622J0964L3369m0930K3312N834K605L3339K4902P1416J2886
3357A421443n853r203L4929j4732j5744J3234R5857O7534p313L4376J8019J8347
3345A650894J4578M8879O1312n8299K7097O1510L7525M6787K3152O3743P0107
3334B047285M3950J4504N2666L8421N7835Q2706l292J1961Q7354M7989N8503P0395
$$ plain form
3322 2610277 2700657 2758981 2791902 2833694 2908229 3002692 3123272 3171214 3272012 3355773 3465540
3311 3465540 3539793 3676241 3810699 3933659 4104673 4251366 4381761 4573230 4738125 4932143
3301 4932143 5143495 5331979 5555916 5793475 5988559 6202624 6483159 6810734 7097537 7333549
3291 7333549 7640550 7933564 8257905 8524860 8780337 9028039 9302387 9469624 9629895 9786490
3281 9786490 9954612 10022925 10093618 10148459 10172543 10136532 10090258 10019845 9917593 9756191 9624107
3270 9624107 9459582 9293814 9104574 8858175 8607440 8373197 8089886 7770329 7526582 7207011
3260 7207011 6926742 6659426 6361443 6124309 5871301 5543802 5373650 5156314 4942787 4709663
3250 4709663 4526687 4389759 4225723 4034295 3861131 3746782 3659299 3534084 3457610 3359762
$$ packed form
3322B610277R0380N8324L2921M1792P4535R4463J20580M7942J00798Q3761J09767
3311C465540P4253J36448J34458J22960J71014J46693J30395J91469J64895J94018
3301D932143K11352J88484K23937K37559J95084K14065K80535L27575K86803K36012
3291G333549L07001K93014L24341K66955K55477K47702K74348J67237J60271J56595
3281I786490J68122O8313P0693N4841K4084l6011m6274p0413j02252j61402j32084
3270I624107j64525j65768j89240k46399k50735k34243k83311l19557k43747l19571
3260G207011k80269k67316k97983k37134k53008l27499j70152k17336k13527k33124
3250D709663j82976j36928j64036j91428j73164j14349q7483j25215p6474r7848
$$ plain form
3240 3359762 3281449 3199613 3118788 3004469 2937463 2834992 2777063 2719590 2622720 2588054 2572929
3229 2572929 2549660 2505639 2448251 2445498 2374257 2364453 2384502 2329028 2259937 2240885 2274599 2232264
3217 2232264 2182367 2143402 2198075 2137872 2148442 2189787 2194876 2147676 2170515 2166506 2159166 2121711
3205 2121711 2104635 2072331 2116620 2086121 2061481 2031566 2030367 2036633 2030112 2006654 1958244 1998639
3193 1998639 2024623 2036906 2044998 2071805 2050728 2054781 2061869 2036422 2018110 1974656 1966025 1945044
3181 1945044 1903285 1910569 1942187 1917610 1902103 1923406 1945145 1976431 1989792 1989582 2008295 2044284
3169 2044284 2087822 2099408 2066563 2074036 2114772 2203722 2219358 2243838 2303426 2374763 2435699 2494447
3157 2494447 2546835 2629955 2678428 2768712 2775514 2837666 2953559 3047977 3132182 3241563 3364705
$$ packed form
3240C359762p8313q1836q0825j14319o7006j02471n7929n7473r6870l4666j5125
3229B572929k3269m4021n7388k753p1241r804K0049n5474o9091j9052L3714m2335
3217B232264m9897l8965N4673o0203J0570M1345N089m7200K2839m009p340l7455
3205B121711j7076l2304M4289l0499k4640k9915j199O266o521k3458m8410M0395
3193A998639K5984J2283Q092K6807k1077M053P088k5447j8312m3454q631k0981
3181A945044m1759P284L1618k4577j5507K1303K1739L1286J3361k10J8713L5989
3169B044284M3538J1586l2845P473M0736Q8950J5636K4480N9588P1337O0936N8748
3157B494447N2388Q3120M8473R0284O802O2152J15893R4418Q4205J09381J23142
$$ plain form
3146 3364705 3499392 3637602 3825984 3886378 4013285 4191773 4295180 4436641 4569517 4738477
3136 4738477 4798395 4884529 5041156 5156438 5157527 5159258 5243275 5257650 5285214 5328628 5301009
3125 5301009 5239089 5139545 5109434 5102388 4993380 4897257 4759174 4572263 4410906 4301976 4175070
3114 4175070 3992184 3836112 3667648 3537787 3402287 3251008 3087000 2999912 2863783 2763436
3104 2763436 2656312 2522351 2458690 2400275 2310789 2262867 2142621 2052599 1954493 1883985 1863529
3093 1863529 1809237 1804106 1715703 1634474 1645004 1596237 1535941 1518477 1499334 1480260 1402028 1362905
3081 1362905 1382704 1333317 1291182 1302163 1330321 1334823 1322108 1280165 1287727 1256567 1247349 1332995
3069 1332995 1312649 1286473 1270972 1285077 1305540 1278796 1264530 1232965 1223802 1193125 1182767 1186416
$$ packed form
3146C364705J34687J38210J88382O0394J26907J78488J03407J41461J32876J68960
3136D738477N9918Q6134J56627J15282J089J731Q4017J4375K7564M3414k7619
3125E301009o1920r9544l0111p046j09008r6123j38083j86911j61357j08930j26906
3114D175070j82886j56072j68464j29861j35500j51279j64008q7088j36129j00347
3104B763436j07124j33961o3661n8415q9486m7922j20246r0022r8106p0508k0456
3093A863529n4292n131q8403q1229J0530m8767o0296j7464j9143j9074p8232l9123
3081A362905J9799m9387m2135J0981K8158M502j2715m1943P562l1160r218Q5646
3069A332995k0346k6176j5501J4105K0463k6744j4266l1565r163l0677j0358L649
$$ plain form
3057 1186416 1178199 1157031 1138319 1105357 1042598 1010063 985038 986969 959962 973207 971845 928448
3045 928448 965972 928494 904079 894613 894198 935374 895796 894468 879052 863977 828958 802853
3033 802853 828800 795109 780817 827966 824248 852331 824409 801211 786329 800821 773365 825597
3021 825597 852714 819701 827438 820250 792241 813730 823756 839158 846386 840959 844890 820446 809109
3008 809109 827131 855375 821150 822388 860768 849499 849394 882067 893170 889690 861730 854555 866055
2995 866055 896845 886573 892180 902451 941117 943858 954654 939121 1017245 997775 940239 931874
2983 931874 931012 995412 1005188 1028079 1036022 1037718 1066352 1056436 1113722 1109655 1108884 1166202 1112589
2970 1112589 1109955 1167390 1166663 1148242 1185975 1198515 1214024 1237119 1311738 1317846 1344180 1381641
$$ packed form
3057A186416q217k1168j8712l2962o2759l2535k5025J931k7007J3245j362m3397
3045I28448L7524l7478k4415r466m15M1176l9578j328j5416j5075l5019k6105
3033H02853K5947l3691j4292M7149l718K8083k7922k3198j4882J4492k7456N2232
3021H25597K7117l3013P737p188k8009K1489J0026J5402P228n427L931k4444j1337
3008H09109J8022K8244l4225J238L8380j1269j05L2673J1103l480k7960p175J1500
2995H66055L0790j0272N607J0271L8666K741J0796j5533P8124j9470n7536q365
2983I31874q62O4400R776K2891P943J696K8634r916N7286m067p71N7318n3613
2970A112589k634N7435p27j8421L7733J2540J5509K3095P4619O108K6334L7461
$$ plain form
2958 1381641 1408264 1409483 1370751 1442943 1414783 1411575 1466348 1527934 1594893 1565318 1599283 1691609
2946 1691609 1718293 1736940 1797864 1866662 1935698 1997800 2045938 2077853 2129880 2183598 2202322
2935 2202322 2254802 2317570 2381884 2385453 2425563 2544181 2625077 2697518 2792395 2877893 2931668
2924 2931668 2947386 3081438 3125378 3199529 3347223 3394505 3529100 3566997 3718435 3873804
2914 3873804 4047255 4161465 4267807 4389197 4565926 4776168 4926813 5078989 5261033 5491355
2904 5491355 5710897 5917952 6191964 6484038 6780924 7045261 7369777 7752941 8104330 8449746
2894 8449746 8919596 9388072 9868834 10470133 11085899 11788213 12586120 13399632 14293107 15241322
2884 15241322 16211039 17310437 18376266 19479847 20507949 21416912 22116692 22501754 22519894
$$ packed form
2958A381641K6623J219l8732P2192k8160l208N4773O1586O6959k9575L3965R2326
2946A691609K6684J8647O0924O8798O9036O2102M8138L1915N2027N3718J8724
2935B202322N2480O2768O4314L569M0110J18618Q0896P2441R4877Q5498N3775
2924B931668J5718J34052M3940P4151J47694M7282J34595L7897J51438J55369
2914C873804J73451J14210J06342J21390J76729K10242J50645J52176J82044K30322
2904E491355K19542K07055K74012K92074K96886K64337L24516L83164L51389L45416
2894H449746M69850M68476M80762O01299O15766P02314P97907Q13512Q93475R48215
2884A5241322R69717J099398J065829J103581J028102R08963O99780L85062J8140
$$ plain form
2875 22519894 22254440 21600753 20747786 19787151 18732218 17578512 16456801 15453267 14458154
2866 14458154 13499497 12677012 11860770 11066718 10337055 9730959 9179553 8683284 8217084
2857 8217084 7768682 7337446 6923478 6593870 6278112 5941401 5707920 5464240 5215455 4976511
2847 4976511 4726896 4572897 4449062 4261043 4089977 3960960 3814742 3673755 3504185 3361356
2837 3361356 3212112 3116370 3033086 2977931 2871137 2798770 2684496 2621171 2576296 2448174 2427381
2826 2427381 2328244 2213259 2172796 2122163 2060938 2041504 2002720 1933061 1881504 1800138 1779145
2815 1779145 1702551 1664879 1617766 1558145 1534147 1520152 1445118 1378681 1364646 1345931 1337674 1314466
2803 1314466 1276108 1214164 1150421 1186360 1151342 1144095 1093022 1051553 1034392 1008817 1016558 988279
$$ packed form
2875B2519894k65454o53687q52967r60635j054933j153706j121711j003534r95113
2866A4458154r58657q22485q16242p94052p29663o06096n51406m96269m66200
2857H217084m48402m31236m13968l29608l15758l36711k33481k43680k48785k38944
2847D976511k49615j53999j23835j88019j71066j29017j46218j40987j69570j42829
2837C361356j49244r5742q3284n5155j06794p2367j14274o3325m4875j28122k0793
2826B427381r9137j14985m0463n0633o1225j9434l8784o9659n1557q1366k0993
2815A779145p6594l7672m7113n9621k3998j3995p5034o6437j4035j8715q257k3208
2803A314466l8358o1944o3743L5939l5018p247n1073m1469j7161k5575P741k8279
$$ plain form
2791 988279 962601 974556 920554 916918 895580 928026 896640 866865 861761 813822 821803 784962
2779 784962 765614 788020 806816 775469 773557 728977 697808 659362 660617 681120 664866 650656
2767 650656 678616 673331 660158 632506 598264 558480 613327 573959 566956 560655 551159 506657
2755 506657 488958 506592 512785 473722 467080 504456 507091 464326 450748 439411 459996 416528
2743 416528 418687 466145 490000 501555 470217 488542 456433 423124 406843 420620 411604 365267
2731 365267 372680 366494 348962 342114 339671 350730 373037 385552 391042 390043 369538 332548 291057
2718 291057 310821 301801 376284 364737 302261 265028 288716 264085 277773 342341 356184 325852
2706 325852 292185 284525 368283 330474 303528 289161 275653 257992 260187 304658 304388 276574
$$ packed form
2791I88279k5678J1955n4002l636k1338L2446l1386k9775n104m7939P981l6841
2779G84962j9348K2406J8796l1347j912m4580l1169l8446J255K0503j6254j4210
2767F50656K7960n285j3173k7652l4242l9784N4847l9368p003o301r496m4502
2755E06657j7699J7634O193l9063o642L7376K635m2765j3578j1337K0585m3468
2743D16528K159M7458K3855J1555l1338J8325l2109l3309j6281J3777r016m6337
2731C65267P413o186j7532o848k443J1059K2307J2515N490r99k0505l6990m1491
2718B91057J9764r020P4483j1547o2476l7233K3688k4631J3688O4568J3843l0332
2706C25852l3667p660Q3758l7809k6946j4367j3508j7661K195M4471k70k7814
$$ plain form
2694 276574 297212 304071 215202 239099 238711 235462 228753 230687 161375 135369 183287 202623 191944
2681 191944 233789 267566 238568 239930 191340 150517 152726 157478 182173 156917 188836 157870
2669 157870 198413 223275 179958 170680 150598 160718 107664 153086 198546 203855 170640 169036
2657 169036 144856 110808 147922 186344 203791 234891 250912 229860 159375 135876 183921 190531
2645 190531 166243 120625 152194 166062 136863 183600 166585 118678 131363 128569 129027 79938
2633 79938 125883 177059 125750 129476 133456 174900 183461 206526 233153 153629 161506 116566 117017
2620 117017 183215 158364 200256 174410 128985 186371 196203 161436 128021 132124 180738 213460
2608 213460 207544 164704 112523 146334 121075 120980 185988 159227 179550 207802 142746 150461 161256
$$ packed form
2694B76574K0638O859q8869K3897l88l249o709J934o9312k6006M7918J9336j0679
2681A91944M1845L3777k8998J362m8590m0823K209M752K4695k5256L1919l0966
2669A57870M0543K4862m3317r278k0082J0120n3054M5422M5460N309l3215j604
2657A69036k4180l4048L7114L8422J7447L1100J6021k1052p0485k3499M8045O610
2645A90531k4288m5618L1569J3868k9199M6737j7015m7907J2685k794M58m9089
2633G9938M5945N1176n1309L726L980M1444Q561K3065K6627p9524P877m4940M51
2620A17017O6198k4851M1892k5846m5425N7386R832l4767l3415M103M8614L2722
2608B13460n916m2840n2181L3811k5259r5O5008k6761K0323K8252o5056P715J0795
$$ plain form
2595 161256 193714 233479 176760 209732 184113 164645 196079 181496 142735 123544 182791 165140
2583 165140 133833 126086 164108 163320 84102 101449 143956 131600 132552 152515 160812 145655 174892
2570 174892 129443 138272 129639 74096 83875 116956 77567 91000 75469 85770 135630 111437
2558 111437 119399 107079 129691 144240 151323 84643 112986 81673 60536 87244 52944 60120
2546 60120 69797 63854 55394 92403 85722 77733 29883 36083 67586 56645 69489 77235 84764
2533 84764 32390 50963 23214 52526 25003 16334 71908 101133 69817 84752 57825 16140
2521 16140 28514 29298 27370 26309 42741 74620 101371 62693 -1448 7485 -6199 11303 40862
2508 40862 -4550 18850 60628 68472 49591 36280 52630 35199 16776 24346 25737 -22788
$$ packed form
2595A61256L2458L9765n6719L2972k5619j9468L1434j4583l8761j9191N9247j7651
2583A65140l1307p747L8022p88p9218J7347M2507j2356R52J9963Q297j5157K9237
2570A74892m5449Q829q633n5543R779L3081l9389J3433j5531J0301M9860k4193
2558A11437P962j2320K2612J4549P083o6680K8343l1313k1137K6708l4300P176
2546F0120R677n943q460L7009o681p989m7850O200L1503j0941J2844P746P529
2533H4764n2374J8573k7749K9312k7523q669N5574K9225l1316J4935k6927m1685
2521A6140J2374P84j928j061J6432L1879K6751l8678o4141Q933j3684J7502K9559
2508D0862m5412K3400M1778P844j8881j3311J6350j7431j8423P570J391m8525
$$ plain form
2496 -22788 10402 58448 18234 18098 34853 63923 10239 30554 35777 43399 35711 52567 91516
2483 91516 93886 94998 91855 46283 47803 45426 27538 60157 54626 60453 90447 83941 46066
2470 46066 -13718 14471 19080 37140 80129 -7609 183 55324 9628 19202 28366 50197 30593
2457 30593 45901 73188 58995 26853 21366 35986 14535 5535 26253 13796 8444 79674
2445 79674 79000 67621 70917 55104 37017 47919 957 24617 31953 35578 69391 82224 111893
2432 111893 74698 46815 -23509 -35779 -46301 -10416 -30486 -43890 5420 16122 39593 23162
2420 23162 11596 -36267 -15314 510 23459 4218 808 42805 34504 58853 65773 24854
2408 24854 12116 24634 21025 4561 25982 41741 66906 43234 56667 100104 82832 17638
$$ packed form
2496b2788L3190M8046m0214j36J6755K9070n3684K0315N223P622p688J6856L8949
2483I1516K370J112l143m5572J520k377j7888L2619n531N827K9994o506l7875
2470D6066n9784K8189M609J8060M2989q7738P792N5141m5696R574R164K1831j9604
2457C0593J5308K7287j4193l2142n487J4620k1451r000K0718j2457n352P1230
2445G9674o74j1379L296j5813j8087J0902m6962K3660P336L625L3813J2833K9669
2432A11893l7195k7883p0324j2270j0522L5885k0070j3404M9310J0702K3471j6431
2420B3162j1566m7863K0953J5824K2949j9241l410M1997q301K4349O920m0919
2408B4854j2738J2518l609j6464K1421J5759K5165k3672J3433M3437j7272o5194
$$ plain form
2396 17638 19737 20536 -3973 -18510 -2119 -22394 -35112 -2170 -17745 7428 10443 -24961 1060
2383 1060 27681 64355 41350 -3655 -6134 -33644 2024 52688 9518 6422 -18316 -1780
2371 -1780 36572 22215 50198 -13106 -5277 -41489 -40978 2535 20833 -1681 -34994 -27475 20829
2358 20829 31060 -447 -11242 14772 6975 -17548 -13635 53744 21910 20566 38585 -4966
2346 -4966 8578 48735 27248 6528 38817 15194 9232 -18489 -6453 -11772 -13486 -33808 14922
2333 14922 6308 21040 25093 4509 59606 30564 51622 25935 17320 61892 40943 -14095
2321 -14095 -10118 -18895 -29516 -17486 27442 51530 34337 83583 95981 -2378 -18084 -14390
2309 -14390 -17432 11522 -5344 19778 -3455 23345 38715 22694 42360 36112 56647 25987
$$ packed form
2396A7638K099P99k4509j4537J6391k0275j2718L2942j5575K5173L015l5404K6021
2383A060K6621L6674k3005m5005k479k7510L5668N0664m3170l096k4738J6536
2371a780L8352j4357K7983o3304P829l6212N11M3513J8298k2514l3313P519M8304
2358B0829J0231l1507j0795K6014p797k4523L913O7379l1834j344J8019m3551
2346d966J3544M0157k1487k0720L2289k3623n962k7721J2036n319j714k0322M8730
2333A4922q614J4732M053k0584N5097k9042K1058k5687q615M4572k0949n5038
2321a4095L977q777j0621J2030M4928K4088j7193M9246J2398r8359j5706L694
2309a4390l042K8954j6866K5122k3233K6800J5370j6021J9666o248K0535l0660
$$ plain form
2297 25987 14747 43669 18817 21101 3122 -39344 -59943 -38477 33311 10378 -27620 -26623
2285 -26623 -11348 35658 8569 26906 -16393 -17074 -14501 -8621 21079 5831 -33126 -21453 -38522
2272 -38522 -10761 15207 33499 30965 38879 42901 74046 79188 47616 30555 32675 14262 -10530
2259 -10530 16338 15785 31353 -1057 12508 17334 6823 -31148 -20120 -6780 -12476 -2496 -27867
2246 -27867 -40187 29989 -41927 -44633 -32780 8218 8028 -16696 38914 54335 28951 29820 28551
2233 28551 -12693 -28441 -22277 -6297 9790 5462 -11223 -3713 -25198 -5067 -46592 -61971
2221 -61971 -7335 -12655 -14558 4731 41222 1430 -7134 -9375 23313 6237 -24657 10812 -32102
2208 -32102 2150 41211 22663 -53001 -20147 39552 40300 54237 75367 -2507 -3019 8431 -16808
$$ packed form
2297B5987j1240K8922k4852K284j7979m2466k0599K1466P1788k2933l7998R97
2285b6623J5275M7006k7089J8337m3299o81K573N880K9700j5248l8957J1673j7069
2272c8522K7761K5968J8292k534P914M022L1145N142l1572j7061K120j8413k4792
2259a0530K6868n53J5568l2410J3565M826j0511l7971J1028J3340n696R980k5371
2246b7867j2320P0176p1916k706J1853M0998j90k4724N5610J5421k5384Q69j269
2233B8551m1244j5748O164J5980J6087m328j6685P510k1485K0131m1525j5379
2221f1971N4636n320j903J9289L6491l9792q564k241L2688j7076l0894L5469m2914
2208c2102L4252L9061j8548p5664L2854N9699P48J3937K1130p7874n12J1450k5239
$$ plain form
2195 -16808 -877 -5422 35425 31001 4242 15271 -1477 -34179 -18116 -35069 -38909 -29871 38096
2182 38096 37444 838 -29609 -1736 -21305 -3217 12605 -33235 -26032 -31217 -23051 862 -2186
2169 -2186 53637 70158 20522 21745 26166 56585 50806 26723 -24369 -32513 11444 -2001 21737
2156 21737 76831 89157 66857 11120 -26115 6330 18711 982 19344 26279 26925 77660
2144 77660 75489 42458 46658 40519 76487 110935 83580 25216 70466 47839 50666 32793 21340
2131 21340 13928 25561 30267 74967 59433 54491 78481 64505 59610 107392 78651 61831 73822
2118 73822 59251 106121 113052 99656 96616 139591 122701 81409 91379 75020 89551 117447
2106 117447 142089 135823 108671 161812 109090 151020 179391 211429 234687 202550 232260 252808
$$ packed form
2195a6808J5931m545M0847m424k6759J1029j6748l2702J6063j6953l840R038O7967
2182C8096o52l6606l0447K7873j9569J8088J5822m5840P203n185Q166K3913l048
2169b186N5823J6521m9636J223M421L0419n779k4083n1092q144M3957j3445K3738
2156B1737N5094J2326k2300n5737l7235L2445J2381j7729J8362O935O46N0735
2144G7660k171l3031M200o139L5968L4448k7355n8364M5250k2627K827j7873j1453
2131B1340p412J1633M706M4700j5534m942K3990j3976m895M7782k8741j6820J1991
2118G3822j4571M6870O931j3396l040M2975j6890m1292R970j6359J4531K7896
2106A17447K4642o266k7152N3141n2722M1930K8371L2038K3258l2137K9710K0548
$$ plain form
2094 252808 273996 347123 401332 458930 522503 572182 648492 794621 922158 891214 833040
2083 833040 700117 557962 458098 375360 327886 272865 258729 256108 236594 226398 168059
2072 168059 134119 142117 97727 99680 120009 138655 83200 72263 105057 130087 82836 74413
2060 74413 35676 49843 78794 28230 51035 45129 77599 50703 92420 50141 6055 -11871
2048 -11871 17463 27528 20745 27310 49491 70568 37483 48731 46107 54895 32978 50530 62574
2035 62574 39420 25027 1905 1353 17113 30974 33313 11357 68207 43836 14253 59908
2023 59908 62602 -4391 2335 9074 12211 -25427 -2150 36137 61056 24901 29667 35873 -2699
2010 -2699 3008 23117 38529 -13613 26605 40211 -1511 4963 32124 29549 23982 678 -34332
$$ packed form
2094B52808K1188P3127N4209N7598O3573M9679P6310J46129J27537l0944n8174
2083H33040j32923j42155r9864q2738m7474n5021j4136k621j9514j0196n8339
2072A68059l3940P998m4390J953K0329J8646n5455j0937L2794K5030m7251q423
2060G4413l8737J4167K8951n0564K2805n906L2470k6896M1717m2279m4086j7926
2048a1871K9334J0065o783O565K2181K1077l3085J1248k624Q788k1917J7552J2044
2035F2574k3154j4393k3122n52J5760J3861K339k1956N6850k4371k9583M5655
2023E9908K694o6993O726O739L137l7638K3277L8287K4919l6155M766O206l8572
2010b699N707K0109J5412n2142M0218J3606m1722O474K7161k575n567k3304l5010
$$ plain form
1997 -34332 -14893 35304 13790 10935 -5303 47472 45593 20871 41476 1465 16221 -12550
1985 -12550 -60866 -35449 -17450 4342 -28733 -25018 17149 -4663 24754 20436 -20677 -7970
1973 -7970 22162 49949 27434 26400 -29928 -62086 -12513 -19879 -27961 29341 46815 -5348 -19274
1960 -19274 21012 -26053 -22560 -5492 -62502 -79812 -66107 -25344 -4163 -27457 -5285 20085
1948 20085 -3097 4184 -4936 24036 -1784 -21074 -16313 36236 72293 16064 10091 12947 -15934
$$ packed form
1997c4332J9439N0197k1514k855j6238N2775j879k4722K0605m0011J4756k8771
1985a2550m8316K5417J7999K1792l3075L715M2167k1812K9417m318m1113J2707
1973g970L0132K7787k2515j034n6328l2158M9573p366q082N7302J7474n2163j3926
1960a9274M0286m7065L493J7068n7010j7310J3705M0763K1181k3294K2172K5370
1948B0085k3182P281r120K8972k5820j9290M761N2549L6057n6229n973K856k8881
$$ [...]
##END NTUPLES=NMR SPECTRUM
##END=
