##TITLE=1H_EC-3299(IV-32)
 CDCl3
 8 sc, 
 4.9.2023
##JCAMPDX= 6.0         $$ Bruker NMR JCAMP-DX V2.0
##DATA TYPE= NMR SPECTRUM
##DATA CLASS= NTUPLES
##ORIGIN= UXNMR, Bruker Analytische Messtechnik GmbH
##OWNER= root
$$ XWIN-NMR		Version 3.5
$$ Mon Sep  4 14:06:26 2023 Russian Standard Time (UT+4h)  she@DPX200
##.OBSERVE FREQUENCY= 200.13135
##.OBSERVE NUCLEUS= ^1H
##.ACQUISITION MODE= SIMULTANEOUS
##.ACQUISITION SCHEME= undefined
##.AVERAGES= 8
##.DIGITISER RES= 18
##SPECTROMETER/DATA SYSTEM= spect
##.PULSE SEQUENCE= zg30
##.SOLVENT NAME= CDCl3
##.SHIFT REFERENCE= (INTERNAL, CDCl3, 0, 15.7348)
##AUDIT TRAIL= $$ (NUMBER, WHEN, WHO, WHERE, WHAT)
$$ ##TITLE= Audit trail, XWIN-NMR		Version 3.5
$$ ##JCAMPDX= 5.01
$$ ##ORIGIN= Bruker BioSpin GmbH
$$ ##OWNER= she
$$ F:/spectra/data/she/nmr/H-F/1/pdata/1/auditp.txt
$$ ##AUDIT TRAIL=  $$ (NUMBER, WHEN, WHO, WHERE, WHAT)
(   1,<2023-09-04 14:05:02.81 +0400>,<she>,<DPX200>,
      <created by zg, POWCHK disabled, PULCHK disabled
       configuration hash MD5:
       00 E9 B6 7A A2 85 ED C7 34 08 36 98 17 FE 4E 26
       data hash MD5: 16K
       20 01 BE 24 CE 0E A1 AB 11 44 10 E9 2A 24 5D 22>)
(   2,<2023-09-04 14:05:13.85 +0400>,<she>,<DPX200>,
      <Start of raw data processing
       efp BC_mod = 2 LB = 0.24 FT_mod = 6 PKNL = 1 PHC0 = -21044.97 PHC1 = 9.25272 SI = 16K 
       data hash MD5: 16K
       21 89 07 44 6F F2 FA E7 C7 02 C3 CE 36 65 22 35>)
(   3,<2023-09-04 14:05:35.89 +0400>,<she>,<DPX200>,
      <pk PHC0 = -11.22694 PHC1 = 14 
       data hash MD5: 16K
       C6 E6 41 B7 69 FB 76 F7 54 2E 20 C6 32 3A EA 80>)
(   4,<2023-09-04 14:05:39.68 +0400>,<she>,<DPX200>,
      <abs ABSG = 5 
       data hash MD5: 16K
       34 20 B9 46 D7 FF B2 EC B0 4C E8 62 DE A0 FE 79>)
$$ ##END=
$$ 
$$ hash MD5
$$ 84 64 04 F6 20 EC 43 8E 49 CA 9C 9E EE BF F2 E5
##$RELAX= 
##$RELAX= 
##$RELAX= 
##$RELAX= 
##$RELAX= 
##$RELAX= 
$$ Bruker specific parameters
$$ --------------------------
##$DU= <F:/spectra>
##$EXPNO= 1
##$NAME= <H-F>
##$PROCNO= 1
##$TYPE= <nmr>
##$USER= <she>
##$AMP= (0..31)
100 100 100 100 100 100 100 100 100 100 100 100 100 100 100 100 100 100 
100 100 100 100 100 100 100 100 100 100 100 100 100 100 
##$AQSEQ= 0
##$AQ_mod= 1
##$AUNM= <au_zg>
##$AUTOPOS= <>
##$BF1= 200.13
##$BF2= 200.13
##$BF3= 200.13
##$BF4= 200.13
##$BF5= 200.13
##$BF6= 200.13
##$BF7= 200.13
##$BF8= 200.13
##$BYTORDA= 1
##$CFDGTYP= 0
##$CFRGTYP= 5
##$CHEMSTR= <none>
##$CNST= (0..31)
1 1 145 1 1 1 1 1 1 1 1 1 1 1 1 1 1 1 1 1 1 1 1 1 1 1 1 1 1 1 1 1 
##$CPDPRG= <>
##$CPDPRG1= <>
##$CPDPRG2= <>
##$CPDPRG3= <>
##$CPDPRG4= <mlev>
##$CPDPRG5= <mlev>
##$CPDPRG6= <mlev>
##$CPDPRG7= <mlev>
##$CPDPRG8= <mlev>
##$CPDPRGB= <>
##$CPDPRGT= <>
##$D= (0..31)
0 1.2 0 0 0 0 0 0 0 0.06 0 0.03 0 0 0 0 0.0002 0 0 0 0 0 0 0 0 0 0 0 0 
0 0 0 
##$DATE= 1693821902
##$DBL= (0..7)
120 120 120 120 120 120 120 120 
##$DBP= (0..7)
150 150 150 150 150 150 150 150 
##$DBP07= 0
##$DBPNAM0= <>
##$DBPNAM1= <>
##$DBPNAM2= <>
##$DBPNAM3= <>
##$DBPNAM4= <>
$$ [...]
##$SUBNAM3= <"">
##$SUBNAM4= <"">
##$SUBNAM5= <"">
##$SUBNAM6= <"">
##$SUBNAM7= <"">
##$SUBNAM8= <"">
##$SUBNAM9= <"">
##$SW= 18.05172834244
##$SWIBOX= (0..15)
0 0 2 0 0 0 0 0 0 0 0 0 0 0 0 0 
##$SW_h= 3612.71676300578
##$TD= 16384
##$TD0= 1
##$TE= 0
##$TE2= 300
##$TE3= 300
##$TEG= 300
##$TL= (0..7)
0 120 120 120 120 120 120 120 
##$TP= (0..7)
150 150 150 150 150 150 150 150 
##$TP07= 0
##$TPNAME0= <>
##$TPNAME1= <>
##$TPNAME2= <>
##$TPNAME3= <>
##$TPNAME4= <>
##$TPNAME5= <>
##$TPNAME6= <>
##$TPNAME7= <>
##$TPOAL= (0..7)
0.5 0.5 0.5 0.5 0.5 0.5 0.5 0.5 
##$TPOFFS= (0..7)
0 0 0 0 0 0 0 0 
##$TUNHIN= 0
##$TUNHOUT= 0
##$TUNXOUT= 0
##$USERA1= <user>
##$USERA2= <user>
##$USERA3= <user>
##$USERA4= <user>
##$USERA5= <user>
##$V9= 5
##$VALIST= <valist>
##$VCLIST= <CCCCCCCCCCCCCCC>
##$VD= 0
##$VDLIST= <DDDDDDDDDDDDDDD>
##$VPLIST= <PPPPPPPPPPPPPPP>
##$VTLIST= <TTTTTTTTTTTTTTT>
##$WBST= 1024
##$WBSW= 4
##$XGAIN= (0..3)
0 0 0 0 
##$XL= 0
##$YL= 0
##$YMAX_a= 205002
##$YMIN_a= -172932
##$ZGOPTNS= <>
##$ZL1= 120
##$ZL2= 120
##$ZL3= 120
##$ZL4= 120
##$ABSF1= 15.75129
##$ABSF2= -2.300559
##$ABSG= 5
##$ABSL= 3
##$ALPHA= 0
##$AQORDER= 0
##$ASSFAC= 0
##$ASSFACI= 0
##$ASSFACX= 0
##$ASSWID= 0
##$AUNMP= <proc_1d>
##$AZFE= 0.1
##$AZFW= 0.1
##$BCFW= 0
##$BC_mod= 2
##$BYTORDP= 0
##$COROFFS= 0
##$CY= -3
##$DATMOD= 1
##$DC= 0
##$DFILT= <>
##$DTYPP= 0
##$F1P= 0
##$F2P= 0
##$FCOR= 1
##$FTSIZE= 16384
##$FT_mod= 6
##$GAMMA= 0
##$GB= 0
##$INTBC= 1
##$INTSCL= 3.70164e-10
##$ISEN= 128
##$LB= 0.24
##$LEV0= 0
##$LPBIN= 0
##$MAXI= 10000
##$MC2= 0
##$MEAN= 0
##$ME_mod= 0
##$MI= 1.114404
##$NCOEF= 0
##$NC_proc= -8
##$NLEV= 6
##$NOISF1= 3.799351
##$NOISF2= 2.8
##$NSP= 0
##$NTH_PI= 0
##$NZP= 0
##$OFFSET= 15.73477
##$PC= 1
##$PHC0= -21056.2
##$PHC1= 23.25272
##$PH_mod= 1
##$PKNL= yes
##$PPARMOD= 0
##$PSCAL= 0
##$PSIGN= 0
##$REVERSE= no
##$SF= 200.130007358105
##$SI= 16384
##$SIGF1= 3
##$SIGF2= 2
##$SINO= 5.538805
##$SIOLD= 16384
##$SREGLST= <1H.CDCl3>
##$SSB= 0
##$STSI= 16384
##$STSR= 0
##$SW_p= 3612.71676300578
##$SYMM= 0
##$S_DEV= 0
##$TDeff= 16384
##$TDoff= 0
##$TI= <>
##$TILT= no
##$TM1= 0
##$TM2= 0
##$TOPLEV= 0
##$USERP1= <user>
##$USERP2= <user>
##$USERP3= <user>
##$USERP4= <user>
##$USERP5= <user>
##$WDW= 1
##$XDIM= 16384
##$YMAX_p= 521955246
##$YMIN_p= -2771233
$$ End of Bruker specific parameters
$$ ---------------------------------
##NTUPLES= NMR SPECTRUM
##VAR_NAME=  FREQUENCY,     SPECTRUM/REAL,   SPECTRUM/IMAG
##SYMBOL=    X,             R,               I
##VAR_TYPE=  INDEPENDENT,   DEPENDENT,       DEPENDENT
##VAR_FORM=  AFFN,          ASDF,            ASDF
##VAR_DIM=   16384,         16384,           16384
##UNITS=     HZ,            ARBITRARY UNITS, ARBITRARY UNITS
##FACTOR=    0.220516191357247, 1,           1
##FIRST=     3148.99960008824, 0,            0
##LAST=      -463.717162917542, 0,           0
##MIN=       -463.717162917542, -2771233,    0
##MAX=       3148.99960008824, 521955246,    0
$$ Real data points
##PAGE= N=1
##DATA TABLE= (X++(R..R)), XYDATA
$$ [...]
5578B9974802l99643R2099m71503m57661r9810j7391k17939j9624K65354l62663
5568B8286021j03721J14713j61472m51011M5857K25341q04477n84306o41155k71592
5558B5654198k10862o86062q26781k56085K43167j60669m84358k53828n02941
5549B2515779j95348j45260J13849k69490n77030o03498R637m44659o96318o12359
5539A9095303l41615k82630o39745j30399J31405N21981J00526p16194N00831
5530A8239463l47959o40625k23259k47860m30325p64153j83374p470L34159j44925
5520A5583672j32176o75354n47277m8794j03892j28480J17425K04950Q779l10295
5510A3968558J47449l7417q05752o27551m5385J17418J6157L7432J85235J88751
$$ y = [29974802, 29575159, 29667258, 29195755, 28738094, 28638284, 28620893, 28402954, 28383330, 28648684, 28286021, 28182300, 28297013, 28135541, 27684530, 27730387, 27955728, 27151251, 26566945, 25925790, 25654198, 25443336, 24757274, 23930493, 23674408, 23917575, 23756906, 23272548, 23018720, 22515779, 22320431, 22175171, 22289020, 22019530, 21442500, 20839002, 20848639, 20403980, 19707662, 19095303, 18753688, 18471058, 17831313, 17700914, 17832319, 18354300, 18454826, 17738632, 18239463, 17891504, 17250879, 17027620, 16779760, 16349435, 15585282, 15401908, 15394438, 15728597, 15583672, 15451496, 14776142, 14228865, 14180071, 14076179, 13947699, 14065124, 14270074, 14278853, 13968558, 14116007, 14078590, 13272838, 12645287, 12599902, 12717320, 12733477, 12770909, 12956144, 13144895]
5500A3144895j50442l72630K43523j1272j91407K59884J55920M58622L01652m3444
5490A3795301k84671K91314k25571P00786p652o2724O92013M18263J69006M73305
5480A5959370k96393K42223O79380K76548L68757Q16508P61986Q08088N91875
5471B0208342K74341J122530Q54381J580992J529529J299253J433572J615182
5463B9918122J354699J477956O00723L43802L46828l82056n80495n43027j016645
5454C1519907r65391j120326p75907k51149M71080K93022j64495L28584P82547
5445C0117872J409650Q77189O09525N81398K89234K44016j99195l85489o04444
5436C2939756o27308j343719j214688j437823j047664j166724q07277j558927
$$ y = [13144895, 12994453, 12621823, 12865346, 12854074, 12662667, 12922551, 13078471, 13537093, 13838745, 13795301, 13510630, 13801944, 13576373, 14277159, 14269507, 14206783, 14898796, 15317059, 15486065, 15959370, 15662977, 15905200, 16584580, 16861128, 17229885, 18046393, 18808379, 19616467, 20208342, 20482683, 21605213, 22459594, 24040586, 25570115, 26869368, 28302940, 29918122, 31272821, 32750777, 33351500, 33695302, 34042130, 33660074, 33079579, 32536552, 31519907, 30554516, 29434190, 28658283, 28407134, 28878214, 29171236, 29006741, 29335325, 30117872, 31527522, 32404711, 33014236, 33595634, 33884868, 34128884, 33929689, 33544200, 32939756, 32312448, 30968729, 29754041, 28316218, 27268554, 26101830, 25294553, 23735626]
5428B3735626r90443q03745k41031m46488q80024l18428n26890k86254J16880
5419A9359203m62595j16499k00162m15988L72953k37689J16044l94927K95435
5410A8315775L5881m60215j72165j74548K78141L79630l2394L14864l29403N41228
5400A8696794N7328L02651J16933J46220J37714K01679L62786K65160Q36474Q46886
5390B1970625M47845J89132M43389M76930O61537l311L57520O49346m1569k69253
5380B4882191l55517K54411K789o95695j77526l13574o52223q14608m73863p47955
5370B0908430o60672m45707J17186k50018l95145m15908m67274k03096K17956
5361A8405752k69128j61740J66509j5166K29160m06866J4268r9457K3967K69347
$$ y = [23735626, 22745183, 21941438, 21700407, 21253919, 20373895, 20055467, 19528577, 19242323, 19359203, 18896608, 18780109, 18579947, 18163959, 18536912, 18299223, 18415267, 18020340, 18315775, 18351656, 17891441, 17719276, 17544728, 17822869, 18202499, 18170105, 18484969, 18155566, 18696794, 18754122, 19056773, 19173706, 19319926, 19457640, 19659319, 20022105, 20287265, 21123739, 21970625, 22418470, 22607602, 23050991, 23527921, 24189458, 24186147, 24543667, 25193013, 25151444, 24882191, 24526674, 24781085, 24783874, 24088179, 23910653, 23597079, 22944856, 22130248, 21656385, 20908430, 20247758, 19802051, 19919237, 19669219, 19274074, 18858166, 18390892, 18187796, 18405752, 18136624, 17974884, 18141393, 18126227, 18355387, 17948521, 17962789, 17863332, 17887299, 18156646]
5351A8156646Q73889K53322K20308p3154N66441M12943O2974L5854O9255O69147
5341B1247625N15129J056376L4602R07635J011088P60585J331207J144065J342359
5332B9350671J693304J707021J921423K191385K200572J770383K039985J824069
5324D4698813K007558J119716R50354O33357j061726j146004j152982j257209
5316D4791877j535378j716689j674603j589578j879975j206569j343528j489193
5308C2356364j172828j381272p08799m84564m13278l327k31795K23682M99193
5299B8683376J153527J236174O99535J488994J301891P84601J823074J737091
5291C8908263J055498J464104J121112Q88162M67113l79291l30281r83923j765729
$$ y = [18156646, 19030535, 19283857, 19504165, 19431011, 19997452, 20410395, 20473369, 20509223, 20578478, 21247625, 21762754, 22819130, 22853732, 23761367, 24772455, 25533040, 26864247, 28008312, 29350671, 31043975, 32750996, 34672419, 36863804, 39064376, 40834759, 42874744, 44698813, 46706371, 47826087, 48776441, 49409798, 48348072, 47202068, 46049086, 44791877, 43256499, 41539810, 39865207, 38275629, 36395654, 35189085, 33845557, 32356364, 31183536, 29802264, 29093465, 28608901, 28195623, 28192296, 27960501, 28184183, 28683376, 29836903, 31073077, 31772612, 33261606, 34563497, 35348098, 37171172, 38908263, 39963761, 41427865, 42548977, 43437139, 43904252, 43524961, 43194680, 42210757, 40445028]
5282D0445028j356820j860953j651535j610220k569126j289014j430451k004553
5274B6672356j596695j381412r33764q73508j310144j301729q68762q58724p07264
5265A6840354q39080n71961l57464o76084k36378l7755m63579n85710M3791k13118
5255A2903016k09039J41719l89370j21378K68258k48878J99568j86237k44909
5246A2112750O8111N0028L84315k32414L8144L67829K53416O4464J18947J46065
5236A3371655N08832K82437N2732J007759N03766L5271O87955J33982r6422L04578
5226A6792545N50438K51857j57428l75019j63933j75683k39053l35099m14592
5217A5734033l57326m51260p08242o11302k44415n21008m41126n4045q4236o20106
$$ y = [40445028, 39088208, 37227255, 35575720, 33965500, 31396374, 30107360, 28676909, 26672356, 25075661, 23694249, 22760485, 21886977, 20576833, 19275104, 18406342, 17547618, 16840354, 16001274, 15429313, 15071849, 14395765, 14159387, 14121632, 13658053, 13072343, 13116134, 12903016, 12693977, 12835696, 12446326, 12324948, 12593206, 12344328, 12543896, 12357659, 12112750, 12180861, 12230889, 12615204, 12382790, 12420934, 12788763, 13042179, 13106643, 13225590, 13371655, 13880487, 14162924, 14215656, 15223415, 15727181, 15762452, 16450407, 16584389, 16487967, 16792545, 17342983, 17594840, 17437412, 17062393, 16898460, 16722777, 16483724, 16148625, 15734033, 15376707, 14925447, 14217205, 13605903, 13361488, 12840480, 12399354, 12345309, 12261073, 11640967]
5207A1640967k44224l6531l8430m08114m83029j8541J44632J06929P0271n1892
5197A0682038l03248j32897k05776J48077m09663j97460M07741K3913O851k16142
5187I803434Q8077P3598m9026M9524n5386l87023L59093j15371j78097K86863
5177I875686J04692j06879j06994K11609m93376k65233L3764K71740O0754n0244
5167I535519j11034p61360j35773J88663p2823l9627L13317O5027m42230J58254
5157H697933m54439J38278k51M84594l5366k52794l00820j60701P8401l57990
5147G836845L2463K62514M4878n4420M2234k82311n30360j30532J83243k07920
5137G196634j05219j23514J24844K27019k45560j27782k21618r0678j09699k55411
$$ y = [11640967, 11396743, 11360212, 11321782, 10913668, 10430639, 10412098, 10556730, 10663659, 10733930, 10682038, 10378790, 10245893, 10040117, 10188194, 9778531, 9581071, 9988812, 10012725, 10019576, 9803434, 9891511, 9965109, 9916083, 9965607, 9910221, 9523198, 9882291, 9766920, 9588823, 9875686, 9980378, 9873499, 9766505, 9978114, 9484738, 9219505, 9253269, 9525009, 9585763, 9535519, 9424485, 8663125, 8527352, 8716015, 8643192, 8603565, 8916882, 8981909, 8539679, 8697933, 8243494, 8381772, 8381521, 8866115, 8830749, 8577955, 8277135, 8116434, 8194835, 7836845, 7869308, 8131822, 8176700, 8122280, 8164514, 7882203, 7351843, 7221311, 7404554, 7196634, 7091415, 6967901, 7092745, 7319764, 7074204, 6946422, 6724804, 6634126, 6524427, 6269016]
5127F269016j3522k9728k05069K67625J46785k14552j35585l703j76428q0861
5117E823978M57652j7827k37248j22413K66116m93378R1229j63492j49271J17248
5107E572594J61211K63371K92252N621m69367O7624K7545K63803k6157l88662
5097E769835L09163n1423L9444L04048J45130o3602l31481J61592J48131J28943
5087F559780O4773J1728M20244j44407J00890k6579l37708K22735L53493k41932
5077F983017L81737l911r6483J77074k19736k18624J19838j12276j2706p2816
5067F925114l10933o49463l0991N54152j10421j0456K0114N00836l41857l63865
5057F182230j89334j14162M0601K58021k53537n4833Q05421j12435k13818q1602
$$ y = [6269016, 6255494, 6225766, 6020697, 6288322, 6435107, 6220555, 6084970, 6081267, 5904839, 5823978, 6281630, 6263803, 6026555, 5904142, 6170258, 5676880, 5768109, 5604617, 5455346, 5572594, 5733805, 5997176, 6289428, 6295049, 5825682, 5893306, 5920851, 6184654, 6158497, 5769835, 6078998, 6027575, 6067019, 6371067, 6516197, 6452595, 6121114, 6282706, 6430837, 6559780, 6624553, 6636281, 7056525, 6912118, 7013008, 6986429, 6648721, 6871456, 7224949, 6983017, 7364754, 7360843, 7264360, 7441434, 7221698, 7003074, 7122912, 7010636, 6997930, 6925114, 6614181, 5964718, 5933727, 6487879, 6377458, 6367002, 6387116, 6887952, 6546095, 6182230, 5992896, 5878734, 5919335, 6177356, 5923819, 5868986, 6674407, 6561972, 6348154, 6266552]
5047F266552P0274m8941m00265p3920J10171J21835R5693K81771k20184K40327
5037F443313o6453j45637J27628j22790N9193p4816k19258L93554K41858L20232
5027F956824l506k75104q5948j57940K87068n503J45310J83444J93567M4847J00943
5016G384002m4889l8773k07034J82426L9103O5415r1326n5624K61957O3223n1475
5005G507005Q0736P6396j76664J29283K59161m57603k10741R5945k89136k7329
4995F987053M8231L82768J84745m90585K58701m63207K2529K96009k8191K28976
4985G427029M2495M67317j24955j22390K84569j52568L5648n1839k97188p8733
4975G429385p3889l4295k57421L15687K33490J93396J51504j64048N8511O65922
$$ y = [6266552, 6336826, 6287885, 5887620, 5813700, 5923871, 6045706, 6141399, 6423170, 6202986, 6443313, 6376860, 6231223, 6358851, 6236061, 6295254, 6220438, 6001180, 6394734, 6636592, 6956824, 6953318, 6678214, 6592266, 6434326, 6721394, 6715891, 6861201, 7044645, 7238212, 7283059, 7384002, 7339113, 7300340, 7093306, 7275732, 7314835, 7380250, 7288924, 7233300, 7495257, 7558480, 7507005, 7587741, 7664137, 7487473, 7616756, 7875917, 7418314, 7207573, 7303518, 7014382, 6987053, 7035284, 7418052, 7602797, 7112212, 7370913, 6907706, 6930235, 7226244, 7198053, 7427029, 7469524, 7936841, 7811886, 7689496, 7974065, 7821497, 7857145, 7805306, 7508118, 7429385, 7355496, 7321201, 7063780, 7379467, 7612957, 7806353, 7957857, 7793809, 7852320, 8518242]
4965H518242o60507l27177K73004K80111Q776K69761j24498K62266j08695o8321
4955H322962M98237l66223k55299M37670k54224J82217r7764J97116j81238m82541
4945H000913k85641j23811J02732L04914K13481J20181l25717L09539J4300k22346
4935H108545j2843J73880J58137m9346K07068J67483R7532k4803K64625k6565
4925I063713p83o4671O325j76319O8164J57088K60633R2538J66005P0116L06187
4914I948996r9011Q9662m72491K35718p214J26198N3951j31032k73090L02310
4904I773997l5644q4358N9646L13442J241J95736k83934R8688M84315K48447K68675
4893A1040251L63458k50754M06506O38159O51212P58631N4537N0978k95941r43870
$$ y = [8518242, 7857735, 7530558, 7803562, 8083673, 8092449, 8362210, 8237712, 8499978, 8391283, 8322962, 8821199, 8454976, 8199677, 8637347, 8383123, 8565340, 8467576, 8664692, 8483454, 8000913, 7715272, 7591461, 7694193, 7999107, 8212588, 8332769, 8007052, 8316591, 8330891, 8108545, 8095702, 8269582, 8427719, 8378373, 8585441, 8752924, 8850456, 8825653, 9090278, 9063713, 9062930, 8998259, 9004584, 8828265, 8896429, 9053517, 9314150, 9406688, 9572693, 9642809, 9948996, 9849985, 9939647, 9467156, 9702874, 9695660, 9821858, 9875809, 9744777, 9471687, 9773997, 9738353, 9653995, 9713641, 10027083, 10028324, 10224060, 9940126, 10038814, 10523129, 10771576, 11040251, 11403709, 11152955, 11559461, 12197620, 12848832, 13607463, 13662000, 13712978, 13417037, 12473167]
4883A2473167l14278l86831n66105J12800K54793j32456j18133m54646p15945
4874A0152366J02875o2401J59687m88490j87430J26401k72988m5969J07029K73530
4864I864610K82k50526J05670k1115J80952k54811J46743j36839l40323J16928
4854I411571k99731O8611o7567m1688L22646q2547j14124q9515J23406J60930
4844I391992J47459L8233O2646j76369j93055k43560l6554p9355N2896K08320
4834I172653m2959J09849q1399l50503O0961M77461j41722J07501M45506n36631
4824I220717K6079p17l98126p5422J3279K13557K28915J35859N43595K00618l9017
4813A0069337M2325L42308o59953l34535M54754L46757l21695j39434r126M7517
$$ y = [12473167, 12158889, 11772058, 11205953, 11318753, 11573546, 11441090, 11322957, 10868311, 10152366, 10255241, 10192840, 10352527, 9864037, 9676607, 9803008, 9530020, 9484051, 9591080, 9864610, 9864892, 9614366, 9720036, 9698921, 9879873, 9625062, 9771805, 9634966, 9294643, 9411571, 9111840, 9180451, 9112884, 9071196, 9393842, 9311295, 9197171, 9107656, 9231062, 9391992, 9539451, 9577684, 9640330, 9463961, 9270906, 9027346, 8990792, 8911437, 8964333, 9172653, 9129694, 9239543, 9158144, 8807641, 8868602, 9346063, 9204341, 9311842, 9757348, 9220717, 9246796, 9246079, 8847953, 8772531, 8785810, 8999367, 9228282, 9364141, 9907736, 10108354, 10069337, 10111662, 10453970, 9794017, 9459482, 9914236, 10260993, 9939298, 9799864, 9790738, 9838255]
4803I838255M39441j90327j9772k17072l84896N80557M64561O9590J56921J85128
4793A0922386p9205K37741L1766j97420p5510J02558Q5988O6510L88671K3277
4783A1506762L028K72198J80722K1973K05125k18164N4380k63565L95638N27219
4773A2685316n47361j00679M56695j56393J65928O7401j7871K30261M59484o4563
4763A3178218o25090K99907o3040K39950M26816J09350Q7789M57159M30456o0226
4753A4481289k17118o6092J83280j3565j5733M57084M20316J92973l72379q4920
4743A4965135K35342l15451J55223O0544K79863P70218L56837n41803L86379N17489
4733A6869776J14110l22024M81577P43444J76733K30030P12251J47239Q849k36316
$$ y = [9838255, 10277696, 10087369, 10067597, 9850525, 9465629, 10046186, 10510747, 10580337, 10737258, 10922386, 10843181, 11080922, 11112688, 10915268, 10839758, 10942316, 11028304, 11094814, 11483485, 11506762, 11509790, 11781988, 11962710, 11984683, 12189808, 11971644, 12026024, 11762459, 12158097, 12685316, 12137955, 12037276, 12493971, 12337578, 12503506, 12570907, 12553036, 12783297, 13242781, 13178218, 12553128, 12853035, 12789995, 13029945, 13456761, 13566111, 13653900, 14111059, 14541515, 14481289, 14264171, 14198079, 14381359, 14367794, 14352061, 14809145, 15229461, 15422434, 15050055, 14965135, 15200477, 14885026, 15040249, 15100793, 15380656, 16150874, 16507711, 15965908, 16352287, 16869776, 16983886, 16661862, 17143439, 17886883, 18063616, 18293646, 19005897, 19153136, 19161985, 18925669]
4723A8925669j78740O62513m17972k77419l72711M36375r7247q4855J14845k84559
4713A8425899N7968o3664N2442j00528O9776O054L29015K13613J48404N24064
4703A9663043j78992l79718L35648O79932L18458K4090M8555K21540N2750J92678
4693B0977984O56173k7928q258M47873P73677J394J31671J57785j27067O14333
4683B3597637L50096L52302K27692J96849M26121J5789L44353j69412J82033L79698
4673B5903158K4346R5611m11624p7094J97128j22228N88239K75177n3082O79087
4663B7098718L42374N06567M23622L75278L30683O83632O49713P95576Q18478
4654C2024641M27480L23558J98933L46330M94207l66735o7924K7465m23215j1527
$$ y = [18925669, 18746929, 19409442, 18991470, 18714051, 18341340, 18777715, 18680468, 18595613, 18710458, 18425899, 18483867, 18420203, 18472645, 18372117, 18441893, 18447947, 18776962, 18990575, 19138979, 19663043, 19484051, 19104333, 19439981, 20119913, 20438371, 20462461, 20511016, 20732556, 20785306, 20977984, 21634157, 21606229, 21597971, 22045844, 22819521, 22820915, 22952586, 23110371, 22983304, 23597637, 23947733, 24300035, 24527727, 24724576, 25150697, 25166486, 25510839, 25341427, 25523460, 25903158, 25927504, 26023115, 25611491, 25534397, 25731525, 25609297, 26197536, 26472713, 26419631, 27098718, 27441092, 27947659, 28371281, 28746559, 29077242, 29760874, 30410587, 31206163, 32024641, 32452121, 32775679, 32974612, 33320942, 33815149, 33448414, 33380490, 33407955, 32984740, 32973213]
4644C2973213q20263l90499l61299o21912j78742l11128k73923m73647l31624
4635B9210176J99084J74996n8579k72967Q5714M19232M99820L68011R4972L63453
4625C1083912N14202P1534M38103L61620L17944M53116O31645r370k48117M49095
4615C4063684P16563N4127l00576K51450j99036j9440l97388K0326m09014j31396
4605C3649300K46540J4012j27212K21479M96662M41695p0356M02798K78304J18937
4595C5672159P64535N70864L16904M01922N10554N20426K38377L28595N46175
4586C9870511k97028l06660j16922P3350N773l64224j05338n99864l51603p8568
4576C7729427k54187n6786L3370j54125M06239k31935J48017O66677J52054O44647
$$ y = [32973213, 32152950, 31762451, 31401152, 30779240, 30600498, 30289370, 30015447, 29541800, 29210176, 29409260, 29584256, 29525677, 29252710, 29338424, 29757656, 30257476, 30625487, 30720459, 31083912, 31598114, 31669648, 32107751, 32469371, 32787315, 33240431, 33872076, 33862706, 33614589, 34063684, 34780247, 34834374, 34533798, 34785248, 34586212, 34566772, 34169384, 34189710, 33780696, 33649300, 33895840, 33909852, 33782640, 34004119, 34500781, 34942476, 34872120, 35274918, 35553222, 35672159, 36436694, 37007558, 37324462, 37726384, 38236938, 38757364, 38995741, 39324336, 39870511, 39573483, 39266823, 39149901, 39223251, 39229024, 38864800, 38759462, 38159598, 37807995, 37729427, 37475240, 37418454, 37451824, 37297699, 37703938, 37472003, 37620020, 38286697, 38438751, 39083398]
4566C9083398J64219K87156O8235L77364j29670O84198J28199j97999Q825P4822
4556D0548747N94857K81151J13827K8314L2474K54175k10117q13986j46413p5453
4546D0607576k79172r4393L84299K94315M34002P04347M42463J30442K60774J45235
4536D3029888l19881K02850k99200p19865k08410j80351k16915o14167j65261
4527D0508688J13387K89837P0435J69973K8214N9532O25004k18510R01062Q10923
4517D3358545N29078O90724P41498R36241P02085Q86617J251349J102399R83461
4508E1181997M90611N59333R53943Q96063R18859R07386P12813R32423J005367
4499E8558795L09389Q98392Q34101J92852k6868M31093O34156P10587L59507O4819
$$ y = [39083398, 39247617, 39534773, 39603008, 39980372, 39850702, 40534900, 40663099, 40465100, 40473925, 40548747, 41143604, 41424755, 41538582, 41566896, 41599370, 41853545, 41643428, 40829442, 40683029, 40607576, 40328404, 40234011, 40618310, 40912625, 41346627, 42050974, 42493437, 42623879, 42884653, 43029888, 42710007, 42912857, 42613657, 41893792, 41685382, 41505031, 41288116, 40673949, 40508688, 40622075, 40911912, 40982347, 41152320, 41180534, 41240066, 41865070, 41646560, 42547622, 43358545, 43887623, 44578347, 45319845, 46256086, 46958171, 47844788, 49096137, 50198536, 51181997, 51672608, 52231941, 53185884, 54081947, 55000806, 55908192, 56621005, 57553428, 58558795, 58868184, 59766576, 60600677, 60793529, 60766661, 61197754, 61831910, 62542497, 62902004, 62966823]
4489F2966823N15349k89374k54727o52016k22838k67558l15506m91881p28188
4480F0260084j77326n17476J285o00374o97386J20992J87239p3972j20273J23034
4470E8505827j113003k082986j384991j147911m16370n89173n76632j97843J90829
4461E1187747K50835J90673N81154N41884M90408L06147Q6628O43448k23742j06825
4451E3948357N69769L52550J21502M90529J84362J90454n06648l73198j44125
4442E4833552J52341L14424o96229n59928m54258K46537k36588l46621K98495
4433E3551725N11611J141907O61605M53492P71850Q66900N61883J035053P70164
4424F0326190J664326R98249J218997J030512M70562M73017P78173N00301n29839
$$ y = [62966823, 63482172, 63192798, 62938071, 62286055, 62063217, 61795659, 61480153, 60988272, 60260084, 60082758, 59565282, 59566567, 58966193, 58268807, 58389799, 58577038, 58503066, 58382793, 58505827, 57392824, 55309838, 53924847, 52776936, 52360566, 51771393, 51194761, 50996918, 51187747, 51438582, 51629255, 52210409, 52752293, 53242701, 53548848, 53635476, 54278924, 54055182, 53948357, 54518126, 54870676, 54992178, 55482707, 55667069, 55857523, 55350875, 54977677, 54833552, 54985893, 55300317, 54604088, 54044160, 53589902, 53836439, 53599851, 53253230, 53551725, 54063336, 55205243, 55866848, 56320340, 57092190, 57959090, 58520973, 59556026, 60326190, 61990516, 62988765, 64207762, 65238274, 65708836, 66181853, 66960026, 67460327, 66930488]
4415F6930488k68144n57870o42930j491508j171273j563853j432230j476881q52369
4406E7473430j121205j318338j180044n37209j090289k33603J59208k47454L30192
4397E2234688P25469J214205J336726J152900J723723J877046J259430J281272
4389F2805459J782127J377157Q80762M24394K37281L12302k83946l19088r79673
4380F6236775j245329j179962j862647j067216j358445r92472r57612j017386
4372E6555706p38340p75431l46676k64845m38923o24505q55501p25321k90962
4363E1495202p65111p28202p84618p09360r47417p00188j170389r39429m69284
4354D4281204R0085R7449p47633Q829L89865J52135O35558K45039O7240J93172
$$ y = [66930488, 66662344, 66104474, 65461544, 63970036, 62798763, 61234910, 59802680, 58325799, 57473430, 56352225, 55033887, 53853843, 53316634, 52226345, 51992742, 52151950, 51904496, 52234688, 52960157, 54174362, 55511088, 56663988, 58387711, 60264757, 61524187, 62805459, 64587586, 65964743, 66845505, 67269899, 67507180, 67819482, 67535536, 67216448, 66236775, 64991446, 63811484, 61948837, 60881621, 59523176, 58530704, 57573092, 56555706, 55817366, 55041935, 54695259, 54430414, 53991491, 53366986, 52511485, 51786164, 51495202, 50730091, 50001889, 49217271, 48507911, 47560494, 46860306, 45689917, 44750488, 44281204, 44371289, 44468738, 43721105, 43729934, 44119799, 44271934, 44907492, 45152531, 45219771, 45412943]
4344D5412943M86879M6739l31914K8957N37581J24671n8569O26493K86444O43701
4334D7803925L84555J084M75464j24519n33974m80791r96349m46701q00957l02522
4324D4979215n66041l30208J3111k42821k19267J14044n3401o37991j01493P7503
4314D3032651J79031K50093k96169J53723J47481o37992P750J31130O39235O67644
4304D4274577J290564J045722N23204J322610L92892N66036O80693O18280L12996
4295E1027574n75957J379J67522K14694j53803K67331N49406O11027Q33346J246584
4285E4189103P38882R19497N99205M33713P32901L65920N45597J10985k5213K82862
4275E8893452O08145Q78176N94569P52826J123364J689971J209512J995241K775142
$$ y = [45412943, 45899822, 45946561, 45614647, 45643604, 46181185, 46305856, 46247287, 46873780, 47160224, 47803925, 48188480, 48189564, 48665028, 48540509, 48006535, 47525744, 46529395, 46082694, 45281737, 44979215, 44413174, 44082966, 44096077, 43853256, 43633989, 43748033, 43694632, 43056641, 42955148, 43032651, 43211682, 43461775, 43165606, 43319329, 43466810, 42828818, 42836568, 42967698, 43606933, 44274577, 45565141, 46610863, 47134067, 48456677, 48849569, 49415605, 50096298, 50714578, 51027574, 50451617, 50452996, 50620518, 50835212, 50681409, 50948740, 51498146, 52109173, 52942519, 54189103, 54927985, 55847482, 56446687, 56880400, 57613301, 57979221, 58524818, 58635803, 58610590, 58893452, 59501597, 60379773, 60974342, 61727168, 62850532, 64540503, 65750015, 67745256, 70520398]
4266G0520398K711411K729670L490902L315179K947967L099278L860118M433290
4258I7108213M716809N387083O370436P523848R450791J1144024J2822904J3331341
4250A67855449J3962705J3126967Q399466J113432o531063j2240067j5209187
4243A70477702j5094112j4073749j1598968j0136542r048400p290255n944624
4236I7291052m951109l863476l240493l112039l031555k446744k753034j972104
4228G1920498j973822j684280j332003o46828l59965l41517L50579J240926J670783
4219F8844371J714731J950817J396549J037483n55095j971765l045160k737569
4211F6634362k779540k238298j888080j938652o66548j11973J56876O67858M89109
$$ y = [70520398, 73231809, 75961479, 79452381, 82767560, 85715527, 88814805, 92674923, 97108213, 101825022, 107212105, 113582541, 121106389, 130557180, 141701204, 154524108, 167855449, 181818154, 194945121, 203344587, 204458019, 197926956, 185686889, 170477702, 155383590, 141309841, 129710873, 119574331, 110525931, 103235676, 97291052, 92339943, 88476467, 85235974, 82123935, 79092380, 76645636, 73892602, 71920498, 69946676, 68262396, 66930393, 66283565, 65923600, 65582083, 65932662, 67173588, 68844371, 70559102, 72509919, 73906468, 74943951, 74388856, 72417091, 69371931, 66634362, 63854822, 61616524, 59728444, 57789792, 57123244, 57011271, 57168147, 57836005, 58325114]
4202E8325114J128839J835681J956434K459133J322015M85899r31404k254976
4194F4326735l064649m017026l655120l262177k958184k457401k121228j609756
4186D1181194j404339j364793j084250j232835n65547l32849j053938r43384o11026
4177C2588233N5824n94048n04847n84268p99712m70886n17793O9978N9619Q2407
4167B9384507j95979k21739j35367K31631L93560L86992Q6596K45667J062550
4158C1238418j58782n17611k1304r2630j57765j3741l13527K08310J00337K50233
4148C0521938L02525R39051P98784O62282Q75416J171928L59522l54270r07107
4139C4370069j089451j082795l84385n60307j85950k79264K5683K48443N41050
$$ y = [58325114, 59453953, 61289634, 63246068, 65705201, 67027216, 67513115, 66581711, 64326735, 61262086, 57245060, 53589940, 50327763, 47369579, 44912178, 42790950, 41181194, 39776855, 38412062, 37327812, 36094977, 35529430, 35196581, 34142643, 33199259, 32588233, 32644057, 32050009, 31545162, 30960894, 30161182, 29690296, 29172503, 29242481, 29302100, 29384507, 29188528, 28966789, 28831422, 29063053, 29456613, 29843605, 29930201, 30175868, 31238418, 31079636, 30562025, 30540721, 30448091, 30290326, 30276585, 29963058, 30171368, 30271705, 30521938, 30824463, 31763514, 32562298, 33224580, 34099996, 35271924, 35631446, 35277176, 34370069, 33280618, 32197823, 31813438, 31253131, 31067181, 30787917, 30813600, 31062043, 31603093]
4130C1603093j83628O42143M98591O12084k2935P33065J646042R73907K49570
4121C6751932O73357J82555l34118j47571L6824m2942J70025P82441N83253K60310
4111C8916066R57717Q22265O59906J746093J382376J631630J268028R46017P78690
4102D9108788J095928J120929M56636P11439N30495P96945J435374J935416K513360
4093E9705310K016869K972438L376841L905442M494315N526965O062498P302792
4085I5363470Q386085J1602827J1701391J6060618K1634556L3218292M4689098
4078B42656337O2502318Q5445337J11301610J8676490q8561930j00770451p9736131
4071B51513580n0023012l6058688k5481708k0158343j4085960j1382946q084853
$$ y = [31603093, 31419465, 32061608, 32560199, 33172283, 33149348, 33882413, 35528455, 36502362, 36751932, 37425289, 37607844, 37273726, 37126155, 37162979, 37120037, 37290062, 38072503, 38655756, 38916066, 39873783, 40696048, 41355954, 43102047, 44484423, 46116053, 47384081, 48330098, 49108788, 50204716, 51325645, 51782281, 52493720, 53024215, 53821160, 55256534, 57191950, 59705310, 61722179, 64694617, 68071458, 71976900, 76471215, 81998180, 88060678, 95363470, 103749555, 115352382, 127053773, 143114391, 164748947, 197967239, 242656337, 305158655, 390603992, 501905602, 520582092, 432020162, 331249711, 251513580, 201490568, 165431880, 139950172, 119791829, 105705869, 94322923, 86238070]
4064H6238070p140459m273714m715066m274694m870656l290590k883726k124905
4056E2664260k208989j313481k201614j753319j552197j095524o47463l93257
4048D1498416q15351l32345n73648n60653l19878j35395k28858J51177J1522P355
4038C8702342L19760J14115n6465O10477L74687J60888k1133M99338O47298M63475
4028D1814782Q45508J129492N22001J83565L62106R92204J189500J335918J008486
4019D9383562Q67593J069497O86618N56713M92892N41948K46511Q4863N31140
4010E4461337j55147O05470N21643J081790Q58576Q26146L28574J218565N29199
4001F0276153l2505p25890r83820l84766l09165n11804m12284m25239l84701Q0376
$$ y = [86238070, 79097611, 74823897, 70108831, 65834137, 60963481, 57672891, 54789165, 52664260, 50455271, 49141790, 46940176, 45186857, 43634660, 42539136, 41891673, 41498416, 40683065, 40350720, 39777072, 39216419, 38896541, 38761146, 38532288, 38683465, 38694987, 38702342, 39022102, 39136217, 39079752, 39690229, 40064916, 40225804, 40204671, 40704009, 41351307, 41814782, 42660290, 43789782, 44311783, 44495348, 44857454, 45849658, 47039158, 48375076, 49383562, 50251155, 51320652, 52007270, 52563983, 53056875, 53598823, 53845334, 53930197, 54461337, 54306190, 54911660, 55433303, 56515093, 57373669, 58199815, 58528389, 59746954, 60276153, 60243648, 59517758, 58533938, 58149172, 57840007, 57328203, 56915919, 56490680, 56105979, 56186355]
3991E6186355K5118N5919n67273j19798o41140j442916j548305j770013j498059
3982D8679888j291477j635524j076491j190018j212860o92820n75965j524665
3974C9480068j123321p74230r81552j733812j277587j411656j148021q78516r38007
3965B9213366p99211p22247p63053o52405o74226j022537q25104j147801n33006
3956B2073776o26296r89197p46835n09685p13835p21220k62951j67631o33632
3947A6702494n70655n07140p91406k32352J47370m11599n04512k44750n30888
3938A3056562m71623k19193j74465n8295J10599m10054l61691l01406k23902J94756
3928A1141288k04239l56648j27088p31673o6353k45614j54735m06973o219J21332
$$ y = [56186355, 56211473, 56267392, 55700119, 55580321, 54939181, 53496265, 51947960, 50177947, 48679888, 47388411, 45752887, 44676396, 43486378, 42273518, 41580698, 41004733, 39480068, 38356747, 37582517, 36600965, 34867153, 33589566, 32177910, 31029889, 30151373, 29213366, 28414155, 27691908, 26928855, 26276450, 25602224, 24579687, 23754583, 22606782, 22073776, 21447480, 20458283, 19711448, 19201763, 18487928, 17766708, 17503757, 17336126, 16702494, 16131839, 15624699, 14833293, 14600941, 14748311, 14336712, 13832200, 13587450, 13056562, 12584939, 12365746, 12191281, 12132986, 12243585, 11833531, 11471840, 11170434, 10946532, 11141288, 10937049, 10580401, 10453313, 9721640, 9655287, 9409673, 9254938, 8847965, 8841746, 8963078]
3918H963078p7389k96377j10148j95945L11272L0994j60872n19223J34170k05875
3908G873685K0422j91028K83577l73370k52014K10845k8841l96700j5626j14869
3898G016081k17414l2030J49379J02397p47009n022j4289k32096k20047j78716
3888E621234j50285K85855K02162K2794K64051j71739r362q0049j383M8974J3762
3877F046014l29635m9241j41753k51480O50172m18179l85612L55096K47102l14267
3867E408217L7115k88038k90407l3952M09554N0988m68796P7306N65139J28594
3857E595720M671J62070R9555n21516o18496L27994O1416k9430K29785j5185j50842
3846E145742O4468P8929j98993L15157j4408J92138m64455n0239J38240o6725
$$ y = [8963078, 8885689, 8589312, 8479164, 8283219, 8594491, 8625485, 8464613, 7945390, 8079560, 7873685, 7894107, 7703079, 7986656, 7613286, 7361272, 7572117, 7543276, 7146576, 7130950, 7016081, 6798667, 6766637, 6916016, 7018413, 6271404, 6266382, 6252093, 6019997, 5799950, 5621234, 5470949, 5756804, 5958966, 5981760, 6245811, 6074072, 6064710, 5984661, 5983278, 6032252, 6046014, 5716379, 5667138, 5525385, 5273905, 5924077, 5505898, 5120286, 5475382, 5722484, 5408217, 5445332, 5157294, 4866887, 4832935, 5242489, 5293477, 4824681, 4901987, 5467126, 5595720, 5600391, 5762461, 5862016, 5340500, 4722004, 5049998, 5111414, 5081984, 5311769, 5296584, 5145742, 5210210, 5289139, 5090146, 5405303, 5390895, 5583033, 5118578, 5068339, 5206579, 5139854]
3836E139854l00920k36490k1417P475m52859K63467J15472l4155J16162l08268
3826D288321q4308j87279k36900k54458M18730L54608r3101m6817j89771K18439
3816D187464K72711m93121O9779M20173k37901n9787Q0347K23389K50629j66818
3806D546865j55527L41461n77627r8755K11359k06867K05447R3108k96887l4671
3796D027906L14566J27400K8398K07304K25731L4305m9360L61494k86808Q8683
3786E079619M80622J3174K7976Q1397p23523l24045l73752k32912m6528j79285
3776C802743r1530k34731q2355L86924J27340Q1013k34495k48229j89662K21963
3766C538981k04617n19564p8409K60175J36949j71332j1848J85184J79546J40253
$$ y = [5139854, 4838934, 4602444, 4581027, 4588502, 4135643, 4399110, 4514582, 4480427, 4596589, 4288321, 4204013, 4016734, 3779834, 3525376, 3944106, 4298714, 4205613, 4158796, 3969025, 4187464, 4460175, 3967054, 4036833, 4457006, 4219105, 4159318, 4239665, 4463054, 4713683, 4546865, 4391338, 4732799, 4155172, 4056417, 4267776, 4060909, 4266356, 4359464, 4062577, 4027906, 4342472, 4469872, 4498270, 4705574, 4931305, 4965610, 4916250, 5277744, 4990936, 5079619, 5560241, 5573415, 5601391, 5682788, 4959265, 4635220, 4261468, 4028556, 3982028, 3802743, 3711213, 3476482, 3394127, 3781051, 3908391, 3989404, 3754909, 3506680, 3317018, 3538981, 3334364, 2814800, 2736391, 2996566, 3133515, 2962183, 2950335, 3135519, 3315065, 3455318]
3756C455318n4487L60685J52731q73910k36310q5004J47252k80030K61801O3312
3746B911358k64396o2716K63670K29260J39766j91762O8055K23780k1041n38326
3736B757648l7540k08025j94523K86502K16120l06144L77920j42127N07697P9818
3726C337346m70568n20126J31913J25025L99291J23353K29886n21603J38995K03803
3716C177315j33022J795P5439M54186m74321j27141j4311L06250L16818k15766
3706C367242J0993K55721j05708O7370L62637k75639k89413J00171J14679l85914
3696C222139P7709P2648j67445L33671N10463r0672Q4841j42767k49036K33635
3686C885186k65898L33658j94750j65959J53675l0558N46773J16908m42866j07211
$$ y = [3455318, 3400831, 3761516, 3914247, 3040337, 2804027, 2719023, 2866275, 2586245, 2848046, 2911358, 2646962, 2584246, 2847916, 3077176, 3216942, 3025180, 3093235, 3317015, 3295974, 2757648, 2720108, 2512083, 2317560, 2604062, 2820182, 2514038, 2891958, 2749831, 3257528, 3337346, 2866778, 2346652, 2478565, 2603590, 3002881, 3126234, 3356120, 2834517, 2973512, 3177315, 3044293, 3046088, 3121527, 3575713, 3101392, 2974251, 2959940, 3266190, 3583008, 3367242, 3378235, 3633956, 3528248, 3595618, 3958255, 3682616, 3393203, 3493374, 3608053, 3222139, 3299848, 3372496, 3205051, 3538722, 4049185, 3958513, 4043354, 3900587, 3651551, 3885186, 3619288, 3952946, 3758196, 3592237, 3745912, 3715354, 4262127, 4379035, 3936169, 3828958]
3676C828958j36315J98196k14189J55110N2052l70457k86373k90043L05015L29866
3666C571820k63569J32169K31047J22458p7011K88302m31954L21826m26492m30818
3656C037778N41499j5539l75172L17609j43668J28779J0953q0029o7642k39778
3646C114790L01493p0060J90087j19376J46000k92026j67465K15466N5224R3867
3636C468000Q1292N40121K5046K3489k39471J47201L01160k40757k31936r7135
3626C777010j50930l25590N1672j13203K47799K97336K16101J73923l32247P0527
3616C912398k2342j55394J58335n4215m9493O96815j74963j02192j10763l11648
3606C786538J314K44761j32040L15995J95935J6660R2142K34399j99159l93960
$$ y = [3828958, 3692643, 3890839, 3676650, 3831760, 3883812, 3513355, 3226982, 2936939, 3241954, 3571820, 3308251, 3440420, 3671467, 3793925, 3716914, 4005216, 3573262, 3895088, 3468596, 3037778, 3579277, 3563738, 3188566, 3506175, 3362507, 3491286, 3502239, 3422210, 3354568, 3114790, 3416283, 3346223, 3536310, 3416934, 3562934, 3270908, 3103443, 3318909, 3374133, 3468000, 3549292, 4089413, 4114459, 4137948, 3898477, 4045678, 4346838, 4106081, 3874145, 3777010, 3626080, 3300490, 3352162, 3238959, 3486758, 3784094, 4000195, 4174118, 3841871, 3912398, 3890056, 3734662, 3892997, 3838782, 3789289, 4486104, 4311141, 4208949, 4098186, 3786538, 3787852, 4032613, 3900573, 4216568, 4412503, 4429163, 4521305, 4755704, 4556545, 4162585]
3596D162585J75987j95984m4699O9604O1521k18065k81558K80310L44427l21275
3586D032853j08487n8488L20500L36508K92043k49529l9050l83110l47952M12420
3576D207708M12642j50106j15258k0303m1636J74809L51080l46706k64187M68551
3566D676594N8087O1462j59489n10871K71913N23526N1536j52206J76922j17540
3556D879934K14330M39329j5560J50479L41339m40024j41679M2771L37046J102
3546E809067r7418J94436o071K91183J07842N5417L52801J48436m44505j17589
3536F293599N05466M15997m5322N662N23179J50753l23053m18620l1412K30633
3526G306882M75211k12420J74247k17066Q1731j65242K5407N56070P8623L01418
$$ y = [4162585, 4338572, 4142588, 4097889, 4167493, 4229014, 4010949, 3729391, 4009701, 4354128, 4032853, 3924366, 3865878, 4186378, 4522886, 4814929, 4565400, 4526350, 4143240, 3795288, 4207708, 4620350, 4470244, 4354986, 4334683, 4293047, 4467856, 4818936, 4472230, 4208043, 4676594, 4734681, 4796143, 4636654, 4125783, 4397696, 4921222, 4972758, 4820552, 4997474, 4879934, 5094264, 5533593, 5518033, 5668512, 6009851, 5569827, 5428148, 5470919, 5807965, 5809067, 5711649, 5906085, 5900014, 6191197, 6299039, 6354456, 6707257, 6855693, 6411188, 6293599, 6799065, 7215062, 7169740, 7175402, 7698581, 7849334, 7526281, 7107661, 7076249, 7306882, 7782093, 7569673, 7743920, 7526854, 7608585, 7443343, 7468750, 8024820, 8103443, 8404861]
3516H404861j59190j9524n905L2472n0249j25622k42801M24474K92040k14801
3506H335755o4307L29370N8559J73795M916J12367k27140K33770j10393k36463
3496H610229K62983L22647r1918M87966j60674K98011J44604j98587L08523K75661
3486A0259445j77920K8626L0862J4920K88894m6716L43637j0196J39115k59548
3476A0611119k80083o0881L24838L33044k7386j78523k76554K89151K22716m93436
3466A0464005J68371M60851k65753k91184M72443q5099o413N03280P5546l58057
3456A1137990R8892o2648k6767M98796N15644j82475l88657M44396K3234k41438
3446A1816967L08690P8403J89984J25814L45124j10790q0454L84384p3363N6842
$$ y = [8404861, 8245671, 8226147, 8220242, 8252714, 8202465, 8076843, 7834042, 8258516, 8550556, 8335755, 8271448, 8600818, 8659377, 8833172, 8838088, 8950455, 8723315, 8957085, 8846692, 8610229, 8873212, 9195859, 9103941, 9591907, 9431233, 9729244, 9873848, 9675261, 9983784, 10259445, 10081525, 10110151, 10141013, 10155933, 10444827, 10398111, 10741748, 10731552, 10870667, 10611119, 10331036, 10270155, 10594993, 10928037, 10900651, 10722128, 10445574, 10734725, 10957441, 10464005, 10632376, 11093227, 10827474, 10536290, 11008733, 10923634, 10917221, 11420501, 11496047, 11137990, 11236882, 11174234, 11147467, 11646263, 12161907, 11979432, 11590775, 12035171, 12058405, 11816967, 12125657, 12204060, 12394044, 12519858, 12864982, 12754192, 12673738, 13058122, 12984759, 13041601]
3436A3041601n1529J54437R5308J42034L74385M43560J89458M0646j17979J76524
3426A4488445Q41421M76933m19639j17966M07931L8841N07648K58429l8359N15432
3416A6959116J57039k06649R1096L06039J59830J74044L57426J50856L053J52410
3406A8304260P0314J33887M13701M92492J76589K24551J10028N13146J05051o610
3396B0537409J39239l5920J14408J34476L58836K19073M25990L12846k9232K87879
3386B2465004P63883L72788M65731O49499M9506k1723O75740M74563P41220K56259
3376B6892470J48697P32166j69557K90902K63457L07562M32670J47418N08647
3367B9554432O45458K26743k1504O6691N69556O64474O07929N20165K37796L37809
$$ y = [13041601, 12990072, 13144509, 13239817, 13381851, 13756236, 14199796, 14389254, 14429900, 14311921, 14488445, 15329866, 15806799, 15387160, 15269194, 15677125, 15715966, 16223614, 16482043, 16443684, 16959116, 17116155, 16909506, 17000602, 17306641, 17466471, 17640515, 17997941, 18148797, 18151850, 18304260, 18374574, 18508461, 18922162, 19414654, 19591243, 19815794, 19925822, 20438968, 20544019, 20537409, 20676648, 20640728, 20755136, 20889612, 21248448, 21467521, 21893511, 22206357, 22177125, 22465004, 23228887, 23601675, 24067406, 24716905, 24766411, 24744688, 25420428, 25894991, 26636211, 26892470, 27041167, 27773333, 27603776, 27894678, 28158135, 28465697, 28898367, 29045785, 29554432, 30199890, 30426633, 30405129, 30471820, 31041376, 31705850, 32313779, 32833944, 33071740, 33409549]
3357C3409549N62524P55807M88747N80965K92656N93250O60686O63471O92079
3348C8699734M57836L98978R84244J134959R11712J217856Q83913J558536J384561
3339D7632329J226207J425707J521212K094791K039740J512330J969633K036047
3331F1457996K742218L078225L115183K655860K995209L447686K903947L893947
3323H6290271L106725L172544L360479K622393K898434L297057K835427K898213
3315A10481543K730625K799316K154723K032267J850837J260142J222456M99856
3307A25031765J36609L51931k69470k48580m68970j023886j117035p41828j068033
3298A20582503j678517j119906j102824j619523j060022j070409j566903j252036
$$ y = [33409549, 33972073, 34727880, 35216627, 35797592, 36090248, 36683498, 37344184, 38007655, 38699734, 39157570, 39556548, 40540792, 41675751, 42587463, 43805319, 44689232, 46247768, 47632329, 48858536, 50284243, 51805455, 53900246, 55939986, 57452316, 59421949, 61457996, 64200214, 67278439, 70393622, 73049482, 76044691, 79492377, 82396324, 86290271, 89396996, 92569540, 95930019, 98552412, 101450846, 104747903, 107583330, 110481543, 113212168, 116011484, 118166207, 120198474, 122049311, 123309453, 124531909, 125031765, 125168374, 125520305, 125250835, 125002255, 124533285, 123509399, 122392364, 121650536, 120582503, 118903986, 117784080, 116681256, 115061733, 114001711, 112931302, 111364399, 110112363]
3290A10112363j827781j199249j136543j287008q19918m69993n98304k81021J44677
3281A02637223K95352L55154P18914J195640J183687J830753J618598J619761
3273A11455082J534920K137938K433790K674954L038167L216202L865841L358592
3265A33715486M290897M396148N003567N237874O285611P169946P295628P642894
3257A81038051Q710489R904246R731901J0260540R985396J0077420R586581Q574734
3249B57869358P676844O514362N912212N830867N303473M858747N749454N668988
3241C05384305N399370L452215J669282j40139k335943l296156m730117o223470
3233B99179347p264913p839294q543937r668257j0263956j0036528j0257578j0029569
$$ y = [110112363, 108284582, 107085333, 105948790, 104661782, 103841864, 103371871, 102773567, 102492546, 102637223, 102932575, 103287729, 104006643, 105202283, 106385970, 108216723, 109835321, 111455082, 112990002, 115127940, 117561730, 120236684, 123274851, 126491053, 130356894, 133715486, 138006383, 142402531, 147406098, 152643972, 158929583, 166099529, 173395157, 181038051, 189748540, 199652786, 209384687, 219645227, 229630623, 239708043, 249294624, 257869358, 265546202, 272060564, 277972776, 283803643, 289107116, 293965863, 299715317, 305384305, 310783675, 314235890, 315905172, 315765033, 313429090, 310132934, 305402817, 299179347, 291914434, 284075140, 275531203, 265862946, 255598990, 245562462, 235304884, 225275315]
3225B25275315j0029978r982839r340995r205477q641446q257837p820363p939957
3217A54056423p410747o482834o876902n742494n054523m826051m268114l689535
3209A09705223l122127k815319k957331k559210j865089k053660j854984j393645
3201I1083858j219843r50659n20971n14922n41492p63638q38090q29145p23935
3192H4181163o76287r4960j28216m83730o35324o99014j004017j169640m66689
3183G8823286j109856j299198j095259p42427j074605o80269o06m58307n82226
3174G1780533p6975r2469l06155n62004N30K78172P60777M04522M21773Q47279
3164G3455983P82445J073834N34819J259534J471193J131372J179102J493836
$$ y = [225275315, 215245337, 205262498, 195921503, 186716026, 178074580, 169816743, 161996380, 154056423, 146645676, 140162842, 133285940, 127543446, 122488923, 117662872, 113394758, 109705223, 106583096, 103767777, 100810446, 98251236, 96386147, 94332487, 92477503, 91083858, 89864015, 88913356, 88392385, 87877463, 87335971, 86572333, 85734243, 84905098, 84181163, 83504876, 83409916, 83281700, 82797970, 82162646, 81463632, 80459615, 79289975, 78823286, 77713430, 76414232, 75318973, 74576546, 73501941, 72821672, 72821066, 72362759, 71780533, 71703558, 71611089, 71304934, 70742930, 70743460, 71021632, 71782409, 72186931, 72608704, 73455983, 74238428, 75312262, 75847081, 77106615, 78577808, 79709180, 80888282, 82382118]
3156H2382118J878227K050802J706754K069136K810163K765956L055098K927158
3148A01645412L311814L266671L296036L063359L430263L473284L211603K790371
3140A27488813K776407K869862K139774J521219J590567J260923O60692O09746
3132A40918003O28526N31094N243J8043p77977j19998k10681L05646K61211J87493
3122A41746603Q12410O67255J047251J486119J895609K198294K006091L020536
3114A54880168L227126L016719L900400M200573L735799L524684L476913L184579
3106A83146961K902930K103049J544236Q42681N29676l92593o39796o77646j038366
3097A88321132j182200p25801o96411l26195n57495j88138l12011m99471m58611
$$ y = [82382118, 84260345, 86311147, 88017901, 90087037, 92897200, 95663156, 98718254, 101645412, 104957226, 108223897, 111519933, 114583292, 118013555, 121486839, 124698442, 127488813, 130265220, 133135082, 135274856, 136796075, 138386642, 139647565, 140308257, 140918003, 141546529, 142077623, 142082866, 142100909, 141322932, 141202934, 140992253, 141297899, 141559110, 141746603, 142559013, 143226268, 144273519, 145759638, 147655247, 149853541, 151859632, 154880168, 158107294, 161124013, 165024413, 169224986, 172960785, 176485469, 179962382, 183146961, 186049891, 188152940, 189697176, 190539857, 191069533, 190676940, 190037144, 189359498, 188321132, 187138932, 186413131, 185716720, 185390525, 184833030, 184644892, 184332881, 183833410, 183374799]
3088A83374799L9128n65123r06464p30182p43537o85252r85850o40707r57934
3079A77198878n81703l45923q38642o79630q41512j408121j431242k207931k238204
3070A66625970l097163l771959m119839m531400m494088m089370n055565n026983
3062A32439603m366899n032655m873866m342448m631353m403326m333954m024766
3054I6430336l636273l031710l419763l512303k529027l003674k767532k576379
3046G1953675k157749k205663j989678k156277j565870q92194j466433p41633
3038E8778178j168773r00817n26802l38391o04592q43098p63876m40966m41049
3029E2749814n26543j233703q45262r06921m47134q34030j258664q97316m06262
$$ y = [183374799, 183413927, 182848804, 181942340, 181212158, 180468621, 179783369, 178797519, 178156812, 177198878, 176617175, 176271252, 175432610, 174752980, 173911468, 172503347, 171072105, 168864174, 166625970, 163528807, 159756848, 155637009, 151105609, 146611521, 142522151, 137466586, 132439603, 128072704, 123040049, 118166183, 113823735, 109192382, 104789056, 100455102, 96430336, 92794063, 89762353, 86342590, 82830287, 80301260, 77297586, 74530054, 71953675, 69795926, 67590263, 65600585, 63444308, 61878438, 60986244, 59519811, 58778178, 57609405, 56708588, 56181786, 55843395, 55238803, 54395705, 53631829, 53190863, 52749814, 52223271, 50989568, 50144306, 49237385, 48790251, 47956221, 46697557, 45800241, 45393979]
3020D5393979q93568l01598m57058r57095o37073q62493m31037k39931n16837
3011D0097289p90693q17580l11059p42718r88071q91552k52194p65114r34582
3002C3603726m26571j054345k96551n97587m58055r70353n50227k00602o94663
2993B8354772j131946J23778j98047l74124o20888l9818l09955l48396l31371
2984B5124005J23941k58110m00061m48428k63021j21794p14610J89282n1600m21472
2974B2758132M2225l50317k38655K23557m91733l57663N84671J89951l67420j31378
2964B1861370m28108N9277J66738J87802m72535o2824J63610Q0261P5809k87043
2954B1344357O14383J53296J42073K79829K03116K70345K44464j9141M95568K74672
$$ y = [45393979, 44500411, 44198813, 43741755, 42784660, 42147587, 41285094, 40854057, 40614126, 40097289, 39306596, 38489016, 38177957, 37435239, 36447168, 35555616, 35303422, 34538308, 33603726, 33177155, 32122810, 31826259, 31228672, 30770617, 29800264, 29250037, 29049435, 28354772, 27222826, 27346604, 27148557, 26774433, 26153545, 26113727, 25803772, 25455376, 25124005, 25247946, 24989836, 24589775, 24141347, 23878326, 23756532, 23041922, 23231204, 23179604, 22758132, 22800357, 22450040, 22211385, 22434942, 21943209, 21585546, 22170217, 22360168, 21992748, 21861370, 21433262, 21492539, 21659277, 21847079, 21374544, 21311720, 21475330, 21555591, 21631400, 21344357, 21958740, 22112036, 22254109, 22533938, 22737054, 23007399, 23251863, 23232722, 23728290, 24002962]
2944B4002962J93120L62381M72940o0030K15624Q30079L30034N88277N70127K29023
2934B7734537M11852N33150L84362M23514L58131M93186J231087P81416M92384
2925C2843619R27926N49422M85722J114012R73814J280697J030009J061225N85552
2916D0851998K58727L43986K96032O17921L48936L38407L60186K39086J68500
2907D3823779N49229P20538N40100O20356R01596Q84422R36044R97035O62852
2898E0635951M60296P02704O23921J281116J759694J135124O35621J161634J946615
2889F0342676J693482J448773K513875J870691K050465K180025K542950K587342
2881G7230279K767300L445645L051302K805137L309035L542800L321387M089129
$$ y = [24002962, 24196082, 24558463, 25031403, 24971373, 25186997, 26017076, 26347110, 26935387, 27505514, 27734537, 28146389, 28679539, 29063901, 29487415, 29845546, 30338732, 31569819, 32351235, 32843619, 33771545, 34320967, 34806689, 35920701, 36894515, 38175212, 39205221, 40266446, 40851998, 41110725, 41454711, 41750743, 42368664, 42717600, 43056007, 43416193, 43655279, 43823779, 44373008, 45093546, 45633646, 46254002, 47155598, 48040020, 48976064, 49973099, 50635951, 51096247, 51798951, 52422872, 53703988, 55463682, 56598806, 57234427, 58396061, 60342676, 62036158, 63484931, 65998806, 67869497, 69919962, 72099987, 74642937, 77230279, 79997579, 83443224, 86494526, 89299663, 92608698, 96151498, 99472885, 103562014]
2873A03562014M342053M144202M887287N157694O149320O980430P246915Q542938
2865A51012853R182572J0395728J1271117J1760491J3811543J4697512J5718036
2858B37849852J6729737J9569252K2877283K7308519L1932918L6639402L9740469
2851D32647432L8841551L2177529J8141326J47408j3265654j9159861j8824799
2844D70704932j5933257j3224458j0238401o592336l629572k071384l922171r328477
2836D05764876j7480119k4339690k9264767l0078447k7660942k4966250k2085101
2829B29889560j9128570j5893569j4565482j2685184j1865440j0488045r121096
2822A36142174q322407p579782p350783o410375n979340n541723m405254m568055
$$ y = [103562014, 107904067, 112048269, 116935556, 122093250, 128242570, 135223000, 142469915, 151012853, 160195425, 170591153, 181862270, 193622761, 207434304, 222131816, 237849852, 254579589, 274148841, 297026124, 324334643, 356267561, 392906963, 432647432, 471488983, 503666512, 521807838, 521955246, 508689592, 489529731, 470704932, 454771675, 441547217, 431308816, 424716480, 421086908, 419015524, 415093353, 405764876, 388284757, 363945067, 334680300, 304601853, 276940911, 251974661, 229889560, 210760990, 194867421, 180301939, 167616755, 155751315, 145263270, 136142174, 127819767, 120239985, 112889202, 106478827, 100499487, 94957764, 90552510, 85984455]
2814H5984455m115483l854028l570695l515450l319546k470455k270287k333286
2806F0535225k080121k240058k094858j633737j811857j472977j686613r35834
2798D6579170j452637j064019r68716j513636p55440j138546j172357j014829
2790C7498990q38378j545766n83580o23774o39334p80335o75406p40182l86086
2781C0686149q58083r52093n69092n78985r45040p85963k74468n94722n11904
2772B4615799j13774k06271m15908k49184j37905j23645j38035n1601J39209N25809
2762B3844494M35299M84667N50287J3503o4074j48259j121846j480919j052141
2753B1461011p06949j28734m31944l11431m71819K49206M74782P53738R9269M91662
$$ y = [85984455, 81868972, 78014944, 74444249, 70928799, 67609253, 65138798, 62868511, 60535225, 58455104, 56215046, 54120188, 52486451, 50674594, 49201617, 47515004, 46579170, 45126533, 44062514, 43093798, 41580162, 40824722, 39686176, 38513819, 37498990, 36660612, 35114846, 34531266, 33907492, 33268158, 32487823, 31812417, 31072235, 30686149, 29828066, 28875973, 28306881, 27727896, 26782856, 25996893, 25722425, 25127703, 24615799, 24502025, 24295754, 23879846, 23630662, 23492757, 23369112, 23231077, 23179476, 23318685, 23844494, 24279793, 24764460, 25314747, 25328250, 25264176, 25115917, 23994071, 22513152, 21461011, 20754062, 20625328, 20193384, 19881953, 19410134, 19659340, 20134122, 20887860, 20987129, 21478791]
2743B1478791N04414q4705j474349j153273n26338j070305o95885r27798m85864
2734A5564688p65088l37808n47348r9254l48793m81569k07185l08986l90594r0099
2724A1987964n4357k03764O4488j22058k96555j17441K93599j80169l5407J39758
2714A1476058m68331l22473L83107n33348n36833j73103j92026M0912k20597O8735
2704I522101l68830n41596k18315l75088n40435N3981K9098k02767j14030m07375
2694F836744k60042J08192K0687j62460j24595j56019j95221o3502l45132p2710
2684E585942k42401J20379K00111l7777k99961J48967j7820J6078k36493m17662
2674D819363M69961J32657k03071K14121l67060k70774j05370l90578J89385j05404
$$ y = [21478791, 21983205, 21898500, 20424151, 19270878, 18744540, 17674235, 16978350, 16050552, 15564688, 14799600, 14461792, 13914444, 13815190, 13466397, 12984828, 12777643, 12468657, 12078063, 11987964, 11933607, 11729843, 11794331, 11672273, 11375718, 11258277, 11551876, 11371707, 11336300, 11476058, 11007727, 10685254, 11068361, 10535013, 9998180, 9825077, 9633051, 9673963, 9453366, 9522101, 9153271, 8611675, 8393360, 8018272, 7477837, 7531818, 7560916, 7358149, 7244119, 6836744, 6576702, 6684894, 6705581, 6543121, 6418526, 6262507, 6067286, 6003784, 5658652, 5585942, 5343541, 5463920, 5664031, 5626254, 5326293, 5475260, 5457440, 5473518, 5237025, 4819363, 5289324, 5421981, 5218910, 5433031, 5065971, 4795197, 4689827, 4299249, 4488634, 4383230]
2664D383230j64129j50862j6440k30856K1042o7162m14868O4008j57818R4820
2654C360965K27843Q3422r3392K41590l72346m7704j42330o6031j29560k81921
2644B780536J87095K34464o7885J19848p4432J80042j2433O295m48438j72370
2634B732722K80826J5806r4731k4624k76468j52908M34978r7568L9694J77954
2624C035681j35176k34941k06143j01418L18431K23020j92162K81025J90581m00544
2614B778354J26486R492Q795R8560L3375K28360n40347M44812K3167r77364m2370
2603B191320L17536L00237j71007k51207o0498k43499L2942P19725k15575m78877
2593B141097M80106K24637J58517q8325m12259K4667J61528K48009l35442K61177
$$ y = [4383230, 4219101, 4068239, 4051799, 3820943, 3841985, 3774823, 3359955, 3423963, 3266145, 3360965, 3588808, 3672230, 3578838, 3820428, 3448082, 3400378, 3258048, 3192017, 3062457, 2780536, 2967631, 3202095, 3134210, 3254058, 3179626, 3359668, 3347235, 3353530, 2905092, 2732722, 3013548, 3029354, 2934623, 2909999, 2633531, 2480623, 2915601, 2818033, 2857727, 3035681, 2900505, 2665564, 2459421, 2358003, 2676434, 2899454, 2707292, 2988317, 3178898, 2778354, 2904840, 2914332, 2923127, 3021687, 3055062, 3283422, 2743075, 3187887, 3211054, 2233690, 2191320, 2508856, 2809093, 2638086, 2386879, 2326381, 2082882, 2115824, 2835549, 2619974, 2141097, 2621203, 2845840, 3004357, 2916032, 2503773, 2528440, 2689968, 2937977, 2602535, 2863712]
2583B863712j86125N2253q8452K07539N51341o46167m20454K14494J81039M89124
2573C218304l14283N23845K17616L0968j57460j59885M23282L06667N2898m1550
2563D100402P9701J34654k61946j83112m7226K01892r9708l36789J67259k46324
2553C508803O7191m29678k21212K30463o97641l00614P36780j52816m21426J99774
2543B519624j14223j6394o2431m9239l40961m0690O3316o46771L46437K23882
2533A882550N1027J48195l66004n84476L63298J03838l3923L1797J58391k38384
2523A516309n37364J11078O4020o8071j27653L39003M94846k20652o52679L12733
2513A231570K4599j32046J05148K46061j8745J21051R9611k55964m0696K64575
$$ y = [2863712, 2677587, 2729840, 2641388, 2848927, 3400268, 2754101, 2333647, 2548141, 2729180, 3218304, 2904021, 3427866, 3645482, 3676450, 3518990, 3359105, 3782387, 4089054, 4141952, 4100402, 4180103, 4314757, 4052811, 3869699, 3822473, 4024365, 3924657, 3587868, 3755127, 3508803, 3575994, 3146316, 2925104, 3155567, 2457926, 2157312, 2894092, 2741276, 2319850, 2519624, 2405401, 2389007, 2326576, 2277337, 1936376, 1895686, 1959002, 1312231, 1658668, 1882550, 1933577, 2081772, 1715768, 1131292, 1494590, 1598428, 1564505, 1596302, 1754693, 1516309, 978945, 1090023, 1154043, 1085972, 958319, 1297322, 1792168, 1571516, 918837, 1231570, 1256169, 1124123, 1229271, 1475332, 1456587, 1577638, 1677249, 1421285, 1380589, 1645164]
2503A645164k14721l43374J2906M2243l46692J15417P588J17985l087j31995J11047
2492A012481P0450q4450K68032j23744l56124j45808J1913N9834n97971M70469
2482E85082Q9084J21804j51768k85972L21084P4797M56031R3276r8538k43927
2472I60953j95487j47076O9795N15240J73583m27903O1773j90491j42332p4235
2462F03820O8092N28530J09176K30472k81957K86436j99973m95838k29923m3469
2452E75366J15986K27270J13864O7440k1580L27432k27771j94942l02837M33062
2442A113290j16070k8734L40010N5892q738n18995q9165J94902K4260K33796O0197
2431A260645k80837l04332M312J95913N624j64617k51775K30775J49868J17870
$$ y = [1645164, 1430443, 1087069, 1099975, 1142218, 795526, 910943, 918531, 1036516, 1033429, 901434, 1012481, 1082931, 998481, 1266513, 1142769, 786645, 640837, 652750, 712584, 114613, 585082, 674166, 795970, 644202, 358230, 679314, 754111, 1210142, 1303418, 1204880, 960953, 765466, 618390, 688185, 1203425, 1377008, 949105, 1010878, 820387, 678055, 603820, 671912, 1200442, 1309618, 1540090, 1258133, 1544569, 1344596, 848758, 618835, 575366, 691352, 918622, 1032486, 1099926, 1078346, 1405778, 1178007, 983065, 680228, 1113290, 997220, 968486, 1308496, 1364388, 1355650, 836655, 747490, 942392, 966652, 1200448, 1260645, 979808, 675476, 679788, 875701, 881325, 716708, 464933, 695708, 845576, 963446]
2421I63446j28961m9680Q7576j49860J4480m0416m33875m2868K13221J71572j38141
2410D66494M3652L71282k77930l1661p3608n7020l3439j9820K60595j09436J78516
2399G17625n8153P9718L09882k06634l89851p58107J60077M31175L24314J74635
2389G84681Q6427k04779K2471m04776L55872J23659m6243K34404l33156j89908
2379D28652P7579k5322J35655M58614K15016K29656L72570J16178j82831K9377
2369A855144l39124l34223J51723O2031m62688l6302j55642M3251L20210k74630
2359H29750j97670K99160j66545M49j35753J40949L94172l94662m63109N04902
2349H11643k94857N7851q321Q3453m0260j48603J39328K40060q5101r1991k95358
$$ y = [963446, 834485, 784805, 872381, 722521, 737001, 696585, 262710, 219842, 433063, 604635, 466494, 510146, 881428, 603498, 571837, 498229, 441209, 407770, 387950, 648545, 539109, 717625, 659472, 739190, 1049072, 842438, 452587, -305520, -145443, 285732, 610046, 784681, 871108, 666329, 688800, 284024, 639896, 763555, 717312, 951716, 618560, 428652, 506231, 480909, 616564, 1075178, 1290194, 1519850, 1892420, 2008598, 1825767, 1855144, 1516020, 1181797, 1333520, 1395551, 932863, 896561, 740919, 784170, 1104380, 829750, 632080, 931240, 764695, 765144, 629391, 770340, 1164512, 769850, 306741, 811643, 516786, 574637, 566316, 649769, 609509, 460906, 600234, 840294, 755193, 663202, 367844]
2338C67844r997N06404k52231M4834M89965k48734o17382l6549K70865j9087l10839
2327A85093j91467J76957J68734J49808J96910j32997m55804K80109M313k51059
2317A30597m9576J32935M63632J99358O8235j60911J94292o0452n6742K23576
2307A084944j28466K6360k72152n2136m9936M8064j36949K5938Q3808K04787j7702
2296H16560k42594L08627L19308l46544k52832K09122L62275j29625l49754J13181
2286H07724j09307Q484n6271j99951N05511j12124m51475j78921J24513L87061
2276G25244J01725K8002K17077p4879j28467r2884L58194k54859l70892M2207
2266E50468l63551L23586J0279K61795j76314K71850L60705k78696m8537n2844
$$ y = [367844, 357847, 864251, 612020, 656854, 1146819, 898085, 280703, 244154, 515019, 495932, 185093, -6374, 170583, 339317, 489125, 686035, 553038, 97234, 377343, 381656, 130597, 81021, 213956, 677588, 876946, 945181, 784270, 978562, 918110, 861368, 1084944, 956478, 982838, 710686, 658550, 608614, 656678, 519729, 545667, 629475, 834262, 816560, 573966, 882593, 1201901, 855357, 602525, 811647, 1173922, 1044297, 694543, 807724, 698417, 706901, 650630, 450679, 956190, 844066, 392591, 213670, 338183, 725244, 826969, 854971, 1072048, 997169, 868702, 775818, 1134012, 879153, 508261, 550468, 186917, 510503, 520782, 782577, 606263, 878113, 1238818, 960122, 911585, 858741]
2256H58741n15320J25091j76441J41599J82379M30980M6356p7090j29658K29541
2246A116178p8956Q56j22159L1278K90688J8970k0222k42566J67059M7450j35212
2235A073364q9075o8034p6970K52511j52208j32052J43857K21258K533J46712
2225A321896j39005j08760l16396K74293J87177J31300j55518m08153M35069K70910
2215A492813k16183L0118r7510L90038k64532r6991L38477J31949j24551R3015
2205A676643J93098k99065L09981l7090L06531k45315o7421k60521N50189O13934
2195B740964L8701l49640r5090k7112J08685L72109M35517J36006j65653j80990
2185C013497J10901L79697k15640k70636k6926O3943q4110M27084K96341k13762
$$ y = [858741, 343421, 468512, 292071, 433670, 616049, 1047029, 1093385, 1016295, 886637, 1116178, 1037222, 1038078, 915919, 947197, 1237885, 1256855, 1236633, 994067, 1161126, 1208576, 1073364, 984289, 916255, 839285, 1091796, 939588, 807536, 951393, 1172651, 1175184, 1321896, 1182891, 1074131, 757735, 1032028, 1219205, 1350505, 1194987, 786834, 1221903, 1492813, 1276630, 1306748, 1209238, 1599276, 1334744, 1237753, 1576230, 1708179, 1583628, 1676643, 1869741, 1570676, 1880657, 1843567, 2150098, 1904783, 1837362, 1576841, 2127030, 2740964, 2779665, 2430025, 2334935, 2307823, 2416508, 2788617, 3224134, 3360140, 3194487, 3013497, 3124398, 3504095, 3288455, 3017819, 2990893, 3054836, 2970726, 3397810, 3694151, 3480389]
2175C480389k16472J58780L91047o8165j19243j32054L76571N11291J46721j77612
2165D351253K43210M29272l00835L38675j02988k96138L50059J16801K82152j02942
2155E308519L77418j67669K81180R7667M38699L19838L06714L49321O34288J67775
2145H113750M67285Q6842J02829P98328J78629q8848L60954N68162M71660O24175
2135A1683766J345102M36900j36729R07141O76844M81332Q32088N94255Q59926
2126A7680625K18132O63888Q03732P67535J666896J606299K529138K576412K189986
2117C0702643P06946J339021K505875L203148L953830M982681N394740P853339
2109F0642223J0946186J5366316K0381776K9445831M1241099N0735883M749270
$$ y = [3480389, 3263917, 3422697, 3813744, 3745579, 3626336, 3494282, 3870853, 4382144, 4528865, 4351253, 4594463, 5023735, 4722900, 5061575, 4958587, 4662449, 5012508, 5129309, 5411461, 5308519, 5685937, 5518268, 5799448, 5897115, 6335814, 6655652, 6962366, 7311687, 7945975, 8113750, 8581035, 8667877, 8770706, 9569034, 9747663, 9658815, 10019769, 10587931, 11059591, 11683766, 13028868, 13465768, 13329039, 14236180, 14913024, 15394356, 16226444, 16820699, 17680625, 17898757, 18562645, 19366377, 20133912, 21800808, 23407107, 25936245, 28512657, 30702643, 31409589, 32748610, 35254485, 38457633, 42411463, 47394144, 52788884, 60642223, 71588409, 86954725, 107336501, 136782332, 178023431, 228759314, 233508584]
2102B33508584m0927512m4729342l4567811k2336467j6184112j1742309r641204
2095E3379827p244940n540966l126167l057356k165798j719771j232926k063242
2087B7228661k640521k626632j931069j579710j092889j267593j146495j280201
2079A3663551q40232l98684m77589p34570m64928m90481m6221o82052k55315m72610
2069H800869j98921l22319n63559k97005l51176j17573j25817l46634j60527k38678
2059F078660j6071l0789j99147J40229l09267m14054k08708j81972k09981K11744
2049D860644l24247K9872L0692j20627r0003l24166n1645m23906M30100k79178
2039C737536n00884j18343j24537k51582P9707M8718P4145l28878j79491M9296
$$ y = [233508584, 192581072, 147851730, 113283919, 90947452, 74763340, 63021031, 53379827, 46134887, 40593921, 37467754, 34410398, 32244600, 30524829, 29291903, 27228661, 24588140, 21961508, 20030439, 18450729, 17357840, 16090247, 14943752, 13663551, 12823319, 12424635, 11947046, 11212476, 10747548, 10257067, 10210846, 9528794, 9273479, 8800869, 8601948, 8279629, 7716070, 7419065, 7067889, 6950316, 6824499, 6477865, 6317338, 6078660, 6062589, 6031800, 5832653, 5972882, 5663615, 5249561, 5040853, 4858881, 4648900, 4860644, 4536397, 4566269, 4596961, 4476334, 4386331, 4062165, 4010520, 3586614, 4016714, 3737536, 3236652, 3118309, 2993772, 2742190, 2821897, 2870615, 2944760, 2615882, 2436391, 2485687]
2029B485687m969j04137l45310J05931K58136K49187o8287m94451K82031k36700
2019B127118k29970j04210j71792m0616M52090j69206J17812P1407j49009l07
2009A903317P6530J31093J21924k82343K02380k55588l24744J18225K995J42530
1999A836319m7262j09276j2627l6875k82259K80804J68692k03604k977R605N059
1988A605599l3950k30930m75163L58643O9980k9156J24345m12822K59870l21331
1978I15085K62342r797m45737L49633k78239m4370J00331o7780l03953J89549
1968F67064J24008q4769l30057j37282O97035J87279l1258l69085M6199j30795
1958F38339l1409K56095K19845m82301m1974N03486k981j5484k02844l47933J28486
$$ y = [2485687, 2480718, 2376581, 2031271, 2137202, 2395338, 2644525, 2576238, 2081787, 2363818, 2127118, 1897148, 1792938, 1621146, 1580530, 2032620, 1863414, 1981226, 2052633, 1903624, 1903317, 1979847, 2110940, 2232864, 1950521, 2152901, 1897313, 1572569, 1690794, 1693789, 1836319, 1789057, 1679781, 1667154, 1630279, 1348020, 1628824, 1797516, 1593912, 1590935, 1600540, 1605599, 1571649, 1340719, 865556, 1224199, 1294179, 1265023, 1389368, 976546, 1236416, 915085, 1177427, 1167630, 721893, 1071526, 793287, 748917, 849248, 781468, 477515, 667064, 791072, 706303, 376246, 238964, 935999, 1123278, 1092020, 722935, 769134, 638339, 606930, 863025, 1082870, 600569, 558595, 1062081, 1059100, 1043616, 840772, 492839, 621325]
1947F21325J5712j27746j13717L36368J32206j77783m1003K20987L20600j10659
1937A076290J74923m55216j60010K84548k36710k55742q021O2509J86833j50368
1927E19036l614M46098p72190M25721L25005n02265j64230M3715j22786R2513
1917B87003P8319o7031j31390J86560J04106k0162j25045L0306J1039j00396o3301
1906A90008J61844J37851Q2810Q9756Q4069L7163j23206l63031k02714M13806
1896E08356j6396k50922L47987j04800n5936M20651K06356n81749m9865M0739
1886D64421J92930K92614k99014l11723J4525K28773J25469j97850l30714K89305
1876D68736J44388j02625M56509o6317k63385k54928j03648K70113j85279K51701
$$ y = [621325, 637037, 509291, 395574, 731942, 864148, 686365, 645362, 866349, 1186949, 1076290, 1251213, 795997, 635987, 920535, 683825, 428083, 420062, 482571, 669404, 519036, 515422, 961520, 189330, 615051, 940056, 437791, 273561, 317276, 194490, 287003, 365322, 298291, 166901, 353461, 457567, 437405, 312360, 342666, 353705, 253309, 190008, 351852, 489703, 572513, 662269, 746338, 783501, 660295, 297264, 94550, 508356, 491960, 241038, 589025, 484225, 428289, 848940, 1055296, 473547, 423682, 464421, 657351, 949965, 650951, 339228, 353753, 582526, 707995, 510145, 179431, 468736, 613124, 510499, 967008, 900691, 637306, 382378, 278730, 548843, 363564, 615265]
1866F15265K89512o32349K68069J02237k21305P9398l48908j54238L5426L95626
1856D28733P8705l27025p0482P78090k91063k90251O5942L88478m7072l52152
1846C61903k7422L30359k13134j83567L64192m81069L09849Q579O9001M06402
1836I45093K63885p1169k37938K85510P8845m2620o25090K11381j56623m33726
1826B17548Q753J66084k00784j27311K44618K71592l52565l9552J93788k03644
1816A78527K09627k54827l25690K48130J25923J39456L09283l19237o1371k30352
1806A9469K58650K9864P829K01999j9105J67115j87277m26750n358j87372k05078
1795c46014N79307p4021M6355k13627J58222L60558L95816m19174k8619m52846
$$ y = [615265, 904777, 272428, 540497, 642734, 421429, 500827, 151919, -2319, 33107, 428733, 507438, 180413, 109931, 888021, 596958, 306707, 372649, 761127, 714055, 361903, 334481, 664840, 451706, 268139, 632331, 151262, 461111, 469690, 538691, 945093, 1208978, 1137809, 899871, 1185381, 1264226, 1221606, 596516, 807897, 651274, 217548, 226301, 392385, 191601, 64290, 308908, 580500, 227935, 188383, 382171, 178527, 388154, 133327, -192363, 55767, 181690, 321146, 630429, 311192, 249821, 19469, 278119, 307983, 315812, 517811, 498706, 665821, 478544, 51794, 46436, -140936, -346014, 233293, 159272, 205627, -8000, 150222, 510780, 906596, 487422, 458803, 5957]
1785E957p2367j86891j7937L41400j5236K4821L1520j57343j58555J08457K29983
1774A33809j03904J13893M05466J9928k37267j30987K66065J05137p3545k88930
1764B09665L38961l06228l89398K09816J78373J44303m2636m86598R4390K47394
1754A98042N4969j65475q7089K27696K46566k03409q357o3473K9512L26049L868
1743E58899l3415j09981m57220k78566l49383M12221J89425k20412L5216K83336
1733C0120J96683P8391l84537j60089M1883J10169p5988J52008k5611m6877k89739
1722c73587J87280K35484l97113O8783j4417M87884R9102M2375r5781j81557j00145
1711d1692J20341K17387l8524j67999j3086K13705m68971K57347L34308j30208
$$ y = [5957, -66410, -253301, -271238, 70162, 54926, 79747, 111267, -46076, -204631, -96174, 133809, 29905, 143798, 549264, 569192, 331925, 200938, 467003, 572140, 498595, 209665, 548626, 242398, -147000, 62816, 241189, 385492, 342856, -143742, -49352, 198042, 253011, 87536, 447, 228143, 474709, 271300, 262943, 199470, 228982, 555031, 558899, 525484, 415503, -41717, -320283, -669666, -257445, -68020, -288432, -253216, 30120, 226803, 305194, -79343, -239432, -197549, -87380, -163368, -11360, -36971, -83848, -373587, -186307, 49177, -347936, -279153, -293570, 194314, 293416, 335791, 240010, 58453, -41692, 78649, 296036, 257512, 89513, 76427, 290132, -178839, 78508, 412816, 282608]
1701B82608K73419j89454j37483l81743J08426q0052M1075N04803K58230l32355
1691C47474P1205m34059q0539n5160J4426l30554J08761J28634N1621j57403j16793
1680d52387K13294K35551J20720j40815M62408j71763k55593j99922k30134J73837
1670b44804J26820l98336L45042L87584r4159j79986l1003k06623j59237M33373
1660b1329J9605k00221K16978p2139n1875j56259M06430K12141P7792k52245q0429
1649I8449j47365K48572l36906O0803K42282J39285l38111l23739K4981J74075
1639a57674k78614L54838P9528k33477P490k36939L91747M54628j69594k00864
1629A1069J98478j45178o12805M40773K85949j00070q6750r1468n20139J83221
$$ y = [282608, 556027, 366573, 229090, -152653, -44227, -124279, -83204, 421599, 679829, 347474, 418679, -15380, -95919, -151079, -136653, -467207, -358446, -229812, -178191, -335594, -452387, -239093, -3542, 117178, -23637, 438771, 267008, 11415, -188507, -418641, -244804, -117984, -516320, -171278, 216306, 122147, -57839, -88842, -295465, -454702, -21329, -1724, -201945, 15033, -57106, -108981, -265240, 141190, 353331, 431123, 178878, 98449, -48916, 199656, -137250, -76447, 165835, 305120, -32991, -356730, -331749, -157674, -436288, -81450, -1922, -235399, -227909, -464848, -73101, 381527, 211933, 11069, 209547, 64369, -548436, -107663, 178286, 78216, -8534, -100002, -620141, -436920]
1619d36920N41805J6490k7081j34910Q3280n21232j01499N00430L00781l76509
1609a55365L23166j30304N7867j01296J94646P0695K94067l3468n30853j94282
1599b05127k79701L36581Q7351P6464Q3503l41957M66610K93853k72422j08588
1589A36567R7697k65092J48417m0724M0353l73964p2388K37861m26673K02992
1579c14954M98221J02344k83632n0621K64166j56718L4324l8016q198J80413j06947
1568A20382K92752k17850k88164N44100O2964k45454q306m3212k81441n2790n4093
1557a71112K81782l36065l01164J63006M02659j92640O5081n0041m32717K24340
1547c46871J39401J92081j84854l72815M49976k02905k12734R8986J79930L726
$$ y = [-436920, 104885, 121375, 94294, -40616, 42664, -478568, -580067, -79637, 221144, -155365, 167801, 37497, 95364, -5932, 188714, 259409, 553476, 520008, -10845, -205127, -484828, -148247, -60896, 15568, 99071, -242886, 223724, 517577, 245155, 136567, 234264, -30828, 117589, 76865, 117218, -256746, -329134, -91273, -517946, -314954, 183267, 285611, 1979, -48642, 215524, 58806, 93130, 55114, 46916, 227329, 120382, 413134, 195284, -92880, 451220, 514184, 268730, 260424, 217212, -64229, -117019, -171112, 110670, -225395, -526559, -363553, 39106, -153534, -88453, -138494, -571211, -346871, -207470, -15389, -200243, -573058, -123082, -325987, -538721, -439735, -259805, -256079]
1537b56079K50729L70376O9042j36160k81375m9437j31455M30467M2785n3862
1527B55031k35183J73581O6826J55982j12035j93896j59863K43885J09141l90185
1517h6716K71457J72157k42551J88809k0901J12810m77330l201M61319p4714K9792
1506C30931j23373L67255n51912k38885O6781J03916J84551J19251K696q2278
1496A78933o1498j87724o4189O1748j37281K71104l3843n78830O51696L8807p3417
1485F5506L12876j11517m6641m76810O2806k8920p5855J90923O3418l02321n3097
1474c99632J71329q0105K29484J10270j73681n15719j91551K09793M60459k18659
1464c98012J09097L86107K44995k10008o1715K09852k08115M38215M78559j83069
$$ y = [-256079, -5350, 365026, 434068, 297908, 16533, -32904, -164359, 266108, 308893, 255031, 19848, 193429, 260255, 416237, 304202, 110306, -49557, 194328, 303469, -86716, 184741, 356898, 114347, 303156, 282255, 395065, -82265, -85466, 375853, 301139, 330931, 207558, 574813, 22901, -215984, -149203, -45287, 139264, 258515, 261211, 178933, 117435, -70289, -134478, -72730, -210011, 61093, 27250, -551580, 100116, 138923, 65506, 378382, 266865, 220224, -256586, -193780, -222700, -298555, -107632, -44214, -346535, -399632, -228303, -308408, -78924, 31346, -142335, -658054, -849605, -639812, -179353, -398012, -288915, 97192, 342187, 132179, 70464, 280316, 72201, 510416, 988975, 805906]
1454H05906j64083j84421j27446k64933l36832l55659N090K02234L70542K69960
1444B20358k63091k16536K55446K05537k74982n34216J29575K51334r7707L05743
1434a8539J78914l54149K6659L96466J54481k65793J27838l68080k4941l5409
1424a82553M4188k44941j13137O8132J36368O3311k505M77143j38272j25070q4828
1413a02164k18226j11542j28248L43337J17196l28739k64206M66342K05847Q6524
1403F6121l13263J9393k6110p7517K3487n7499J4977k38361N7717k6786L04118
1392b53723m090Q2856J21150K79673R5950j55319k70114o4886j73433j05369K35492
1381b11813K31300K57909o8052l407j86567N3977K64522n77144L76425J92892
$$ y = [805906, 641823, 457402, 329956, 65023, -271809, -627468, -622378, -420144, -49602, 220358, -42733, -259269, -3823, 201714, -73268, -607484, -477909, -226575, -324282, -18539, 160375, -193774, -167115, 229351, 383832, 118039, 245877, -122203, -147144, -182553, -138365, -383306, -496443, -428311, -291943, -228632, -231137, 246006, 107734, -17336, -102164, -320390, -431932, -560180, -216843, -99647, -428386, -692592, -226250, -20403, 66121, -247142, -227749, -253859, -331376, -307889, -365388, -350411, -588772, -531055, -557841, -253723, -257813, -174957, -53807, 225866, 321816, 166497, -103617, -168503, -341936, -447305, -211813, 19487, 277396, 209344, 205937, 19370, 73347, 337869, -239275, 137150, 330042]
1371C30042J52597l14882j16177o6187M5972m51187j63012K56760j1210n8833
1361c96117L39958K57288n9911N0519r680K07173k24655m57150p6617J11631o7627
1350c25188L76434j36732k3238R9813q7976J60456j71733j44367K10777J41255
1340I9501m71667M60704J49169J00556j00977l83975J41435l60090p6326L77908
1330f3762o5031J20769k57481J63022J71525n5565J77226m464l02079k68576J78433
1319b05983M3600k767o9354J66270J19228j04706m9812K20133k82475j9043J98202
1308A3293m3008K31084k62977j33547J26666L00670q2430j89404M66341j97866
1298B28822j23955L55420l15378o16942K00780m8633j58381K1464O62749K60439
$$ y = [330042, 482639, 167757, 51580, -14607, 31365, -419822, -582834, -326074, -337284, -396117, -56159, 201129, 141218, 191737, 182057, 389230, 164575, -292575, -369192, -257561, -325188, 51246, -85486, -108724, -8911, -96887, 63569, -108164, -252531, -41754, 99501, -372166, 88538, 237707, 338263, 237286, -146689, -5254, -365344, -441670, -63762, -128793, -8024, -265505, -102483, 69042, 13477, 190703, 186239, -115840, -384416, -205983, -162383, -165150, -234504, -68234, 50994, -53712, -103524, 116609, -165866, -184909, 13293, -29715, 201369, -61608, -195155, -68489, 232181, 149751, -39653, 426688, 228822, 104867, 460287, 144909, -472033, -271253, -319886, -478267, -456803, 205946, 466385]
1288D66385k84910K89239p28505K36526p820j80608M20273j38670l17714P1050
1278a74754j9156J70896j10363J91723N0916J7537Q7996k43050l1930K82790r8199
1267A24406J18499K4709o25641K66469M48266L23182l62111j56748J77569L9921
1257C78521l58310O7548J2216Q5452l37596n3204k12368k845J55102L8073j07713
1246c35124J92583j70276M07702K40036m75954J86815n7369j02944j37242j77185
1236d28958R5110n2960n4014J25439Q0549K97818J22315m70459J69667m5363l549
1225a64405j64360K67790r092N5476j75693J01250J15479j20761M5422J59443
1215A10549L0391k95360J54892j57685j3310K36363m53123l7491M41078M1919
$$ y = [466385, 181475, 470714, -257791, -21265, -29085, -209693, 210580, 71910, -245804, -174754, -193910, -23014, -133377, 58346, 109262, 126799, 214795, -28255, -60185, 222605, 124406, 242905, 267614, -358027, -91558, 356708, 679890, 317779, 161031, 338600, 378521, 20211, 87759, 99975, 185427, -152169, -205373, -417741, -420586, -265484, -227411, -335124, -142541, -312817, 94885, 334921, -141033, 45782, -11587, -114531, -251773, -428958, -333848, -386808, -440822, -315383, -234834, 62984, 185299, -285160, -115493, -160856, -164405, -328765, -60975, -70067, -14591, -190284, -89034, 26445, -94316, -48894, 110549, 140940, -154420, 472, -157213, -170523, 65840, -387283, -424774, 16304, 58223]
1205E8223l23641K13392k9378m9688j5718J81306j8159L31106L9734l14386r1428
1194a8637P4330j6323n47561K99263K07197J54770m37987j07242J94912J41359
1184e5919K8010L66277k56160r7261j30444L0766M1100n6715k51109k10318N58266
1173c3507K71386m12934q8217J14971j48538j23850k18131j8760K55513j09932
1163e11999K08411j71794M46853N20209k47852O7753J52549l82152j04285K98892
1153B76585l3591m03142J8377l56620l2250q4196K4891J78152O7377N0539J47181
1142a46697o0060P0683m5126L8486K16213j07777j05992n7342l7959O8822j1707
1131a78456j03591M05533M7886J233j13587J46897n8236l25217K41816Q0672O9341
$$ y = [58223, -265418, -52026, -81404, -131092, -146810, 34496, 16337, 347443, 387177, 72791, -18637, 55693, 39370, -508191, -208928, -1731, 153039, -284948, -392190, -197278, -55919, -27909, 338368, 82208, -15053, -145497, -114731, -73631, -130346, -381455, -591773, -33507, 237879, -175055, -263272, -148301, -296839, -420689, -638820, -657580, -402067, -511999, -303588, -475382, -28529, 491680, 243828, 311581, 464130, 81978, -22307, 276585, 242994, -160148, -141771, -498391, -530641, -614837, -589946, -411794, -344417, -293878, -146697, -206757, -136074, -181200, -142714, 73499, -34278, -140270, -197612, -235571, -166749, -178456, -282047, 123486, 171372, 172605, 59018, 205915, 147679, -177538, 64278, 144950, 214291]
1120B14291j12751m54865j57439j1680K73091J75465n0849n07070K21960L46956
1110f2891j32111k15302J85531O55012m2538j5603l42446k40626K75238j09476
1100d5212J44137K54073k10907j36542M45J56407J06984l61029j19166j5919J4047
1089b12682L9590J48491J04083K12616j03519l12834j85215p6238M94859k51606
1079a42455m15306M19694J12888k60034M29265j71403n0409L7609k01455N65976
1069C24370J29833j09740P1848M5751K75079m61363j14156n1034j35299p6503
1059a01214l06118J23712R0643K6590K06640k98924k12861L4908J7270K16288
1049b03066K75156m7750j13313M184J02764O8492N0451l68677n551K27989J86423
$$ y = [214291, 101540, -353325, -510764, -522444, -249353, -73888, -124737, -631807, -409847, -62891, -195002, -410304, -224773, 430239, 387701, 372098, 29652, -210974, 64264, -45212, 98925, 352998, 142091, 5549, 5994, 162401, 269385, -91644, -210810, -226729, -212682, -173092, -24601, 79482, 292098, 188579, -124255, -309470, -385708, 109151, -142455, -557761, -138067, -25179, -285213, 144052, -27351, -77760, -40151, -241606, 324370, 454203, 344463, 416311, 462062, 737141, 275778, 161622, 110588, -24711, -101214, -407332, -283620, -192977, -166387, 40253, -258671, -471532, -436624, -419354, -203066, 72090, 24340, -88973, -84789, 17975, 86467, 136918, -231759, -237310, -9321, 177102]
1038A77102J25012k6621J78880m65653K80277j62362l24452M3524K80085l67611
1028b61819L7232Q5627l1774J68997l89029l13773K90367P7560M89840m5219k35686
1017a27677J15475N9263O6202j19075j17744j25144O5196K38446R3233J78840
1007C27015j34805m39088k96066K78379m7372J54397M29883J1398k83690K22300
997B22351q4723p1523l30346j71516M60701K72990j41585K61261k17797k78761
987g8948k26862K78506j6093j47255N6347n1166K76896J31708k03202j05517j76957
976b62543K46682K45519o36363Q5606J10267J93693m4871K89713K04218j65218
966B66703O6727R3847j1553j41010k44144k39975q9604N16719k28302k83710j46092
$$ y = [177102, 302114, 275493, 454373, -11280, 268997, 106635, -217817, -174293, 105792, -261819, -224587, -138960, -170734, -1737, -390766, -704539, -414172, -336612, 153228, 108009, -127677, -12202, 47061, 113263, -5812, -123556, -248700, -183504, 54942, 148175, 327015, 192210, -246878, -542944, -264565, -311937, -157540, 272343, 283741, 51, 222351, 137628, 66105, -264241, -435757, 24944, 297934, 156349, 417610, 199813, -78948, -305810, -27304, -43397, -190652, -134305, -185471, 91425, 223133, 19931, -85586, -262543, -15861, 229658, -406705, -321099, -210832, -17139, -62010, 227703, 431921, 266703, 333430, 427277, 415724, 274714, 30570, -209405, -299009, 217710, -10592, -294302, -440394]
955d40394L17975j48441K45563p9381K24072o9359p6528J31837l0159j72772j96990
944b94577k39896L82644J96039j05901k67506J09506K04493K0053p3968J2098
934e7015j33922j4818L49885J77357l29003k69352J97650K30258L08972J41633
924F01645k07130r9513j73369k96486K35860m1456L04284J48681l34086p02594
914e64164M62326J5959j91328N17551l72464K68987K71359k14722k87980k4781
904a19257J81199Q0459l30353j84980J84453R1790K20837j9331j05139k57479
894b57801m4384n36371K24152L45301j68027n7689R0644j92445L2653L92608Q4728
883h6631M05074k6644n1768K50398m78937n12894Q2977J24900j07409j04686O7152
$$ y = [-440394, -122419, -270860, -25297, -104678, 119394, 50035, -26493, 105344, 75185, -97587, -294577, -534473, -151829, 44210, -61691, -329197, -219691, -15198, 4855, -69113, -57015, -190937, -205755, 144130, 321487, -7516, -276868, -79218, 151040, 460012, 601645, 394515, 295002, 121633, -174853, 61007, 19551, 323835, 472516, 138430, -564164, -101838, -85879, -277207, 240344, -132120, 136867, 408226, 193504, -94476, -119257, 61942, 142401, -187952, -372932, -188479, -96689, 124148, 104817, -322, -257801, -302185, -838556, -614404, -269103, -437130, -494819, -404175, -596620, -563967, -171359, -86631, 318443, 291799, 240031, 490429, 11492, -501402, -418425, -293525, -400934, -505620, -438468]
872d38468J62531n4578L63500M9421j44471k43759l4534K790R1615K08441M82725
861D45213N4078k44920P564k2380J35409l44645k10475l1522O12430j44253n23391
850b66892j48150K9186M25898J6819K15053J772m14291m7055M32452o8197j75607
839I88Q281K12521J95852m01996L0270q4295N70810o2721q6573k69251k51627
828a37741L4254N82909J09160q30786j65760J38210j30157m0621K4163M22825
818F456K47735J91620m54153l25500L44632J47133j54422j84425K67871N6862
808A43809k87295j12400K19181K87398k25886k65844k82970n8290M12992l03704
798d73009N28627L78750m09932l45390K68163O3583n80888P5383l1378j02311
$$ y = [-438468, -275937, -330515, 32985, 82406, -62065, -305824, -340358, -337568, -245953, -37512, 445213, 499291, 254371, 261935, 239555, 374964, 30319, -180156, -211678, 400752, 256499, -266892, -415042, -385856, 40042, 56861, 271914, 273686, -140605, -187660, 244792, 176595, 988, 9269, 221790, 417642, 15646, 45916, -38379, 532431, 469710, 383137, 113886, -137741, -103487, 479422, 588582, -242204, -407964, -269754, -399911, -440532, -416369, 6456, 254191, 445811, -8342, -333842, 10790, 157923, 3501, -180924, 86947, 143809, -143486, -255886, -36705, 250693, 24807, -241037, -524007, -582297, -169305, -473009, 55618, 434368, 24436, -320954, -52791, 10792, -570096, -494713, -526091, -628402]
788f28402K19677M7061N39310k15679K43634k15732L17921j63696R480j19328
778C4246J51802R2108j80930k09926l7815J12825j3985p275O3394k7580l5653
767e8789M0164P67731J89835o07549m26038N26862K21965j74655q3183l15818
757H0525j14227J30300j16419K6576J30039K97445j55805N4191N421j72121J00744
746B66669k85388K15736l03403J27788m0293M00685P1824l53187K6649k3160j04674
735g54n40574K2628L35207J56788L5561N0112J54161P3830K7138k64948L54881
724D04030K1213K87389l10720n34192J52243L33441j76207L6414k96294O3136
714a9547j90857L72805j0641j85419J43825l70043n2827R227l87837Q25676J95242
$$ y = [-628402, -408725, -361664, 177646, -38033, 205601, -10131, 307790, 144094, 153574, 34246, 186048, 278156, 97226, -112700, -150515, -37690, -51675, -58950, 4444, -23136, -58789, -18625, 749106, 938941, 331392, -94646, 432216, 654181, 479526, 396343, 80525, -33702, 96598, -19821, 6755, 136794, 434239, 278434, 332625, 338046, 165925, 266669, -18719, 197017, -106386, 21402, -18891, 381794, 453618, 100431, 127080, 103920, -754, -541328, -518700, -183493, -26705, 8856, 58968, 213129, 286959, 314097, 49149, 404030, 425243, 712632, 401912, -132280, 19963, 353404, 177197, 213611, -82683, -19547, -210404, 162401, 151760, -33659, 110166, -259877, -312704, -303477, -691314, 134362, 329604]
703C29604l03567J3830k82071J85546K68371k4226J18895k74129K954l01176J35477
692a30492k3011p774n6669j30121P97M38305j80032j49244K80629N1478J23254
681B17120l16868l01421K82194L93982j46577K1934K21269j17518k9244j36725
671H8146o263L5242q4767k97809k2586l11886M6668K06222k68146J14356J44968
660c55855M45882J55826n1865o64713K77252M3713K80377l72932L03276j6498
650D4463k41482K72764r0302j6751J51944R9806j56792N3450j23285k60456J48370
639a18271J31101K16368k00495J75811K22511m34016l07581N41078k73274K93524
629B46756n3651m23247O7028k84876M29353K87965k17149j89530J88372N0422
$$ y = [329604, 26037, 39867, -242204, -56658, 211713, 187487, 306382, 32253, 35207, -265969, -130492, -153503, -161277, -217946, -348067, -347270, 91035, -88997, -238241, 42388, 93866, 217120, -99748, -401169, -118975, 275007, 128430, 150364, 371633, 254115, 224871, 88146, 81883, 117125, 32358, -265451, -288037, -599923, -553255, -347033, -615179, -500823, -355855, 90027, 245853, 193988, -470725, -193473, -149760, 130617, -242315, 60961, 44463, -197019, 75745, -14557, -31308, 120636, 220442, 63650, 117100, -6185, -266641, -118271, 12830, 229198, 28703, 204514, 427025, -6991, -314572, 226506, -46768, 246756, 193105, -230142, -163114, -447990, -18637, 269328, 52179, -137351, 51021, 101443]
619A01443k73663J67621j7839K38408j46799J80113J81075j57258k66247J87256
609A94110j50940R5532k3988O7803j62599J59357L98775l11050j51736j92896
599g7632j46515N30404J90451p51156J47075J18771J82432l81387j5733Q2472
589a20818J57025O3049k42101j58987r2029m7379K63206j03629K35118j00034
579a46579K681k82032k54068M34923j24639J28765J71739j64491L56620q1458
569D1461l25178L7557J50301N6310k17815P9146l6480K77225k41771k21276J43802
558b56718j23191K35453L85304l60209k93421j42439J46007J48502J78789j79913
548b61836j89619N16202j72810p2642m294J79180J91680o6431l89989K67005L52475
$$ y = [101443, -172220, -4599, -22438, 215970, 69171, 249284, 430359, 273101, 6854, 194110, 43170, 138702, 114714, 182517, 19918, 179275, 578050, 267000, 115264, -77632, -224147, 306257, 496708, -254448, -107373, 11398, 193830, -187557, -203290, -120818, 36207, 99256, -142845, -301832, -393861, -441240, -178034, -281663, -46545, -146579, -143898, -425930, -679998, -245075, -369714, -240949, -69210, -233701, 122919, 41461, -283717, -246160, -95859, -39549, -257364, -178218, -214698, 62527, -179244, -400520, -256718, -379909, -144456, 240848, -119361, -412782, -555221, -409214, -260712, -81923, -261836, -451455, 64747, -108063, -180705, -184999, -5819, 185861, 119430, -270559, -3554, 348921]
537C48921o7670k29504k70577k27265O332R7175K30908J88955J22968K2976L81071
526F04290l8030o18496j65614J13786L83240k03653m5109J53274m94570n6075
516c66957J23560k874p2189K0794j0578K97919j5689M0002J27812k39435J25974
505B8339P2061K5947k13803m6036L42561K12923k35429q3914J6926L28869r588
494D38856l16057L09591n9621q0612o0657q0115L50652m30669j63095P1123J6640
483c964J12677J9720n855l55401R3144J67227J53438j13293J46670l36095r710
472a31442l13257N78234N379l13009M20738K02474o11757j2736J38621n49917
462e86672M90962O8384K5233j38315K29254r5979J77305M57303K15484m13061
$$ y = [348921, 281251, 51747, -218830, -446095, -439763, -342588, -111680, 77275, 200243, 223219, 604290, 566260, -52236, -217850, -104064, 279176, 75523, 30414, 183688, -310882, -366957, -243397, -246271, -318460, -297666, -308244, -10325, -26014, 13988, 141800, -97635, 28339, 100400, 126347, -87456, -133492, 209069, 421992, 186563, 102649, 119575, 448444, 438856, 122799, 432390, 372769, 292157, 231500, 151385, 502037, 71368, -91727, -20604, -3964, 108713, 128433, 122578, -232823, -139679, 27548, 180986, 67693, 214363, -121732, -131442, -444699, 133535, 138914, -174095, 246643, 449117, -162640, -175376, -36755, -586672, -95710, -27326, -2093, -140408, 88846, -7133, 170172, 627475, 842959, 429898]
452D29898k52033l61625L32294J5642Q1508k73766O3048j65113j08848j7392J69034
441h7353L74415J2802k8192l62122J59228j328j39916Q5810R9662k66528j66040
430c19562K05444N02007r2997j42373l55657j8002m5745K24075j15307K09278
420E1161K0903m78292J15732K65323p0483j62729J60420J07828r4563L4053m78700
409e29347J17323O43999k8187J3372k94960j29641L31789K43559j57963O486n1451
398A64979J27832o0476j76816k55882m9668N4870j47102k56563L19598K29545
388d9683L34328l53760n74267j55570J01388o2968K53231L17145R8765j45983
378b37374K68685K21296k23496q1164l82525k23199J52292L31551K8272j9738
$$ y = [429898, 177865, -183760, 148534, 164176, 245684, -28082, 34966, -130147, -238995, -256387, -87353, 287062, 299864, 271672, -90450, 68778, 67450, -72466, 13344, 113006, -153522, -319562, -114118, 387889, 294892, 152519, -203138, -221140, -266885, -42810, -158117, 51161, 72064, -406228, -290496, -25173, -95656, -258385, -97965, 9863, -84700, -50647, -529347, -412024, 231975, 203788, 217160, -77800, -207441, 124348, 367907, 209944, 216430, 164979, 292811, 232335, 55519, -200363, -250031, -195161, -342263, -598826, -279228, -49683, 284645, -69115, -643382, -798952, -697564, -760532, -507301, -190156, -91391, -237374, 31311, 252607, 29111, -52053, -434578, -657777, -505485, -173934, -145662, -165400]
368a65400j31733L69974M54743Q7453l72016l29913J65660K64617l46081J35866
358A33170j33888k57207j09466k29677P05388M59110k61509j66868J30002J21682
348C90737j99750m50141k62887M82079m0249o1021o5897M3877L60885k96188j57467
337b56022K83714M16901j73796m550q1955k55345P523J5969k64077k57123K047
326e66714J73803P61414j46343j46753Q2708J68702n61436K5783J70852p4321
316a12305J44912j97449N6345K62675r5712m62561l7879K79596J45719J53168
306A36509K61421n79362Q4182J64856m25233M16810n2507n29435J05947L2470
296c84342J75424L73099k43589N7016j71134K47157L8355l15838Q6567J9671J80218
$$ y = [-165400, -297133, 72841, 527584, 615037, 243021, -86892, 78768, 343385, -2696, 133170, -718, -257925, -367391, -597068, 108320, 567430, 305921, 139053, 269055, 390737, 190987, -259154, -522041, -39962, -80211, -141232, -207129, -163252, 197633, -98555, -256022, 27692, 444593, 270797, 266247, 184292, -71053, -63530, -47561, -311638, -568761, -566714, -392911, 368503, 222160, 75407, 158115, 326817, -234619, -208836, -37984, -112305, 32607, -164842, -108497, 154178, 58466, -404095, -441974, -162378, -16659, 136509, 397930, -181432, -97250, 67606, -357627, 59183, 6676, -522759, -416812, -384342, -208918, 164181, -79408, -22392, -193526, 53631, 91986, -223852, -137285, -117614, 62604]
285F2604j024k42630L9875J02614l13562L65136J78760K8666j12988K38715J3733
274C59899l63548k36749q0398J5920J03176l73023J91141L08877J27404J63409
264B16108J33833k58051J42439J70676j13715j14001r2402K349Q9670p2548J11996
253B16354P4858m69488J47819M25438k9489k06020j82428l74309K5968j88952
243e60249J29752J68228n11866J10203n148J05739L97351Q2263J40427n4685N8799
232F0814k36826l4275O3555K9245L81967k74997j19150J80801j75885K53856k85256
221a56151j36549j37078K8227K24813L24004q6716k64487K4557J74106l93360
211c98634J37054J11806J25260J572j71908J46920J22889K47740l03661k87133
$$ y = [62604, 61580, -181050, -141175, -38561, -352123, 13013, 191773, 220439, 107451, 346166, 359899, -3649, -240398, -320796, -304876, -201700, -574723, -383582, -74705, 52699, 216108, 349941, 91890, 234329, 405005, 291290, 177289, 84887, 87236, 176906, 104358, 216354, 291212, -178276, -30457, 394981, 365492, 159472, -22956, -397265, -371297, -560249, -430497, -262269, -774135, -663932, -669080, -563341, -165990, -83727, 56700, 2015, 60814, -176012, -210287, -146732, -117487, 264480, -10517, -129667, 51134, -124751, 129105, -156151, -292700, -429778, -401551, -176738, 147266, 60550, -203937, -179380, -5274, -398634, -261580, -149774, -24514, -22942, -194850, -47930, 74959, 322699, 19038, -268095]
201b68095P1971K06528l11671n0124J05167K13401J52827j09796L5954j68083
191a21921J68138l15984j57584L6526m5091L64591j2264l74007L9510K79166j6619
180a55539P8868L47250j20351n71791L25958n9829K37336N0627N8842j21205k74484
169b04318M30190N1023l4185l25181j38168L26052J64328j57998l11166M0247
159a59176k80728N3762M72877j10096q4301Q6244K5741J67952K35574j16065l76669
148h4885p3690K55913k92823r093l9005J17772J32637k16694K47008J47855j31448
137E3547L9193K18108k21437J36017k24153j84499J54519N570J28170j34253l83149
126d12367j29284N7686L70423K68179J68933j11126j89985k65579j53272N4175
$$ y = [-268095, -196124, 10404, -301267, -351391, -246224, -32823, 120004, 10208, 46162, -121921, 46217, -269767, -427351, -390825, -435916, -71325, -83589, -457596, -418086, -138920, -155539, -76671, 270579, 150228, -421563, -95605, -155434, 81902, 132529, 191371, 70166, -204318, 225872, 276895, 242710, -82471, -220639, 105413, 269741, 111743, -199423, -159176, -439904, -386142, 86735, -23361, -107662, -21418, 4323, 172275, 407849, 291784, -84885, -158575, 97338, -195485, -204578, -243583, -125811, 6826, -209868, 37140, 184995, 53547, 92740, 310848, 89411, 225428, 1275, -183224, -28705, -23135, 105035, -29218, -412367, -541651, -483965, -113542, 154637, 323570, 212444, 22459, -243120, -396392, -342217]
116c42217L31871k2675j52960k41176o2345K88079o3282K25826R0795L0976J46102
105B28994J9713n6105k1924R6584R2181j59080m52296J96742J30407n0474j22727
94i7985K25471R1381k70113J06030J96828Q82m72660l5904J13327n4955j76956
83c74654j49056N0398K55972R7790K0403l49678J52304J07290k18714J83749k3063
72b47259r0217R7616R978J20238j15297j05282J96481J02258k00583J4174j12312
61c30205J75233L44271n5164n3868N3177P0777o8490J36841k92260k82903K79496
50b3095K96718j32597k4944k84764o7805K37640k09248j33701p5418N57489L6399
39A76674l36447k11895K09552p939J01361J8154Q2612q0854j89901J59856N0064
$$ y = [-342217, -10346, -33021, -185981, -427157, -489502, -201423, -264705, -38879, 51916, 82892, 228994, 248707, 192602, 170678, 267262, 359443, 200363, -251933, -55191, 75216, 24742, -97985, 127486, 218867, -51246, 54784, 251612, 252494, -220166, -256070, -142743, -197698, -374654, -523710, -473312, -217340, -119550, -99147, -448825, -296521, -189231, -407945, -224196, -247259, -337476, -239860, -229882, -109644, -224941, -330223, -133742, -31484, -232067, -217893, -330205, -154972, 189299, 134135, 80267, 133444, 204221, 135731, 272572, -19688, -302591, -23095, 273623, 141026, 116082, -168682, -236487, 1153, -208095, -341796, -417214, 140275, 176674, -159773, -371668, -162116, -170055, -68694, -50540, 32072, -48782, -238683, -78827, -28763]
28b8763r2508r1580K19574j28753k8994L30092n1427l56135K58350J14869k70399
17a25674j04269M8443j35297J97045J00789l1161l1760m9547J06394J01957J7305
6I4225j79395k02209J70063K88940k78793l1645
0a38814
$$ y = [-28763, -121271, -212851, 6723, -122030, -151024, 179068, 127641, -228494, 29856, 144725, -125674, -229943, -181500, -316797, -119752, -18963, -50124, -81884, -131431, -25037, 76920, 94225, -85170, -287379, -117316, 171624, -107169, -138814]
$$ Imaginary data points
##PAGE= N=2
##DATA TABLE= (X++(I..I)), XYDATA
16383c618065j78881r0209K02292L17179Q1604l25329j88117J63378J46186J80846
16373c309116o6003o4851M0061L34482J88566R2631N31330m71638r8573j56899
16363b980010R5012Q7928M11666l41647J07604J55539R0165j66645j50037R8969
16353b591456J89460K25667r8722J13706k29790P9748K39637j30516M18490L26623
16343a457153j82794J47271k8050k5923N3558j12880M18875R9987l13420J78504
16333a222025J31765K62250j05676o3j58014L04347K50218j45357N5739q5704
16323g12520j45440J93002K5641q0740L04687K22149j18389j204P9826r0067J65984
16312a57071L7143p790j83506L68852K86697L62847l09819o0736j53931k52055
$$ y = [-3618065, -3796946, -3887155, -3684863, -3367684, -3286080, -3611409, -3799526, -3636148, -3489962, -3309116, -3375119, -3439970, -3399909, -3065427, -2876861, -2784230, -2252900, -2724538, -2823111, -2980010, -2884998, -2797070, -2385404, -2727051, -2619447, -2463908, -2373743, -2540388, -2690425, -2591456, -2401996, -2176329, -2275051, -2161345, -2391135, -2311387, -2071750, -2202266, -1783776, -1457153, -1639947, -1492676, -1520726, -1546649, -1493091, -1605971, -1187096, -1087109, -1400529, -1222025, -1090260, -828010, -933686, -933749, -1091763, -787416, -537198, -682555, -626816, -712520, -857960, -664958, -639317, -720057, -415370, -193221, -311610, -312814, -232988, -323055, -157071, -119928, -127718, -311224, 57628, 344325, 707172, 397353, 336617, 182686, -69369]
16302f9369L4739J82317L06667J53685L43048m25992o8492J66900m2703j3188
16292E67612n323j50021m5656R8205M92189k41121K80517p4871J85420j02653
$$ y = [-69369, -34630, 147687, 454354, 608039, 951087, 525095, 456603, 623503, 580800, 567612, 562289, 412268, 366612, 464817, 957006, 715885, 996402, 921531, 1106951, 1004298]
$$ [...]
##END NTUPLES=NMR SPECTRUM
##END=
