##TITLE=1H_EC-3299(IV-3)
 CDCl3
 8 sc, 
 1.9.2023
##JCAMPDX= 6.0         $$ Bruker NMR JCAMP-DX V2.0
##DATA TYPE= NMR SPECTRUM
##DATA CLASS= NTUPLES
##ORIGIN= UXNMR, Bruker Analytische Messtechnik GmbH
##OWNER= root
$$ XWIN-NMR		Version 3.5
$$ Fri Sep  1 14:49:39 2023 Russian Standard Time (UT+4h)  she@DPX200
##.OBSERVE FREQUENCY= 200.13135
##.OBSERVE NUCLEUS= ^1H
##.ACQUISITION MODE= SIMULTANEOUS
##.ACQUISITION SCHEME= undefined
##.AVERAGES= 8
##.DIGITISER RES= 18
##SPECTROMETER/DATA SYSTEM= spect
##.PULSE SEQUENCE= zg30
##.SOLVENT NAME= CDCl3
##.SHIFT REFERENCE= (INTERNAL, CDCl3, 0, 15.7623)
##AUDIT TRAIL= $$ (NUMBER, WHEN, WHO, WHERE, WHAT)
$$ ##TITLE= Audit trail, XWIN-NMR		Version 3.5
$$ ##JCAMPDX= 5.01
$$ ##ORIGIN= Bruker BioSpin GmbH
$$ ##OWNER= she
$$ F:/spectra/data/she/nmr/H-F/1/pdata/1/auditp.txt
$$ ##AUDIT TRAIL=  $$ (NUMBER, WHEN, WHO, WHERE, WHAT)
(   1,<2023-09-01 14:48:16.53 +0400>,<she>,<DPX200>,
      <created by zg, POWCHK disabled, PULCHK disabled
       configuration hash MD5:
       00 E9 B6 7A A2 85 ED C7 34 08 36 98 17 FE 4E 26
       data hash MD5: 16K
       37 24 04 5C 85 68 43 49 C7 66 6A 48 0D A6 C6 8D>)
(   2,<2023-09-01 14:48:19.75 +0400>,<she>,<DPX200>,
      <Start of raw data processing
       efp BC_mod = 2 LB = 0.24 FT_mod = 6 PKNL = 1 PHC0 = -21053.06 PHC1 = 17.85272 SI = 16K 
       data hash MD5: 16K
       0E 45 F7 C1 2B 24 F7 90 9F DF 92 83 1C FA 2A DD>)
(   3,<2023-09-01 14:48:36.73 +0400>,<she>,<DPX200>,
      <pk PHC0 = 1.75568 PHC1 = -1.6 
       data hash MD5: 16K
       C0 CB 3E B9 CB 17 A9 74 36 50 C6 67 72 38 17 E0>)
(   4,<2023-09-01 14:48:40.43 +0400>,<she>,<DPX200>,
      <abs ABSG = 5 
       data hash MD5: 16K
       AE D0 B2 8A E7 73 F8 A7 FA 38 22 05 0D A3 40 D7>)
$$ ##END=
$$ 
$$ hash MD5
$$ 03 FE C2 50 B3 DF 3C D3 2D 9E 88 26 60 99 83 DD
##$RELAX= 
##$RELAX= 
##$RELAX= 
##$RELAX= 
##$RELAX= 
##$RELAX= 
$$ Bruker specific parameters
$$ --------------------------
##$DU= <F:/spectra>
##$EXPNO= 1
##$NAME= <H-F>
##$PROCNO= 1
##$TYPE= <nmr>
##$USER= <she>
##$AMP= (0..31)
100 100 100 100 100 100 100 100 100 100 100 100 100 100 100 100 100 100 
100 100 100 100 100 100 100 100 100 100 100 100 100 100 
##$AQSEQ= 0
##$AQ_mod= 1
##$AUNM= <au_zg>
##$AUTOPOS= <>
##$BF1= 200.13
##$BF2= 200.13
##$BF3= 200.13
##$BF4= 200.13
##$BF5= 200.13
##$BF6= 200.13
##$BF7= 200.13
##$BF8= 200.13
##$BYTORDA= 1
##$CFDGTYP= 0
##$CFRGTYP= 5
##$CHEMSTR= <none>
##$CNST= (0..31)
1 1 145 1 1 1 1 1 1 1 1 1 1 1 1 1 1 1 1 1 1 1 1 1 1 1 1 1 1 1 1 1 
##$CPDPRG= <>
##$CPDPRG1= <>
##$CPDPRG2= <>
##$CPDPRG3= <>
##$CPDPRG4= <mlev>
##$CPDPRG5= <mlev>
##$CPDPRG6= <mlev>
##$CPDPRG7= <mlev>
##$CPDPRG8= <mlev>
##$CPDPRGB= <>
##$CPDPRGT= <>
##$D= (0..31)
0 1.2 0 0 0 0 0 0 0 0.06 0 0.03 0 0 0 0 0.0002 0 0 0 0 0 0 0 0 0 0 0 0 
0 0 0 
##$DATE= 1693565295
##$DBL= (0..7)
120 120 120 120 120 120 120 120 
##$DBP= (0..7)
150 150 150 150 150 150 150 150 
##$DBP07= 0
##$DBPNAM0= <>
##$DBPNAM1= <>
##$DBPNAM2= <>
##$DBPNAM3= <>
##$DBPNAM4= <>
$$ [...]
##$SUBNAM3= <"">
##$SUBNAM4= <"">
##$SUBNAM5= <"">
##$SUBNAM6= <"">
##$SUBNAM7= <"">
##$SUBNAM8= <"">
##$SUBNAM9= <"">
##$SW= 18.05172834244
##$SWIBOX= (0..15)
0 0 2 0 0 0 0 0 0 0 0 0 0 0 0 0 
##$SW_h= 3612.71676300578
##$TD= 16384
##$TD0= 1
##$TE= 0
##$TE2= 300
##$TE3= 300
##$TEG= 300
##$TL= (0..7)
0 120 120 120 120 120 120 120 
##$TP= (0..7)
150 150 150 150 150 150 150 150 
##$TP07= 0
##$TPNAME0= <>
##$TPNAME1= <>
##$TPNAME2= <>
##$TPNAME3= <>
##$TPNAME4= <>
##$TPNAME5= <>
##$TPNAME6= <>
##$TPNAME7= <>
##$TPOAL= (0..7)
0.5 0.5 0.5 0.5 0.5 0.5 0.5 0.5 
##$TPOFFS= (0..7)
0 0 0 0 0 0 0 0 
##$TUNHIN= 0
##$TUNHOUT= 0
##$TUNXOUT= 0
##$USERA1= <user>
##$USERA2= <user>
##$USERA3= <user>
##$USERA4= <user>
##$USERA5= <user>
##$V9= 5
##$VALIST= <valist>
##$VCLIST= <CCCCCCCCCCCCCCC>
##$VD= 0
##$VDLIST= <DDDDDDDDDDDDDDD>
##$VPLIST= <PPPPPPPPPPPPPPP>
##$VTLIST= <TTTTTTTTTTTTTTT>
##$WBST= 1024
##$WBSW= 4
##$XGAIN= (0..3)
0 0 0 0 
##$XL= 0
##$YL= 0
##$YMAX_a= 968668
##$YMIN_a= -856634
##$ZGOPTNS= <>
##$ZL1= 120
##$ZL2= 120
##$ZL3= 120
##$ZL4= 120
##$ABSF1= 15.78545
##$ABSF2= -2.266401
##$ABSG= 5
##$ABSL= 3
##$ALPHA= 0
##$AQORDER= 0
##$ASSFAC= 0
##$ASSFACI= 0
##$ASSFACX= 0
##$ASSWID= 0
##$AUNMP= <proc_1d>
##$AZFE= 0.1
##$AZFW= 0.1
##$BCFW= 0
##$BC_mod= 2
##$BYTORDP= 0
##$COROFFS= 0
##$CY= -3
##$DATMOD= 1
##$DC= 0
##$DFILT= <>
##$DTYPP= 0
##$F1P= 0
##$F2P= 0
##$FCOR= 1
##$FTSIZE= 16384
##$FT_mod= 6
##$GAMMA= 0
##$GB= 0
##$INTBC= 1
##$INTSCL= 3.70164e-10
##$ISEN= 128
##$LB= 0.24
##$LEV0= 0
##$LPBIN= 0
##$MAXI= 10000
##$MC2= 0
##$MEAN= 0
##$ME_mod= 0
##$MI= 1.114404
##$NCOEF= 0
##$NC_proc= -4
##$NLEV= 6
##$NOISF1= 3.799351
##$NOISF2= 2.8
##$NSP= 0
##$NTH_PI= 0
##$NZP= 0
##$OFFSET= 15.76231
##$PC= 1
##$PHC0= -21051.3
##$PHC1= 16.25272
##$PH_mod= 1
##$PKNL= yes
##$PPARMOD= 0
##$PSCAL= 0
##$PSIGN= 0
##$REVERSE= no
##$SF= 200.130001845702
##$SI= 16384
##$SIGF1= 3
##$SIGF2= 2
##$SINO= 5.538805
##$SIOLD= 16384
##$SREGLST= <1H.CDCl3>
##$SSB= 0
##$STSI= 16384
##$STSR= 0
##$SW_p= 3612.71676300578
##$SYMM= 0
##$S_DEV= 0
##$TDeff= 16384
##$TDoff= 0
##$TI= <>
##$TILT= no
##$TM1= 0
##$TM2= 0
##$TOPLEV= 0
##$USERP1= <user>
##$USERP2= <user>
##$USERP3= <user>
##$USERP4= <user>
##$USERP5= <user>
##$WDW= 1
##$XDIM= 16384
##$YMAX_p= 316920467
##$YMIN_p= -310112
$$ End of Bruker specific parameters
$$ ---------------------------------
##NTUPLES= NMR SPECTRUM
##VAR_NAME=  FREQUENCY,     SPECTRUM/REAL,   SPECTRUM/IMAG
##SYMBOL=    X,             R,               I
##VAR_TYPE=  INDEPENDENT,   DEPENDENT,       DEPENDENT
##VAR_FORM=  AFFN,          ASDF,            ASDF
##VAR_DIM=   16384,         16384,           16384
##UNITS=     HZ,            ARBITRARY UNITS, ARBITRARY UNITS
##FACTOR=    0.220516191357247, 1,           1
##FIRST=     3154.51113501141, 0,            0
##LAST=      -458.205627994369, 0,           0
##MIN=       -458.205627994369, -310112,     0
##MAX=       3154.51113501141, 316920467,    0
$$ Real data points
##PAGE= N=1
##DATA TABLE= (X++(R..R)), XYDATA
$$ [...]
7219H6042Q167J2944J5662R050m176o280k1501Q167K4727l494K9472k054K9627
$$ 86042 94209 107153 122815 131865 127689 121409 99908 108075 132802 129308 158780 156726 186353
7206A86353J9417O848P264J2783J0935r14J7311L5457J0362J0333L1869L6702
$$ 186353 205770 212618 219882 232665 243600 242686 259997 295454 305816 316149 348018 384720
7194C84720O6090N5660N1758K4200N0516P5232Q2488Q0367J28020J17025J47422
$$ 384720 450810 506470 558228 582428 632944 708176 790664 871031 999051 1116076 1263498
7183A263498J32604J34495J13002P3018K9415R85j0984k7329j9071k2075j7749
$$ 1263498 1396102 1530597 1643599 1716617 1746032 1747017 1736033 1708704 1689633 1667558 1649809
7172A649809p7769q9908q2765j34332j00422j19089j17285p4045r0579q7178m1569
$$ 1649809 1572040 1482132 1399367 1265035 1164613 1045524 928239 854194 763615 676437 634868
7161F34868m0261l5505m4251m0350K437m2760k5276j5211j3511K7506j451j6456
$$ 634868 594607 559102 514851 474501 476938 434178 408902 393691 380180 407686 406235 389779
7149C89779J6180k0676K6304K3130j9308N586K6554J8465K1505K0006J8573K8572
$$ 389779 405959 385283 411587 434717 415409 420995 447549 466014 487519 507525 526098 554670
7137E54670J6718Q2178P5339O3214Q2853J15935J16114O8074J19498J01814O3778
$$ 554670 571388 653566 728905 792119 874972 990907 1107021 1175095 1294593 1396407 1460185
7126A460185O0996j0614j6082p939k405L3062N68k7082q2818j22045j31940j22687
$$ 1460185 1521181 1510567 1494485 1486546 1484141 1517203 1517771 1490689 1407871 1285826 1153886 1031199
7114A031199j55701j09029r2214p6475j8530n2500l7166o4876k4871k6226m9282
$$ 1031199 875498 766469 674255 597780 579250 526750 489584 424708 399837 373611 324329
7103C24329l2872j5913j0512l7624k1519m6754k6489j340n980k5516k1341j4374
$$ 324329 291457 275544 265032 227408 205889 159135 132646 131306 125326 99810 78469 64095
7091F4095l03M310q283l2627j4342M359K1662k4644l1578J3802J1385k66l788
$$ 64095 63792 68102 59819 27192 12850 17209 38871 14227 -17351 -3549 7836 7570 3782
7078C782m899j0066l0830K7013m156l2098J267J0376L000K27m261P233j8048N676
$$ 3782 -1117 -11183 -42013 -15000 -19156 -51254 -49987 -39611 -36611 -36384 -40645 -33412 -51460 -45784
7064d5784J1919l1442J2934J326J1957k358N730J5281n798j2046l2697k0123j137
$$ -45784 -33865 -65307 -52373 -51047 -39090 -41448 -35718 -20437 -26235 -38281 -70978 -91101 -92238
7051i2238O414j2634q278L1457l4504J05n307j7108N775J499L170j5227K005N185
$$ -92238 -85824 -98458 -106736 -75279 -109783 -109678 -114985 -132093 -126318 -124819 -121649 -136876 -134871 -129686
7037a29686J2713k4613k321j263J0427j0588M960M0283m359r084k8729j972K5153
$$ -129686 -116973 -141586 -143907 -145170 -134743 -145331 -140371 -100088 -104447 -113531 -142260 -144232 -119079
7024a19079o879j4513N180r158J3740N152k7751j3055k194j1441J2300J8511J3284
$$ -119079 -125958 -140471 -135291 -144449 -130709 -125557 -153308 -166363 -168557 -179998 -167698 -149187 -135903
7011a35903P437J2080M071r958j7685M843p604K0953K6834k3490N151m766J0926
$$ -135903 -128466 -116386 -112315 -122273 -139958 -135115 -142719 -121766 -94932 -118422 -113271 -118037 -107111
6998a07111j0122m851P284J823l591m975o716Q766K0893N12n732K0394o130o987
$$ -107111 -117233 -122084 -114800 -112977 -116568 -121543 -128259 -119493 -98600 -98088 -103820 -83426 -89556 -96543
6984i6543P554l1423o34K891Q491J2768N113K2J1742L377N393L0404r997n686
$$ -96543 -88989 -120412 -121046 -118155 -109664 -96896 -91783 -91761 -80019 -76642 -71249 -40845 -50842 -56528
6970e6528m41k298J0231j5633M758J29k205J5454J3727n611j219J1377M812j3386
$$ -56528 -56969 -59267 -49036 -64669 -59911 -59782 -61987 -46533 -32806 -38417 -39636 -28259 -23447 -36833
6956c6833J0146K8720J7017j5512j4736l489n712m053J5075R9J7495r370J080
$$ -36833 -26687 2033 19050 3538 -11198 -14687 -20399 -24452 -9377 -9278 8217 -1153 -73
6943g3p844j0959J93o390j9345J495p236L174j0780m76J4785r286j6640p255K278
$$ -73 -7917 -18876 -18683 -25073 -44418 -42923 -50159 -46985 -57765 -58241 -43456 -52742 -69382 -76637 -74359
6928g4359k5621J044K4480K6255o629l2403j1071K9960k7346J1127k967J1781
$$ -74359 -99980 -98936 -74456 -48201 -54830 -87233 -98304 -68344 -95690 -84563 -87530 -75749
6916g5749K0413J5928k7034k3823J3032q348O908l613p940l312l129j2919K4846
$$ -75749 -55336 -39408 -66442 -90265 -77233 -85581 -78673 -82286 -90226 -93538 -96667 -109586 -84740
6903h4740J5097l703j139k23P220M359j0608J2330M2556J0524J7226N890J9674
$$ -84740 -69643 -73346 -74485 -74708 -67488 -63129 -73737 -61407 -18851 -8327 8899 14789 34463
6890C4463j8957l028j6350L925O638j8130l2442j0103L4316j8415j9726j6784
$$ 34463 15506 12478 -3872 53 6691 -11439 -43881 -53984 -19668 -38083 -57809 -74593
6878g4593m448j5177J9931J9729o910k0735K7907q267j2141j8262K268K6999l228
$$ -74593 -79041 -94218 -74287 -54558 -61468 -82203 -54296 -62563 -74704 -92966 -90698 -63699 -66927
6865f6927m464K6577J3181K263K1604J4418k3044k1055k317R745M231N274M835
$$ -66927 -71391 -44814 -31633 -29370 -7766 6652 -16392 -37447 -39764 -30019 -25788 -20514 -15679
6852a5679k6483k0397M287o989N481M4438m744L8741J4285L0476k3334O401K2530
$$ -15679 -42162 -62559 -58272 -65261 -59780 -15342 -20086 18655 32940 63416 40082 46483 69013
6839F9013K1564J9607J2261J8270M648K1957Q490n337L5156K9658L9935j1258
$$ 69013 90577 110184 122445 140715 145363 167320 175810 170473 205629 235287 275222 263964
6827B63964r447J9006j1717j357l2443J720J0682l3471k1327l459O951J3612j4763
$$ 263964 254517 273523 261806 260449 228006 229726 240408 206937 185610 182151 189102 202714 187951
6814A87951K395l1146q833J9826k9188j6762j9165P93M02k5140o69l8596r19K2954
$$ 187951 190346 159200 150367 170193 141005 124243 105078 105871 106273 81133 80464 41868 40949 63903
6800F3903M943o960n726J172k981j2564M913P307m408K0178K4422j7413l834J0961
$$ 63903 68846 61886 56160 57332 54351 41787 46700 54007 49599 69777 94199 76786 72952 83913
6786H3913Q584J0456l4584j879j8828k3026q124j1827j0876K2368L428l7624J266
$$ 83913 92497 102953 68369 66490 47662 24636 16512 4685 -6191 16177 19605 -18019 -16753
6773a6753j5773K812P286p961k0655R884k8601k8261J4518J4097k9436q811J9437
$$ -16753 -32526 -29714 -22428 -30389 -51044 -41160 -69761 -98022 -83504 -69407 -98843 -107654 -88217
6760h8217j8317k0029J2307O632m660m0350P702K1933k7301J2721Q729o256K6563
$$ -88217 -106534 -126563 -114256 -107624 -112284 -152634 -144932 -122999 -150300 -137579 -128850 -135106 -108543
6747a08543k916J0676q545j7266O875j2143j2380J5647J4963j1898q103p796j4260
$$ -108543 -111459 -100783 -109328 -126594 -119719 -131862 -144242 -128595 -113632 -125530 -133633 -141429 -155689
6734a55689n969j0705L6166K3457j9397j8282j1993r191J3672n446k7257J101
$$ -155689 -161658 -172363 -136197 -112740 -132137 -150419 -162412 -171603 -157931 -163377 -190634 -189533
6722a89533P153J8415o816K0653l42K0926j7275j0382N84O926l1800J4707l13
$$ -189533 -182380 -163965 -170781 -150128 -150470 -129544 -146819 -157201 -156617 -149691 -181491 -166784 -167097
6709a67097k961k0908k0615Q129K724j9945R881L1121r525q025n207J5112J8618
$$ -167097 -170058 -190966 -211581 -203452 -200728 -220673 -210792 -179671 -189196 -197221 -202428 -187316 -168698
6696a68698P134M385j8751r044M8413q235m1561J545K0280J1556j8595l3863n237
$$ -168698 -161564 -157179 -175930 -184974 -136561 -144796 -186357 -184812 -164532 -152976 -171571 -205434 -210671
6683b10671K3185R097L171j365n962N368j1694J5464o913J0636j6090j6096m110
$$ -210671 -187486 -178389 -175218 -176583 -182545 -177177 -188871 -173407 -180320 -169684 -185774 -201870 -205980
6670b05980L1445n518l60L168p307K1682j1669k3217j4278q444K3593J3584k721
$$ -205980 -174535 -180053 -180413 -177245 -184552 -162870 -174539 -197756 -212034 -220478 -196885 -183301 -186022
6657a86022r664J3592P646k4048J2243R674P357J7190P168k9698j5856k61K3782
$$ -186022 -195686 -182094 -174448 -198496 -186253 -176579 -169222 -152032 -144864 -174562 -190418 -190679 -166897
6644a66897K635n577j4425r110O566m991N290o00K9420j0278j6298j2767J2202
$$ -166897 -164262 -169839 -184264 -193374 -186808 -191799 -186509 -187109 -157689 -167967 -184265 -197032 -184830
6631a84830j9390o483M2322k749j6028M26l703J9430j0994K7810j453k1240k1499
$$ -184830 -204220 -210703 -168381 -171130 -187158 -186732 -190435 -171005 -181999 -154189 -155642 -176882 -198381
6618a98381m0832J8808M8736J6973Jo910m4519J4510K944J7806m202P983M377
$$ -198381 -239213 -220405 -171669 -154696 -154695 -161605 -206124 -191614 -188670 -170864 -175066 -167083 -162706
6605a62706Q970j2646l4665J5679l215M688r791J613J7264N932j756m6250P304
$$ -162706 -153736 -166382 -201047 -185368 -188583 -183895 -193686 -192073 -174809 -168877 -170633 -216883 -209579
6592b09579L7568K4250k6259j4029k732k9964K0932J0416M836J5997j0008L929
$$ -209579 -172011 -147761 -174020 -188049 -190781 -220745 -199813 -189397 -184561 -168564 -178572 -174643
6580a74643o778N44k448j155l0007O024O664J4110K2299j3724o053O728m347J0035
$$ -174643 -181421 -180877 -183325 -184480 -214487 -208463 -201799 -187689 -165390 -179114 -185167 -178439 -182786 -172751
6566a72751k9k708N641k0068k892K3359n202K8691j4898P215k6113k5230L8856
$$ -172751 -172780 -175488 -169847 -189915 -192807 -169448 -174650 -145959 -160857 -153642 -179755 -204985 -166129
6553a66129k676j0387k4969J782J7494l203J3807q84j0349M801k1935K496K6105
$$ -166129 -168805 -179192 -204161 -202379 -184885 -188088 -174281 -175165 -185514 -180713 -202648 -200152 -174047
6540a74047j2101n377L67J819P246M099K1691q641P907j0884j1347J8875j7654
$$ -174047 -186148 -191525 -191158 -189339 -182093 -177994 -156303 -164944 -157037 -167921 -179268 -160393 -178047
6527a78047J1886M646k0269R5j7770J9994k7493p285l780J674K4477N5945n418
$$ -178047 -166161 -161515 -181784 -181689 -199459 -179465 -206958 -214243 -218023 -216349 -191872 -135927 -141345
6514a41345j8765r474N2043l087j8205j3301n973L382q857L479K7527j1730k2557
$$ -141345 -160110 -169584 -117541 -120628 -138833 -152134 -158107 -154725 -163582 -160103 -132576 -144306 -166863
6501a66863K5512n986j5422j5492j8514R721J4102R483K3761L126j9811j0012
$$ -166863 -141351 -147337 -162759 -178251 -196765 -187044 -172942 -163459 -139698 -136572 -156383 -166395
6489a66395M1079l0304J2893Q044j3585j2762j9917N802M806o651J3023K5178
$$ -166395 -125316 -155620 -142727 -134683 -148268 -161030 -180947 -175145 -170339 -176990 -163967 -138789
6477a38789J306j1821l279o370K8026j9021K1321K785j645O293k7643o064M7R270
$$ -138789 -137483 -149304 -152583 -158953 -130927 -149948 -128627 -125842 -127487 -121194 -148837 -154901 -154854 -145584
6463a45584J1715N371k5833O95q911L7442m746j1226j1315m338J6814L1035n528
$$ -145584 -133869 -128498 -154331 -153636 -162547 -125105 -129851 -141077 -152392 -156730 -139916 -108881 -114409
6450a14409l0880J7774L2595l819o122k8508J3569K1307k9308Q175O960r177j1027
$$ -114409 -145289 -127515 -94920 -98739 -104861 -133369 -119800 -98493 -127801 -119626 -112666 -121843 -132870
6437a32870r454n39L160K3455L203j4314J6052o746l2229J5232N2892n86l387
$$ -132870 -142324 -142863 -139703 -116248 -113045 -127359 -111307 -118053 -150282 -135050 -82158 -82744 -86131
6424h6131r691j5119j1311L9921j3854q863J1765j6913K0098j6875J7521J4848
$$ -86131 -95822 -110941 -122252 -82331 -96185 -105048 -93283 -110196 -90098 -106973 -89452 -74604
6412g4604q173K85N619j828m6138K369L2552M143m47r730k8008M633J6384k953
$$ -74604 -82777 -82492 -76873 -78701 -124839 -122470 -89918 -85775 -86222 -95952 -123960 -119327 -102943 -105896
6398a05896J2286K3828J9652J2096j5281k616j0566j6809J9701j0225k0157q491
$$ -105896 -93610 -69782 -50130 -38034 -53315 -55931 -66497 -83306 -63605 -73830 -93987 -102478
6386a02478J3999j1559J9087N53j3773J3563J0971j1235j820L1735J2411m9j1274
$$ -102478 -88479 -100038 -80951 -80398 -94171 -80608 -69637 -80872 -82692 -50957 -38546 -38595 -49869
6373d9869j601l4937l777K2307J8176k0017N190L204q032j362J0550P662j5834
$$ -49869 -51470 -86407 -90184 -67877 -49701 -69718 -64528 -61324 -69356 -70718 -60168 -52506 -68340
6360f8340m694K445J9657O732J618K536J1110j1784r52M056N852o816k3049J2777
$$ -68340 -73034 -70589 -50932 -44200 -42582 -40046 -28936 -40720 -41672 -37616 -31764 -38580 -61629 -48852
6346d8852J2611m460j5618J3275q602m22L569m594O264N294J9261P398l592N282
$$ -48852 -36241 -40701 -56319 -43044 -51646 -52068 -48499 -53093 -46829 -41535 -22274 -14876 -18468 -13186
6332a3186j5325J3552l8962J150K6677K0724L826j6761J5064j363k2368J5181
$$ -13186 -28511 -14959 -53921 -52771 -26094 -5370 -1544 -18305 -3241 -4604 -26972 -11791
6320a1791K0133J843o782j1986q325l1475L4262K2637j8281L23K1998k366l880
$$ -11791 8342 10185 3403 -8583 -16908 -48383 -14121 8516 -9765 -9442 12556 10190 6310
6307F310n329J193K9636l99k2164K3029P419k576o600n20N082m218L829J1061
$$ 6310 981 2174 31810 31411 9247 32276 39695 37119 30519 29999 35081 30863 34692 45753
6293D5753j0070N517L534q720L5961P119J053K8746P436o757K1015K7508M1992
$$ 45753 35683 41200 44734 36014 71975 79094 80147 108893 116329 109572 130587 158095 200087
6280B00087L7330J652J8115L2147M5098N3323J7386Q568K9619L0457R194j7526
$$ 200087 237417 239069 257184 289331 334429 387752 405138 413706 443325 473782 482976 465450
6268D65450k9789k6115m0528p3410k6594l3166l3760j2271j5775j9616K36o351
$$ 465450 435661 409546 369018 295608 269014 235848 202088 189817 174042 154426 154662 148311
6256A48311l635j7004j4649l650j7107k6403K9809k2626j6991J0207N384j2863
$$ 148311 144676 127672 113023 109373 92266 65863 95672 73046 56055 66262 71646 58783
6244E8783j3960J8215K162k9016m916M3358l39o861p339l540k9722J8842K1410
$$ 58783 44823 63038 65200 36184 31268 74626 74287 67426 60087 56547 26825 45667 67077
6231F7077o764j1977j24J3603P04j7038j0676K0354j5270l8107l530K5568o80
$$ 67077 60313 48336 48212 61815 62519 45481 34805 55159 39889 1782 -1748 23820 23140
6218B3140j2678j112j5732Q863K3361p579q903j4549j381Q228L3585j6510j6788
$$ 23140 10462 9350 -6382 2481 25842 18263 9360 -5189 -6570 1658 35243 18733 1945
6205A945K0047j8151q420l334p950M340K1122K4567j1139J0982j3652j1793K2851
$$ 1945 21992 3841 -4579 -7913 -15863 -11523 9599 34166 23027 34009 20357 8564 31415
6192C1415R906k0789O246J5317j8858j2534n333J5366m947m685P093m980m921
$$ 31415 41321 20532 26778 42095 23237 10703 5370 20736 15789 11104 18197 13217 8296
6179H296J1802j1055l945k628K3019j7407K266P901K064n451j5002O043J784L0490
$$ 8296 20098 9043 5098 2470 25489 8082 10348 18249 20313 14862 -140 5903 7687 38177
6165C8177J1825k1580j2716N067o174j6518J5512r896j187P488J0094J9266j4407
$$ 38177 50002 28422 15706 20773 14599 -1919 13593 3697 2510 9998 20092 39358 24951
6152B4951l661j095J5829J0417J9273m8289l8672K1041l417J9277N916o253J7668
$$ 24951 21290 20195 36024 46441 65714 17425 -21247 -206 -3623 15654 21570 15317 32985
6139C2985L89p941M921O444L254M536n913j3497l63J4116K1028j2339J0999Q488
$$ 32985 33374 25433 30354 36798 40052 44588 38675 25178 24815 38931 59959 47620 58619 67107
6125F7107J3219P74N383l5223J9417j7626J4693N946J4962J9771K4148r345j175
$$ 67107 80326 81100 86483 51260 70677 53051 67744 73690 88652 108423 132571 123226 122051
6112A22051N595j8809P844r439M035r098R983j9507J9854l726L169J3927j7297
$$ 122051 127646 108837 116681 107242 111277 102179 112162 92655 112509 108783 111952 125879 108582
6099A08582k140k4120N270Q861j7107K0589J9825J4331m260J0809j1088J010J3133
$$ 108582 106442 82322 87592 96453 79346 99935 119760 134091 129831 140640 129552 130562 143695
6086A43695J0327o591J0971N758K8451Q893k9192K8569J7163j8072k0800j5744
$$ 143695 154022 147431 158402 164160 192611 201504 172312 200881 218044 199972 179172 163428
6074A63428j1043j591q19k4672k111k9106n09J4456j8854L1166k6073o482R700
$$ 163428 152385 150794 149975 125303 123192 94086 93577 108033 89179 120345 94272 87790 97490
6061I7490P461L8978q506k5642N460M418k886J0653O572J4882l0302P370m695
$$ 97490 104951 143929 135423 109781 115241 119659 116773 127426 133998 148880 118578 125948 121253
6048A21253k1668P419K3599j0414M544k0954K0913q319J7436L3439j9693m780
$$ 121253 99585 107004 130603 120189 124733 103779 124692 116373 133809 167248 147555 142775
6036A42775R968k192n930q644l104J1478p53Q561O735j6763O215N199j7579r274
$$ 142775 152743 150551 144621 135977 132873 144351 143598 152159 158894 142131 148346 153545 135966 126692
6022A26692L242J6212M027L331m45j0878J7748P468l320L348n265J8450p066k208
$$ 126692 129934 146146 150173 153504 153059 142181 159929 167397 164077 167425 162160 180610 173544 171336
6008A71336K0431J118O163l015l092j65k0240J4135r430m370J5006J5132j9538
$$ 171336 191767 192885 199048 196033 192941 192776 172536 186671 177241 172871 187877 203009 183471
5995A83471j1284R898J045Q443J3108K0560o15j6485K7766j5190r393K1594J1386
$$ 183471 172187 182085 183130 191573 204681 225241 224626 208141 235907 220717 211324 232918 244304
5982B44304j0857L480J3620O37p78n713J3856o825J663q442j2411K735k321K007
$$ 244304 233447 236927 250547 251184 250406 244693 258549 251724 253387 244945 232534 235269 232948 234955
5968B34955k665J6987P324P701L235j2310N007Q644J1329j1250O249K3161k3901
$$ 234955 232290 249277 256601 264302 267537 255227 260234 268878 280207 268957 275206 298367 274466
5955B74466p430K0066J1668J732J841J3267J566k7146K5411O072J9218n495J6567
$$ 274466 267036 287102 298770 300502 302343 315610 317176 290030 315441 321513 340731 335236 351803
5942C51803L253l617O162J3171k3018j806J9830p792k2689J9058L7474r199j3823
$$ 351803 355056 351439 357601 370772 347754 345948 365778 357986 335297 354355 391829 382630 368807
5929C68807o341j5937J5692J7135K856K1261O897j2214k448k547K5494K4971q011
$$ 368807 362466 346529 362221 379356 382212 403473 410370 398156 395708 393161 418655 443626 435615
5916D35615m933l275J8357j9987L2741L398k3358j001K8035m115J9440L891r23
$$ 435615 430682 427407 445764 425777 458518 461916 438558 437557 465592 461477 480917 484808 483885
5903D83885J9703K334M130k0186q512n823J3083P401K0625L2444j8325R495J0387
$$ 483885 503588 505922 510052 489866 481354 475531 488614 496015 516640 549084 530759 540254 550641
5890E50641K5962L088j8802P996J4348J9208R772r895J0007K5444J2332J4101
$$ 550641 576603 579691 560889 568885 583233 602441 612213 602318 612325 637769 650101 664202
5878F64202K2883N561L3623K6426r88P671J1004j7419P943J0062l1495k9956J6427
$$ 664202 687085 692646 726269 752695 751707 759378 770382 752963 760906 770968 739473 709517 725944
5865G25944k5650J2096L0143o352J168J1590K1161P163K3838l6677J0168L7331
$$ 725944 700294 712390 742533 736181 737349 748939 770100 777263 801101 764424 774592 811923
5853H11923n592j1644O078J2232K1675J0261N022J4246j7849K3560n157K0389
$$ 811923 806331 794687 800765 812997 834672 844933 849955 864201 846352 869912 864755 885144
5841H85144K9820R426K982O249K9752J7454J4952Q227j1722r912K3234j2910k3047
$$ 885144 914964 924390 927372 933621 963373 980827 995779 1004006 992284 982372 1005606 992696 969649
5828I69649n955K411J3991J984j991J2023j2700J0839j423R241K950K659K4815
$$ 969649 963694 966105 980096 982080 980089 992112 979412 990251 988828 998069 1001019 1003678 1028493
5815A028493K4398J3207J2240J7386J2362J9174J2681K4525J6329K316K7762K6501
$$ 1028493 1052891 1066098 1078338 1095724 1108086 1127260 1139941 1164466 1180795 1183111 1210873 1237374
5803A237374J3458J9108P957p765K8495K6542K2998M0828K2401K1403K0443L7583
$$ 1237374 1250832 1269940 1277897 1270132 1298627 1325169 1348167 1388995 1411396 1432799 1453242 1490825
5791A490825K1985J8562L4016J3602Q0652N5633L7699O5347O8420M8887P5003
$$ 1490825 1512810 1531372 1565388 1578990 1659642 1715275 1752974 1818321 1886741 1935628 2010631
5780B010631O3155Q1552Q8508N0640R6277J11286Q4208J16415J18782J31412J17509
$$ 2010631 2073786 2155338 2243846 2294486 2390763 2502049 2586257 2702672 2821454 2952866 3070375
5769C070375J32593R4377J13360J25603R0810Q7116L344J90Q585K0194O832R391
$$ 3070375 3202968 3297345 3410705 3536308 3627118 3714234 3717578 3717768 3726353 3746547 3753379 3762770
5757C762770r538K9522N3301L4695K1864N272J2955J9183R122M6206O1265Q5430
$$ 3762770 3753232 3782754 3836055 3870750 3892614 3897886 3910841 3930024 3939146 3985352 4046617 4132047
5745D132047O5415N6809P6158Q2593P0615O5603Q1430O3892O2715m789j0551k227
$$ 4132047 4197462 4254271 4330429 4413022 4483637 4549240 4630670 4694562 4757277 4752488 4741937 4739710
5733D739710l9777l8338m9805n7498r1858r4724n7635p8958o8463m7453q9095
$$ 4739710 4699933 4661595 4611790 4554292 4462434 4367710 4310075 4231117 4162654 4115201 4026106
5722D026106n6859o0132m2814p4515m1821k9507n2277n1685m1059k6688k5089
$$ 4026106 3969247 3909115 3866301 3791786 3749965 3720458 3668181 3616496 3575437 3548749 3523660
5711C523660N251m4731k0177m261n410L5364J7044N6538K8020M2430O8373P6674
$$ 3523660 3528911 3484180 3464003 3459742 3454332 3489696 3506740 3563278 3591298 3633728 3702101 3778775
5699C778775P0404P3079J21857J23463J47740J52062J71666J78109K08079K13563
$$ 3778775 3849179 3922258 4044115 4167578 4315318 4467380 4639046 4817155 5025234 5238797
5689E238797K23706J86120J30164P5262J8906j4019q4430q7579j31421j20219
$$ 5238797 5462503 5648623 5778787 5854049 5872955 5858936 5774506 5686927 5555506 5435287
5679E435287j43289j20320q2727r8798q2585o9958n0742n2516j7432l6768k5376
$$ 5435287 5291998 5171678 5088951 4990153 4907568 4837610 4786868 4734352 4716920 4680152 4654776
5668D654776K9564J602O396M303K6349J5501M5817N2054K9258M0800N0363P0128
$$ 4654776 4684340 4685942 4692338 4696641 4722990 4738491 4784308 4836362 4865620 4906420 4956783 5026911
5656E026911R1045R5189P1268J00622J31708J73980J25117J69235J67076K01494
$$ 5026911 5117956 5213145 5284413 5385035 5516743 5690723 5815840 5985075 6152151 6353645
5646F353645J95908K25251K60982K34800K41570K19172K07110J49737J18809k6589
$$ 6353645 6549553 6774804 7035786 7270586 7512156 7731328 7938438 8088175 8206984 8180395
5636H180395j04950j24544j93793j86089k51518k81984k65117k11664k06281j69159
$$ 8180395 8075445 7950901 7757108 7571019 7319501 7037517 6772400 6560736 6354455 6185296
5626F185296j44898j26775j27883o9282o7098o0315q390j0067L533N6176N2346
$$ 6185296 6040398 5913623 5785740 5716458 5649360 5589045 5580655 5570588 5574121 5630297 5682643
5615E682643O6964J16368J11550J25921J60605J38708J40275J42353J63022J29784
$$ 5682643 5749607 5865975 5977525 6103446 6264051 6402759 6543034 6685387 6848409 6978193
5605F978193J17181N5880M083m046j5865q6394j21310r5784j17184j00600j00755
$$ 6978193 7095374 7151254 7155337 7151291 7135426 7049032 6927722 6831938 6714754 6614154 6513399
5594F513399p7324p2714l2162j986J3047M4525O0178N5216Q1072P6736J16457
$$ 6513399 6436075 6363361 6331199 6329213 6342260 6386785 6446963 6502179 6583251 6659987 6776444
5583F776444J08927R8041R3366J14719O6364N426K8528J3240r168L302q600M673
$$ 6776444 6885371 6983412 7076778 7191497 7257861 7263287 7291815 7305055 7295887 7299189 7290589 7295262
5571G295262p218j2528M74K5542N7019P4522M9803O0820N8080J02743J46651J54429
$$ 7295262 7288044 7275516 7275990 7301532 7358551 7433073 7482876 7543696 7601776 7704519 7851170 8005599
5559H005599J66287J73071K30988K53159K57472K93220L23191L68508L63665L72508
$$ 8005599 8171886 8344957 8575945 8829104 9086576 9379796 9702987 10071495 10435160 10807668
5549A0807668M29337M92113M93230M73745M74141M67826L97396L53486K59941
$$ 10807668 11237005 11729118 12222348 12696093 13170234 13638060 14035456 14388942 14648883
5540A4648883J48503N0782m3656j21594k00439k60262k61141k81079k81777k64676
$$ 14648883 14797386 14848168 14804512 14682918 14482479 14222217 13961076 13679997 13398220 13133544
5530A3133544k98530k65469k54304k23782j84239j57248j46397j29168j09799
$$ 13133544 12835014 12569545 12315241 12091459 11907220 11749972 11603575 11474407 11364608
5521A1364608r8441m9742l7739k4565P21k4676K2772P9541R0875R2772J49481
$$ 11364608 11266167 11216425 11178686 11154121 11154842 11130166 11152938 11232479 11323354 11416126 11565607
5510A1565607J61703J34631J31925J09247J57232J79962J90524J98186J68445
$$ 11565607 11727310 11861941 11993866 12103113 12260345 12440307 12630831 12829017 12997462
5501A2997462J99751J23961O0220M393p4489j49460k23703k68970k91658l18330
$$ 12997462 13197213 13321174 13381394 13385787 13311298 13161838 12938135 12669165 12377507 12059177
5491A2059177l61052l82596m47073m14290m28634m33374m01659l88139l94628
$$ 12059177 11698125 11315529 10868456 10454166 10025532 9592158 9190499 8802360 8407732
5482H407732l41694l35521k84780k66981k56541j97664k06976j87232j70323j11050
$$ 8407732 8066038 7730517 7445737 7178756 6922215 6724551 6517575 6330343 6160020 6048970
5472F048970j24882j10834j09473r7199q4347p4156o8028q0658o7617p6435r0775
$$ 6048970 5924088 5813254 5703781 5606582 5522235 5448079 5380051 5299393 5231776 5155341 5064566
5461E064566n6010n8128r5772n7847l7697n8369n6345o8297o6599l9325l1138
$$ 5064566 5008556 4950428 4854656 4796809 4759112 4700743 4644398 4576101 4509502 4470177 4439039
5450D439039m8553n4510n8347p1894m1117j9775l3180m0877l7181J2286J041j1107
$$ 4439039 4390486 4335976 4277629 4205735 4164618 4144843 4111663 4070786 4033605 4045891 4046932 4035825
5438D035825k0887r000L7526J3380k1787j16K4616n828J1796M6954Q458L1839
$$ 4035825 4014938 4005938 4043464 4056844 4035057 4034941 4059557 4053729 4065525 4112479 4120937 4152776
5426D152776P8724N6650L1631O3402P6338J07008Q9516R3893J29601J31709J00011
$$ 4152776 4231500 4288150 4319781 4383183 4459521 4566529 4656045 4749938 4879539 5011248 5111259
5415E111259J30889J34683J37279J47532J61346J34252J46202J52019J25198J23492
$$ 5111259 5242148 5376831 5514110 5661642 5822988 5957240 6103442 6255461 6380659 6504151
5405F504151J08237Q4816Q4329J04496O8431M3640O6753N1705K4699O3492R738
$$ 6504151 6612388 6697204 6781533 6886029 6954460 6998100 7064853 7116558 7141257 7204749 7214487
5394G214487n5347q6605q1486p1637j06827j22355j25968j51693j22326j28214
$$ 7214487 7159140 7072535 6991049 6919412 6812585 6690230 6564262 6412569 6290243 6162029
5384F162029j52981k60898k30143k10328k14174j89635j60975j02832j24971j03064
$$ 6162029 6009048 5748150 5518007 5307679 5093505 4903870 4742895 4640063 4515092 4412028
5374D412028q6500r8718q8796o1444l6408m8764m0595j9499k7749n324q356l834
$$ 4412028 4325528 4226810 4138014 4076570 4040162 3991398 3950803 3931304 3903555 3898231 3889875 3886041
5362C886041K116J3335M0269P9242J3554M7065Q4936R9774J19710Q4733K9556
$$ 3886041 3888157 3901492 3941761 4021003 4034557 4081622 4166558 4266332 4386042 4470775 4500331
5351D500331M220j6589l2955o36K9495L1832P9479R8627Q1554J25514J19835J28326
$$ 4500331 4504551 4487962 4455007 4454371 4483866 4515698 4595177 4693804 4775358 4900872 5020707 5149033
5339E149033J24899J51985J64083J92913K23107K10433K31551K27093K62034K42981
$$ 5149033 5273932 5425917 5590000 5782913 6006020 6216453 6448004 6675097 6937131 7180112
5329G180112K27032J92568K09239J94046J15498L0107N343k1538j16837j77552
$$ 7180112 7407144 7599712 7808951 8002997 8118495 8148602 8153945 8132407 8015570 7838018
5319G838018k02429k15916k18176k26455j80410j66369j81555j54496j19178q1920
$$ 7838018 7635589 7419673 7201497 6975042 6794632 6628263 6446708 6292212 6173034 6091114
5309F091114j04905l1477m0792p499k1493K4982M9408P3520Q2988R5749J21931
$$ 6091114 5986209 5954732 5913940 5906441 5884948 5909930 5959338 6032858 6115846 6211595 6333526
5298F333526J48389J52709J97863K25041K50946K73479L27770L06775L13205L32070
$$ 6333526 6481915 6634624 6832487 7057528 7308474 7581953 7909723 8216498 8529703 8861773
5288H861773L52518L29822L29746L24248K79880K22344J64943J30379R1450O2376
$$ 8861773 9214291 9544113 9873859 10198107 10477987 10700331 10865274 10995653 11087103 11149479
5278A1149479N1447N6122P1129P7756J23392J81838K35286L21260K97491L31203
$$ 11149479 11200926 11257048 11328177 11405933 11529325 11711163 11946449 12267709 12565200 12896403
5268A2896403L84660L20605K86877K21517R8286j276j31230k25103l60849m34682
$$ 12896403 13281063 13601668 13888545 14110062 14208348 14207072 14075842 13850739 13489890 13055208
5258A3055208m81360n67707n73247n69116n48563n30157m99142m87778m32778
$$ 13055208 12573848 12006141 11432894 10863778 10315215 9785058 9285916 8798138 8365360
5249H365360m06165m06325l33846l21878k64748k41964k14470j93177j93910j70753
$$ 8365360 7959195 7552870 7219024 6897146 6632398 6390434 6175964 5982787 5788877 5618124
5239E618124j19033j07462r7596r2208n8305m7888k1577l7689k2912l912P269
$$ 5618124 5499091 5391629 5294033 5201825 5143520 5095632 5074055 5036366 5013454 5009542 5016811
5228E016811J147N383L3904L4472N5625O7756K9224P3568P5661J13886J39872
$$ 5016811 5017958 5023341 5057245 5091717 5147342 5215098 5244322 5317890 5393551 5507437 5647309
5217E647309J24865J19802K06594K08533J99971K44635K72312K97953L25174L55558
$$ 5647309 5772174 5891976 6098570 6307103 6507074 6751709 7024021 7321974 7647148 8002706
5207H002706L60522L90868M31542M61460M47350M01222L92208L12132K82841K10414
$$ 8002706 8363228 8754096 9185638 9647098 10094448 10495670 10887878 11200010 11482851 11693265
5197A1693265R7867j4485j19592k42328l25977l71268m31058m77007m88204n05431
$$ 11693265 11791132 11776647 11657055 11414727 11088750 10717482 10286424 9809417 9321213 8815782
5187H815782m95577m49916m42197m20609m09140l66588l17161l11940k86180k34456
$$ 8815782 8320205 7870289 7428092 7007483 6598343 6231755 5914594 5602654 5316474 5082018
5177E082018k28872j94773j64404j58054j46447j25372j41165r0744r5409o8457
$$ 5082018 4853146 4658373 4493969 4335915 4189468 4064096 3922931 3832187 3736778 3668321
5167C668321p5538o2760m9443n3890n6229m0505m2120o448l3234k7908J3774L6771
$$ 3668321 3592783 3530023 3480580 3426690 3370461 3329956 3287836 3281388 3248154 3220246 3234020 3270791
5155C270791J8875K3740L7961M1383Q9039Q1474J03256J25017J17866J34448J55271
$$ 3270791 3289666 3313406 3351367 3392750 3481789 3563263 3666519 3791536 3909402 4043850 4199121
5144D199121J84668J86775J95667K27717J78693J40825J43123J30868O4960p625
$$ 4199121 4383789 4570564 4766231 4993948 5172641 5313466 5456589 5587457 5652417 5644792
5134E644792m0635m0420j07296j24236j33350j31737j01110j07619j01188j54533
$$ 5644792 5604157 5563737 5456441 5332205 5198855 5067118 4966008 4858389 4757201 4602668
5124D602668k45466k85564k67209k07825j97111j81418j29481j33858j04592j12526
$$ 4602668 4357202 4071638 3804429 3596604 3399493 3218075 3088594 2954736 2850144 2737618
5114B737618n7515p4260j01727p6413m4580m2430o0148m5435m7881l8929n0619
$$ 2737618 2680103 2605843 2504116 2427703 2383123 2340693 2280545 2235110 2187229 2148300 2097681
5103B097681n0514l9204k5735m2399j7974m1808l0543m0404j8401j5297j7886
$$ 2097681 2047167 2007963 1982228 1939829 1921855 1880047 1849504 1809100 1790699 1775402 1757516
5092A757516o26o0363j8896k2984j533j3296m9943L859p184k1609k6277j5933
$$ 1757516 1756890 1696527 1677631 1654647 1653114 1639818 1589875 1593734 1586550 1564941 1538664 1522731
5080A522731k855l2333j7860K60j9776N043J587m4299O146R932R630k3845j2112
$$ 1522731 1519876 1487543 1469683 1469943 1450167 1455210 1456797 1412498 1418644 1428576 1438206 1414361 1402249
5067A402249J2434P764j7304j6378l2262j8604k0744L669k3274k0007j6246k6976
$$ 1402249 1414683 1422447 1405143 1388765 1356503 1337899 1317155 1320824 1297550 1277543 1261297 1234321
5055A234321M535m1185l6734k1838Q130j6103P300J3372l54o312k1660k4578P676
$$ 1234321 1238856 1197671 1160937 1139099 1147229 1131126 1138426 1151798 1151444 1145132 1123472 1098894 1106570
5042A106570L30j5056K7032J051r089j1057k0838j0787K402k845Q553N732k0033
$$ 1106570 1106900 1091844 1118876 1119927 1110838 1099781 1078943 1068156 1070558 1067713 1076266 1081998 1061965
5029A061965r416K1919o880j0112N235M428L894k2757j1356J0857K363R530J8530
$$ 1061965 1052549 1074468 1067588 1057476 1062711 1067139 1071033 1048276 1036920 1047777 1050140 1059670 1078200
5016A078200j2261j264l928K2730L186j7160q281J9604L592j1357R888j8894j7462
$$ 1078200 1065939 1064675 1060747 1083477 1086663 1069503 1061222 1080826 1084418 1073061 1082949 1064055 1046593
5003A046593J0734P946J3042j5588j9420m3548J4910Q436n006j3190J0957j5568
$$ 1046593 1057327 1065273 1078315 1062727 1043307 999759 1014669 1023105 1018099 1004909 1015866 1000298
4991A000298j474J1233k789J5863k531k7905k8290L2836k0578r076J2563J9386
$$ 1000298 998824 1010057 1007268 1023131 1020600 992695 964405 997241 976663 967587 980150 999536
4979I99536j4121R670J5152o754J0860r991J0547j3759L34O42n789J5009P910
$$ 999536 985415 995085 1010237 1003483 1014343 1004352 1014899 1001140 1001474 1002116 996327 1011336 1019246
4966A019246q967k2336L097k018K6658j2908q586K4532r889k2677J7850K4266
$$ 1019246 1010279 987943 991040 989022 1015680 1002772 994186 1018718 1008829 986152 1004002 1028268
4954A028268l3326k17J9090n355j5495Q832J6952J9972J1346L934j4118J4258
$$ 1028268 994942 994725 1013815 1008460 992965 1001797 1018749 1038721 1050067 1054001 1039883 1054141
4942A054141p897P188K160k3592O368j1732M953M216j1902n221K0172m233K5644
$$ 1054141 1046244 1053432 1055592 1032000 1038368 1026636 1031589 1035805 1023903 1018682 1038854 1034621 1060265
4929A060265J1334P509j9147k8779Q566q0p97P631J8641j3822k1824K2599J4174
$$ 1060265 1071599 1079108 1059961 1031182 1039748 1039668 1038871 1046502 1065143 1051321 1029497 1052096 1066270
4916A066270J778K2581P374o320k4360l418O834j0858Q264n259M159K8307M271
$$ 1066270 1068048 1090629 1098003 1091683 1067323 1063905 1070739 1059881 1068145 1062886 1067045 1095352 1099623
4903A099623j6539p984K0790p18r553j0055L0972K3955J01R641q847J3863K2528
$$ 1099623 1083084 1075100 1095890 1095172 1085619 1075564 1106536 1130491 1130592 1140233 1131386 1145249 1167777
4890A167777Q08m645j1765o862r69K1110O512j9426k2772J5122K1992m496K31
$$ 1167777 1168585 1163940 1152175 1145313 1144344 1165454 1171966 1152540 1129768 1144890 1166882 1162386 1162617
4877A162617j352K0499k422R06L8827M1624R039n360j9269J3657Q984o596J4193
$$ 1162617 1161265 1181764 1179342 1180248 1219075 1260699 1269738 1264378 1245109 1258766 1267750 1261154 1275347
4864A275347k2965p327j9189N973j3180J5965j899j0822R251j318Q078m846L1616
$$ 1275347 1252382 1245055 1225866 1231839 1218659 1234624 1232725 1221903 1231154 1229836 1237914 1233068 1264684
4851A264684J9961K8011R794J9274K6810M1196M0369O9085M3259J579J3116J9766
$$ 1264684 1284645 1312656 1322450 1341724 1368534 1409730 1450099 1519184 1562443 1564022 1577138 1596904
4839A596904l2408l6214m4223j3560k8926k6241k5444m3443J130j7727k6788l079
$$ 1596904 1564496 1528282 1484059 1470499 1441573 1415332 1389888 1346445 1347575 1329848 1303060 1299981
4827A299981j9025l692j1219O115j078q735K596k3247L59J0312k2170O787J5944
$$ 1299981 1280956 1277264 1266045 1272160 1271082 1262347 1264943 1241696 1242055 1252367 1230197 1236984 1252928
4814A252928K5363r30j5328J242O533k8207j7432j8037P67J468n688j4981l2958
$$ 1252928 1278291 1277361 1262033 1263275 1269808 1241601 1224169 1206132 1206899 1208367 1202679 1187698 1154740
4801A154740K8173o445K968R974l0239k5491J6656m497O188Q575j0449k0151L3740
$$ 1154740 1182913 1176468 1179436 1189410 1159171 1133680 1150336 1145839 1152027 1160602 1150153 1130002 1163742
4788A163742l113k821M3673J5386l282o301j3794j4080J7242m111Q535J6381J8781
$$ 1163742 1160629 1157808 1201481 1216867 1213585 1207284 1193490 1179410 1196652 1192541 1201076 1217457 1236238
4775A236238K22n454j0350O911j8160R933J4716L727J0205r355J3233J0060K7505
$$ 1236238 1236460 1231006 1220656 1227567 1209407 1219340 1234056 1237783 1247988 1238633 1251866 1261926 1289431
4762A289431J3904m160R57L2993K1553K6475m35K7744O728p700J9246K6815M1660
$$ 1289431 1303335 1299175 1300132 1333125 1354678 1381153 1380718 1408462 1415190 1407490 1426736 1453551 1495211
4749A495211L0590J4632K5520M2123J0884j8395O609L5927K0395K1264J9125K9119
$$ 1495211 1525801 1540433 1565953 1608076 1618960 1600565 1607174 1643101 1663496 1684760 1703885 1733004
4737A733004N5870L7619O3394P9621R3770J18025J43390K01074K98733L23549
$$ 1733004 1788874 1826493 1889887 1969508 2063278 2181303 2324693 2525767 2824500 3148049
4727C148049L28669K33720P1354j37118k74349k85025k61157j91764j31662j01128
$$ 3148049 3476718 3710438 3781792 3644674 3370325 3085300 2824143 2632379 2500717 2399589
4717B399589o6288n7568n1541l2817j2610N620o096k7157J0315o296K0028K792
$$ 2399589 2333301 2275733 2224192 2191375 2178765 2184385 2178289 2151132 2161447 2155151 2175179 2177971
4705B177971L2992J8249k0091J5204M0210M4648K5517J9625J4109K8091j0414
$$ 2177971 2210963 2229212 2209121 2224325 2264535 2309183 2334700 2354325 2368434 2396525 2386111
4694B386111L3994K4744K1970K4101K1792L8426J1025J9522K6342L2385L2874
$$ 2386111 2420105 2444849 2466819 2490920 2512712 2551138 2562163 2581685 2608027 2640412 2673286
4683B673286M1528M2789M9057M0455N9574O5819P0788Q2820P4012J05466J00837
$$ 2673286 2714814 2757603 2806660 2847115 2906689 2972508 3043296 3126116 3200128 3305594 3406431
4672C406431Q8944J12538R6352J73907K05913J98890K88931L34801L10939K00097
$$ 3406431 3495375 3607913 3704265 3878172 4084085 4282975 4571906 4906707 5217646 5417743
4662E417743O6224m7427j67443k69702k78206k02466j17268j01249q2863m9305
$$ 5417743 5483967 5436540 5269097 4999395 4721189 4518723 4401455 4300206 4217343 4168038
4652D168038j1799k518N2065M7981M4393M3944O3984P0874N1726Q1008N7693M4311
$$ 4168038 4156239 4153721 4205786 4253767 4298160 4342104 4406088 4476962 4528688 4609696 4667389 4711700
4640D711700K8486k62L5943K1174n108K0966J408l0674j3795j1149l7078j5311
$$ 4711700 4740186 4739924 4775867 4797041 4791933 4812899 4814307 4783633 4769838 4758689 4721611 4706300
4628D706300l9971l8747M803k1747p445J3621j322K0449N1710L5627M5760K5109
$$ 4706300 4666329 4627582 4632385 4610638 4603193 4616814 4615492 4635941 4687651 4723278 4769038 4794147
4616D794147O6491M7961N8166N6725M1676N9130L6396K8908N4697J5176L0989
$$ 4794147 4860638 4908599 4966765 5023490 5065166 5124296 5160692 5189600 5244297 5259473 5290462
4605E290462K5286N2252L9402K9396M4712K9785L9247O9910P9595N7082M7722
$$ 5290462 5315748 5368000 5407402 5436798 5481510 5511295 5550542 5620452 5700047 5757129 5804851
4594E804851O0854L3975M1580L2522L5129L6204J1005J8984L6751K7254L9750
$$ 5804851 5865705 5899680 5941260 5973782 6008911 6045115 6056120 6075104 6111855 6139109 6178859
4583F178859O6070O9852M9612N6604O0161J02472R4666J01981J08248J46342J31543
$$ 6178859 6244929 6314781 6364393 6420997 6481158 6583630 6678296 6780277 6888525 7034867 7166410
4572G166410J23936J41735J45129J65220J48077J40195J16346J06962O5991O1394
$$ 7166410 7290346 7432081 7577210 7742430 7890507 8030702 8147048 8254010 8320001 8381395
4562H381395M2778l682k0543n6609o7876m2925q1927n2147o6627n5799r2978n9820
$$ 8381395 8424173 8420491 8399948 8343339 8275463 8232538 8150611 8098464 8031837 7976038 7883060 7823240
4550G823240m9203n7876n4019l3216m2163k8441M310J7144M3474N0772J7720J6202
$$ 7823240 7774037 7716161 7662142 7628926 7586763 7558322 7562632 7579776 7623250 7674022 7691742 7707944
4538G707944L7376P2079Q2312M2213L6189M2089L8036L9819j5297L06p774n6007
$$ 7707944 7745320 7817399 7899711 7941924 7978113 8020202 8058238 8098057 8082760 8083066 8075292 8019285
4526H019285l9560j2471l7523k9240m1725j5571j9925j1960j4375J3778M2815
$$ 8019285 7979725 7967254 7929731 7900491 7858766 7843195 7823270 7811310 7796935 7810713 7853528
4515G853528J7579L4949L7265M1101R1000J04308J07032J40130J66634J95692
$$ 7853528 7871107 7906056 7943321 7984422 8075422 8179730 8286762 8426892 8593526 8789218
4505H789218J89624J99418J72582J26841R4683P1177N8394K9653L3076M3476Q6347
$$ 8789218 8978842 9178260 9350842 9477683 9572366 9643543 9701937 9731590 9764666 9808142 9894489
4494I894489J16089J47147J25886J78790J95803J62625K14131K77102K27231K14102
$$ 9894489 10010578 10157725 10283611 10462401 10658204 10820829 11034960 11312062 11539293 11753395
4484A1753395K27376K01593J76098J48655J57489J24935J39399J17029J37653
$$ 11753395 11980771 12182364 12358462 12507117 12664606 12789541 12928940 13045969 13183622
4475A3183622J95666K03996K15748K18889K12592K06711J52360J69605J44259
$$ 13183622 13379288 13583284 13799032 14017921 14230513 14437224 14589584 14759189 14903448
4466A4903448J07635Q4738M8838L4413m815J0210K2267J0246l9032j4181m841
$$ 14903448 15011083 15095821 15144659 15179072 15174257 15184467 15206734 15216980 15177948 15163767 15158926
4455A5158926p55l5875m9077o2243m6160n9759m9855m8743k4210k9250J7482J1754
$$ 15158926 15158171 15122296 15073219 15010976 14964816 14905057 14855202 14806459 14782249 14752999 14770481 14782235
4443A4782235J0568K2859K1700K6574J5165l9022n4362l2698l8163l9411L0912
$$ 14782235 14792803 14815662 14837362 14863936 14879101 14840079 14785717 14753019 14714856 14675445 14706357
4432A4706357N0254Q4315K05673J93455K45882K88080L45403L56039M39041M51372
$$ 14706357 14756611 14840926 15046599 15240054 15485936 15774016 16119419 16475458 16914499 17365871
4422A7365871M61508M73553M95996M48270M09413L58673L28192K78496K52865
$$ 17365871 17827379 18300932 18796928 19245198 19654611 20013284 20341476 20619972 20872837
4413B0872837K33995K61977K68379L13285L45950L21948K48619J25354P9632R0704
$$ 20872837 21106832 21368809 21637188 21950473 22296423 22618371 22866990 22992344 23071976 23162680
4403B3162680M0436J773k5014r4680j39362j98778k14913k34118k46818k19711
$$ 23162680 23203116 23204889 23179875 23085195 22945833 22747055 22532142 22298024 22051206 21831495
4393B1831495k24446k44215j98805j57755j69018j38923j37504j24281j48343
$$ 21831495 21607049 21362834 21164029 21006274 20837256 20698333 20560829 20436548 20288205
4384B0288205j75255j51804j31390j38946j00978q5016n4661l0118K0566J9519
$$ 20288205 20112950 19961146 19829756 19690810 19589832 19504816 19450155 19420037 19440603 19460122
4374A9460122K2614O9030J12735K0482K7588m5833o3492j05557j53463k30873
$$ 19460122 19482736 19551766 19664501 19684983 19712571 19666738 19603246 19497689 19344226 19113353
4364A9113353k27787k14284j93852k14084j67652q3234j09774l6765J156L1795
$$ 19113353 18885566 18671282 18477430 18263346 18095694 18012460 17902686 17865921 17867077 17898872
4354A7898872O3880R2172Q5299O7234O3882j1491j03754j85902k47367k16965
$$ 17898872 17962752 18054924 18140223 18207457 18271339 18259848 18156094 17970192 17722825 17505860
4344A7505860k33498k47507j96706j46754j37653j15962p2241k8465J9299Q2155
$$ 17505860 17272362 17024855 16828149 16681395 16543742 16427780 16355539 16327074 16346373 16428528
4334A6428528J22161J51506J66535J97745K28740K66340K56317K62945K66908
$$ 16428528 16550689 16702195 16868730 17066475 17295215 17561555 17817872 18080817 18347725
4325A8347725K86854L78736L87021M23603N28768N76487O14453O30529O76646
$$ 18347725 18634579 19013315 19400336 19823939 20352707 20929194 21543647 22174176 22850822
4316B2850822O79570O37570M60293J55732l08193p52885j066825j178116j138991
$$ 22850822 23530392 24167962 24628255 24783987 24475794 23722909 22656084 21477968 20338977
4307B0338977j003186q40102o57458n64610m39851l51038l09906k00403j76533
$$ 20338977 19335791 18495689 17838231 17273621 16833770 16482732 16172826 15972423 15795890
4298A5795890j65615r4703j25343j22443j33738r6636j52280j40488j95696k17607
$$ 15795890 15630275 15535572 15410229 15287786 15154048 15057412 14905132 14764644 14568948 14351341
4288A4351341k16998k19800j91044j56473j60595j14648j12366r7589l2090n0761
$$ 14351341 14134343 13914543 13723499 13567026 13406431 13291783 13179417 13081828 13049738 12998977
4278A2998977p926J305M3215Q6363Q2181R7505Q5337J38094J41153J24104J16555
$$ 12998977 12991051 12992356 13035571 13121934 13204115 13301620 13386957 13525051 13666204 13790308 13906863
4267A3906863J37167P3783K8904Q842m1348r3436r8333j43928j69651j52996j51785
$$ 13906863 14044030 14117813 14146717 14155559 14114211 14020775 13922442 13778514 13608863 13455867 13304082
4256A3304082j38956j34743j15590j11533j14418j07424p4060o2736o8646k7553
$$ 13304082 13165126 13030383 12914793 12803260 12688842 12581418 12507358 12444622 12375976 12348423
4246A2348423n472K0665L2296P6252L7100P3862O7397L1015N8625K2049k3917
$$ 12348423 12342951 12363616 12395912 12472164 12509264 12583126 12650523 12681538 12740163 12762212 12738295
4235A2738295m5717p0286l5829q4519o5988m8387l3698k5674l2689k4991j8538
$$ 12738295 12692578 12622292 12586463 12501944 12435956 12387569 12353871 12328197 12295508 12270517 12251979
4224A2251979J2156J3747l7945p7436o2224m5462o9880p6170o6601p1593p7851
$$ 12251979 12264135 12277882 12239937 12162501 12100277 12054815 11984935 11908765 11842164 11770571 11692720
4213A1692720o9631o7569p9658p5556j00841o7640q4057m9192j20905j16069j05657
$$ 11692720 11623089 11555520 11475862 11400306 11299465 11231825 11147768 11098576 10977671 10861602 10755945
4202A0755945n9715o1908l9966l8739n5297n9713K84l707N2943O8779N3080J09373
$$ 10755945 10696230 10634322 10594356 10555617 10500320 10440607 10440891 10437184 10490127 10558906 10611986 10721359
4190A0721359J15739J28108J23465P5019J08429R6211J18297J43020J09465J38890
$$ 10721359 10837098 10965206 11088671 11163690 11272119 11368330 11486627 11629647 11739112 11878002
4180A1878002K04460J47975J96939J90475K31299K55879K83752K96279L13259
$$ 11878002 12082462 12230437 12427376 12617851 12849150 13105029 13388781 13685060 13998319
4171A3998319L31626L67467L51471M21915M64732M76036N49797N89412O38800
$$ 13998319 14329945 14697412 15048883 15470798 15935530 16411566 16961363 17550775 18189575
4162A8189575P49418Q01162Q76737R69474J126339J243287J385139J553600J752640
$$ 18189575 18938993 19740155 20616892 21586366 22712705 23955992 25341131 26894731 28647371
4153B8647371J915096K053946K140241K219002K292451K429485K520751K732820
$$ 28647371 30562467 32616413 34756654 36975656 39268107 41697592 44218343 46951163
4145D6951163K841379K849974K703657K329740J617926N68579o88494j846715
$$ 46951163 49792542 52642516 55346173 57675913 59293839 59862418 59173924 57327209
4137E7327209k857883l503439l715981l619459l477826l184065k834114k511142
$$ 57327209 54469326 50965887 47249906 43630447 40152621 36968556 34134442 31623300
4129C1623300k235892j912113j641857j456856j310579j165595r50469q37186
$$ 31623300 29387408 27475295 25833438 24376582 23066003 21900408 20949939 20112753
4121B0112753p62950o39377o03450n85570n30793m37753m09521l97194l73795
$$ 20112753 19349803 18710426 18106976 17521406 16990613 16552860 16143339 15746145 15372350
4112A5372350l27895k82418k93569j77800j35844q5086l8544K0311J1607K5172
$$ 15372350 15044455 14762037 14468468 14290668 14154824 14069738 14031194 14051505 14063112 14088284
4102A4088284P9518P8850Q7055Q8245J7045M4829k435k7010q9989j10360j76318
$$ 14088284 14167802 14246652 14333707 14421952 14438997 14483826 14481391 14454381 14364392 14254032 14077714
4091A4077714j88047j37767n0352O77L2317O9174J74222J74862K14130J49814
$$ 14077714 13889667 13751900 13701548 13702225 13734542 13803716 13977938 14152800 14366930 14516744
4081A4516744P2931J10464J64672J90843K41042K34984K71745L03858L85257L80549
$$ 14516744 14589675 14700139 14864811 15055654 15296696 15531680 15803425 16107283 16492540 16873089
4071A6873089M04203L83648M65203M10284M03560L31800M62649N84452P60441
$$ 16873089 17277292 17660940 18126143 18536427 18939987 19271787 19734436 20318888 21079329
4062B1079329P63258Q08016P91184Q17266O24335O14916N97720O55437O13416
$$ 21079329 21842587 22650603 23441787 24259053 24883388 25498304 26096024 26751461 27364877
4053B7364877P03538P10851Q47188Q37967J098014J329825J657737J791841K527554
$$ 27364877 28068415 28779266 29626454 30464421 31562435 32892260 34549997 36341838 38869392
4044C8869392L111709L758134L859138M369999N023361O417634P967695J0831712
$$ 38869392 41981101 45739235 49598373 53968372 58991733 65409367 73377062 84208774
4036H4208774J4967235K1616215K7402479L6495185N1189607N5109145K5931827
$$ 84208774 99176009 120792224 148194703 184689888 235879495 290988640 316920467
4029C16920467k3601255n1943431n1018599l9129355k9750156k0145565j4464527
$$ 316920467 293319212 241375781 190357182 151227827 121477671 101332106 86867579
4022H6867579j1194824r267451p550153o074487m578941l494520k817261k716223
$$ 86867579 75672755 66405304 58855151 52780664 48201723 44707203 41889942 39173719
4014C9173719k707540k566837k169173j930005j704246j504340j282811j174819
$$ 39173719 36466179 33899342 31730169 29800164 28095918 26591578 25308767 24133948
4006B4133948j110021j036508q26049p54428o17841m73655l54351l33022k98516
$$ 24133948 23023927 21987419 21161370 20406942 19789101 19315446 18961095 18628073 18329557
3997A8329557l11614l18153l71923l97283l37738l03243k04684j01424o0683l6864
$$ 18329557 18017943 17699790 17327867 16930584 16592846 16289603 16084919 15983495 15922812 15885948
3987A5885948N0331J0432k0047o8802k4861k0490p2344o1343m8634n1774J4756
$$ 15885948 15936279 15946711 15926664 15857862 15833001 15812511 15740167 15678824 15630190 15578416 15593172
3976A5593172J34942J94800J87024K12772J67403J88370J05047P4768L9129L2281
$$ 15593172 15728114 15922914 16109938 16322710 16490113 16678483 16783530 16858298 16897427 16929708
3966A6929708L4376L9995K9161K1710j7147N3712O7040J00133J16500J32682R4526
$$ 16929708 16964084 17004079 17033240 17054950 17037803 17091515 17158555 17258688 17375188 17507870 17602396
3955A7602396M6889l4322p0789j14949j86283k46751k80472k50143j95724k19477
$$ 17602396 17649285 17614963 17544174 17429225 17242942 16996191 16715719 16465576 16269852 16050375
3945A6050375j41366j60775j16020j58670j63017k43387k77877l00008l30822
$$ 16050375 15909009 15748234 15632214 15473544 15310527 15067140 14789263 14489255 14158433
3936A4158433l96688l79321l40773l19482l14188k95690l09314k87992l41013
$$ 14158433 13761745 13382424 13041651 12722169 12407981 12112291 11802977 11514985 11173972
3927A1173972k88643k59571k33100k28428j89338k08534k01062k39058k79446
$$ 11173972 10885329 10625758 10392658 10164230 9974892 9766358 9565296 9326238 9046792
3918I046792k94523k85709k80016k08892k15425j95185k44166k40787k44641k09911
$$ 9046792 8752269 8466560 8186544 7977652 7762227 7567042 7322876 7082089 6837448 6627537
3908F627537j70694r0938j24907j10529j20463j44970j03735q8614j51315j43236
$$ 6627537 6456843 6365905 6240998 6130469 6010006 5865036 5761301 5672687 5521372 5378136
3898E378136j62839j79858j78280j40237j33537j42259r7323j10306j08247j04286
$$ 5378136 5215297 5035439 4857159 4716922 4583385 4441126 4343803 4233497 4125250 4020964
3888D020964p0971o0540p1683m8334n6629r4326q6965j23440j13207p5267l4091
$$ 4020964 3949993 3889453 3817770 3769436 3712807 3618481 3531516 3408076 3294869 3219602 3185511
3877C185511n2755l9806p3672o5517o0215m4204j2586m4451j7311k1312n6313
$$ 3185511 3132756 3092950 3019278 2953761 2893546 2849342 2836756 2792305 2774994 2753682 2697369
3866B697369l6188l5810m8111l4937p7604j3631l5841j0728l3494l3498n3873
$$ 2697369 2661181 2625371 2577260 2542323 2464719 2451088 2415247 2404519 2371025 2337527 2283654
3855B283654m6588j4189j276k7602m8499n0185m8448k146j594J3292k4450n322
$$ 2283654 2237066 2222877 2221601 2193999 2145500 2095315 2046867 2044721 2043127 2056419 2031969 2026647
3843B026647K518j159l3342k8393l7137m4567m5230l0517j489k1680n0133m4521
$$ 2026647 2029165 2028006 1994664 1966271 1929134 1884567 1839337 1808820 1807331 1785651 1735518 1690997
3831A690997n1184o9950m1293j7661l7203l958j4336J1822k5013j4645j9164K715
$$ 1690997 1639813 1569863 1528570 1510909 1473706 1469748 1455412 1467234 1442221 1427576 1408412 1411127
3819A411127k4104k0804l8336Q513j5437L1220n388l350r576r82k574j4709j6754
$$ 1411127 1387023 1366219 1327883 1336396 1320959 1352179 1346791 1343441 1333865 1332883 1330309 1315600 1298846
3806A298846Q992n286Q14j87J692j249m1544l1928j8384j342l706l7446m4545
$$ 1298846 1307838 1302552 1303366 1303179 1304871 1303622 1262078 1230150 1211766 1210424 1206718 1169272 1124727
3793A124727j1300O733k3242j6190l5837k0605O405j0183j7747l4178k4570K1110
$$ 1124727 1113427 1120160 1096918 1080728 1044891 1024286 1030691 1020508 1002761 968583 944013 965123
3781I65123j9353j0648K1196q535m941j4101O572J2651m3035j2023j6993k7577
$$ 965123 945770 935122 956318 947783 942842 928741 935313 947964 904929 892906 875913 848336
3769H48336K8078j2416J2616J7350q802K3149Q417p842l220M5238r870q150k478
$$ 848336 876414 863998 876614 893964 885162 908311 916728 908886 905666 950904 941034 932884 930406
3756I30406J845L4226K6429L595J8364K5023L2417K1898M1452R0299J12806J50278
$$ 930406 932251 966477 992906 996501 1014865 1039888 1072305 1094203 1135655 1225954 1338760 1489038
3744A489038J26666J37594J15359M8724O773o6045j17969j50680j33921j40272
$$ 1489038 1615704 1753298 1868657 1917381 1924154 1858109 1740140 1589460 1455539 1315267
3734A315267j22315j20752r0360p8846r8403l188j8183k7005j5745n7156J997
$$ 1315267 1192952 1072200 981840 902994 804591 801403 783220 756215 740470 683314 685311
3723F85311l0503k5703l3788k0800j2526m495K3088q731p114k0161m04m454Q208
$$ 685311 654808 629105 595317 574517 561991 557496 580584 571853 564739 544578 544174 539720 547928
3710E47928l6652K608j7630J5474J0979k9291j7323R792J339k5351L394l215k8012
$$ 547928 511276 513884 496254 511728 522707 493416 476093 485885 487224 461873 465267 462052 434040
3697D34040L912p524j7372p977N844k279K2132q153j5134l3297L0441j1283M292
$$ 434040 437952 430428 413056 405079 410923 408644 430776 422623 407489 374192 404633 393350 397642
3684C97642j2055n415k2158J0K0012J5465k9894p762R499K1680M516R469K470
$$ 397642 385587 380172 358014 358024 378036 393501 363607 355845 365344 387024 391540 401009 403479
3671D03479Q302P630J1903R518O626r749l2625l4373k914j1078R781J670J4704
$$ 403479 411781 419411 431314 440832 447458 437709 405084 370711 367797 356719 366500 368170 382874
3658C82874j2232l770n29j1321N977n457J1565K3241J7775k4173J6579n491j3046
$$ 382874 370642 366872 366343 355022 360999 355542 367107 390348 408123 383950 400529 395038 381992
3645C81992J1844K5989j086P9r923M941l204J2766j5939j0727N924q816P360J9936
$$ 381992 393836 419825 418739 418818 408895 413836 410632 423398 407459 396732 402656 393840 401200 421136
3631D21136j3205M4740j2065L031P883p917J1590L1740J3626j348Q338Q318M2700
$$ 421136 407931 452671 440606 443637 451520 443603 455193 486933 500559 499211 507549 515867 558567
3618E58567J1603K6044L897L3989J4718j4140R252k1886J5184M814k9282J0571
$$ 558567 570170 596214 600111 634100 648818 634678 643930 622044 637228 642042 612760 623331
3606F23331J9568k0536n145j0423k373j5369J7071L1591l758l4790K2959M202
$$ 623331 642899 622363 617218 606795 604422 589053 606124 637715 633957 599167 622126 626328
3594F26328j5141J1214l326Q938Q773J623K982j0587J223J0315Q401k094p771
$$ 626328 611187 622401 619075 628013 636786 638409 641391 630804 632027 642342 650743 648649 640878
3581F40878l245j8660M554K2050O347j0404j8823j0120J1779j5130L244o695J2848
$$ 640878 637633 618973 623527 645577 651924 641520 622697 612577 624356 609226 612470 605775 618623
3568F18623O246k0157k505k0161R730l0470N747J9671K8168q899M673J3683J3394
$$ 618623 624869 604712 602207 582046 591776 561306 567053 586724 614892 605993 610666 624349 637743
3555F37743n777M278j548N6L2785k2267k893O930q256k771K8695K5536k0885k591
$$ 637743 631966 636244 634696 634752 667537 645270 642377 649307 641051 638280 666975 692511 671626 669035
3541F69035K0988J2387J6566l327n245j28K558J3586J5806R760J4692L2979Q988
$$ 669035 690023 702410 718976 715649 710404 710276 712834 726420 742226 751986 766678 799657 808645
3528H08645j5521J8078L1427K0085M9068P42j0404J5298K3341Q738J5303J4996
$$ 808645 793124 811202 842629 862714 911782 912524 902120 917418 940759 949497 964800 979796
3516I79796m210m711J9021L85k082N531L3315N445j1464L4645J9197l900J6413
$$ 979796 975586 970875 989896 990281 988199 993730 1027045 1032490 1021026 1055671 1074868 1070968 1087381
3503A087381M7545J6773l792L5885K0904j8486R292J5471J6812K1724M1812K1253
$$ 1087381 1134926 1151699 1147907 1183792 1204696 1186210 1195502 1210973 1227785 1249509 1291321 1312574
3491A312574K0519m796J1492L948o472M8180R698J6389j7922R851L2208j8388
$$ 1312574 1333093 1328297 1339789 1343737 1337265 1385445 1395143 1411532 1393610 1403461 1435669 1417281
3479A417281J2751J0961K0662j1572Q560K281m505o957O861J8587J7070l043j2060
$$ 1417281 1430032 1440993 1461655 1450083 1458643 1460924 1456419 1449462 1456323 1474910 1491980 1488937 1476877
3466A476877O573J2582l398j0138L07J8895j9703K2433o065O969L080k2570j1431
$$ 1476877 1483450 1496032 1492634 1482496 1482803 1501698 1481995 1504428 1498363 1505332 1508412 1485842 1474411
3453A474411K470J4710O329k868K0285N346q010q250j4328J3580J998J7833J846
$$ 1474411 1476881 1491591 1497920 1495052 1515337 1520683 1512673 1504423 1490095 1503675 1505673 1523506 1525352
3440A525352N12J2068J4396r861M511M4993K939K4862K943J1614L9478K3383K7743
$$ 1525352 1525864 1537932 1552328 1542467 1546978 1591971 1594910 1619772 1622715 1634329 1673807 1697190 1724933
3427A724933L4267L4599M0992L6583K0634M4006M6937N4874K7177J5200R810L0696
$$ 1724933 1759200 1793799 1834791 1871374 1892008 1936014 1982951 2037825 2065002 2080202 2090012 2120708
3415B120708J0215j107J1003N867j257J1534J3362K3358L0691r424J9958J4683
$$ 2120708 2130923 2129816 2140819 2146686 2145429 2156963 2170325 2193683 2224374 2214950 2234908 2249591
3403B249591m414k7340K6375P401N760P697J6492j1817J1313J1056J8380l46Q959
$$ 2249591 2245177 2217837 2244212 2251613 2257373 2265070 2281562 2269745 2281058 2292114 2310494 2310148 2319107
3390B319107K419L4888O2997L1195J2632K9276L3816K877L1059J8482L5233M4185
$$ 2319107 2321526 2356414 2419411 2450606 2463238 2492514 2526330 2529207 2560266 2578748 2613981 2658166
3378B658166L2129P357J9051M3028M2950L6117O9152O0096M5855K7819O2997M5148
$$ 2658166 2690295 2697652 2716703 2759731 2802681 2838798 2907950 2968046 3013901 3041720 3104717 3149865
3366C149865N4863P5445P9662Q0653O6214O6228P7429O3057Q4783J03826O8493
$$ 3149865 3204728 3280173 3359835 3440488 3506702 3572930 3650359 3713416 3798199 3902025 3970518
3355C970518N8174N6752M7938M8038N0830P5879L8987Q2490M4170M7136N6041
$$ 3970518 4028692 4085444 4133382 4181420 4232250 4308129 4347116 4429606 4473776 4520912 4576953
3344D576953N9868M2812O7676N5032n094M1969P6093l034K7323M7320M5015N7102
$$ 4576953 4636821 4679633 4747309 4802341 4797247 4839216 4915309 4912275 4939598 4986918 5031933 5089035
3332E089035L6596J2382O7898P2739P2079N4565N5625O7438P1107O7225Q3813
$$ 5089035 5125631 5138013 5205911 5278650 5350729 5405294 5460919 5528357 5599464 5666689 5750502
3321E750502J09361Q7059J10315J31649J24521R4348J14009J35951J29605J36686
$$ 5750502 5859863 5946922 6057237 6188886 6313407 6407755 6521764 6657715 6787320 6924006
3311F924006J44354J63169J70035J57755K01906J96146J83603J99837K03934K09314
$$ 6924006 7068360 7231529 7401564 7559319 7761225 7957371 8140974 8340811 8544745 8754059
3301H754059K37205K37693K26693K69676K68282K45974K90396L16994L30284L52998
$$ 8754059 8991264 9228957 9455650 9725326 9993608 10239582 10529978 10846972 11177256 11530254
3291A1530254L67532L65468L48022L47242L73387L32113L03940L09123K72955
$$ 11530254 11897786 12263254 12611276 12958518 13331905 13664018 13967958 14277081 14550036
3282A4550036K72500K34805K09752K25949K20206K26624K27304K23377K29451
$$ 14550036 14822536 15057341 15267093 15493042 15713248 15939872 16167176 16390553 16620004
3273A6620004K37114K17891K37312K33143K37475K35310K54473K47730K45379
$$ 16620004 16857118 17075009 17312321 17545464 17782939 18018249 18272722 18520452 18765831
3264A8765831K38557K77429L08149L36032L89292M59654M73827N66556O65329
$$ 18765831 19004388 19281817 19589966 19925998 20315290 20774944 21248771 21815327 22480656
3255B2480656P08240P43307Q09616Q83472R16548R64644R70993R95781J006838
$$ 22480656 23188896 23932203 24741819 25625291 26541839 27506483 28477476 29473257 30480095
3246C0480095J045539J048043J025270R87608R75968R36318Q67209Q45433Q09323
$$ 30480095 31525634 32573677 33598947 34586555 35562523 36498841 37366050 38211483 39020806
3237C9020806P70093P14260O80524O28467O57669O44444O47904O59963O95896
$$ 39020806 39790899 40505159 41185683 41814150 42471819 43116263 43764167 44424130 45120026
3228D5120026P07236P09781P58267P65048Q12801Q83143R76376J049757J178052
$$ 45120026 45827262 46537043 47295310 48060358 48873159 49756302 50732678 51782435 52960487
3219E2960487J327159J495612J680987J819589J949431K042645K146093K123986
$$ 52960487 54287646 55783258 57464245 59283834 61233265 63275910 65422003 67545989
3211F7545989K049260J913788J739370J487164J159996Q33697N64361L02588R0349
$$ 67545989 69595249 71509037 73248407 74735571 75895567 76729264 77293625 77596213 77686562
3202G7686562o5510j46755k35435m13626n95121p11649q31435r45995j036685
$$ 77686562 77621052 77474297 77238862 76825236 76230115 75518466 74687031 73741036 72704351
3193G2704351j200516j424487j633182j815568j998652k129297k173871k161842
$$ 72704351 71503835 70079348 68446166 66630598 64631946 62502649 60328778 58166936
3185E8166936k114623k032670j891809j770488j687060j572195j513620j426843
$$ 58166936 56052313 54019643 52127834 50357346 48670286 47098091 45584471 44157628
3177D4157628j288981j170804j073286r64781q92279q54526q08309p52916p59026
$$ 44157628 42868647 41697843 40624557 39659776 38767497 37912971 37104662 36351746 35592720
3168C5592720p32729p41453p12378p36091p23960p30700p05294p04404o71798
$$ 35592720 34859991 34118538 33406160 32670069 31946109 31215409 30510115 29805711 29133913
3159B9133913o33752o68937o14062n89786n63032n19534m59883m27556l56171
$$ 29133913 28500161 27831224 27217162 26627376 26064344 25544810 25084927 24657371 24301200
3150B4301200l22197l43571m14611n09017n50529n17554m60463m27112l75596
$$ 24301200 23979003 23635432 23220821 22711804 22161275 21643721 21183258 20756146 20380550
3141B0380550l19150k71326k49308k37423k41088j84524j51422j39829j42407
$$ 20380550 20061400 19790074 19540766 19303343 19062255 18877731 18726309 18586480 18444073
3132A8444073r6458o0802m3890k3682M748M8734P3033J37863J45799J96038K22317
$$ 18444073 18347615 18286813 18242923 18219241 18223989 18272723 18345756 18483619 18629418 18825456 19047773
3121A9047773K84053L29418L73953M21364M12504L53633L16350K93639K48001
$$ 19047773 19331826 19661244 20035197 20456561 20869065 21222698 21539048 21832687 22080688
3112B2080688K92803K88023K61034K50239K15810K02231J88368J95931J72218
$$ 22080688 22373491 22661514 22922548 23172787 23388597 23590828 23779196 23975127 24147345
3103B4147345J57146J38326J08596J50689J84677J73280J62500J67344J31106
$$ 24147345 24304491 24442817 24551413 24702102 24886779 25060059 25222559 25389903 25521009
3094B5521009J18253J14866J29361R6280N4919N5771K5915L0019O705R640L887
$$ 25521009 25639262 25754128 25883489 25979769 26034688 26090459 26116374 26146393 26153098 26162738 26166625
3083B6166625o0056o4783n8193o8278k7424J0780j2190N5309J31866J78691K14149
$$ 26166625 26106569 26041786 25983593 25915315 25887891 25898671 25886481 25941790 26073656 26252347 26466496
3072B6466496L10239L88322M71561N46830O10429O48949P66037P73560Q21386
$$ 26466496 26776735 27165057 27636618 28183448 28793877 29442826 30208863 30982423 31803809
3063C1803809Q34605Q52985Q96135Q99852Q86126R15908Q93489Q76363Q95067
$$ 31803809 32638414 33491399 34387534 35287386 36173512 37089420 37982909 38859272 39754339
3054C9754339Q85286Q67690Q34018Q15876P99238Q06036P75831P55193P81184
$$ 39754339 40639625 41507315 42341333 43157209 43956447 44762483 45538314 46293507 47074691
3045D7074691P25190P65151P43198P43748P54851P26878P76088P46589P50732
$$ 47074691 47799881 48565032 49308230 50051978 50806829 51533707 52309795 53056384 53807116
3036E3807116P16468P14697O36436N76593M85827L01297R8250o2889k62672n34705
$$ 53807116 54523584 55238281 55874717 56451310 56937137 57238434 57336684 57273795 57011123 56476418
3026E6476418p98377r84827j204104j368546j449441j526177j582849j543564
$$ 56476418 55678041 54693214 53489110 52120564 50671123 49144946 47562097 46018533
3018D6018533j535766j436607j372576j290795j212006j153293j110149j070339
$$ 46018533 44482767 43046160 41673584 40382789 39170783 38017490 36907341 35837002
3010C5837002j041670r57775r66917r74913r35360r19365r24588r22726q99578
$$ 35837002 34795332 33837557 32870640 31895727 30960367 30041002 29116414 28193688 27294110
3001B7294110q72434q20209q10154p50911p13128o72341o15481o11021n66100
$$ 27294110 26421676 25601467 24791313 24040402 23327274 22654933 22039452 21428431 20862331
2992B0862331n54841m72893m19266m05361l76540l55474l09578l02942k71467
$$ 20862331 20307490 19834597 19415331 19009970 18633430 18277956 17968378 17665436 17393969
2983A7393969j98264j73653j30124j26152q4783o9770l1128j8105J8571J7718
$$ 17393969 17195705 17022052 16891928 16765776 16680993 16611223 16580095 16561990 16580561 16598279
2973A6598279j654K30N381n2204p3884q6340r4686o6038j03295r5188o6093p4547
$$ 16598279 16596625 16596855 16602236 16550032 16476148 16389808 16295122 16229084 16125789 16030601 15964508 15889961
2961A5889961n5674o9244p5245n1598j21386j19494j32879j41214k03423k06928
$$ 15889961 15834287 15765043 15689798 15638200 15516814 15397320 15264441 15123227 14919804 14712876
2951A4712876k36249k64859k78598k95396l03154k84656k85080k69550k58112
$$ 14712876 14476627 14211768 13933170 13637774 13334620 13049964 12764884 12495334 12237222
2942A2237222k21898k46113k02554j88178j86033j76166j55622j17900j35507
$$ 12237222 12015324 11769211 11566657 11378479 11192446 11016280 10860658 10742758 10607251
2933A0607251j33011q3295p3054p7225r4311n6232k6426l3388m1445l9450l2589
$$ 10607251 10474240 10390945 10317891 10240666 10146355 10090123 10063697 10030309 9988864 9949414 9916825
2922I916825l9826l1581l2434l0961j3487n3878l1087l8281n0825o0365m4643
$$ 9916825 9876999 9845418 9812984 9782023 9768536 9714658 9683571 9645290 9594465 9534100 9489457
2911I489457k5002m9896m7221k6009q44l6523j8837J9740J0192J0209J1091R836
$$ 9489457 9464455 9414559 9367338 9341329 9340485 9303962 9285125 9304865 9315057 9325266 9336357 9346193
2899I346193J2649K9917N0735O3407K3864M9645N1241N8410P2758O7829J06846
$$ 9346193 9358842 9388759 9439494 9502901 9526765 9576410 9627651 9686061 9758819 9826648 9933494
2888I933494J28814J17419J26842J79924J67980J61041K06776K17992K35563K63992
$$ 9933494 10062308 10179727 10306569 10486493 10654473 10815514 11022290 11240282 11475845 11739837
2878A1739837K88483L34297L40711L60645L55434L61237K23402J44728Q1791M3874
$$ 11739837 12028320 12362617 12703328 13063973 13419407 13780644 14004046 14148774 14230565 14274439
2868A4274439L6140P9283R2384J02954J70503J77600J72176J97407K40885K54135
$$ 14274439 14310579 14389862 14482246 14585200 14755703 14933303 15105479 15302886 15543771 15797906
2858A5797906K94579L46483L37320M19547M24165M52043N19956N32504N95731
$$ 15797906 16092485 16438968 16776288 17195835 17620000 18072043 18591999 19124503 19720234
2849A9720234O15820O76840P04366P64191Q34555Q34746Q73540R32032R13730
$$ 19720234 20336054 21012894 21717260 22481451 23316006 24150752 25024292 25956324 26870054
2840B6870054R22724R24861R46662J030815J144554J246476J407222J548394J780584
$$ 26870054 27792778 28717639 29664301 30695116 31839670 33086146 34493368 36041762 37822346
2831C7822346J988066K196052K473816K789788L150561L509239L941150M470498
$$ 37822346 39810412 42006464 44480280 47270068 50420629 53929868 57871018 62341516
2823F2341516N104486N774269O590631P407390Q205403Q939594R467497R503719
$$ 62341516 67446002 73220271 79810902 87218292 95423695 104363289 113830786 123334505
2815A23334505Q644471O437499L108610q10878m271472o456861p331999p149938
$$ 123334505 131978976 138416475 141525085 140714207 136442735 129985874 122653875 115503937
2807A15503937o496608n701855m870450m169624l753332l565993l611302l668462
$$ 115503937 109007329 103305474 98435024 94265400 90512068 86946075 83334773 79666311
2799G9666311l590183l354751l030318k641982k309792k087387j935522j882181
$$ 79666311 76076128 72721377 69691059 67049077 64739285 62651898 60716376 58834195
2791E8834195j898876j850926j818336j760381j745996j849907j957539k105197
$$ 58834195 56935319 55084393 53266057 51505676 49759680 47909773 45952234 43847037
2783D3847037k196629k246964k170232k114473k013261j823770j646800j467975
$$ 43847037 41650408 39403444 37233212 35118739 33105478 31281708 29634908 28166933
2775B8166933j348545j240162j187524j085225j054704j037412r53480q98724
$$ 28166933 26818388 25578226 24390702 23305477 22250773 21213361 20259881 19361157
2767A9361157q00155p34669o86384o44639n95635n41702m99277m53466m50324
$$ 19361157 18561002 17826333 17139949 16495310 15899675 15357973 14858696 14405230 13954906
2758A3954906m23058l91567l97512l81184l40428l62802l82877l53263l14553
$$ 13954906 13531848 13140281 12742769 12361585 12021157 11658355 11275478 10922215 10607662
2749A0607662l02632l03828l09116k91573k52185k29746k28099k53239k26201
$$ 10607662 10305030 10001202 9692086 9400513 9148328 8918582 8690483 8437244 8211043
2740H211043k23946k11902j73117j61527k03302j81186j44774j59999j60485j50645
$$ 8211043 7987097 7775195 7602078 7440551 7237249 7056063 6911289 6751290 6590805 6440160
2730F440160j77785j42469j07932j41324j13665j25971j07071j12371j12011q1374
$$ 6440160 6262375 6119906 6011974 5870650 5756985 5631014 5523943 5411572 5299561 5218187
2720E218187j14174q8855q9249j04954q9998q9407p9037o3649p2660p9021r0725
$$ 5218187 5104013 5015158 4925909 4820955 4730957 4641550 4562513 4498864 4426204 4347183 4256458
2709D256458m6244m8000l0728l2053m0793k9860l7728l3677k3452m0299l7134
$$ 4256458 4210214 4162214 4131486 4099433 4058640 4028780 3991052 3957375 3933923 3893624 3856490
2698C856490m662o7609m6278l5130l6709l9977l6677l9948o4031j8566m4203l6666
$$ 3856490 3851828 3784219 3737941 3702811 3666102 3626125 3589448 3549500 3485469 3466903 3422700 3386034
2686C386034m0340o6573r6251n8083n4676m1480n9666q2239l8018n7367n3305
$$ 3386034 3345694 3279121 3182870 3124787 3070111 3028631 2968965 2886726 2848708 2791341 2738036
2675B738036l7829l2563m3282l2244k7251j9809k8404k8708l6805k5686m933k1229
$$ 2738036 2700207 2667644 2624362 2592118 2564867 2545058 2516654 2487946 2451141 2425455 2420522 2399293
2663B399293m9041m6030j3458j2635m5060k0898j8654m8799j186R388n4715k1081
$$ 2399293 2350252 2304222 2290764 2278129 2233069 2212171 2193517 2144718 2143532 2152920 2098205 2077124
2651B077124k6949m026l1529j3118k0917l9993l1978M776q541l3494k571j4826
$$ 2077124 2050175 2046149 2014620 2001502 1980585 1940592 1908614 1913390 1904849 1871355 1868784 1853958
2639A853958l0728j3915j7236k0609l1786n5462k5914j7160j1512J1030k5868
$$ 1853958 1823230 1809315 1792079 1771470 1739684 1684222 1658308 1641148 1629636 1640666 1614798
2628A614798l5981j5664l6643N19j9839R242k5663m9064j9463j8913m730j5661
$$ 1614798 1578817 1563153 1526510 1527029 1507190 1516432 1490769 1441705 1422242 1403329 1398599 1382938
2616A382938j4404m5916k3791k1791j8938l6479l99m9237j7278j6784k719p5j7264
$$ 1382938 1368534 1322618 1298827 1277036 1258098 1221619 1221220 1171983 1154705 1137921 1135202 1135127 1117863
2603A117863O028m244m0959l6761p433l155J0681j1539q904k7414p109m4039Q812
$$ 1117863 1123891 1119647 1078688 1041927 1034494 1031339 1042020 1030481 1021577 994163 987054 943015 951827
2590I51827L575l8433Q468J0176L49j682n862L585l1253J6924m385k1033j4992
$$ 951827 955402 916969 925437 935613 935962 934280 928418 932003 900750 917674 913289 892256 877264
2577H77264q628J006L662k7424K1363k7175k5399p098j1795K848k852K1233j1700
$$ 877264 868636 869642 873304 845880 867243 840068 814669 807571 795776 798624 795772 817005 805305
2564H05305k5636J7547R563j5238k2392M778L2676R465k9581l1662L833K1240
$$ 805305 779669 797216 806779 791541 769149 773927 806603 816068 786487 754825 758658 779898
2552G79898K250o559r456J7842k6820o38K4100J7024P743J6287J9065J2266K8908
$$ 779898 782148 775589 766133 783975 757155 756517 780617 797641 805384 821671 840736 853002 881910
2539H81910O572J9835K0951N7114J9288L3603O8725M0382J9222K7977l6039q910
$$ 881910 888482 908317 929268 986382 1005670 1039273 1107998 1148380 1167602 1195579 1159540 1150630
2527A150630j7679n5267l1465l6773l1067k6604l3055j1515j4373m2025j3516
$$ 1150630 1132951 1077684 1046219 1009446 978379 951775 918720 907205 892832 850807 837291
2516H37291j7241k3624j7651j0549k9120N692q738j8047k987j7775k3436j0333
$$ 837291 820050 796426 778775 768226 739106 744798 736060 718013 715026 697251 673815 663482
2504F63482p211k0975K368l161o157p192k5967l9005p888M417j0187k4552j3284
$$ 663482 656271 635296 637664 634503 628346 621154 595187 556182 548294 552711 542524 517972 504688
2491E04688r815K7182k4712l1273k3684N84R843k8037j2867L6811N949k0069j5381
$$ 504688 494873 522055 497343 466070 442386 442970 452813 424776 411909 448720 454669 434600 419219
2478D19219K4439j9076k3561n301l309n930j9310J6901r350l0381m981J940r067
$$ 419219 443658 424582 401021 395720 392411 386481 367171 384072 374722 344341 339360 341300 332233
2465C32233J6343J786k799k813m0997J0166K0306r520l0717J7654n626N576r319
$$ 332233 348576 350362 347563 344750 303753 313919 334225 324705 293988 311642 306016 311592 302273
2452C02273J0417O010l3414j720K059J0972K2472p778k4293O21j4360j4928p422
$$ 302273 312690 318700 285286 283566 285625 296597 319069 311291 286998 287619 273259 258331 250909
2439B50909N928k8470J5746J7113J1455m745j4242k7008r196j1535K1311M920
$$ 250909 256837 228367 244113 261226 272681 267936 253694 226686 217490 205955 227266 232186
2427B32186P062l730j7064J6028N347j5991P958K5697k2606k1062L65j25r751
$$ 232186 239248 235518 218454 234482 239829 223838 231796 257493 234887 213825 214190 214065 204314
2414B04314m435m996r032J8400J4358k579j3933l176P52k831l8172Q460J062J7450
$$ 204314 199879 194883 185851 204251 218609 216030 202097 198921 199673 196842 158670 167130 168192 185642
2400A85642j3188K3013K9590K693Q975l1740j3726L140j5488j6370j5383K2203
$$ 185642 172454 195467 225057 227750 236725 204985 191259 194399 178911 162541 147158 169361
2388A69361J4714r312k795J8245M190l2664q765K9720R914l8307O66J1454n402
$$ 169361 184075 174763 171968 190213 194403 161739 152974 182694 192608 154301 154967 166421 161019
2375A61019Q400J245j8270L224L7290j6734j5048n701j4324M098J4898o847j2543
$$ 161019 169419 170664 152394 155618 192908 176174 161126 155425 141101 145199 160097 153250 140707
2362A40707J1667n959l28q77J0038k948j6848q756K1918r470k486l170L245J3229
$$ 140707 152374 146415 146087 145210 155248 152300 135452 126696 148614 139144 136658 133488 136733 149962
2348A49962p73J089P734N587l682k1629J1656k5525n606k203L427n943j6478o943
$$ 149962 149189 150278 158012 163599 159917 138288 149944 124419 118813 116610 120037 114094 97616 90673
2334I0673q496j7918J8935R006n270K668n700j2684K8077j8463j6487J8213o243
$$ 90673 82177 64259 83194 92200 86930 89598 83898 71214 99291 80828 64341 82554 76311
2321G6311J1508r838J5509M485k26n066l785J0979j8737L176K1986O569M857Q714
$$ 76311 87819 77981 93490 97975 97749 92683 88898 99877 81140 84316 106302 112871 117728 126442
2307A26442k0978L936k233j5245r482J5826M155J0886j6798R53J2033l8188J2958
$$ 126442 105464 109400 107167 91922 82440 98266 102421 113307 96509 97462 109495 71307 84265
2294H4265k0432J5073O693K417p61K513m703k8277p429j7231K02J2648J6552k4456
$$ 84265 63833 78906 85599 88016 87255 89768 85065 56788 49359 32128 32330 44978 61530 37074
2280C7074K673j2586L433K5942j6071K4726l932j134K099p353n412j9819K7454
$$ 37074 39747 27161 30594 56536 40465 65191 61259 60125 62224 54871 49459 29640 57094
2267E7094R457k5182q822q395J0988L791M404O927n962q376j1033k3685K2751
$$ 57094 66551 41369 32547 24152 35140 38931 43335 50262 44300 35924 24891 1206 23957
2254B3957J2365o155j6104m83J2701k4090L608K0656J088N963j3171N937j1159
$$ 23957 36322 30167 14063 13580 26281 2191 5799 26455 27543 33506 20335 26272 15113
2241A5113Q083r57k0417K1888L096k9018k558Q106K9654p219J1377M95k0394J4226
$$ 15113 23196 22239 1822 23710 26806 -2212 -4770 3336 32990 25771 37148 37643 17249 31475
2227C1475n723O405L600j4722m479P114K4619l685j1034j2671M391J5232k6613
$$ 31475 25752 32157 35757 21035 16556 23670 48289 44604 33570 20899 25290 40522 13909
2214A3909J9303j3954J5271r146m2174K2062J6393J7284j518Q669j407j6520j7746
$$ 13909 33212 19258 34529 25383 -16791 5271 21664 38948 37430 46099 44692 28172 10426
2201A0426J8946p020K63j4667J994J9479M738N432n289O840L689j0670J954n442
$$ 10426 29372 22352 22615 7948 9942 29421 34159 39591 34302 41142 44831 34161 36115 30673
2187C0673M897J6813Q539L263j7479J3533J1207P60j0343L2334o47m3475j2177
$$ 30673 35570 52383 60922 64185 46706 60239 71446 72206 61863 94197 93550 50075 37898
2174C7898J653N322R646j789K834j4859K3964J7813J3828R455j0242P564j001
$$ 37898 39551 44873 54519 52730 55564 40705 64669 82482 96310 105765 95523 103087 102086
2161A02086k464J2277k2301L7638q625l5866J3909R709L99p437J16o024J8257
$$ 102086 99622 111899 89598 127236 118611 82745 96654 106363 106762 99325 99441 93417 111674
2148A11674Q517K1664M024n369J0044q876k067p890J1224L2244n498m278j8433
$$ 111674 120191 141855 145879 140510 150554 141678 139611 131721 142945 175189 169691 165413 146980
2135A46980j6434K3607J5794J1822R861J9208J9039k0721N496J1201P189l141
$$ 146980 130546 154153 169947 181769 191630 210838 229877 209156 214652 225853 233042 229901
2123B29901M994J638J9636L3806L757J0804J2157K6995M0156J3572J975q8K651
$$ 229901 234895 236533 256169 289975 293732 304536 316693 343688 383844 397416 399391 399303 401954
2110D01954M8452J4572L9578J5995K1592K3955K6393K1308j1876L4333O0353L2626
$$ 401954 450406 464978 504556 520551 542143 566098 592491 613799 601923 636256 696609 729235
2098G29235N496N2421P8899R5515O7620Q4323J10404O1827L6394R9626J35337
$$ 729235 734731 787152 866051 961566 1029186 1113509 1223913 1285740 1322134 1421760 1557097
2087A557097J24755K02877K85814L74441N22342O94928Q67123J227591J781436
$$ 1557097 1681852 1884729 2170543 2544984 3067326 3762254 4629377 5856968 7638404
2078G638404J669711J89404j252490j637994j407484j064750p65969n05718l75104
$$ 7638404 9308115 9497519 8245029 6607035 5199551 4134801 3368832 2863114 2488010
2069B488010l43639k77360k03536j79799j21103n2737l3049o5799r9487j05253
$$ 2488010 2144371 1867011 1663475 1483676 1362573 1309836 1276787 1210988 1111501 1006248
2059A006248r6659j11919o1087k8398m5438m0246o9431m6774p909n502k6372l7785
$$ 1006248 909589 797670 736583 708185 662747 622501 553070 506296 498387 492885 466513 428728
2047D28728k371k5329k857j3897r677k4534j4462l7112r648j4123O147N729j0926
$$ 428728 426357 401028 398171 384274 374597 350063 335601 298489 288841 274718 280865 286594 275668
2034B75668l599l6117J430j0492j3894n269l44l1174r399J444p828L389j1634
$$ 275668 272069 235952 237382 226890 212996 207727 207383 176209 166810 168254 160426 163815 152181
2021A52181p611R60k0285J261L352j0601M687j5555l501P30j8294J9581k611k5798
$$ 152181 144570 145530 125245 126506 129858 119257 123944 108389 104888 105618 87324 106905 104294 78496
2007G8496Q965k6883Q312m5577J1750L3446K88J945M086j8737k1939P723j3815
$$ 78496 87461 60578 68890 23313 35063 68509 68797 70742 74828 56091 34152 41875 28060
1994B8060j1510N179J5542M745N121j7485l176q566j0025O111K513J5073n512
$$ 28060 16550 21729 37271 42016 47137 29652 26476 17910 7885 13996 16509 31582 26070
1981B6070m357P939m7330J4025l37J48J7266l101L004p755J472K085l0897J147
$$ 26070 21713 29652 -17678 -3653 -3990 -3842 13424 10323 13327 5572 7044 9129 -21768 -20621
1967b0621J5098J0920J1359j5317j0188l162J6703L480j5896r04J3074J616o922
$$ -20621 -5523 5397 16756 1439 -8749 -11911 4792 8272 -7624 -8528 4546 6162 -760
1954g60k217L2666p277j9943o495J4692j3981j0454K2246R438o754L4559j0801
$$ -760 -2977 29689 22412 2469 -4026 10666 -3315 -13769 8477 17915 11161 45720 34919
1941C4919J54j3268k2024K1249j8398k6174K700M435l4916L5958P796j0882J7514
$$ 34919 35073 21805 -219 21030 2632 -23542 -20842 -16407 -51323 -15365 -7569 -18451 -937
1928i37l116k0692j3503K6352j1601k2215K2846J5218O194j3579q599j3542Q708
$$ -937 -4053 -24745 -38248 -11896 -23497 -45712 -22866 -7648 -1454 -15033 -23632 -37174 -28466
1915b8466j0536m432l48K1642n005q568R930j1336K8089P729k7642j9859R877
$$ -28466 -39002 -43434 -43782 -22140 -27145 -35713 -25783 -37119 -9030 -1301 -28943 -48802 -38925
1902c8925M2864j9333K082j1935j7639L9208j4233l093P520j6226o643q276J08
$$ -38925 3939 -15394 -13312 -25247 -42886 -3678 -17911 -21004 -13484 -29710 -36353 -44629 -44521
1889d4521J1379K8510k1734l2200j7646J1462k012J757L0300O309k501p668l087
$$ -44521 -33142 -4632 -26366 -58566 -76212 -64750 -66762 -65005 -34705 -28396 -30897 -38565 -41652
1876d1652k287M864n390j610j9256K2193K008j3924N416R354j7118J3190R594
$$ -41652 -43939 -39075 -44465 -46075 -65331 -43138 -41130 -55054 -49638 -40284 -57402 -44212 -34618
1863c4618j1178P40P267K0530k4822l305J757J2477k3553J0320j2367n266J622
$$ -34618 -45796 -45056 -37789 -17259 -42081 -45386 -43629 -31152 -54705 -44385 -56752 -62018 -60396
1850f0396M1121k491k9835O444P637o075k8093J5985j653J0768J500j0223q991
$$ -60396 -19275 -21766 -51601 -45157 -37520 -43595 -71688 -55703 -57356 -46588 -45088 -55311 -64302
1837f4302J1659O26j0551J1856M00j8530P880J1711k1971M335K0682Q132L484
$$ -64302 -52643 -52017 -62568 -50712 -50312 -68842 -60962 -49251 -71222 -66887 -46205 -38073 -34589
1824c4589P628J4694j2494k0151K405k646l416K936M2171j3000l2481o435N322
$$ -34589 -26961 -12267 -24761 -44912 -42507 -45153 -48569 -45633 -3462 -16462 -48943 -55378 -50056
1811e0056K1645J1290J4166k3578j7407R375J1855Q259J2682R554l2085l6479
$$ -50056 -28411 -17121 -2955 -26533 -43940 -34565 -22710 -14451 -1769 7785 -24300 -60779
1799f0779K0495O949l2984J067L6675j3842n075r621J5406j5831j0098j3957K0161
$$ -60779 -40284 -33335 -66319 -65252 -28577 -42419 -47494 -57115 -41709 -57540 -67638 -81595 -61434
1786f1434o100r547J1482P167n856J5558n540r48Q446Q287o318j5574J1605P228
$$ -61434 -67534 -77081 -65599 -58432 -64288 -48730 -54270 -55218 -46772 -38485 -44803 -60377 -48772 -41544
1772d1544k9034o444n64J4218k991Q798J9132k8798k041l259j3313K2692j1226
$$ -41544 -70578 -77022 -77586 -63368 -66359 -57561 -38429 -67227 -69268 -72527 -85840 -63148 -74374
1759g4374l733N3828N27j7557J517k0522j262M9l819O098J667J346N025p386r864
$$ -74374 -78107 -24279 -23752 -41309 -39792 -60314 -61576 -61527 -65346 -59248 -57581 -56235 -51210 -58596 -68460
1744f8460M663J565j341j0487q39K9086K6230q673k8918j8655J1899L032n404
$$ -68460 -63797 -62232 -63573 -74060 -74899 -45813 -19583 -28256 -57174 -75829 -63930 -60898 -66302
1731f6302L4778o224l452J0299j0218R04p190l6471k4674L2305q795J6394J5336
$$ -66302 -31524 -37748 -41200 -30901 -41119 -40215 -47405 -83876 -108550 -76245 -85040 -68646 -53310
1718e3310k1116j1564N8388K0232l0754o706j1387J474J1041n638k803j3246J5196
$$ -53310 -74426 -85990 -27602 -7370 -38124 -44830 -56217 -54743 -43702 -49340 -52143 -65389 -50193
1705e0193k2342J7369P2j3847j845R408j1174N468n998Q027J1083M082j1817N919
$$ -50193 -72535 -55166 -55094 -68941 -70786 -61378 -72552 -67084 -73082 -65055 -53972 -49890 -61707 -55788
1691e5788r731N484K6021l764N309j1515l4518J2872j4194J6610p114m658J8461
$$ -55788 -65519 -60035 -34014 -37778 -32469 -43984 -78502 -65630 -79824 -63214 -70328 -74986 -56525
1678e6525j6186j5503k8121J4754N0607J2541j8599J795J599j9054j0363J1342
$$ -56525 -72711 -88214 -116335 -101581 -50974 -38433 -57032 -55237 -53638 -72692 -83055 -71713
1666g1713M402q900j2790J8032L706q395n572J400l047J6742q567o471R07J1387
$$ -71713 -67311 -76211 -89001 -70969 -67263 -75658 -81230 -79830 -82877 -66135 -74702 -81173 -80266 -68879
1652f8879r02l856P034j2139J7009L161J8356m424j3799n343J8099K1038k2876
$$ -68879 -69781 -73637 -66603 -78742 -61733 -58572 -40216 -44640 -58439 -63782 -45683 -24645 -47521
1639d7521k531k6239j788Q315J3055K606M266r529J111J442Q916n450j1834J5554
$$ -47521 -50052 -76291 -78079 -69764 -56709 -54103 -49837 -59366 -58255 -56813 -47897 -53347 -65181 -49627
1625d9627j7686K028q868k6693L0573q403R150o228o666P190J9244P747r912n0
$$ -49627 -67313 -65285 -74153 -100846 -70273 -78676 -69526 -75754 -82420 -75230 -55986 -48239 -58151 -58201
1611e8201K594l450J5961p451O522K2358k3826j4063r609k911K1179L7776j9786
$$ -58201 -55607 -59057 -43096 -50547 -44025 -21667 -45493 -59556 -69165 -72076 -50897 -13121 -32907
1598c2907k7589J0094l101K4517J580o938p65J012N12k143k1480J143m395m871
$$ -32907 -60496 -50402 -53503 -28986 -27406 -34344 -35109 -34097 -33585 -35728 -57208 -56065 -60460 -65331
1584f5331K6172j2060q122R851o371J6128j4117j4513O961M074J6565j1604j3554
$$ -65331 -39159 -51219 -59341 -49490 -55861 -39733 -53850 -68363 -61402 -57328 -40763 -52367 -65921
1571f5921J9557j890j1151n548J3945p527k6274K7712J5594l5266M926J7754r406
$$ -65921 -46364 -48254 -59405 -64953 -51008 -58535 -84809 -57097 -41503 -76769 -71843 -54089 -63495
1558f3495L428R007K114N818j7425j9258K8269j291k825P068Q160R513n427p033
$$ -63495 -60067 -51060 -48946 -43128 -60553 -79811 -51542 -52833 -55658 -48590 -40430 -30917 -36344 -43377
1544d3377L938o011J4951m249m3202J3535L3966J3063P850j6557j1995m290j5507
$$ -43377 -39439 -45450 -30499 -34748 -77950 -64415 -30449 -17386 -9536 -26093 -38088 -42378 -57885
1531e7885J6320j3158O51O347k2995J0077j2060R110l781K1032p524J6063P762
$$ -57885 -41565 -54723 -54072 -47725 -70720 -60643 -72703 -63593 -67374 -46342 -53866 -37803 -30041
1518c0041k3708M293J5776j623m083j020j1861o262J0598J213Q085M172k3526
$$ -30041 -53749 -49456 -33680 -35303 -39386 -40406 -52267 -58529 -47931 -46718 -38633 -34461 -57987
1505e7987O805J8010L263j3595J5200o42k9767O512P233m96j1703K3022o572j8919
$$ -57987 -51182 -33172 -29909 -43504 -28304 -28946 -58713 -52201 -44968 -45464 -57167 -34145 -40717 -59636
1491e9636J6660L11l000O423K153q844j6268p334o326j5428K486K9025J5983k772
$$ -59636 -42976 -42665 -45665 -39242 -37089 -45933 -62201 -69535 -75861 -91289 -88803 -59778 -43795 -46567
1477d6567o124j458R909M592k876N956j1722n745J5011j5990M466p699L657J2451
$$ -46567 -52691 -54149 -44240 -39648 -42524 -36568 -48290 -54035 -39024 -55014 -50548 -58247 -54590 -42139
1463d2139j4637J374J9542J329k8632r136L110J9036J7376n423r448J8618J3822
$$ -42139 -56776 -55402 -35860 -34531 -63163 -72299 -69189 -50153 -32777 -38200 -47648 -29030 -15208
1450a5208j9768k1118R01J6501j0489l5408J7535J9008n810J0235J4444r930n489
$$ -15208 -34976 -56094 -55193 -38692 -49181 -84589 -67054 -48046 -53856 -43621 -29177 -39107 -44596
1437d4596j6362N539N579J6756j8571j7273K6473J1611j2756q458j5448j4185
$$ -44596 -60958 -55419 -49840 -33084 -51655 -68928 -42455 -30844 -43600 -52058 -67506 -81691
1425h1691L2583r847K9397R935o631m5910r95R273J7179K903q716N989p70n362
$$ -81691 -49108 -58955 -29558 -19623 -26254 -72164 -73159 -63886 -46707 -43804 -52520 -46531 -47301 -52663
1411e2663R416Q192O859l329r249Q78r567J1073j2052R36p541r396j92M083L0026
$$ -52663 -43247 -35055 -28196 -31525 -40774 -39896 -49463 -38390 -50442 -49506 -57047 -66443 -66635 -62552 -32526
1396c2526q769k3952J1513q974J1980n842j0415Q385J8700K0149j9561k083J156
$$ -32526 -41295 -65247 -53734 -62708 -50728 -56570 -66985 -58600 -39900 -19751 -39312 -41395 -40239
1383d0239k475j3716J3797J7922j8023k1269M61N5923L750l5249J811o084Q799
$$ -40239 -42714 -56430 -42633 -24711 -42734 -64003 -63542 -7619 -3869 -39118 -37307 -43391 -34592
1370c4592J28j5173P974K0449J0821O797r543j957l651l2732k1060J7400J7755
$$ -34592 -34464 -49637 -41663 -21214 -10393 -3596 -13139 -15096 -18747 -51479 -72539 -55139 -37384
1357c7384K252J9461k821l4509O440J0410M961j4202J5854K950r769M944j4909
$$ -37384 -35132 -15671 -18492 -53001 -46561 -36151 -31190 -45392 -29538 -26588 -36357 -31413 -46322
1344d6322J2804N933O465J707j2477R24p980n970P500M034K0227J4402J5838l7113
$$ -46322 -33518 -27585 -21120 -19413 -31890 -30966 -38946 -44916 -37416 -33382 -13155 1247 17085 -20028
1330b0028K9198k0042k5382J4863j9215o846J5878R102q04j8274M759P162N0j2423
$$ -20028 9170 -10872 -36254 -21391 -40606 -47452 -31574 -22472 -23276 -41550 -36791 -29629 -29579 -42002
1316d2002J779J0764l8626K2565K4560J1181J701o085k4345j4231M437L5142j6024
$$ -42002 -40223 -29459 -68085 -45520 -20960 -9779 -8078 -14163 -38508 -52739 -48302 -13160 -29184
1303b9184j675K2507j0385p586j953o878P011J0161j0403K7855j2429j5892J2360
$$ -29184 -30859 -8352 -18737 -26323 -28276 -35154 -28143 -17982 -28385 -530 -12959 -28851 -16491
1290a6491J995j8566k4880J966j3003j1196L5284L2126k1572j0787l567L240q312
$$ -16491 -14496 -33062 -57942 -55976 -68979 -80175 -44891 -12765 -34337 -45124 -48691 -45451 -53763
1277e3763J6734P339J8530j6735M59M019j5254O196J3684J5260l4438O21p19j6622
$$ -53763 -37029 -29690 -11160 -27895 -27436 -23417 -38671 -32475 -18791 -3531 -37969 -37348 -38067 -54689
1263e4689K8365K2138k4646n317k2002L141K1200J3695K6520j0534k3152r213
$$ -54689 -26324 -4186 -28832 -34149 -56151 -53010 -31810 -18115 8405 -2129 -25281 -34494
1251c4494p952j6007J0156n500k3831K5811J1885J7683l9761K079K9359j6815
$$ -34494 -42446 -58453 -48297 -53797 -77628 -51817 -39932 -22249 -62010 -59931 -30572 -47387
1239d7387L212n780K8676J2399r518j4414K1408m569k2403O257P300o60L773O759
$$ -47387 -44175 -49955 -21279 -8880 -18398 -32812 -11404 -15973 -38376 -32119 -24819 -25479 -21706 -14947
1225a4947k5931j6625l517J6113N680J8078J3927o660j9595R28M600j3900J254
$$ -14947 -40878 -57503 -61020 -44907 -39227 -21149 -7222 -13882 -33477 -32549 -27949 -41849 -40595
1212d0595J6705K531K0823j9439j4465j1165N616K6964j5448m019O170l64o753
$$ -40595 -23890 -21359 -536 -19975 -34440 -45605 -39989 -13025 -28473 -32492 -26322 -26686 -33439
1199c3439m0940J3343K7799j5445M98J568K2711k1820r737J3435J4918J5215k2901
$$ -33439 -74379 -61036 -33237 -48682 -48184 -46616 -23905 -45725 -55462 -42027 -27109 -11894 -34795
1186c4795J7284j0606Q44K6456J1530l243k0505p644j2347j0245J2156O060N718
$$ -34795 -17511 -28117 -27273 -817 10713 7470 -13035 -20679 -33026 -43271 -31115 -25055 -19337
1173a9337r838n025J693J0864j4489l494N4061R463k6094l2362L6283r934J0830
$$ -19337 -29175 -34200 -32507 -21643 -36132 -39626 14435 23898 -2196 -34558 1725 -8209 2621
1160B621l941k1399P045j8791k748p415q79J9679n587L682k706J2928N151k1926
$$ 2621 -1320 -22719 -15674 -34465 -37213 -44628 -45507 -25828 -31415 -27733 -30439 -17511 -12360 -34286
1146c4286k6984P086L2319J7601j7424j451P667j1052k8J1967k144j8203j965
$$ -34286 -61270 -54184 -21865 -4264 -21688 -23139 -15472 -26524 -26552 -14585 -16729 -34932 -36897
1133c6897M344J0576J0892k6834k5453K3271J9231r339K943p670j7931L6832j735
$$ -36897 -32553 -21977 -11085 -37919 -63372 -40101 -20870 -30209 -27266 -34936 -52867 -16035 -17770
1120a7770J6019l0726j102m616l244l028K957K3036j4379k8183K3188J9437j5691
$$ -17770 -1751 -32477 -33579 -38195 -41439 -44467 -41510 -18474 -32853 -61036 -37848 -18411 -34102
1107c4102K3647J0686j4089r892r17J1887M939K490q29k4926J2214n850N5j7817
$$ -34102 -10455 231 -13858 -23750 -24667 -12780 -7841 -5351 -6180 -31106 -18892 -24742 -24687 -42504
1093d2504R262J2218p67n659K4854K269n620J0383p914k2214N794K3997q030j8853
$$ -42504 -33242 -21024 -21791 -27450 -2596 -327 -5947 4436 -3478 -25692 -19898 4099 -3931 -22784
1079b2784J4206j8523J6144K5343j2090j2655j3323j798M663O255N494q902l0019
$$ -22784 -8578 -27101 -10957 14386 2296 -10359 -23682 -25480 -20817 -14562 -9068 -17970 -47989
1066d7989J8827l92p49K702p696M0017Q700k0069P80K820J9800l3361n776K5767
$$ -47989 -29162 -29554 -30303 -27601 -35297 4720 13420 -6649 -5869 -3049 16751 -16610 -22386 3381
1052C381k2869l782K5047K481o492R647J0817j1339j0056J0209r315q010l311
$$ 3381 -19488 -23270 1777 4258 -2234 7413 18230 6891 -3165 7044 -2271 -10281 -13592
1039a3592J624M312k7180p366K2624m171R699p828L049K1838m063K092J6701o189
$$ -13592 -11968 -7656 -34836 -42202 -19578 -23749 -14050 -21878 -18829 3009 -1054 1038 17739 11550
1025A1550j5425l115l00r353m963j1234N135K5000J3641O038j8940K818q634J0328
$$ 11550 -3875 -6990 -7290 -16643 -21606 -32840 -27705 -2705 10936 16974 -1966 852 -7782 2546
1011B546J6361J092k3027j0023l1574J0717K0979J8786R16N437k5410k477K6616
$$ 2546 18907 19999 -3028 -13051 -44625 -33908 -12929 5857 6773 12210 -13200 -15677 10939
998A0939n072Q74Q686j539r862l596J8157j3117L685N649l1937Q746l271O711
$$ 10939 5867 6741 15427 13888 4026 430 18587 5470 9155 14804 -17133 -8387 -11658 -4947
984d947j1943J2190R182Q140j2710j9171m383k69l829O71N268j1248L109m548
$$ -4947 -16890 -4700 4482 12622 -88 -19259 -23642 -23911 -27740 -27069 -21801 -33049 -29940 -34488
970c4488N948K1946l540O661K8464L964l1088J1867L3868j5456l2187Q642R590
$$ -34488 -28540 -6594 -10134 -3473 24991 28955 -2133 9734 43602 28146 -4041 4601 14191
957A4191K3784m255j4409j6853k1918L2507k0943K509J771J5975k824j8704J1193
$$ 14191 37975 33720 19311 2458 -19460 13047 -7896 -5387 -3616 12359 9535 -9169 2024
944B024K4834n45o248j2226j1604N285R762l397J3563j7112k1359J5589l6o948
$$ 2024 26858 26313 20065 7839 -3765 1520 11282 7885 21448 4336 -17023 -1434 -1470 -8418
930h418j0206k552R517L4426K633p27l098j6341k2487P501K3665J1537o341j1177
$$ -8418 -18624 -21176 -11659 22767 25400 24673 21575 5234 -17253 -9752 13913 25450 19109 7932
916G932k5968Q547O283j3386k505j0296k838K5969P659J486q760J1752k1113J1185
$$ 7932 -18036 -9489 -3206 -16592 -19097 -29393 -32231 -6262 1397 2883 -5877 5875 -15238 -4053
902d053J4981J3713j2395o266P98j5987q33p752q573R054L5307q61J7214p6l630
$$ -4053 10928 24641 12246 5980 6778 -9209 -10042 -17794 -26367 -17313 17994 17133 34347 34271 30641
887C0641l1576J0154K1564j7285K554j2699J4341p384J4728r124j2900O83l619
$$ 30641 -935 9219 30783 13498 16052 3353 17694 10310 25038 15914 3014 3697 78
874G8J6682k6305K353p63N720K0362r25k4088M223K3805n925J1420j730j5435
$$ 78 16760 -9545 -7192 -7955 -2235 18127 17202 -6886 -2663 21142 15217 26637 24907 9472
860I472m712O740o978K9O940J260r837k246Q096m516P54K5698K7859M123l3055
$$ 9472 4760 11500 4522 4551 11491 12751 2914 668 8764 4248 5002 30700 58559 62682 29627
845B9627j8234k3391J0118K8135N983P381o409J6j1229K347j7446M277J0784P28
$$ 29627 11393 -11998 -1880 26255 32238 39619 33210 33226 21997 24344 6898 11175 21959 22687
831B2687k1791k923r000P863Q500n481o00J0244J1790J1469N824j6222r8Q529
$$ 22687 896 -2027 -11027 -3164 5336 -145 -745 9499 21289 32758 38582 22360 22262 30791
817C0791l4155o075M0940o978J348j9637r855q442J7551J6973q77l4144K4125
$$ 30791 -3364 -9439 31501 24523 25871 6234 -3621 -12063 5488 22461 21584 -12560 11565
804A1565J2006j5658L4979k6784j4116j1471J6906M862j3414L974l575J2750K1269
$$ 11565 23571 7913 42892 16108 1992 -9479 7427 12289 -1125 2849 -726 12024 33293
791C3293m824q181J3105J3875j5225o649j1506J4230M289R22l2916p333K3246
$$ 33293 28469 20288 33393 47268 32043 25394 13888 28118 32407 33329 413 -6920 16326
778A6326J8105j839L86j5518k0430J1885K5908J690q355n118o611q077r078J0174
$$ 16326 34431 32592 32978 17460 -2970 8915 34823 36513 28158 23040 16429 8352 -726 9448
764I448O344j6812L146J6430r67P725o959K842J048L644k458j2883L458R263j1123
$$ 9448 15792 -1020 2126 18556 17589 25314 18355 21197 22245 25889 23431 10548 14006 23269 12146
$$ [...]
##END NTUPLES=NMR SPECTRUM
##END=
