##TITLE=1H_EC-3299(IV-2)
 CDCl3
 8 sc, 
 1.9.2023
##JCAMPDX= 6.0         $$ Bruker NMR JCAMP-DX V2.0
##DATA TYPE= NMR SPECTRUM
##DATA CLASS= NTUPLES
##ORIGIN= UXNMR, Bruker Analytische Messtechnik GmbH
##OWNER= root
$$ XWIN-NMR		Version 3.5
$$ Fri Sep  1 14:42:04 2023 Russian Standard Time (UT+4h)  she@DPX200
##.OBSERVE FREQUENCY= 200.13135
##.OBSERVE NUCLEUS= ^1H
##.ACQUISITION MODE= SIMULTANEOUS
##.ACQUISITION SCHEME= undefined
##.AVERAGES= 8
##.DIGITISER RES= 18
##SPECTROMETER/DATA SYSTEM= spect
##.PULSE SEQUENCE= zg30
##.SOLVENT NAME= CDCl3
##.SHIFT REFERENCE= (INTERNAL, CDCl3, 0, 15.7854)
##AUDIT TRAIL= $$ (NUMBER, WHEN, WHO, WHERE, WHAT)
$$ ##TITLE= Audit trail, XWIN-NMR		Version 3.5
$$ ##JCAMPDX= 5.01
$$ ##ORIGIN= Bruker BioSpin GmbH
$$ ##OWNER= she
$$ F:/spectra/data/she/nmr/H-F/1/pdata/1/auditp.txt
$$ ##AUDIT TRAIL=  $$ (NUMBER, WHEN, WHO, WHERE, WHAT)
(   1,<2023-09-01 14:40:42.95 +0400>,<she>,<DPX200>,
      <created by zg, POWCHK disabled, PULCHK disabled
       configuration hash MD5:
       00 E9 B6 7A A2 85 ED C7 34 08 36 98 17 FE 4E 26
       data hash MD5: 16K
       E7 97 06 C3 60 71 33 38 D0 15 39 A6 10 50 47 AB>)
(   2,<2023-09-01 14:40:56.54 +0400>,<she>,<DPX200>,
      <Start of raw data processing
       efp BC_mod = 2 LB = 0.24 FT_mod = 6 PKNL = 1 PHC0 = -21047.76 PHC1 = 11.45272 SI = 16K 
       data hash MD5: 16K
       73 3E B5 C8 E0 D8 93 54 F2 AF F7 1A AF 97 5E 6C>)
(   3,<2023-09-01 14:41:15.54 +0400>,<she>,<DPX200>,
      <pk PHC0 = -5.303141 PHC1 = 6.4 
       data hash MD5: 16K
       A0 EE B2 FF BB B0 81 3F D3 85 CE 68 1C 22 2D D0>)
(   4,<2023-09-01 14:41:19.28 +0400>,<she>,<DPX200>,
      <abs ABSG = 5 
       data hash MD5: 16K
       45 88 D8 F8 B8 ED 7A 91 CA A4 7A C2 7E FC 2A E0>)
$$ ##END=
$$ 
$$ hash MD5
$$ 81 2F C8 18 35 A0 12 44 E7 3A 7A D2 84 3A CD 45
##$RELAX= 
##$RELAX= 
##$RELAX= 
##$RELAX= 
##$RELAX= 
##$RELAX= 
$$ Bruker specific parameters
$$ --------------------------
##$DU= <F:/spectra>
##$EXPNO= 1
##$NAME= <H-F>
##$PROCNO= 1
##$TYPE= <nmr>
##$USER= <she>
##$AMP= (0..31)
100 100 100 100 100 100 100 100 100 100 100 100 100 100 100 100 100 100 
100 100 100 100 100 100 100 100 100 100 100 100 100 100 
##$AQSEQ= 0
##$AQ_mod= 1
##$AUNM= <au_zg>
##$AUTOPOS= <>
##$BF1= 200.13
##$BF2= 200.13
##$BF3= 200.13
##$BF4= 200.13
##$BF5= 200.13
##$BF6= 200.13
##$BF7= 200.13
##$BF8= 200.13
##$BYTORDA= 1
##$CFDGTYP= 0
##$CFRGTYP= 5
##$CHEMSTR= <none>
##$CNST= (0..31)
1 1 145 1 1 1 1 1 1 1 1 1 1 1 1 1 1 1 1 1 1 1 1 1 1 1 1 1 1 1 1 1 
##$CPDPRG= <>
##$CPDPRG1= <>
##$CPDPRG2= <>
##$CPDPRG3= <>
##$CPDPRG4= <mlev>
##$CPDPRG5= <mlev>
##$CPDPRG6= <mlev>
##$CPDPRG7= <mlev>
##$CPDPRG8= <mlev>
##$CPDPRGB= <>
##$CPDPRGT= <>
##$D= (0..31)
0 1.2 0 0 0 0 0 0 0 0.06 0 0.03 0 0 0 0 0.0002 0 0 0 0 0 0 0 0 0 0 0 0 
0 0 0 
##$DATE= 1693564842
##$DBL= (0..7)
120 120 120 120 120 120 120 120 
##$DBP= (0..7)
150 150 150 150 150 150 150 150 
##$DBP07= 0
##$DBPNAM0= <>
##$DBPNAM1= <>
##$DBPNAM2= <>
##$DBPNAM3= <>
##$DBPNAM4= <>
$$ [...]
##$SUBNAM3= <"">
##$SUBNAM4= <"">
##$SUBNAM5= <"">
##$SUBNAM6= <"">
##$SUBNAM7= <"">
##$SUBNAM8= <"">
##$SUBNAM9= <"">
##$SW= 18.05172834244
##$SWIBOX= (0..15)
0 0 2 0 0 0 0 0 0 0 0 0 0 0 0 0 
##$SW_h= 3612.71676300578
##$TD= 16384
##$TD0= 1
##$TE= 0
##$TE2= 300
##$TE3= 300
##$TEG= 300
##$TL= (0..7)
0 120 120 120 120 120 120 120 
##$TP= (0..7)
150 150 150 150 150 150 150 150 
##$TP07= 0
##$TPNAME0= <>
##$TPNAME1= <>
##$TPNAME2= <>
##$TPNAME3= <>
##$TPNAME4= <>
##$TPNAME5= <>
##$TPNAME6= <>
##$TPNAME7= <>
##$TPOAL= (0..7)
0.5 0.5 0.5 0.5 0.5 0.5 0.5 0.5 
##$TPOFFS= (0..7)
0 0 0 0 0 0 0 0 
##$TUNHIN= 0
##$TUNHOUT= 0
##$TUNXOUT= 0
##$USERA1= <user>
##$USERA2= <user>
##$USERA3= <user>
##$USERA4= <user>
##$USERA5= <user>
##$V9= 5
##$VALIST= <valist>
##$VCLIST= <CCCCCCCCCCCCCCC>
##$VD= 0
##$VDLIST= <DDDDDDDDDDDDDDD>
##$VPLIST= <PPPPPPPPPPPPPPP>
##$VTLIST= <TTTTTTTTTTTTTTT>
##$WBST= 1024
##$WBSW= 4
##$XGAIN= (0..3)
0 0 0 0 
##$XL= 0
##$YL= 0
##$YMAX_a= 825733
##$YMIN_a= -693946
##$ZGOPTNS= <>
##$ZL1= 120
##$ZL2= 120
##$ZL3= 120
##$ZL4= 120
##$ABSF1= 15.73257
##$ABSF2= -2.31928
##$ABSG= 5
##$ABSL= 3
##$ALPHA= 0
##$AQORDER= 0
##$ASSFAC= 0
##$ASSFACI= 0
##$ASSFACX= 0
##$ASSWID= 0
##$AUNMP= <proc_1d>
##$AZFE= 0.1
##$AZFW= 0.1
##$BCFW= 0
##$BC_mod= 2
##$BYTORDP= 0
##$COROFFS= 0
##$CY= -3
##$DATMOD= 1
##$DC= 0
##$DFILT= <>
##$DTYPP= 0
##$F1P= 0
##$F2P= 0
##$FCOR= 1
##$FTSIZE= 16384
##$FT_mod= 6
##$GAMMA= 0
##$GB= 0
##$INTBC= 1
##$INTSCL= 3.70164e-10
##$ISEN= 128
##$LB= 0.24
##$LEV0= 0
##$LPBIN= 0
##$MAXI= 10000
##$MC2= 0
##$MEAN= 0
##$ME_mod= 0
##$MI= 1.114404
##$NCOEF= 0
##$NC_proc= -5
##$NLEV= 6
##$NOISF1= 3.799351
##$NOISF2= 2.8
##$NSP= 0
##$NTH_PI= 0
##$NZP= 0
##$OFFSET= 15.78545
##$PC= 1
##$PHC0= -21053.06
##$PHC1= 17.85272
##$PH_mod= 1
##$PKNL= yes
##$PPARMOD= 0
##$PSCAL= 0
##$PSIGN= 0
##$REVERSE= no
##$SF= 200.129997215727
##$SI= 16384
##$SIGF1= 3
##$SIGF2= 2
##$SINO= 5.538805
##$SIOLD= 16384
##$SREGLST= <1H.CDCl3>
##$SSB= 0
##$STSI= 16384
##$STSR= 0
##$SW_p= 3612.71676300578
##$SYMM= 0
##$S_DEV= 0
##$TDeff= 16384
##$TDoff= 0
##$TI= <>
##$TILT= no
##$TM1= 0
##$TM2= 0
##$TOPLEV= 0
##$USERP1= <user>
##$USERP2= <user>
##$USERP3= <user>
##$USERP4= <user>
##$USERP5= <user>
##$WDW= 1
##$XDIM= 16384
##$YMAX_p= 290916441
##$YMIN_p= -464454
$$ End of Bruker specific parameters
$$ ---------------------------------
##NTUPLES= NMR SPECTRUM
##VAR_NAME=  FREQUENCY,     SPECTRUM/REAL,   SPECTRUM/IMAG
##SYMBOL=    X,             R,               I
##VAR_TYPE=  INDEPENDENT,   DEPENDENT,       DEPENDENT
##VAR_FORM=  AFFN,          ASDF,            ASDF
##VAR_DIM=   16384,         16384,           16384
##UNITS=     HZ,            ARBITRARY UNITS, ARBITRARY UNITS
##FACTOR=    0.220516191357247, 1,           1
##FIRST=     3159.14206088451, 0,            0
##LAST=      -453.574702121272, 0,           0
##MIN=       -453.574702121272, -464454,     0
##MAX=       3159.14206088451, 290916441,    0
$$ Real data points
##PAGE= N=1
##DATA TABLE= (X++(R..R)), XYDATA
$$ [...]
$$ plain form
7777 -356341 -371719 -339170 -325339 -356529 -361807 -369340 -368272 -337561 -337234 -354006 -356889 -328372 -359651
7764 -359651 -328688 -305218 -309127 -295284 -321254 -309872 -297471 -279555 -308454 -295528 -272274 -256272
7752 -256272 -264000 -311675 -313930 -314697 -330514 -326792 -322334 -264613 -282360 -308275 -294487 -320817 -318927
7739 -318927 -325856 -365516 -323410 -339642 -348512 -307602 -293353 -297373 -304360 -327785 -293681 -255701
7727 -255701 -274797 -266887 -256869 -235659 -282294 -318086 -313301 -253913 -251038 -238167 -237698 -240945 -258053
7714 -258053 -245550 -267772 -229883 -198871 -207205 -260366 -266151 -225218 -203990 -206576 -263608 -233937
7702 -233937 -227148 -244738 -242346 -234594 -246916 -189831 -142663 -183615 -177277 -206638 -227090 -215749
7690 -215749 -211134 -247995 -225040 -252001 -209972 -214661 -284090 -278739 -263882 -277874 -252213 -208451
$$ packed form
7777c56341j5378L2549J3831l1190n278p533J068L0711L27j6772k883K8517l1279
7764c59651L0963K3470l909J3843k5970J1382J2401J7916k8899J2926K3254J6002
7752b56272p728m7675k255p67j5817L722M458N7721j7747k5915J3788k6330J890
7739c18927o929l9660M2106j6232q870M0910J4249m020o987k3425L4104L7980
7727b55701j9096P910J0018K1210m6635l5792M785N9388K875J2871M69l247j7108
7714b58053J2503k2222L7889L1012q334n3161n785M0933K1228k586n7032K9671
7702b33937O789j7590K392P752j2322N7085M7168m0952O338k9361k0452J1341
7690b15749M615l6861K2955k6961M2029m689o9429N351J4857j3992K5661M3762
$$ plain form
7678 -208451 -210744 -220983 -227524 -257391 -228575 -177939 -216596 -266108 -250299 -196838 -221855 -180899
7666 -180899 -222891 -221257 -187925 -226750 -230097 -214067 -196317 -168508 -226503 -280591 -276239 -215088
7654 -215088 -221769 -232816 -259416 -240625 -260590 -249425 -222352 -191674 -262107 -279791 -240493 -242392
7642 -242392 -262085 -271809 -254115 -256064 -306417 -309383 -252526 -173851 -200660 -238476 -169741 -223809
7630 -223809 -221868 -197183 -201614 -177909 -196887 -229925 -257646 -226490 -227156 -245316 -213420 -230331
7618 -230331 -217154 -193096 -172609 -192532 -200887 -239140 -239584 -258518 -206188 -178639 -255198 -203928
7606 -203928 -196054 -222712 -211626 -255156 -180063 -170284 -196556 -223771 -195021 -202201 -191509 -210881
7594 -210881 -225611 -198561 -202236 -224462 -175656 -178438 -219064 -191082 -185306 -178588 -170875 -198817 -132284
$$ packed form
7678b08451k293j0239o541k9867K8816N0636l8657m9512J5809N3461k5017M0956
7666a80899m1992J634L3332l8825l347J6030J7750K7809n7995n4088M352O1151
7654b15088o681j1047k6600J8791j9965J1165K7073L0678p0433j7684L9298j899
7642b42392j9693r724J7694j949n0353k966N6857P8675k6809l7816O8735n4068
7630b23809J941K4685m431K3705j8978l3038k7721L1156o66j8160L1896j6911
7618b30331J3177K4058K0487j9923q355l8253m44j8934N2330K7549p6559N1270
7606b03928P874k6658J1086m3530P5093R779k6272k7215K8750p180J0692j9372
7594b10881j4730K7050l675k2226M8806k782m0626K7982N776O718P713k7942O6533
$$ plain form
7581 -132284 -134172 -149978 -153255 -213327 -181825 -131165 -140374 -167667 -154037 -164795 -129847 -121219
7569 -121219 -142205 -147791 -147871 -127262 -82750 -56248 -70306 -80620 -54818 -115438 -104738 -57734
7557 -57734 -78016 -102173 -75371 -79103 -78607 -21725 -23095 -21196 -19671 -47392 -11264 -12559 -28128
7544 -28128 -17543 1057 6001 -20233 -33400 19584 1731 -20718 17975 11466 24786 -4090
7532 -4090 2714 20688 40698 70927 54668 39067 50446 84414 82812 77234 71089 79078 118100
7519 118100 100537 45688 91644 103180 63625 46830 31901 39445 75267 86059 52280 85132
7507 85132 172554 189331 177005 137097 183782 214201 223819 194641 196822 228550 262193 196839
7495 196839 226919 313906 335452 365167 372231 357824 372317 406344 433933 435173 468191 571892
$$ packed form
7581a32284j888j5806l277o0072L1502N0660r209k7293J3630j0758L4948Q628
7569a21219k0986n586q0K0609M4512K6502j4058j0314K5802o0620J0700M7004
7557e7734k0282k4157K6802l732M96N6882j370J899J525k7721L6128j295j5569
7544b8128J0585J8600M944k6234j3167N2984j7853k2449L8693o509J3320k8876
7532d090O804J7974K0010L0229j6259j5601J1379L3968j602n578o145P989L9022
7519A18100j7563n4849M5956J1536l9555j6795j4929P544L5822J0792l3779L2852
7507H5132Q7422J6777j2326l9908M6685L0419R618k9178K181L1728L3643o5354
7495A96839L0080Q6987K1546K9715P064j4407J4493L4027K7589J240L3018J03701
$$ plain form
7483 571892 608766 639281 660034 675862 683510 731001 687475 677131 687541 733456 774269 745998
7471 745998 710657 730429 678555 637283 593808 576797 609117 631719 658723 670492 702258 703103
7459 703103 653710 680897 727724 763678 727541 714611 767962 790606 813540 806448 846000 883040
7447 883040 913709 938507 911884 900824 955615 981674 966240 983698 993197 1038137 1072939 1078450
7435 1078450 1124210 1154369 1207042 1257865 1303788 1347257 1462303 1479369 1548794 1649302 1713107
7424 1713107 1817947 1938087 2041864 2146025 2284541 2481286 2709565 2973969 3238088 3493231
7414 3493231 3776372 3993957 4186540 4295875 4275185 4271494 4365428 4475391 4580052 4685899
7404 4685899 4736572 4745878 4671403 4559963 4513035 4473659 4531884 4605679 4765932 4914295 4987916
$$ packed form
7483E71892L6874L0515K0753J5828P648M7491m3526j0344J0410M5915M0813k8271
7471G45998l5341J9772n1874m1272m3475j7011L2320K2602K7004J1769L1766Q45
7459G03103m9393K7187M6827L5954l6137j2930N3351K2644K2934p092L9552L7040
7447H83040L0669K4798k6623j1060N4791K6059j5434J7458R499M4940L4802N511
7435A078450M5760L0159N2673N0823M5923M3469J15046J7066O9425J00508O3805
7424A713107J04840J20140J03777J04161J38516J96745K28279K64404K64119K55143
7414C493231K83141K17585J92583J09335k0690l691R3934J09963J04661J05847
7404D685899N0673R306p4475j11440m6928l9376N8225P3795J60253J48363P3621
$$ plain form
7393 4987916 4983176 4858781 4756518 4668823 4578355 4598531 4611085 4499055 4334433 4036087 3714251
7382 3714251 3413991 3099660 2883837 2654324 2475212 2315892 2156429 2076270 1996097 1949488
7372 1949488 1864428 1756020 1698776 1671950 1633355 1598970 1538318 1446470 1345012 1347135 1392528
7361 1392528 1378849 1362425 1416371 1438645 1363184 1350940 1397777 1370317 1329115 1361175 1370573 1434149
7349 1434149 1446864 1491157 1532822 1579498 1610876 1690093 1748904 1834607 1977552 2139838 2274364
7338 2274364 2433399 2613097 2822049 3041423 3235791 3444555 3552088 3588775 3561582 3486051
7328 3486051 3547230 3595354 3718695 3834376 3860691 3851401 3684226 3565039 3465748 3475250 3517170
7317 3517170 3605263 3754059 3865276 3885717 3852908 3753964 3664507 3600344 3551217 3534266 3575529
$$ packed form
7393D987916m740j24395j02263q7695r0468K0176J2554j12030j64622k98346l21836
7382C714251l00260l14331k15823k29513j79112j59320j59463q0159q0173m6609
7372A949488q5060j08408n7244k6826l8595l4385o0652r1848j01458K123M5393
7361A392528j3679j6424N3946K2274p5461j2244M6837k7460m1202L2060R398O3576
7349A434149J2715M4293M1665M6676L1378P9217N8811Q5703J42945J62286J34526
7338B274364J59035J79698K08952K19374J94368K08764J07533L6687k7193p5531
7328C486051O1179M8124J23341J15681K6315r290j67175j19187r9291R502M1920
7317C517170Q8093J48796J11217K0441l2809r8944q9457o4163m9127j6951M1263
$$ plain form
7306 3575529 3458078 3285136 3071716 2864755 2583173 2346104 2193470 1981600 1779271 1605041
7296 1605041 1466998 1374704 1314910 1243757 1206719 1113787 1037684 983752 969384 915791 880906
7285 880906 808056 761472 794358 792073 795522 795279 814377 797914 770946 760826 756532 733864 770582
7272 770582 798507 820564 811282 807511 815945 812703 801847 736659 706889 667876 691471 701850
7260 701850 645688 592192 547351 565361 565808 581387 575501 572749 583906 567132 577233 549661
7248 549661 563666 558198 540415 593590 613223 650656 634142 645489 641775 638185 721517 715643
7236 715643 681510 712381 769402 779181 772199 795747 841342 829391 846155 937467 967759 990799
7224 990799 1059495 1142828 1068281 1126641 1190893 1231684 1257148 1229827 1247952 1311391 1334941 1360929
$$ packed form
7306C575529j17451j72942k13420k06961k81582k37069j52634k11870k02329j74230
7296A605041j38043r2294n9794p1153l7038r2932p6103n3932j4368n3593l4885
7285H80906p2850m6584L2886k285L449k43J9098j6463k6968j0120m294k2668L6718
7272G70582K7925K2057r282l771Q434l242j0856o5188k9770l9013K3595J0379
7260G01850n6162n3496m4841J8010M47J5579n886k752J1157j6774J0101k7572
7248E49661J4005n468j7783N3175J9633L7433j6514J1347l714l590Q3332n874
7236G15643l4133L0871N7021R779o982K3548M5595j1951J6764R1312L0292K3040
7224I90799O8696Q3333p4547N8360O4252M0791K5464k7321J8125O3439K3550K5988
$$ plain form
7212 1360929 1391686 1440519 1488149 1472769 1461463 1474952 1399124 1445489 1503087 1492577 1556761
7201 1556761 1624337 1676805 1744991 1851922 1847338 1929005 2023392 2169315 2275656 2413387 2549533
7190 2549533 2714955 2866749 3036945 3221346 3495584 3755510 4018843 4374502 4734082 5126926
7180 5126926 5637220 6153767 6788239 7365255 7789671 8041535 8029547 7800108 7598076 7418318
7170 7418318 7300690 7263689 7185440 6976989 6550235 5949187 5346293 4832958 4405500 4004039
7160 4004039 3651214 3369822 3187331 3012317 2859969 2713575 2533820 2424790 2439950 2402321
7150 2402321 2312303 2249923 2216749 2269018 2234297 2264819 2319809 2309842 2377230 2448786 2460342 2475727
7138 2475727 2511259 2623809 2762424 2895124 3011492 3184211 3398282 3706178 3953416 4217372
$$ packed form
7212A360929L0757M8833M7630j5380j1306J3489p5828M6365N7598j0510O4184
7201A556761O7576N2468O8186J06931m584Q1667R4387J45923J06341J37731J36146
7190B549533J65422J51794J70196J84401K74238K59926K63333L55659L59580L92844
7180E126926N10294N16547O34472N77016M24416K51864j1988k29439k02032j79758
7170G418318j17628l7001p8249k08451m26754o01048o02894n13335m27458m01461
7160D004039l52825k81392j82491j75014j52348j46394j79755j09030J5160l7629
7150B402321r0018o2380l3174N2269l4721L0522N4990r967O7388P1556J1556J5385
7138B475727L5532J12550J38615J32700J16368J72719K14071L07896K47238K63956
$$ plain form
7128 4217372 4544000 4993000 5434424 5932981 6362837 6702546 6881175 6829243 6644644 6474902
7118 6474902 6380478 6283636 6258115 6209191 5986548 5543880 4933578 4281677 3724354 3249989
7108 3249989 2799113 2457670 2203789 1958716 1781003 1629278 1506443 1373228 1323133 1248467
7098 1248467 1117345 1074498 1025590 964537 888722 845131 831951 818657 802067 743609 673811
7087 673811 654358 627677 623154 599844 561971 541900 521506 560775 535769 527736 484727 430056
7075 430056 430280 393102 389447 384664 365152 386025 411453 372642 348401 348558 386873 384577 285163
7062 285163 257454 305828 329985 291059 284333 256800 278677 307878 226443 227969 225055 214268
7050 214268 242498 226068 200461 212512 186731 197470 164211 128127 124519 137111 160821 96960
$$ packed form
7128D217372L26628M49000M41424M98557M29856L39709J78629n1932j84599j69742
7118F474902r4424r6842k5521m8924k22643m42668o10302o51901n57323m74365
7108C249989m50876l41443k53881k45073j77713j51725j22835j33215n0095p4666
7098A248467j31122m2847m8908o1053p5815m3591j3180j3294j6590n8458o9798
7087F73811j9453k6681m523k3310l7873k0071k0394L9269k5006q033m3009n4671
7075D30056K24l7178l655m783j9512K0873K5428l8811k4241J57L8315k296r9414
7062B85163k7709M8374K4157l8926o726k7533K1877K9201q1435J526k914j0787
7050B14268K8230j6430k5607J2051k5781J0739l3259l6084l608J2592K3710o3861
$$ plain form
7038 96960 46021 48585 76998 44666 54395 83520 63771 47325 53665 74648 45284 84326
7026 84326 110870 82903 60287 91197 84036 101550 85730 22944 25120 14805 20444 46242
7014 46242 50334 30730 21181 -3078 8373 -8899 -35786 -60831 -39331 -16727 -42381 -50477
7002 -50477 -12175 -9057 20757 36829 58661 46985 20778 31865 80280 65493 -12392 26306
6990 26306 94069 124365 191443 175421 200075 162245 179297 140222 73416 110912 68864 36787
6978 36787 36373 56330 111466 74669 88958 129119 88072 44462 87736 110853 100646 120997
6966 120997 134788 76784 70833 133335 126381 125061 104749 140955 94673 116120 125833 168780
6954 168780 156757 148654 93676 97084 58263 68321 117218 118884 78831 71478 55562 96894
$$ packed form
7038I6960n0939K564K8413l2332R729K9125j9749j6446O340K0983k9364L9042
7026H4326K6544k7967k2616L0910p161J7514j5820o2786K176j0315N639K5798
7014D6242M092j9604r549k4259J1451j7272k6887k5045K1500K2604k5654q096
7002e0477L8302L118K9814J6072K1832j1676k6207J1087M8415j4787p7885L8698
6990B6306O7763L0296O7078j6022K4654l7830J7052l9075o6806L7496m2048l2077
6978C6787m14J9957N5136l6797J4289M0161m1047m3610M3274K3117j0207K0351
6966A20997J3791n8004n951O2502o954j320k0312L6206m6282K1447R713M2947
6954A68780j2023q103n4978L408l8821J0058M8897J666m0053p353j5916M1332
$$ plain form
6942 96894 97703 108214 137511 155749 111937 92451 128805 120629 144242 85137 105728 115780
6930 115780 93950 157685 185383 142952 106728 69249 67906 71061 117684 66105 91849 60336
6918 60336 46968 62545 115738 74296 76637 95057 156240 194490 169646 209245 159462 171485
6906 171485 223032 237732 280423 288016 378719 427937 438517 441896 492338 511211 479949 476828
6894 476828 497305 507464 494309 471152 464073 430492 400184 411554 379442 411362 380730 405755
6882 405755 400093 456874 464628 414383 486183 550760 559720 650663 650620 649603 626168 600155 549229
6869 549229 530282 513974 559664 563557 532623 519327 537657 632073 708305 761081 798261 881018
6857 881018 945181 1011464 1088800 1175858 1181035 1173033 1117023 1058444 935323 816400 772234 690900
$$ packed form
6942I6894Q09J0511K9297J8238m3812j9486L6354q176K3613n9105K0591J0052
6930A15780k1830O3735K7698m2431l6224l7479j343L155M6623n1579K5744l1513
6918F0336j3368J5577N3193m1442K341J8420O1183L8250k4844L9599m9783J2023
6906A71485N1547J4700M2691P593R0703M9218J0580L379N0442J8873l1262l121
6894D76828K0477J0159j3155k3157p079l3581l0308J1370l2112L1920l0632K5025
6882D05755n662N6781P754n0245P1800O4577Q960R0943m3j017k3435k6013n0926
6869E49229j8947j6308M5690L893l0934j3296J8330R4416P6232N2776L7180Q2757
6857H81018O4163O6283P7336Q7058N177q002n6010n8579j23121j18923m4166q1334
$$ plain form
6845 690900 576065 500367 465049 460945 403023 365784 342664 332419 390476 380929 329640 301349
6833 301349 326172 361902 311087 309596 279500 305155 370441 381676 418222 464782 488612 487029
6821 487029 438706 384821 358705 303320 325169 301735 265124 263467 244755 256169 251260 270586
6809 270586 267283 291974 329452 306670 282077 311737 323600 323432 302784 288194 303384 305981
6797 305981 250360 143540 90091 92953 75004 58623 6788 48274 60044 46753 23200 -17134
6785 -17134 -26742 -52635 -96696 -118609 -20596 -47447 -36047 -60461 -35850 -97909 -95967 -102993
6773 -102993 -125253 -106420 -86833 -125229 -160701 -127727 -107073 -148910 -128049 -110184 -151945 -126065
6761 -126065 -135000 -147959 -110580 -84530 -64561 -55387 -132099 -182668 -119212 -87912 -117689 -116111
$$ packed form
6845F90900j14835p5698l5318m104n7922l7239k3120j0245N8057r547n1289k8291
6833C01349K4823L5730n0815j491l0096K5655O5286J1235L6546M6560K3830j583
6821D87029m8323n3885k6116n5385K1849k3434l6611j657j8712J1414m909J9326
6809B70586l303K4691L7478k2782k4593K9660J1863j68k0648j4590J5190K597
6797C05981n5621j06820n3449K862j7949j6381n1835M1486J1770j3291k3553m0334
6785a7134r608k5893m4061k1913R8013k6851J1400k4414K4611o2059J942p026
6773a02993k2260J8833J9587l8396l5472L2974K0654m1837K0861J7865m1761K5880
6761a26065q935j2959L7379K6050J9969R174p6712n0569O3456L1300k9777J578
$$ plain form
6749 -116111 -92403 -62036 -76764 -38321 -48641 -23398 -52162 -91228 -153196 -128937 -166549 -180312
6737 -180312 -154655 -182088 -218988 -232441 -178322 -176395 -182109 -196340 -273724 -213342 -161972 -210058
6725 -210058 -167763 -132831 -157897 -237135 -194119 -151414 -174104 -149983 -198920 -203068 -174962 -214418
6713 -214418 -195113 -167962 -211080 -250544 -215791 -213434 -243307 -270373 -229558 -214804 -214326 -202356
6701 -202356 -200337 -205088 -189089 -224205 -220789 -184462 -182002 -183790 -194253 -239201 -265378 -208612 -215433
6688 -215433 -199092 -199725 -247840 -182646 -165869 -181239 -211434 -185499 -173980 -215011 -215704 -199708
6676 -199708 -218015 -262829 -232776 -224508 -218691 -214099 -234787 -263197 -232925 -242750 -239523 -218627 -246557
6663 -246557 -190289 -135081 -137383 -160057 -176491 -116793 -174257 -199304 -173579 -160980 -209528 -182670
$$ packed form
6749a16111K3708L0367j4728L8443j0320K5243k8764l9066o1968K4259l7612j3763
6737a80312K5657k7433l6900j3453N4119J927n714j4231p7384O0382N1370m8086
6725b10058M2295L4932k5066p9238M3016M2705k2690K4121m8937m148K8106l9456
6713b14418J9305K7151m3118l9464L4753K357k9873k7066M0815J4754M78J1970
6701b02356K019m751J5999l5116L416L6327K460j788j0463m4948k6177N6766o821
6688b15433J6341o33m8115O5194J6777j5370l0195K5935J1519m1031o93J5996
6676a99708j8307m4814L0053Q268N817M592k0688k8410L0272r825L227K0896k7930
6663b46557N6268N5208k302k2674j6434N9698n7464k5047K5725J2599m8548K6858
$$ plain form
6651 -182670 -150313 -141393 -167791 -183967 -123044 -181709 -251810 -227234 -201296 -107310 -155395 -157761
6639 -157761 -220976 -206923 -204898 -219052 -188279 -199787 -209697 -218366 -216993 -218091 -203237 -227961 -174866
6626 -174866 -169307 -161859 -161572 -207262 -242374 -181845 -198014 -155805 -222951 -218283 -204444 -250244 -205836
6613 -205836 -206542 -262411 -258918 -248677 -223515 -243366 -212700 -178660 -188597 -224169 -195684 -202429 -206079
6600 -206079 -205970 -196190 -204985 -200904 -166318 -134833 -160265 -161024 -148752 -164166 -214178 -185782 -202724
6587 -202724 -203083 -235368 -260249 -219699 -193815 -145548 -172328 -155069 -218585 -230905 -254042 -195975
6575 -195975 -179618 -199034 -181581 -181241 -181977 -158325 -154023 -169499 -178934 -185538 -196629 -179811 -194765
6562 -194765 -206617 -211717 -219937 -227713 -245614 -242464 -217471 -194533 -179918 -186559 -145172 -101736 -114791
$$ packed form
6651a82670L2357Q920k6398j6176O0923n8665p0101K4576K5938R3986m8085k366
6639a57761o3215J4053K025j4154L0773j1508r910q669J373j098J4854k4724N3095
6626a74866N559P448K87m5690l5112O0529j6169M2209o7146M668J3839m5800M4408
6613b05836p06n5869L493J0241K5162j9851L0666L4040r937l5572K8485o745l650
6600b06079J09R780q795M081L4586L1485k5432p59J2272j5414n0012K8396j6942
6587b02724l59l2285k4881M0550K5884M8267k6780J7259o3516j2320k3137N8067
6575a95975J6357j9416J7453L40p36K3652M302j5476r435o604j1091J6818j4954
6562a94765j1852n100q220p776j7901L150K4993K2938J4615o641M1387M3436j3055
$$ plain form
6549 -114791 -130588 -143285 -154136 -165265 -125386 -158394 -211376 -184015 -156512 -134473 -161007 -163691
6537 -163691 -176479 -208284 -193249 -169221 -160319 -181832 -170721 -170498 -211006 -164116 -182986 -202616
6525 -202616 -172626 -142880 -129716 -128259 -140722 -236187 -203146 -174021 -159432 -148129 -182228 -199602
6513 -199602 -181069 -168231 -184354 -152560 -190386 -227692 -221702 -180655 -188182 -180234 -116182 -126965
6501 -126965 -142992 -133071 -137959 -87470 -91348 -91435 -109998 -93134 -63891 -84371 -80852 -119925 -102654
6488 -102654 -74109 -115561 -95210 -60144 -51799 -75533 -60651 -82214 -73595 -39685 -83842 -104780
6476 -104780 -56235 -40681 -91843 -97781 -115726 -104678 -77788 -64870 -104683 -71260 -114021 -167929
6464 -167929 -137947 -87399 -59414 -21681 -32451 -105293 -56859 -5939 -38387 -29304 -72804 -89966
$$ packed form
6549a14791j5797j2697j0851j1129L9879l3008n2982K7361K7503K2039k6534k684
6537a63691j2788l1805J5035K4028Q902k1513J1111K23m0508M6890j8870j9630
6525b02616K9990K9746J3164J457j2463r5465L3041K9125J4589J1303l4099j7374
6513a99602J8533J2838j6123L1794l7826l7306N990M1047p527P948O4052j0783
6501a26965j6027R921m888N0489l878q7j8563J6864K9243k0480L519l9073J7271
6488a02654K8545m1452K0351L5066Q345k3734J4882k1563Q619L3910m4157k0938
6476a04780M8545J5554n1162n938j7945J1048K6890J2918l9813L3423m2761n3908
6464a67929K9982N0548K7985L7733j0770p2842M8434N0920l2448R083m3500j7162
$$ plain form
6452 -89966 -74904 -92124 -106677 -78326 -49219 -77040 -49988 -26713 -37674 3743 -7336 -4272
6440 -4272 -3987 -32025 -73255 -39888 -32717 -19655 -21771 -5769 -28844 -75858 -37905 -25903 16157
6427 16157 22462 7897 2331 27704 28197 30511 -1125 -71718 -52809 -556 32235 14089 -45277
6414 -45277 -26455 43702 43523 -7436 -12042 3844 44922 33756 43429 38993 40569 -10457 -22993
6401 -22993 32502 39610 58456 42399 62175 62737 34301 43560 98506 119960 160705 184966 160393
6388 160393 103427 32392 100436 87572 146800 129979 65090 99899 50109 80513 101358 110247
6376 110247 134550 139680 121734 172010 166434 93298 118814 123332 120274 152308 170294 143718
6364 143718 148561 155198 167999 175184 209381 191073 201818 161482 188160 185727 248030 266047
$$ packed form
6452h9966J5062j7220j4553K8351K9107k7821K7052K3275j0961M1417j1079L064
6440d272K85k8038m1230L3367P171J3062k116J6002k3075m7014L7953J2002M2060
6427A6157O305j4565n566K5373M93K314l1636p0593J8909N2253L2791j8146n9366
6414d5277J8822P0157j79n0959m606J5886M1078j1166R673m436J576n1026j2536
6401b2993N5495P108J8846j6057J9776N62k8436R259N4946K1454M0745K4261k4573
6388A60393n6966p1035O8044j2864N9228j6821o4889L4809m9790L0404K0845Q889
6376A10247K4303N130j7946N0276n576p3136K5516M518l058L2034J7986k6576
6364A43718M843O637J2801P185L4197j8308J0745m0336K6678k433O2303J8017
$$ plain form
6352 266047 239404 273316 315322 295678 286871 287334 195876 177731 164408 189807 186771 198303
6340 198303 165646 174681 238366 234520 223684 219295 177995 168653 153897 178999 191326 164004
6328 164004 196316 226986 211245 213083 184266 159272 134284 125941 145128 187151 221292 264638
6316 264638 250318 232902 232460 214817 212354 245043 274320 306804 257693 240663 260590 240827
6304 240827 252919 290598 257455 265840 289034 279470 281048 259074 234306 254289 339222 354101
6292 354101 309043 302231 298086 296577 253468 262962 321996 358250 349849 298075 325125 324242 350499
6279 350499 386564 391946 379167 403278 473378 470149 473782 507478 542719 595354 613628 618891
6267 618891 614062 636906 624886 571955 593715 590412 581329 554770 545101 561284 462730 431586
$$ packed form
6352B66047k6643L3912M2006j9644q807M63r1458j8145j3323K5399l036J1532
6340A98303l2657R035O3685l846j0836m389m1300r342j4756K5102J2327k7322
6328A64004L2312L0670j5741J838k8817k4994k4988q343J9187M2023L4141M3346
6316B64638j4320j7416m42j7643k463L2689K9277L2484m9111j7030J9927j9763
6304B40827J2092L7679l3143Q385K3194r564J578k1974k4768J9983Q4933J4879
6292C54101m5058o812m145j509m3109R494N9034L6254q401n1774K7050q83K6257
6279C50499L6065N382j2779K4111P0100l229L633L3696L5241N2635J8274N263
6267F18891m829K2844j2020n2931K1760l303r083k6559r669J6183r8554l1144
$$ plain form
6255 431586 411586 432480 433452 437680 432708 425135 466462 521288 518670 504627 515351 524444 513706
6242 513706 471365 503972 511374 541229 486851 435438 435789 513382 478294 485273 487945 489865 487068
6229 487068 481764 553863 554999 579101 561618 555457 554767 507017 520013 516570 517468 604421 652963
6216 652963 636122 669324 663172 750092 795065 731218 669778 677141 712136 674968 650399 607291
6204 607291 612081 648896 639298 643087 636230 627126 678196 664046 747610 727504 679413 625992 623962
6191 623962 663348 648724 590976 535021 470106 492986 505295 488216 451976 493197 484853 483843
6179 483843 471243 439709 436723 416792 460427 464249 445769 449502 420658 467496 489825 454486
6167 454486 447632 502232 515066 462381 442514 483771 469464 477189 525284 543604 475077 463252
$$ packed form
6255D31586k0000K0894R72M228m972p573M1327N4826k618j4043J0724R093j0738
6242E13706m2341L2607P402K9855n4378n1413L51P7593l5088O979K672J920k797
6229D87068n304P2099J136K4102j7483o161o90m7750J2996l443Q98Q6953M8542
6216F52963j6841L3202o152Q6920M4973o3847o1440P363L4995l7168k4569m3108
6204F07291M790L6815r598L789o857r104N1070j4150Q3564k0106m8091n3421k030
6191F23962L9386j4624n7748n5955o4915K2880J2309j7079l6240M1221q344j010
6179D83843j2600l1534k986j9931M3635L822j8480L733k8844M6838K2329l5339
6167D54486o854N4600J2834n2685j9867M1257j4307P725M8095J8320o8527j1825
$$ plain form
6155 463252 479501 474816 499527 481831 494348 479005 499934 489217 511045 504671 536172 601575
6143 601575 606165 607703 612450 576211 594327 654892 653744 696252 712860 698644 753138 835775
6131 835775 833893 798244 871909 865374 840006 848474 933678 948410 971766 944620 983672 1025053
6119 1025053 1051852 1097185 1147448 1164826 1172890 1230578 1335478 1376060 1328411 1400331 1503126
6108 1503126 1528718 1606010 1593713 1564213 1666444 1733716 1757131 1753181 1817733 1837565 1891297
6097 1891297 1933251 1952982 2037552 2120154 2166606 2212692 2292013 2362720 2487579 2517375 2590737
6086 2590737 2663214 2737462 2789031 2866169 2932217 2929184 3011402 3055953 3123569 3232996 3335426
6075 3335426 3432384 3448848 3386883 3332844 3294528 3186581 3084523 2941371 2833889 2775739 2666313
$$ packed form
6155D63252J6249m685K4711j7696J2517j5343K0929j0717K1828o374L1501O5403
6143F01575M590J538M747l6239J8116O0565j148M2508J6608j4216N4494Q2637
6131H35775j882l5649P3665o535k5368Q468Q5204J4732K3356k7146L9052M1381
6119A025053K6799M5333N0263J7378Q064N7688J04900M0582m7649P1920J02795
6108A503126K5592P7292j2297k9500J02231O7272K3415l950O4552J9832N3732
6097A891297M1954J9731Q4570Q2602M6452M6086P9321P0707J24859K9796P3362
6086B590737P2477P4248N1569P7138O6048l033Q2218M4551O7616J09427J02430
6075C335426R6958J6464o1965n4039l8316j07947j02058j43152j07482n8150j09426
$$ plain form
6064 2666313 2559241 2508385 2478369 2388308 2389765 2402317 2428231 2454479 2495425 2463203 2374926
6053 2374926 2364137 2353086 2291728 2270801 2211430 2199502 2115395 2048907 2030162 2017865 2056225
6042 2056225 2070623 2150331 2215065 2252650 2331567 2305149 2295789 2302129 2274739 2275462 2252268 2264423
6030 2264423 2284640 2281906 2240859 2186391 2089853 2080701 2080529 2109618 2127437 2164631 2190661 2244097
6018 2244097 2293700 2309530 2340662 2290915 2279067 2301289 2297734 2278496 2251150 2187483 2174544 2135274
6006 2135274 2062490 2014314 2021176 2093855 2080851 2092212 2120148 2103425 2095822 2074470 2067014 2048483
5994 2048483 2025559 1994792 1945051 1924817 1880803 1865225 1895366 1861195 1822264 1799444 1791639 1773371
5982 1773371 1771205 1759273 1786011 1789318 1732458 1707061 1691855 1662417 1579192 1592436 1638310 1579320
$$ packed form
6064B666313j07072n0856l0016r0061J457J2552K5914K6248M0946l2222q8277
6053B374926j0789j1051o1358k0927n9371j1928q4107o6488j8745j2297L8360
6042B056225J4398P9708O4734L7585P8917k6418r360O340k7390P23k3194J2155
6030B264423K0217k734m1047n4468r6538r152j72K9089J7819L7194K6030N3436
6018B244097M9603J5830L1132m9747j1848K2222l555j9238k7346o3667j2939l9270
6006B135274p2784m8176O862P2679j3004J1361K7936j6723p603k1352p456j8531
5994B048483k2924l0767m9741k0234m4014j5578L0141l4171l8931k2820p805j8268
5982A773371k166j1932K6738L307n6860k5397j5206k9438q3225J3244M5874n8990
$$ plain form
5970 1579320 1558155 1523497 1459902 1430019 1474246 1414666 1420585 1435227 1434201 1371414 1403327 1405367
5958 1405367 1413986 1422288 1447193 1488925 1469624 1495130 1472938 1478103 1476965 1529626 1498047 1456205
5946 1456205 1489736 1555362 1508180 1530256 1538969 1566088 1585023 1590986 1606520 1586604 1627873 1651676
5934 1651676 1702866 1679999 1663446 1681480 1760615 1764023 1789218 1811717 1834266 1876822 1885724 1905976
5922 1905976 1939353 1967399 1934936 1978555 2020676 2055114 2065789 2085759 2114033 2154414 2186973
5911 2186973 2222934 2282719 2291102 2345137 2392227 2390257 2478441 2596101 2635217 2626030 2670780 2759386
5899 2759386 2832127 2886790 2921125 2974940 3058997 3123028 3216459 3269595 3306462 3365160 3382440
5888 3382440 3323463 3313353 3342224 3272547 3200479 3189754 3216486 3253365 3224859 3191108 3176501
$$ packed form
5970A579320k1165l4658o3595k9883M4227n9580N919J4642j026o2787L1913K040
5958A405367Q619Q302K4905M1732j9301K5506k2192N165j138N2661l1579m1842
5946A456205L3531O5626m7182K2076Q713K7119J8935N963J5534j9916M1269K3803
5934A651676N1190k2867j6553J8034P9135L408K5195K2499K2549M2556Q902K0252
5922A905976L3377K8046l2463M3619M2121L4438J0675J9970K8274M0381L2559
5911B186973L5961N9785Q383N4035M7090j970Q8184J17660L9116r187M4750Q8606
5899B759386P2741N4663L4335N3815Q4057O4031R3431N3136L6867N8698J7280
5888C382440n8977j0110K8871o9677p2068j0725K6732L6879k8506l3751j4607
$$ plain form
5877 3176501 3155393 3167332 3193207 3176071 3202042 3214485 3266257 3332273 3307086 3305734 3346662 3351491
5865 3351491 3385137 3408838 3452185 3470216 3510726 3527624 3602998 3641660 3636452 3609161 3645240 3684331
5853 3684331 3712950 3733137 3748345 3795092 3828954 3875803 3876586 3866445 3865344 3899175 3984557 3989518
5841 3989518 4011667 4091479 4108526 4168295 4226310 4271677 4338739 4356901 4456450 4553682 4630610
5830 4630610 4701874 4778345 4902610 4958548 5091110 5247107 5403249 5524875 5747043 5947262
5820 5947262 6086765 6190890 6330133 6505882 6704027 6854782 7060272 7263575 7468148 7763222
5810 7763222 8075443 8404411 8757998 9110819 9490259 9868206 10278121 10609367 10963141 11338689
5800 11338689 11648357 11950722 12145571 12367577 12493577 12592803 12680114 12763119 12809466 12864781
$$ packed form
5877C176501k1108J1939K5875j7136K5971J2443N1772O6016k5187j352M0928M829
5865C351491L3646K3701M3347J8031M0510J6898P5374L8662n208k7291L6079L9091
5853C684331K8619K0187J5208M6747L3862M6849P83j0141j101L3831Q5382M961
5841C989518K2149P9812J7047N9769N8015M5367O7062J8162R9549R7232P6928
5830D630610P1264P6471J24265N5938J32562J55997J56142J21626K22168K00219
5820E947262J39503J04125J39243J75749J98145J50755K05490K03303K04573K95074
5810G763222L12221L28968L53587L52821L79440L77947M09915L31246L53774L75548
5800A1338689L09668L02365J94849K22006J26000R9226Q7311Q3005M6347N5315
$$ plain form
5790 12864781 12870798 12818299 12839093 12818970 12806414 12757264 12820559 12856047 12903119 12960969 13091633
5779 13091633 13283183 13498131 13755353 14024234 14364105 14736563 15076624 15406697 15673682
5770 15673682 15927330 16136222 16300289 16296282 16185532 15929330 15465969 14977129 14473443 14021938
5760 14021938 13517854 13018840 12547570 12052324 11439376 10805772 10124742 9591225 9165057
5751 9165057 8745487 8389690 8020508 7765433 7532570 7243638 7071303 6881645 6748633 6657414
5741 6657414 6479560 6324471 6203215 6066463 5939424 5792267 5738523 5667400 5623707 5601609
5731 5601609 5551846 5550353 5513221 5516881 5459343 5452591 5463117 5438355 5394872 5358786 5312866 5323799
5719 5323799 5276545 5209300 5194857 5165177 5148883 5141762 5143838 5144721 5160936 5189582 5227294 5259874
$$ packed form
5790A2864781O017n2499K0794k0123j2556m9150O3295L5488M7072N7850J30664
5779A3091633J91550K14948K57222K68881L39871L72458L40061L30073K66985
5770A5673682K53648K08892J64067m007j10750k56202m63361m88840n03686m51505
5760A4021938n04084m99014m71270m95246o12948o33604o81030n33517m26168
5751I165057m19570l55797l69182k55075k32863k88932j72335j89658j33012r1219
5741F657414j77854j55089j21256j36752j27039j47157n3744p1123m3693k2098
5731E601609m9763j493l7132L660n7538o752J0526k4762m3483l6086m5920J0933
5719E323799m7254o7245j4443k9680j6294p121K076Q83J6215K8646L7712L2580
$$ plain form
5707 5259874 5339947 5352756 5371715 5351909 5274738 5308597 5304897 5259382 5254932 5205820 5214598 5210991
5695 5210991 5189885 5248355 5214487 5199252 5223284 5245310 5223747 5274419 5280538 5297047 5401540
5684 5401540 5415954 5461748 5520806 5556322 5666755 5769792 5829111 5918879 5994620 6053705 6159203
5673 6159203 6238837 6248303 6340892 6329111 6375049 6415266 6448264 6492913 6543291 6556106 6596918 6680190
5661 6680190 6681756 6662426 6642337 6647517 6666502 6610267 6524347 6507006 6459272 6433895 6390956 6323399
5649 6323399 6322926 6345089 6328860 6297859 6266123 6324593 6382409 6387429 6398931 6504907 6588491 6635878
5637 6635878 6739369 6848379 6959431 7022092 7121970 7256659 7350316 7450850 7560465 7703003
5627 7703003 7883337 7953513 7997494 8024961 8093322 8113398 8113316 8118571 8164096 8233215 8207874 8193825
$$ packed form
5707E259874Q0073J2809J8959j9806p7171L3859l700m5515m450m9112Q778l607
5695E210991k1106N8470l3868j5235K4032K2026k1563N0672O119J6509J04493
5684E401540J4414M5794N9058L5516J10433J03037N9319Q9768P5741N9085J05498
5673F159203P9634R466R2589j1781M5938M0217L2998M4649N0378J2815M0812Q3272
5661F680190J566j9330k0089N180J8985n6235q5920j7341m7734k5377m2939o7557
5649F323399m73K2163j6229l1001l1736N8470N7816N020J1502J05976Q3584M7387
5637F635878J03491J09010J11052O2661R9878J34689R3657J00534J09615J42538
5627G703003J80334P0176M3981K7467O8361K0076q2N255M5525O9119k5341j4049
$$ plain form
5615 8193825 8216456 8271837 8333666 8344902 8372835 8362966 8414776 8386836 8417260 8453533 8481109 8539209
5603 8539209 8548182 8544548 8580390 8618451 8684508 8793483 8859291 8969205 9102767 9236856 9434179
5592 9434179 9608530 9833834 10112148 10299743 10540984 10804560 11031064 11210476 11398628 11582650
5582 11582650 11762597 11926980 12054919 12125764 12187763 12240292 12277935 12294969 12283549 12160836
5572 12160836 12097766 11991503 11920340 11794533 11651759 11513905 11410176 11233305 11047964 10870598
5562 10870598 10688612 10565804 10477517 10366919 10237557 10072808 9988370 9972095 9945169 9913667
5552 9913667 9862695 9819892 9803913 9742017 9669671 9612922 9560858 9517405 9486252 9424078 9310464
5541 9310464 9202949 9191429 9179547 9144072 9059477 9079675 9100234 9000278 8885703 8775584 8648229
$$ packed form
5615H193825K2631N5381O1829J1236K7933r869N1810k7940L0424L6273K7576N8100
5603H539209Q973l634L5842L8061O6057J08975O5808J09914J33562J34089J97323
5592I434179J74351K25304K78314J87595K41241K63576K26504J79412J88152J84022
5582A1582650J79947J64383J27939P0845O1999N2529L7643J7034j1420j22713
5572A2160836o3070j06263p1163j25807j42774j37854j03729j76871j85341j77366
5562A0870598j81986j22808q8287j10598j29362j64749q4438j6275k6926l1502
5552I913667n0972m2803j5979o1896p2346n6749n2064m3453l1153o2174j13614
5541I310464j07515j1520j1882l5475q4595K0198K0559r9956j14575j10119j27355
$$ plain form
5530 8648229 8474976 8297674 8119244 7919345 7671302 7447646 7285347 7098462 6939140 6798238
5520 6798238 6613925 6490958 6373480 6250155 6156160 6023492 5965524 5915452 5799654 5723477
5510 5723477 5681643 5689309 5700352 5673999 5652271 5694036 5825879 5997748 6146749 6382393 6512828
5499 6512828 6537198 6341999 5952018 5641470 5482670 5316667 5207320 5109224 5077064 4994916
5489 4994916 4979008 4905019 4881815 4868517 4844668 4808831 4855445 4878056 4896035 4882852 4906616
5478 4906616 4922023 4971639 4980293 5049617 5139017 5176510 5203975 5264648 5343856 5306301 5307690 5347984
5466 5347984 5371765 5390786 5458756 5552849 5584342 5639100 5719895 5774528 5889324 5984198 6041002
5455 6041002 6053259 6112393 6208534 6317375 6418320 6535474 6620819 6732329 6875628 7055825
$$ packed form
5530H648229j73253j77302j78430j99899k48043k23656j62299j86885j59322j40902
5520F798238j84313j22967j17478j23325r3995j32668n7968n0072j15798p6177
5510E723477m1834P666J1043k6353k1728M1765J31843J71869J49001K35644J30435
5499F512828K4370j95199l89981l10548j58800j66003j09347r8096l2160q2148
5489D994916j5908p3989k3204j3298k3849l5837M6614K2611J7979j3183K3764
5478D906616J5407M9616Q654O9324Q9400L7493K7465O0673P9208l7555J389M0294
5466E347984K3781J9021O7970R4093L1493N4758Q0795N4633J14796R4874N6804
5455F041002J2257N9134R6141J08841J00945J17154Q5345J11510J43299J80197
$$ plain form
5445 7055825 7220907 7391087 7521770 7710892 7910768 8087213 8231659 8316395 8320499 8318167
5435 8318167 8335824 8346856 8389977 8524223 8590877 8710314 8842192 9040826 9196203 9439169
5425 9439169 9683122 9894746 10173561 10458815 10796220 11105503 11351090 11491165 11571664 11716217
5415 11716217 11850643 12052445 12320501 12660975 13073225 13494691 13943222 14464372 15070935
5406 15070935 15658988 16390651 17136616 17849598 18636166 19469470 20365572 21150537 21888607
5397 21888607 22532023 23030154 23388101 23642023 23820889 23941374 24018648 24090475 24169634 24399067
5387 24399067 24712178 24837216 24748938 24610793 24419849 24098628 23752499 23284583 22824802 22379652
5377 22379652 21888083 21401677 20881239 20346307 19772303 19161975 18640402 18136464 17675555
$$ packed form
5445G055825J65082J70180J30683J89122J99876J76445J44446Q4736M104k332
5435H318167J7657J1032M3121J34246O6654J19437J31878J98634J55377K42966
5425I439169K43953K11624K78815K85254L37405L09283K45587J40075Q0499J44553
5415A1716217J34426K01802K68056L40474M12250M21466M48531N21150O06563
5406A5070935N88053P31663P45965P12982P86568Q33304Q96102P84965P38070
5397B1888607O43416M98131L57947K53922J78866J20485P7274P1827P9159K29433
5387B4399067L13111J25038q8278j38145j90944l21221l46129m67916m59781m45150
5377B2379652m91569m86406n20438n34932n74004o10328n21573n03938m60909
$$ plain form
5368 17675555 17270417 16907245 16488799 16026177 15501456 14989751 14611803 14168180 13832052
5359 13832052 13668818 13509333 13348045 13267549 13330723 13093748 12573237 12174847 11862564 11684055
5349 11684055 11566007 11435111 11366276 11250958 11273303 11270643 11252981 11285696 11321151 11359850 11426352
5338 11426352 11507881 11522711 11513366 11459090 11467502 11447776 11432099 11469062 11532833 11630836 11700032 11830827
5326 11830827 11968393 12115630 12318152 12461399 12527084 12602986 12598644 12643069 12600297 12484744
5316 12484744 12270906 12008536 11809919 11661384 11588829 11539804 11513376 11562214 11677450 11720033
5306 11720033 11777768 12012946 12211774 12391108 12620743 12871843 13067617 13072383 12836402 12297543
5296 12297543 11664631 11058377 10550986 10141004 9727945 9392019 9094159 8809091 8627608
$$ packed form
5368A7675555m05138l63172m18446m62622n24721n11705l77948m43623l36128
5359A3832052j63234j59485j61288q0496O3174k36975n20511l98390l12283j78509
5349A1684055j18048j30896o8835j15318K2345k660j7662L2715L5455L8699O6502
5338A1426352Q1529J4830r345n4276Q412j9726j5677L6963O3771R8003O9196J30795
5326A1830827J37566J47237K02522J43247O5685P5902m342M4425m2772j15553
5316A2484744k13838k62370j98617j48535p2555m9025k6428M8838J15236M2583
5306A1720033N7735K35178J98828J79334K29635K51100J95774M766k35981n38859
5296A2297543o32912o06254n07391m09982m13059l35926k97860k85068j81483
$$ plain form
5287 8627608 8485956 8353768 8221711 8116747 8084981 8067610 8051914 8119896 8171520 8290742
5277 8290742 8425829 8471823 8570894 8706711 8855812 9022558 9168579 9341668 9499657 9662322
5267 9662322 9871607 10071369 10290561 10553261 10804196 11012878 11170319 11294820 11355358 11379600
5257 11379600 11408070 11529815 11710358 11998218 12339683 12723952 13049934 13188237 13122796 12957005
5247 12957005 12769834 12531980 12325832 12122670 11877496 11711752 11516763 11279043 11167137
5238 11167137 11088354 11010038 10914542 10770721 10644972 10478190 10316725 10173966 10033008 9912752
5228 9912752 9795246 9664420 9584812 9563816 9601257 9691359 9855099 10022971 10208652 10287453
5218 10287453 10240011 10028832 9798285 9624606 9452710 9262389 9160424 9046254 8944094 8812000
$$ packed form
5287H627608j41652j32188j32057j04964l1766j7371j5696O7982N1624J19222
5277H290742J35087M5994R9071J35817J49101J66746J46021J73089J57989J62665
5267I662322K09285J99762K19192K62700K50935K08682J57441J24501O0538K4242
5257A1379600K8470J21745J80543K87860L41465L84269L25982J38303o5441j65791
5247A2957005j87171k37854k06148k03162k45174j65744j94989k37720j11906
5238A1167137p8783p8316r5496j43821j25749j66782j61465j42759j40958j20256
5228I912752j17506j30826p9608k0996L7441R0102J63740J67872J85681P8801
5218A0287453m7442k11179k30547j73679j71896j90321j01965j14170j02160j32094
$$ plain form
5208 8812000 8677129 8616759 8484690 8473499 8454731 8486538 8371761 8291663 8273296 8247831 8200135
5197 8200135 8209789 8225990 8267365 8363463 8472204 8618431 8701247 8866459 9025163 9200479 9339836
5186 9339836 9496491 9729112 9875328 10013871 10151236 10198635 10204738 10168735 10000759 9774140
5176 9774140 9489648 9247668 9055773 8803564 8564035 8422560 8195945 7999244 7872838 7727540
5166 7727540 7584882 7482870 7377704 7261555 7242096 7204529 7126931 7078289 7023185 6926248 6892734
5155 6892734 6849973 6839194 6712844 6594197 6537822 6523663 6452273 6345731 6319168 6336331 6369192
5144 6369192 6352207 6295850 6308777 6350852 6426066 6390854 6336066 6307810 6210871 6108119 6066098
5133 6066098 5993668 5927636 5924488 5915544 5863844 5845563 5915070 5935624 6024645 6067094 6154575 6222726
$$ packed form
5208H812000j34871o0370j32069j1191j8768L1807j14777q0098j8367k5465m7696
5197H200135R654J6201M1375R6098J08741J46227Q2816J65212J58704J75316J39357
5186I339836J56655K32621J46216J38543J37365M7399O103l6003j67976k26619
5176I774140k84492k41980j91895k52209k39529j41475k26615j96701j26406j45298
5166G727540j42658j02012j05166j16149j9459l7567p7598m8642n5104r6937l3514
5155F892734m2761j0779j26350j18647n6375j4159p1390j06542k6563J7163L2861
5144F369192j6985n6357J2927M2075P5214l5212n4788k8256r6939j02752m2021
5133F066098p2430o6032l148q944n1700j8281O9507K0554Q9021M2449Q7481O8151
$$ plain form
5121 6222726 6316101 6305310 6316496 6295253 6358123 6356515 6299588 6282432 6345968 6336224 6335104 6389367
5109 6389367 6374998 6391999 6339170 6315614 6298566 6308947 6370143 6407198 6464996 6643110 6822380
5098 6822380 6861798 6957201 7044010 7045756 7037744 7015891 6944007 6892982 6835685 6768631 6720214 6654704
5086 6654704 6579014 6510734 6444078 6354965 6311764 6312392 6291834 6207017 6189105 6125078 6052056 5986469
5074 5986469 5919611 5699868 5616143 5505308 5377544 5280986 5107267 4940269 4859624 4777319
5064 4777319 4630763 4554013 4454114 4430604 4344309 4335577 4273197 4220079 4252046 4231977 4258734
5053 4258734 4316321 4317413 4313117 4355561 4403332 4434382 4454419 4521772 4527425 4562051 4571570 4605167
5041 4605167 4560320 4569144 4712796 4809371 5004519 5199227 5266051 5195263 5011509 4780256 4544179
$$ packed form
5121F222726R3375j0791J1186k1243O2870j608n6927j7156O3536r744j120N4263
5109F389367j4369J7001n2829k3556j7048J0381O1196L7055N7798J78114J79270
5098F822380L9418R5403Q6809J746q012k1853p1884n1025n7297o7054m8417o5510
5086F654704p5690o8280o6656q9113m3201O28k0558q4817j7912o4027p3022o5587
5074E986469o6858k19743q3725j10835j27764r6558j73719j66998q0645q2305
5064D777319j46556p6750r9899k3510q6295q732o2380n3118L1967k0069K6757
5053D258734N7587J092m296M2444M7771L1050K0037O7353N653L4626R519L3597
5041D605167m4847Q824J43652R6575J95148J94708O6824p0788j83754k31253k36077
$$ plain form
5030 4544179 4343058 4202347 4113464 4061767 4006413 3924971 3893918 3838551 3741373 3718933 3706920
5019 3706920 3723365 3686534 3647528 3686694 3659875 3676551 3713507 3707218 3696300 3681285 3684908 3730833
5007 3730833 3708882 3672441 3674280 3709042 3682465 3658013 3687020 3729641 3758697 3780405 3753926 3770565
4995 3770565 3781071 3800529 3812539 3851583 3838830 3825608 3826521 3876351 3899749 3904340 3901537 3960843
4983 3960843 3991513 4043390 4115995 4085423 4149428 4176562 4185655 4269446 4355662 4391972 4480750 4616636
4971 4616636 4741614 4813053 5021775 5204821 5281756 5271816 5217392 5087583 4864343 4621824
4961 4621824 4492117 4375244 4331792 4300579 4235660 4165619 4158718 4235399 4252818 4269045 4232107
4950 4232107 4244094 4254365 4294475 4335905 4327772 4259669 4318135 4344564 4351445 4404147 4412732 4443937
$$ packed form
5030D544179k01121j40711q8883n1697n5354q1442l1053n5367r7178k2440j2013
5019C706920J6445l6831l9006L9166k6819J6676L6956o289j0918j5015L623M5925
5007C730833k1951l6441J839L4762k6577k4452K9007M2621K9056K1708k6479J6639
4995C770565J0506J9458J2010L9044j2753j3222R13M9830K3398M591k803N9306
4983C960843L0670N1877P2605l0572O4005K7134R093Q3791Q6216L6310Q8778J35886
4971D616636J24978P1439K08722J83046P6935r940n4424j29809k23240k42519
4961D621824j29707j16873m3452l1213o4919p0041o901P6681J7419J6227l6938
4950D232107J1987J0271M0110M1430q133o8103N8466K6429O881N2702Q585L1205
$$ plain form
4938 4443937 4441640 4357908 4346682 4402436 4426702 4431181 4410091 4460214 4482759 4442003 4497758 4566004
4926 4566004 4514992 4593988 4572302 4591411 4582449 4596047 4613712 4626685 4597451 4606748 4681393 4701102
4914 4701102 4738733 4760503 4730114 4743626 4708609 4721952 4744649 4716782 4694751 4669073 4664271 4673526
4902 4673526 4723750 4745806 4753826 4754483 4758419 4812994 4863460 4927481 4967844 5063697 5203610 5238767
4890 5238767 5280207 5336724 5362014 5402754 5410314 5443413 5486244 5538234 5594998 5581612 5624259 5607609
4878 5607609 5625845 5710012 5715400 5678193 5705943 5703716 5710387 5741496 5792056 5847328 5832171 5864468
4866 5864468 5962043 5986089 6054613 6097038 6090538 6183194 6311838 6364873 6453675 6486621 6488428 6567245
4854 6567245 6579642 6600742 6639239 6662521 6685684 6739946 6785792 6822652 6928711 6984621 7023091
$$ packed form
4938D443937k297q3732j1226N5754K4266M479k1090N0123K2545m0756N5755O8246
4926D566004n1012P8996k1686J9109q962J3598J7665J2973k9234R297P4645J9709
4914D701102L7631K1770l0389J3512l5017J3343K2697k7867k2031k5678m802R255
4902D673526N0224K2056Q020O57L936N4575N0466O4021M0363R5853J39913L5157
4890E238767M1440N6517K5290M0740P560L3099M2831N1990N6764j3386M2647j6650
4878E607609J8236Q4167N388l7207K7750k227O671L1109N0560N5272j5157L2297
4866E864468R7575K4046O8524M2425o500R2656J28644N3035Q8802L2946J807P8817
4854F567245J2397K1100L8497K3282K3163N4262M5846L6860J06059N5910L8470
$$ plain form
4843 7023091 7094991 7084194 7149243 7229863 7235216 7216019 7211207 7191809 7228090 7253552 7324352 7377203
4831 7377203 7468758 7582053 7763072 7921147 8057515 8132077 8216855 8330009 8536171 8678716
4821 8678716 8860581 9109491 9292764 9447884 9630755 9770524 9922487 10089960 10249973 10382450
4811 10382450 10570870 10833383 10927610 10933365 10921731 10967833 10938138 10999213 11118727 11248249 11388055
4800 11388055 11561339 11687125 11892102 12088970 12244624 12343582 12495137 12688749 12891892 13042484
4790 13042484 13270380 13329234 13377428 13417292 13506811 13607428 13806157 14050063 14285007 14552207
4780 14552207 14838857 15073154 15442566 15822865 16208229 16500922 16794661 17078317 17482571
4771 17482571 17882854 18301824 18768231 19300738 19865798 20457916 21082855 21816226 22532068
$$ packed form
4843G023091P1900j0797O5049Q0620N353j9197m812j9398L6281K5462P0800N2851
4831G377203R1555J13295J81019J58075J36368P4562Q4778J13154K06162J42545
4821H678716J81865K48910J83273J55120J82871J39769J51963J67473J60013J32477
4811A0382450J88420K62513R4227N755j1634M6102k9695O1075J19514J29522J39806
4800A1388055J73284J25786K04977J96868J55654R8958J51555J93612K03143J50592
4790A3042484K27896N8854M8194L9864Q9519J00617J98729K43906K34944K67200
4780A4552207K86650K34297L69412L80299L85364K92693K93739K83656M04254
4771A7482571M00283M18970M66407N32507N65060N92118O24939P33371P15842
$$ plain form
4762 22532068 23204171 23814210 24424249 25009187 25595404 26202946 26943010 27580019 28270279
4753 28270279 28893503 29662006 30522980 31404660 32451805 33545737 34819916 36306389 37891058
4744 37891058 39698463 41656723 43897943 46399775 49251693 52655266 56840310 61824398
4736 61824398 67983233 75119908 83193733 92584839 103904785 118084376 137149243 162050694
4728 162050694 191155529 226051330 265807630 290916441 289453987 267663687 222608437
4721 222608437 172302113 133800270 107327538 89487345 76515871 66891298 59592198
4714 59592198 54006492 49666394 46410911 43707718 41550453 39693615 38065018 36594580
4706 36594580 35404693 34445141 33697367 33005290 32428131 32061945 31805409 31464864 31260760
$$ packed form
4762B2532068O72103O10039O10039N84938N86217O07542P40064O37009O90260
4753B8270279O23224P68503Q60974Q81680J047145J093932J274179J486473J584669
4744C7891058J807405J958260K241220K501832K851918L403573M185044M984088
4736F1824398O158835P136675Q073825R391106J1319946J4179591J9064867K4901451
4728A62050694K9104835L4895801L9756300K5108811j462454k1790300m5055250
4721B22608437n0306324l8501843k6472732j7840193j2971474r624573p299100
4714E9592198n585706m340098l255483k703193k157265j856838j628597j470438
4706C6594580j189887r59552p47774o92077n77159l66186k56536l40545k04104
$$ plain form
4697 31260760 31081935 31032133 30987778 31055139 31113517 31262723 31335481 31471367 31646857 31797199
4687 31797199 31928559 32171191 32403596 32719221 33082544 33515638 33917412 34511916 35217296
4678 35217296 36040081 37022334 38137758 39387236 40889641 42533468 44312251 46407111
4670 46407111 48974693 52215687 56166879 60769276 66395995 73032161 80832010 90343094
4662 90343094 102098941 116961192 136962448 161143356 188346622 223939986 259359710
4655 259359710 267484665 257018808 244862900 213016693 167309438 128952711 102204151
4648 102204151 84338233 71320105 61644747 54169000 48311169 43833480 40529700 37792857
4640 37792857 35479303 33490651 31796357 30208740 28779487 27440466 26331055 25323767
$$ packed form
4697C1260760j78825m9802m4355O7361N8378J49206P2758J35886J75490J50342
4687C1797199J31360K42632K32405L15625L63323M33094M01774N94504P05380
4678C5217296Q22785R82253J115424J249478J502405J643827J778783K094860
4670D6407111K567582L240994L951192M602397N626719O636166P799849R511084
4662I0343094J1755847J4862251K0001256K4180908K7203266L5593364L5419724
4655B59359710Q124955j0465857j2155908l1846207m5707255l8356727k6748560
4648A02204151j7865918j3018128r675358p475747n857831m477689l303780k736843
4640C7792857k313554j988652j694294j587617j429253j339021j109411j007288
$$ plain form
4632 25323767 24457046 23632484 22837355 22141794 21503774 20849465 20224409 19624157 19011511
4623 19011511 18472673 17991549 17572619 17169506 16769480 16494478 16122210 15754463 15392669
4614 15392669 15059763 14821324 14562541 14308755 14079419 13948293 13840909 13624288 13437729
4605 13437729 13291070 13141486 12954995 12804081 12679174 12590281 12483233 12338574 12209508 12113597
4595 12113597 11972222 11822389 11683543 11546597 11395059 11319981 11289520 11267998 11273048 11294049
4585 11294049 11352059 11328279 11268081 11264129 11242034 11238770 11249692 11224939 11201955 11166500 11152448 11113227
4573 11113227 11067205 11008411 10983872 10951706 10988659 10939472 10887084 10841428 10796222 10704541 10639940
4562 10639940 10533216 10462473 10458011 10504413 10565588 10640642 10669663 10630887 10666269 10773460 10767645
$$ packed form
4632B5323767q66721q24562p95129o95561o38020o54309o25056o00252o12646
4623A9011511n38838m81124m18930m03113m00026k75002l72268l67747l61794
4614A5392669l32906k38439k58783k53786k29336j31126j07384k16621j86559
4605A3437729j46659j49584j86491j50914j24907q8893j07048j44659j29066r5911
4595A2113597j41375j49833j38846j36946j51538p5078l0461k1522N050K1001
4585A1294049N8010k3780o0198l952k2095l264J0922k4753k2984l5455j4052l9221
4573A1113227m6022n8794k4539l2166L6953m9187n2388m5656m5206r1681o4601
4562A0639940j06724p0743m462M6402O1175P5054K9021l8776L5382J07191n815
$$ plain form
4551 10767645 10791084 10815205 10857249 10956411 11037867 11000139 11026034 11051591 10999039 10909405 10850406
4540 10850406 10891432 10953290 10950151 10989613 11071554 11137152 11112500 11185580 11178457 11196863 11234004 11280679
4528 11280679 11248282 11195390 11161876 11086275 10930280 10868285 10783147 10712378 10697972 10667856 10623403
4517 10623403 10590308 10639019 10659943 10737987 10825719 10871934 10938622 10967163 11026396 11083298 11130621
4506 11130621 11206088 11241428 11297138 11316119 11389627 11453202 11467894 11494887 11637908 11693723 11750831
4495 11750831 11796208 11801577 11780434 11876445 11959533 11947080 12083915 12181743 12328256 12530010 12628410
4484 12628410 12728912 12885269 13029932 13131093 13198641 13285964 13360354 13424665 13528514 13576286
4474 13576286 13631976 13666145 13673338 13605402 13588633 13610968 13719847 13793340 13929742 14037267 14097117
$$ packed form
4551A0767645K3439K4121M2044R9162Q1456l7728K5895K5557n2552q9634n8999
4540A0850406M1026O1858l139L9462Q1941O5598k4652P3080p123J8406L7141M6675
4528A1280679l2397n2892l3514p5601j55995o1995q5138p0769j4406l0116m4453
4517A0623403l3095M8711K0924P8044Q7732M6215O6688K8541N9233N6902M7323
4506A1130621P5467L5340N5710J8981P3508O3575J4692K6993J43021N5815N7108
4495A1750831M5377N369k1143R6011Q3088j2453J36835R7828J46513K01754R8400
4484A2628410J00502J56357J44663J01161O7548Q7323P4390O4311J03849M7772
4474A3576286N5690L4169P193o7936j6769K2335J08879P3493J36402J07525N9850
$$ plain form
4463 14097117 14161167 14264200 14349310 14440296 14488823 14509698 14520078 14547895 14547109 14562444 14545572
4452 14545572 14520565 14490855 14492691 14440794 14377600 14363198 14310662 14226647 14171389 14132458 14039066
4441 14039066 14019135 13977896 13992439 13975476 14026712 14068127 14188322 14330629 14496524 14724885
4431 14724885 14877018 15157253 15370518 15568503 15801063 15989909 16197399 16375667 16545061
4422 16545061 16744841 16957896 17148224 17357817 17531190 17773340 17996343 18167049 18377407
4413 18377407 18595814 18828558 18996251 18995842 18792275 18396400 17938570 17569968 17332784 17193060
4403 17193060 17131739 17085388 17026558 17012877 16967371 16929762 16900571 16878185 16962845 17020826 17136918
4392 17136918 17259285 17293156 17335807 17407109 17464439 17502380 17496613 17528474 17520629 17459462 17356495
$$ packed form
4463A4097117O4050J03033Q5110R0986M8527K0875J0380K7817p86J5335j6872
4452A4545572k5007k9710J836n1897o3194j4402n2536q4015n5258l8931r3392
4441A4039066j9931m1239J4543j6963N1236M1415J20195J42307J65895K28361
4431A4724885J52133K80235K13265J97985K32560J88846K07490J78268J69394
4422A6545061J99780K13055J90328K09593J73373K42150K23003J70706K10358
4413A8377407K18407K32744J67693m09k03567l95875m57830l68602k37184j39724
4403A7193060o1321m6351n8830j3681m5506l7609k9191k2386Q4660N7981J16092
4392A7136918J22367L3871M2651P1302N7330L7941n767L1861p845o1167j02967
$$ plain form
4381 17356495 17256315 17203776 17084493 17000111 16914083 16868379 16793274 16694811 16639031 16603716 16624504
4370 16624504 16571860 16494933 16498909 16516844 16521944 16538393 16605202 16703448 16898176 17027755 17187190
4359 17187190 17366015 17510767 17687290 17881108 17963444 18105598 18255652 18360683 18534443 18664248
4349 18664248 18902403 19087484 19297221 19567649 19845593 20185774 20590070 21013912 21407798
4340 21407798 21798739 22052701 22259207 22398024 22338109 22252453 22187364 22099537 22018856 21927984
4330 21927984 21868196 21820597 21729353 21647309 21553270 21397535 21277698 21243366 21194747 21103823 21049150
4319 21049150 20989927 20859228 20754814 20632592 20510194 20517776 20523759 20606799 20734236 20780164 20881102
4308 20881102 20904470 20825807 20620689 20359058 20060380 19672384 19356070 19072434 18836147 18640737
$$ packed form
4381A7356495j00180n2539j19283q4382q6028m5704p5105r8463n5780l5315K0788
4370A6624504n2644p6927L976J7935N100J6449O6809R8246J94728J29579J59435
4359A7187190J78825J44752J76523J93818Q2336J42154J50054J05031J73760J29805
4349A8664248K38155J85081K09737K70428K77944L40181M04296M23842L93886
4340B1407798L90941K53962K06506J38817n9915q5656o5089q7827q0681r0872
4330B1927984n9788m7599r1244q2044r4039j55735j19837l4332m8619r0924n4673
4319B1049150n9223j30699j04414j22222j22398P582N983Q3040J27437M5928J00938
4308B0881102K3368p8663k05118k61631k98678l87996l16314k83636k36287j95410
$$ plain form
4298 18640737 18513873 18547916 18584293 18622890 18626327 18655792 18670524 18744849 18750858 18716482 18718075 18716029
4286 18716029 18708851 18758535 18864829 18949909 19047197 19281644 19497239 19714121 19963481 20181317
4276 20181317 20340526 20470195 20585835 20540292 20448487 20295958 20128037 19917616 19635092 19419787
4266 19419787 19228195 19083366 18964363 18845565 18805906 18700139 18663858 18630837 18557850 18549800
4256 18549800 18492000 18462530 18436883 18337061 18340023 18340702 18307713 18321278 18333982 18292472 18292297 18303371
4244 18303371 18311183 18342770 18409335 18540977 18656852 18751258 18860397 18911266 18895390 18874081 18738970
4233 18738970 18612644 18508009 18325555 18149884 17989705 17897516 17803547 17783470 17780377 17702941
4223 17702941 17777257 17900348 18036087 18229443 18426447 18640134 18875750 19086348 19251667 19416545
$$ packed form
4298A8640737j26864L4043L6377L8597L437K9465J4732P4325O009l4376J593k046
4286A8716029p178M9684J06294Q5080R7288K34447K15595K16882K49360K17836
4276B0181317J59209J29669J15640m5543r1805j52529j67921k10421k82524k15305
4266A9419787j91592j44829j19003j18798l9659j05767l6281l3021p2987q050
4256A8549800n7800k9470k5647r9822K962O79l2989J3565J2704m1510j75J1074
4244A8303371P812L1587O6565J31642J15875R4406J09139N0869j5876k1309j35111
4233A8738970j26326j04635j82454j75671j60179r2189r3969k0077l093p7436
4223A7702941P4316J23091J35739J93356J97004K13687K35616K10598J65319J64878
$$ plain form
4213 19416545 19598970 19772249 19825372 19879727 19917444 19976508 20040788 20086015 20065046 19942948 19809215
4202 19809215 19690585 19521056 19381306 19341405 19296762 19234874 19196710 19174433 19123568 19101457 19106397
4191 19106397 19162370 19280448 19418050 19569164 19815748 20066018 20260659 20384337 20406668 20269664
4181 20269664 19997346 19617133 19244741 18921171 18663848 18426343 18245486 18021534 17895257
4172 17895257 17868247 17837490 17890936 17996390 18157485 18326954 18490032 18763311 19066783 19408048
4162 19408048 19807970 20275550 20784559 21414718 22142993 22950064 23843421 24858752 26071526
4153 26071526 27318944 28733871 30281681 32059093 33867368 35646307 37359008 38780088
4145 38780088 39745211 40266186 40160214 39703994 39209613 38885827 38831657 39027992 39486912 40115499
$$ packed form
4213A9416545J82425J73279N3123N4355L7717N9064O4280M5227k0969j22098j33733
4202A9809215j18630j69529j39750l9901m4643o1888l8164k2277n0865k2111M940
4191A9106397N5973J18078J37602J51114K46584K50270J94641J23678K2331j37004
4181B0269664k72318l80213l72392l23570k57323k37505j80857k23952j26277
4172A7895257k7010l0757N3446J05454J61095J69469J63078K73279L03472L41265
4162A9408048L99922M67580N09009O30159P28275Q07071Q93357J015331J212774
4153B6071526J247418J414927J547810J777412J808275J778939J712701J421080
4145C8780088R65123N20975j05972m56220m94381l23786n4170J96335M58920O28587
$$ plain form
4135 40115499 40670351 41099938 41079771 40558988 39590422 38254670 36960528 35780711 34813761
4126 34813761 34032416 33559299 33326688 33337012 33446686 33601846 33663461 33394046 32874916 31936367
4116 31936367 30623924 29140443 27641854 26201594 24834702 23749274 22868067 22113769
4108 22113769 21505481 20989610 20513587 20140651 19830777 19544593 19287208 19059639 18880820
4099 18880820 18685562 18529423 18446923 18461674 18396522 18412029 18423940 18417997 18290915 18134832 17841204
4088 17841204 17348499 16793950 16145632 15502439 14826668 14255903 13676963 13177854 12666586
4079 12666586 12181978 11764866 11458159 11214994 11004653 10743323 10526267 10379419 10216573
4070 10216573 10022923 9883527 9785368 9708663 9601772 9509655 9465792 9368406 9229197 9092321
$$ packed form
4135D0115499N54852M29587k0167n20783r68566j335752j294142j179817r66950
4126C4813761p81345m73117k32611J0324J09674J55160O1615k69415n19130r38549
4116C1936367j312443j483481j498589j440260j366892j085428q81207p54298
4108B2113769o08288n15871m76023l72936l09874k86184k57385k27569j78819
4099A8880820j95258j56139q2500J4751o5152J5507J1911n943j27082j56083k93628
4088A7841204m92705n54549o48318o43193o75771n70765n78940m99109n11268
4079A2666586m84608m17112l06707k43165k10341k61330k17056j46848j62846
4070A0216573j93650j39396r8159p6705j06891r2117m3863r7386j39209j36876
$$ plain form
4060 9092321 8964220 8769964 8676692 8505296 8397297 8326451 8167634 8109746 8051328 8002457
4050 8002457 7942286 7882074 7908960 7888636 7856646 7910329 7880334 7887275 7915040 7819112 7741779 7774735
4038 7774735 7773147 7793526 7802938 7834266 7912081 8045142 8139436 8264647 8338183 8368128 8390999
4027 8390999 8422597 8462513 8519591 8530767 8563505 8628919 8738679 8875976 9034325 9173297 9254935
4016 9254935 9420378 9540049 9637980 9680345 9743513 9737960 9726139 9712960 9745759 9877441 10048043
4005 10048043 10194108 10359359 10537319 10717436 10874106 11028715 11156425 11262170 11336649 11416881
3995 11416881 11446069 11546879 11715432 11895989 12046859 12226631 12429199 12680239 12969534 13204784
3985 13204784 13463045 13686943 13944229 14144990 14344884 14575016 14878056 15217235 15435771
$$ packed form
4060I092321j28101j94256r3272j71396j07999p0846j58817n7888n8418m8871
4050H002457o0171o0212K6886k0324l1990N3683k9995O941K7765r5928p7333L2956
4038G774735j588K0379R412L1328P7815J33061R4294J25211P3536K9945K2871
4027H390999L1598L9916N7078J1176L2738O5414J09760J37297J58349J38972Q1638
4016I254935J65443J19671R7931M2365O3168n553j1821j3179L2799J31682J70602
4005A0048043J46065J65251J77960J80117J56670J54609J27710J05745P4479Q0232
3995A1416881K9188J00810J68553J80557J50870J79772K02568K51040K89295K35250
3985A3204784K58261K23898K57286K00761J99894K30132L03040L39179K18536
$$ plain form
3976 15435771 15645555 15961072 16294235 16583474 16925595 17319690 17644088 17960489 18306491
3967 18306491 18594770 18852980 19136505 19378965 19654347 19887491 20116278 20336536 20588303
3958 20588303 20773946 21005152 21276654 21483962 21707046 21930910 22028908 22102763 22153932 22142437
3948 22142437 22167952 22177705 22095110 21998666 21968186 21915210 21852954 21676479 21508338 21332145 21138864
3937 21138864 20871496 20582924 20218368 19821807 19449392 19044085 18592238 18207905 17815498
3928 17815498 17381474 16964795 16587214 16129602 15653734 15272046 14811735 14334535 13855096
3919 13855096 13373191 12896131 12436066 11950208 11530321 11147444 10725832 10399521 10010241
3910 10010241 9632859 9322993 8942489 8566014 8218066 7986392 7697400 7369013 7139786
$$ packed form
3976A5435771K09784L15517L33163K89239L42121L94095L24398L16401L46002
3967A8306491K88279K58210K83525K42460K75382K33144K28787K20258K51767
3958B0588303J85643K31206K71502K07308K23084K23864R7998P3855N1169j1495
3948B2142437K5515R753q2595r6444l0480n2976o2256j76475j68141j76193j93281
3937B1138864k67368k88572l64556l96561l72415m05307m51847l84333l92407
3928A7815498m34024m16679l77581m57612m75868l81688m60311m77200m79439
3919A3855096m81905m77060m60065m85858m19887l82877m21612l26311l89280
3910A0010241l77382l09866l80504l76475l47948k31674k88992l28387k29227
$$ plain form
3901 7139786 6882103 6635868 6448622 6265336 6000549 5846880 5671692 5510986 5383518 5266166
3891 5266166 5121761 4997493 4863741 4714697 4633632 4544033 4442674 4425554 4355177 4283248
3881 4283248 4165274 4096517 4071699 3937752 3852739 3814482 3790406 3752933 3710838 3615804 3584024
3870 3584024 3490107 3493532 3509187 3473028 3407300 3340290 3265333 3187104 3103611 3033460 2985112 2987463
3858 2987463 2938752 2895358 2913922 2860342 2861093 2789573 2792838 2761953 2726266 2724752 2644697 2636369
3846 2636369 2651650 2636961 2627203 2598244 2553666 2544874 2569443 2597329 2614754 2575404 2536311 2573912
3834 2573912 2551810 2540747 2528409 2564319 2563126 2535105 2566610 2550117 2526179 2564875 2579563 2562539
3822 2562539 2545671 2552438 2532245 2534782 2464004 2399699 2403620 2373039 2325978 2340064 2379243 2383801
$$ packed form
3901G139786k57683k46235j87246j83286k64787j53669j75188j60706j27468j17352
3891E266166j44405j24268j33752j49044q1065q9599j01359j7120p0377p1929
3881D283248j17974o8757k4818j33947q5013l8257k4076l7473m2095r5034l1780
3870C584024r3917L425J5655l6159o5728o7010p4957p8229q3493p0151m8348K351
3858B987463m8711m3394J8564n3580P51p1520L265l0885l5687j514q0055q328
3846B636369J5281j4689r758k8959m4578q792K4569K7886J7425l9350l9093L7601
3834B573912k2102j1063j2338L5910j193k8021L1505j6493k3938L8696J4688j7024
3822B562539j6868O767k0193K537p0778o4305L921l0581m7061J4086L9179M558
$$ plain form
3810 2383801 2322361 2303598 2302091 2318303 2289946 2294036 2335905 2299891 2289170 2305834 2323047 2376141
3798 2376141 2389386 2390102 2428238 2456175 2508957 2545709 2609987 2648066 2716053 2842194 2896262 2986898
3786 2986898 3056796 3147399 3246575 3368743 3537016 3660223 3776328 3884835 3978928 4136223
3776 4136223 4301870 4345923 4469179 4599880 4646286 4699407 4813003 4883015 4982779 5110972
3766 5110972 5161036 5242926 5338627 5343567 5398136 5413436 5454441 5406443 5362724 5271116 5129945
3755 5129945 5034902 4910577 4779747 4631628 4491313 4373088 4289136 4209465 4106874 4046691
3745 4046691 3973872 3842806 3775070 3695271 3554148 3388988 3219089 3074493 2941096 2816772
3735 2816772 2712142 2602220 2513354 2451984 2364719 2263615 2204713 2193562 2153736 2148933 2151965
$$ packed form
3810B383801o1440j8763j507J6212k8357M090M1869l6014j0721J6664J7213N3094
3798B376141J3245P16L8136K7937N2782L6752O4278L8079O7987J26141N4068R0636
3786B986898O9898R0603R9176J22168J68273J23207J16105J08507R4093J57295
3776D136223J65647M4053J23256J30701M6406N3121J13596P0012R9764J28193
3766E110972N0064Q1890R5701M940N4569J5300M1005m7998m3719r1608j41171
3755E129945r5043j24325j30830j48119j40315j18225q3952p9671j02591o0183
3745D046691p2819j31066o7736p9799j41123j65160j69899j44596j33397j24324
3735B816772j04630j09922q8866o1370q7265j01104n8902j1151l9826m803L032
$$ plain form
3724 2151965 2107717 2031582 1989433 2005031 2021123 1962745 1984216 2025609 2017144 2044707 2005180 2050124
3712 2050124 2037437 2036227 2024205 2096835 2079325 2048101 2074489 2064068 2078042 2116570 2092350 2063817
3700 2063817 2094019 2054724 2060995 2089637 2074026 2083138 2138207 2101216 2137222 2157196 2167692 2183508
3688 2183508 2199948 2195215 2153992 2153287 2191516 2241136 2248868 2255697 2232288 2261388 2273226 2351725
3676 2351725 2321196 2298979 2325849 2385430 2441422 2520130 2590674 2653231 2760479 2849216 2948193
3665 2948193 3022044 3116736 3205465 3301198 3337865 3425952 3500361 3604895 3677472 3723253 3775983
3654 3775983 3868429 3933923 4026814 4030959 4132904 4309924 4407239 4494552 4627476 4681726 4717891
3643 4717891 4781520 4875367 4891604 4847401 4820737 4850360 4853625 4859753 4881157 4871721 4950279 4956624
$$ packed form
3724B151965m4248p6135m2149J5598J6092n8378K1471M1393q465K7563l9527M4944
3712B050124j2687j210j2022P2630j7510l1224K6388j0421J3974L8528k4220k8533
3700B063817L0202l9295O271K8642j5611R112N5069l6991L6006J9974J0496J5816
3688B183508J6440m733m1223p05L8229M9620P732O829k3409K9100J1838P8499
3676B351725l0529k2217K6870N9581N5992P8708P0544O2557J07248Q8737R8977
3665B948193P3851R4692Q8729R5733L6667Q8087P4409J04534P2577M5781N2730
3654C775983R2446O5494R2891M145J01945J77020R7315Q7313J32924N4250L6165
3643D717891O3629R3847J6237m4203k6664K9623L265O128K1404r436P8558O345
$$ plain form
3631 4956624 4946555 4954864 5002612 4983315 4976832 4997281 4954557 4974867 4944054 4890281 4854102 4786681
3619 4786681 4775854 4820971 4835426 4862814 4935584 5007004 5150447 5309765 5463761 5620191 5853076
3608 5853076 6093225 6266107 6426309 6610620 6792288 6918538 7027890 7119329 7201392 7348001
3598 7348001 7453884 7621849 7745639 7889259 8096588 8291424 8441406 8609426 8871813 9208096
3588 9208096 9545286 9872072 10130432 10391321 10611781 10747029 10722531 10577852 10390039 10093260
3578 10093260 9711938 9331248 8933595 8528367 8140173 7769910 7470187 7166556 6984333
3569 6984333 6892888 6867010 6827172 6829302 6807398 6711569 6659568 6587765 6525590 6475153 6452761 6500143
3557 6500143 6505000 6440252 6308063 6143980 5998990 5867082 5734430 5628737 5560473 5446199
$$ packed form
3631D956624j0069Q309M7748j9297o483K0449m2724K0310l0813n3773l6179o7421
3619D786681j0827M5117J4455K7388P2770P1420J43443J59318J53996J56430K32885
3608E853076K40149J72882J60202J84311J81668J26250J09352R1439Q2063J46609
3598G348001J05883J67965J23790J43620K07329J94836J49982J68020K62387L36283
3588I208096L37190L26786K58360K60889K20460J35248k4498j44679j87813k96779
3578A0093260l81322l80690l97653m05228l88194l70263k99723l03631j82223
3569F984333r1445k5878l9838K130k1904r5829n2001p1803o2175n0437k2392M7382
3557F500143M857o4748j32189j64083j44990j31908j32652j05693o8264j14274
$$ plain form
3547 5446199 5291220 5140215 5009114 4891705 4741857 4590916 4468921 4388645 4297088 4206465
3537 4206465 4224566 4157511 4073427 4030399 4059370 4046465 4025326 3996864 3945609 3964149 4000946
3526 4000946 4020818 4030464 4042864 4093502 4134627 4113175 4177154 4143551 4152081 4223678 4291079 4322739
3514 4322739 4380146 4449982 4500042 4619664 4652413 4724848 4814121 4876751 5005694 5098928 5183080
3503 5183080 5219882 5180308 5220625 5249509 5336437 5415934 5395932 5425200 5462809 5453340 5443846 5419170
3491 5419170 5379104 5357729 5362963 5284370 5251560 5247867 5259557 5260421 5255141 5262957 5264928 5329493 5414728
3478 5414728 5406334 5456164 5482219 5515534 5548935 5527676 5614922 5677212 5755307 5798958 5831765 5888409
3466 5888409 5960090 6027299 6155792 6228451 6284220 6371458 6472227 6643912 6813144 6931648
$$ packed form
3547E446199j54979j51005j31101j17409j49848j50941j21995q0276r1557r0623
3537D206465J8101o7055q4084m3028K8971j2905k1139k8462n1255J8540L6797
3526D000946J9872R646J2400N0638M1125k1452O3979l3603Q530P1597O7401L1660
3514D322739N7407O9836N0060J19622L2749P2435Q9273O2630J28943R3234Q4152
3503E183080L6802l9574M0317K8884Q6928P9497k0002K9268L7609r469r494k4676
3491E419170m0066k1375N234p8593l2810l693J1690Q64n280P816J971O4565Q5235
3478E414728q394M9830K6055L3315L3401k1259Q7246O2290P8095M3651L2807N6644
3466E888409P1681O7209J28493P2659N5769Q7238J00769J71685J69232J18504
$$ plain form
3456 6931648 7038073 7227712 7437244 7651805 7914149 8117373 8425317 8760247 9122982 9485001
3446 9485001 9801469 10112713 10439557 10700351 10977484 11249111 11482000 11642002 11773034 11826493
3436 11826493 11813028 11639881 11526823 11373895 11104784 10936361 10755179 10530487 10313893 10129822
3426 10129822 9947497 9764957 9583646 9362989 9153702 8953448 8816857 8689897 8543589
3417 8543589 8366740 8176621 8129358 8080725 7999720 7890619 7861271 7881178 7887445 7926393 7953119
3406 7953119 7971241 8000421 8071928 8110495 8140398 8235082 8329942 8354629 8429650 8565599 8663979
3395 8663979 8714435 8820802 8953780 9040613 9176503 9246295 9357981 9458999 9576388 9681952
3385 9681952 9785971 9888362 9956481 10068513 10229701 10425842 10576943 10694243 10805979 10941288
$$ packed form
3456F931648J06425J89639K09532K14561K62344K03224L07944L34930L62735L62019
3446I485001L16468L11244L26844K60794K77133K71627K32889J60002J31032N3459
3436A1826493j3465j73147j13058j52928k69111j68423j81182k24692k16594j84071
3426A0129822j82325j82540j81311k20657k09287k00254j36591j26960j46308
3417H543589j76849j90119m7263m8633q1005j09101k9348J9907O267L8948K6726
3406G953119J8122K9180P1507L8567K9903R4684R4860K4687P5021J35949R8380
3395H663979N0456J06367J32978Q6833J35890O9792J11686J01018J17389J05564
3385I681952J04019J02391O8119J12032J61188J96141J51101J17300J11736J35309
$$ plain form
3375 10941288 11059460 11219730 11405469 11502309 11621158 11728103 11816619 11985553 12151323 12268481
3365 12268481 12419115 12568595 12711198 12831367 12953329 13084194 13220916 13395292 13553812
3356 13553812 13667523 13811854 13966310 14099078 14166596 14307299 14426907 14614761 14701688 14849572
3346 14849572 15067435 15184666 15285512 15457848 15609889 15806605 15946381 16070563 16267943
3337 16267943 16342087 16539572 16722055 16910928 17127029 17222195 17350930 17512443 17754726 18048132
3327 18048132 18295816 18572872 18900425 19224736 19562295 19913370 20263083 20568553 20857822
3318 20857822 21233186 21627988 21954423 22277694 22636185 23042627 23434847 23836717 24214078
3309 24214078 24674401 25164675 25656258 26082150 26537566 27059746 27579568 28100623 28586288
$$ packed form
3375A0941288J18172J60270J85739R6840J18849J06945Q8516J68934J65770J17158
3365A2268481J50634J49480J42603J20169J21962J30865J36722J74376J58520
3356A3553812J13711J44331J54456J32768O7518J40703J19608J87854Q6927J47884
3346A4849572K17863J17231J00846J72336J52041J96716J39776J24182J97380
3337A6267943P4144J97485J82483J88873K16101R5166J28735J61513K42283K93406
3327A8048132K47684K77056L27553L24311L37559L51075L49713L05470K89269
3318B0857822L75364L94802L26435L23271L58491M06442L92220M01870L77361
3309B4214078M60323M90274M91583M25892M55416N22180N19822N21055M85665
$$ plain form
3300 28586288 29098830 29577732 30141181 30725627 31286460 31834905 32543475 33324203 34100840
3291 34100840 34996054 36004326 37115874 38269132 39493073 40759245 42092988 43449087
3283 43449087 44731901 45958808 47051212 48019734 48949210 49822756 50633626 51432240 52217333
3274 52217333 52989638 53853722 54752289 55605487 56419697 57119617 57744464 58177676 58505227
3265 58505227 58675654 58740747 58641192 58472049 58256783 58003902 57671026 57377700 57147203 56841991
3255 56841991 56632383 56534304 56427546 56390413 56367306 56338890 56384501 56435213 56487914 56597268 56675151
3244 56675151 56809505 56990412 57203669 57413656 57735284 58069927 58418717 58793042 59264850
3235 59264850 59790774 60296977 60857000 61468146 62087512 62759110 63483806 64303631 65234320
$$ packed form
3300B8586288N12542M78902N63449N84446N60833N48445P08570P80728P76637
3291C4100840Q95214J008272J111548J153258J223941J266172J333743J356099
3283D3449087J282814J226907J092404R68522R29476Q73546Q10870P98614P85093
3274E2217333P72305Q64084Q98567Q53198Q14210O99920O24847M33212L27551
3265E8505227J70427O5093r9555j69143k15266k52881l32876k93326k30497l05212
3255E6841991k09608r8079j06758l7133k3107k8416M5611N0712N2701J09354P7883
3244E6675151J34354J80907K13257K09987L21628L34643L48790L74325M71808
3235E9264850N25924N06203N60023O11146O19366O71598P24696Q19825R30689
$$ plain form
3226 65234320 66185158 67278025 68417858 69587057 70866146 72225290 73721265 75236425
3218 75236425 76782109 78370786 79931479 81519916 83107745 84764679 86399848 88126398
3210 88126398 89909604 91756079 93767115 95875291 98127165 100555392 103093464 105830130
3202 105830130 108699345 111650406 114712630 117825644 120800761 123588213 126030944 127950893
3194 127950893 129228265 129761584 129656502 128894680 127725195 126316290 124734861 123056619
3186 123056619 121295425 119569500 117883161 116216608 114556232 112877571 111072816 109146630
3178 109146630 107146995 104936100 102421359 99380681 95994446 92545618 89027096 85626696
3170 85626696 82357290 79113762 76027946 73123821 70395932 67880632 65568943 63482000
$$ packed form
3226F5234320R50838J092867J139833J169199J279089J359144J495975J515160
3218G5236425J545684J588677J560693J588437J587829J656934J635169J726550
3210H8126398J783206J846475K011036K108176K251874K428227K538072K736666
3202A05830130K869215K951061L062224L113014K975117K787452K442731J919949
3194A27950893J277372N33319j05082p61822j169485j408905j581429j678242
3186A23056619j761194j725925j686339j666553j660376j678661j804755j926186
3178A09146630j999635k210895k514741l040678l386235l448828l518522l400400
3170H5626696l269406l243528l085816k904125k727889k515300k311689k086943
$$ plain form
3162 63482000 61539979 59759515 58211266 56804944 55489488 54307208 53181873 52260333
3154 52260333 51478746 50745855 50090244 49549599 49112622 48831630 48576362 48385066 48341603 48483853
3144 48483853 48398961 47642075 46632766 45781156 45173747 44784921 44486123 44235539 44031569
3135 44031569 43895498 43758171 43674409 43616353 43612063 43605554 43673644 43756691 43862831 44016345 44251198
3124 44251198 44516099 44902101 45322377 45807408 46374032 47019750 47813762 48658033 49640390
3115 49640390 50686734 51806938 52991606 54136478 55007061 55779404 56600781 57422797 58328687
3106 58328687 59180191 60063091 60910631 61717367 62448307 63207491 63969563 64768124 65593269
3097 65593269 66445924 67239462 68036649 68732679 69354574 70004983 70484348 70867667 71189184
$$ packed form
3162F3482000j942021j780464j548249j406322j315456j182280j125335r21540
3154E2260333p81587p32891o55611n40645m36977k80992k55268j91296m3463J42250
3144D8483853q4892p56886j009309q51610o07409l88826k98798k50584k03970
3135D4031569j36071j37327q3762n8056m290o509O8090Q3047J06140J53514K34853
3124D4251198K64901L86002M20276M85031N66624O45718P94012Q44271R82357
3115D9640390J046344J120204J184668J144872Q70583P72343Q21377Q22016R05890
3106E8328687Q51504Q82900Q47540Q06736P30940P59184P62072P98561Q25145
3097F5593269Q52655P93538P97187O96030O21895O50409M79365L83319L21517
$$ plain form
3088 71189184 71563186 71825751 71984826 72123647 72260477 72273526 72286516 72224438 72102993 71996815
3078 71996815 71887105 71654294 71469258 71251100 71049741 70755796 70535486 70365703 70069002
3069 70069002 69723109 69342060 68883893 68385588 67786777 67149770 66492891 65858289 65239424
3060 65239424 64558228 63828033 63258091 62775292 62316102 61909295 61641170 61474292 61410608 61441587
3050 61441587 61523774 61698049 61953423 62331401 62690875 63143791 63657521 64206075 64803579 65435603
3040 65435603 66055254 66617198 67139821 67580934 67928207 68211890 68307387 68377245 68282545 68055689
3030 68055689 67727296 67348364 66827859 66298387 65729553 65008639 64215176 63397768 62527000
3021 62527000 61588207 60591863 59516757 58391325 57240975 56051086 54740640 53401208
$$ packed form
3088G1189184L74002K62565J59075J38821J36830J3049J2990o2078j21445j06178
3078G1996815j09710k32811j85036k18158k01359k93945k20310j69783k96701
3069G0069002l45893l81049m58167m98305n98811o37007o56879o34602o18865
3060F5239424o81196p30195n69942m82799m59190m06807k68125j66878o3684L0979
3050F1441587Q2187J74275K55374L77978L59474M52916N13730N48554N97504O32024
3040F5435603O19651N61944N22623M41113L47273K83683R5497O9858r4700k26856
3030F8055689l28393l78932n20505n29472n68834p20914p93463q17408q70768
3021F2527000r38793r96344j075106j125432j150350j189889j310446j339432
$$ plain form
3013 53401208 51961577 50475125 48858453 47166682 45472319 43759666 42016749 40305402
3005 40305402 38674179 37119071 35548733 34060520 32658012 31336582 30039966 28852324
2997 28852324 27774886 26846368 25930689 25084998 24305873 23624861 22915596 22283914 21729462
2988 21729462 21213352 20745986 20234751 19841443 19471520 19132329 18814955 18481414 18192588
2979 18192588 17948938 17687368 17439724 17217004 17046170 16840160 16674589 16553682 16349069
2970 16349069 16194379 16099712 15918447 15864882 15808558 15725833 15619372 15568819 15483137 15354381
2960 15354381 15260871 15169850 14982483 14807400 14667463 14472197 14255711 14043656 13814165 13674268
2950 13674268 13425724 13232502 12960780 12712976 12529111 12334283 12121632 11898217 11773590
$$ packed form
3013E3401208j439631j486452j616672j691771j694363j712653j742917j711347
3005D0305402j631223j555108j570338j488213j402508j321430j296616j187642
2997B8852324j077438r28518r15679q45691p79125o81012p09265o31682n54452
2988B1729462n16110m67366n11235l93308l69923l39191l17374l33541k88826
2979A8192588k43650k61570k47644k22720j70834k06010j65571j20907k04613
2970A6349069j54690r4667j81265n3565n6324q2725j06461n0553q5682j28756
2960A5354381r3510r1021j87367j75083j39937j95266k16486k12055k29491j39897
2950A3674268k48544j93222k71722k47804j83865j94828k12651k23415j24627
$$ plain form
2941 11773590 11651190 11495540 11360319 11308307 11166906 11065015 11017270 11025354 10943258 10872352
2931 10872352 10888486 10814521 10777713 10825306 10862212 10854557 10815216 10863710 10894176 10928948 10992181
2920 10992181 11056678 11135399 11165295 11286289 11391360 11452630 11573309 11697382 11825241 11907764
2910 11907764 12034467 12202835 12365609 12536985 12706956 12888748 13159238 13404068 13613794
2901 13613794 13894228 14193648 14474832 14765321 15072344 15389195 15731325 15966507 16238053
2892 16238053 16524975 16776525 17105429 17395553 17705557 18033208 18444014 18837336 19252047
2883 19252047 19655935 20049718 20487272 20928418 21398778 21915207 22568620 23209869 23903676
2874 23903676 24673911 25521451 26514900 27584611 28764723 30171060 31797799 33688091 35773690
$$ packed form
2941A1773590j22400j55650j35221n2012j41401j01891m7745Q084q2096p0906
2931A0872352J6134p3965l6808M7593L6906p655l9341M8494L0466L4772O3233
2920A0992181O4497P8721K9896J20994J05071O1270J20679J24073J27859Q2523
2910A1907764J26703J68368J62774J71376J69971J81792K70490K44830K09726
2901A3613794K80434K99420K81184K90489L07023L16851L42130K35182K71546
2892A6238053K86922K51550L28904K90124L10004L27651M10806L93322M14711
2883A9252047M03888L93783M37554M41146M70360N16429O53413O41249O93807
2874B3903676P70235Q47540R93449J069711J180112J406337J626739J890292K085599
$$ plain form
2865 35773690 37924032 39949998 41393333 41821970 41115623 39768771 38387583 37251089
2857 37251089 36405479 35884853 35638254 35549365 35562546 35652310 35835351 36203725 36668072 37260133
2847 37260133 37996391 38830295 39886859 40948018 42040702 43295222 44695170 46319330
2839 46319330 48208334 50285130 52607115 55351126 58491383 62129696 66429260 71354861
2831 71354861 76625434 81842223 86402174 89114673 89345696 87989847 86275212 85079869
2823 85079869 84648470 84889535 85768256 87292014 89501288 92393449 95926184 100024700 104752768
2814 104752768 109933057 115302600 120494213 124996113 128396031 130459617 131479366 131811486
2806 131811486 131728506 131451443 131325094 131831249 133276470 135838842 139623048 144657742 150851957
$$ packed form
2865C5773690K150342K025966J443335M28637p06347j346852j381188j136494
2857C7251089q45610n20626k46599q8889J3181Q9764J83041L68374M64347N92061
2847C7260133P36258Q33904J056564J061159J092684J254520J399948J624160
2839D6319330J889004K076796K321985K744011L140257L638313M299564M925601
2831G1354861N270573N216789M559951K712499K31023j355849j714635j195343
2823H5079869m31399K41065Q78721J523758K209274K892161L532735M098516M728068
2814A04752768N180289N369543N191613M501900L399918K063586J019749L32120
2806A31811486q2980k77063j26349N06155J445221K562372L784206N034694O194215
$$ plain form
2797 150851957 158012060 166108462 174702973 183292918 191210217 197738829 202245723 204395736
2789 204395736 203733493 199291135 190637825 178278395 163708169 148620602 134292285 121303617
2781 121303617 109901083 100004264 91481689 84142987 77811905 72330941 67565113 63366286
2773 63366286 59681476 56404718 53457806 50855471 48478046 46321411 44376580 42584546
2765 42584546 40999950 39483655 38114937 36907009 35837998 34850174 34046545 33380192 32763324
2756 32763324 32412975 32250474 32193237 32286620 32506539 32500897 32228912 31490521 30370119 29139084
2746 29139084 28029736 27194467 26588394 26241069 26113337 26127052 26085202 25814314 25174078 24079812
2736 24079812 22693286 21269726 19998638 18816480 17851037 17001259 16217834 15586634 15020405
$$ packed form
2797A50851957P160103Q096402Q594511Q589945P917299O528612M506894K150013
2789B04395736o62243m442358q653310j2359430j4570226j5087567j4328317j2988668
2781A21303617j1402534r896819q522575p338702o331082n480964m765828m198827
2773F3366286l684810l276758k946912k602335k377425k156635j944831j792034
2765D2584546j584596j516295j368718j207928j069011r87824q03629o66353o16868
2756C2763324l50349j62501n7237R3383K19919n642k71985p38391j120402j231035
2746B9139084j109348q35269o06073l47325j27732J3715m1850k70888o40236j094266
2736B4079812j386526j423560j271088j182158r65443q49778p83425o31200n66229
$$ plain form
2727 15020405 14466484 14035494 13645347 13237496 12835865 12454980 12134013 11892361 11619116
2718 11619116 11271062 10962781 10698462 10511253 10251492 9979650 9775876 9568082 9360715
2709 9360715 9221973 8955750 8758460 8621689 8488319 8324934 8160125 8031937 7875861 7762702
2699 7762702 7646558 7548797 7428898 7279459 7151513 7078808 6984226 6955765 6877666 6815377 6783491
2688 6783491 6711486 6728812 6813126 6881328 6904686 6977364 7092669 7176680 7248209 7285111 7272142
2677 7272142 7305893 7271186 7236519 7169827 7108586 6969447 6832491 6647510 6504448 6342658
2667 6342658 6151635 5966111 5740772 5554988 5348784 5178964 5033581 4856253 4738094 4631354
2657 4631354 4512592 4374790 4207055 4175248 4069597 3928409 3831620 3777066 3684427 3610444
$$ packed form
2727A5020405n53921m30990l90147m07851m01631l80885l20967k41652k73245
2718A1619116l48054l08281k64319j87209k59761k71842k03774k07794k07367
2709I360715j38742k66223j97290j36771j33370j63385j64809j28188j56076j13159
2699G762702j16144r7761j19899j49439j27946p2705r4582k8461p8099o2289l1886
2688F783491p2005J7326Q4314O8202K3358P2678J15305Q4011P1529L6902j2969
2677G272142L3751l4707l4667o6692o1241j39139j36956j84981j43062j61790
2667F342658j91023j85524k25339j85784k06204j69820j45383j77328j18159j06740
2657D631354j18762j37802j67735l1807j05651j41188r6789n4554r2639p3983
$$ plain form
2647 3610444 3568860 3558302 3465281 3411749 3400825 3289717 3297962 3313692 3282119 3242150 3195526
2636 3195526 3135271 3083982 3083903 3049191 3020380 3005429 2950592 2868696 2844785 2848639 2804440 2750256
2624 2750256 2738537 2750961 2680587 2641509 2643097 2657733 2623636 2568268 2552663 2529238 2532555 2514135
2612 2514135 2501844 2491931 2439819 2357572 2315266 2296005 2256877 2200947 2157677 2137726 2105229 2060352
2600 2060352 2049042 2021929 2011132 2017108 1949780 1910455 1897476 1894789 1877946 1875379 1897154 1923314
2588 1923314 1873463 1789084 1785077 1818550 1823249 1818980 1804635 1838652 1886076 1830006 1806426 1807119
2576 1807119 1788890 1757770 1678061 1638068 1627208 1614399 1576184 1562234 1598662 1573873 1574174 1529232
2564 1529232 1512374 1511464 1521405 1484563 1498957 1520265 1492002 1484437 1501803 1496715 1455780 1471211
$$ packed form
2647C610444m1584j0558r3021n3532j0924j11108Q245J5730l1573l9969m6624
2636C195526o0255n1289p9l4712k8811j4951n4837q1896k3911L854m4199n4184
2624B750256j1719J2424p0374l9078J588J4636l4097n5368j5605k3425L317j8420
2612B514135j2291r913n2112q2247m2306j9261l9128n5930m3270j9951l2497m4877
2600B060352j1310k7113j0797N976o7328l9325j2979k687j6843k567K1775K6160
2588A923314m9851q4379m007L3473M699m269j4345L4017M7424n6070k3580O93
2576A807119j8229l1120p9709l9993j0860j2809l8215j3950L6428k4789L01m4942
2564A529232j6858r10R941l6842J4394K1308k8263p565J7366n088m0935J5431
$$ plain form
2552 1471211 1466695 1480999 1490846 1505496 1547366 1564210 1587152 1542259 1529430 1539577 1545613 1553930
2540 1553930 1514614 1526914 1541367 1579585 1576685 1578984 1570418 1528702 1537905 1561280 1634408 1630496
2528 1630496 1654733 1715304 1731296 1676158 1672863 1719421 1650773 1659007 1722388 1722245 1681969 1674480
2516 1674480 1679992 1657423 1666394 1687735 1717729 1735058 1762742 1805969 1780810 1759347 1731096 1692717
2504 1692717 1655896 1625593 1557316 1520870 1457026 1361450 1326414 1252370 1211289 1185232 1158063
2493 1158063 1110076 1026296 989940 961350 927255 917188 897922 944939 868591 808883 777104
2482 777104 754342 810089 768228 764671 756775 772479 752805 729807 709259 736715 717469 673414
2470 673414 704775 725524 677523 660718 666896 646285 662550 697124 653485 633676 643904 628725
$$ packed form
2552A471211m516J4304R847J4650M1870J6844K2942m4893j2829J0147O036Q317
2540A553930l9316J2300J4453L8218k900K299q566m1716R203K3375P3128l912
2528A630496K4237O0571J5992n5138l295M6558o8648Q234O3381j43m0276p489
2516A674480N512k2569Q971K1341K9994J7329K7684M3227k5159k1463k8251l8379
2504A692717l6821l0303o8277l6446o3844r5576l5036p4044m1081k6057k7169
2493A158063m7987q3780l6356k8590l4095j0067j9266M7017p6348n9708l1779
2482G77104k2762N5747m1861l557p896J5704j9674k2998k0548K7456j9246m4055
2470F73414L1361K0749m8001j6805O178k0611J6265L4574m3639j9809J0228j5179
$$ plain form
2458 628725 628906 590748 626271 651055 622174 625980 589158 573265 573027 562761 586925 538473 520439
2445 520439 523164 509276 548515 546002 534989 520435 497778 514475 507365 502798 465401 428653
2433 428653 471187 447335 444904 438739 496478 447837 382307 341509 353692 389462 382320 459139
2421 459139 420781 406961 444225 386702 364938 356575 360027 376105 395128 403681 330313 311040
2409 311040 344449 328171 313723 340020 302540 294296 324901 326993 291167 359779 364221 332061
2397 332061 336896 324565 285431 281514 314174 350759 375736 347416 339269 342589 324808 308011
2385 308011 307655 308917 339199 367281 309592 284508 286327 278579 273924 298237 313876 315152 282948
2372 282948 282615 266237 287478 290943 270261 264916 256609 250154 273459 302997 269123 224259 209948
$$ packed form
2458F28725J81l8158L5523K4784k8881L806l6822j5893k38j0266K4164m8452j8034
2445E20439K725j3888L9239k513j1013j4554k2657J6697p110m567l7397l6748
2433D28653M2534k3852k431o165N7739m8641o5530m0798J2183L5770p142P6819
2421D59139l8358j3820L7264n7523k1764q363L452J6078J9023Q553p3368j9273
2409C11040L3409j6278j4448K6297l7480q244L0605K092l5826O8612M442l2160
2397C32061M835j2331l9134l917L2660L6585K4977k8320q147L320j7781j6797
2385C08011l56J262L0282K8082n7689k5084J819p748m655K4313J5639J276l2204
2372B82948l33j6378K1241L465k0682n345q307o455K3305K9538l3874m4864j4311
$$ plain form
2359 209948 238489 249185 252405 251757 278089 260371 227538 223524 222210 234968 199253 237934 275955
2346 275955 216246 189724 194948 272333 231059 202317 185890 170097 154774 162142 135185 202274
2334 202274 236621 199577 199638 224905 207589 201296 192261 242268 260027 257235 240525 233076 283511
2321 283511 256978 252130 193084 158580 131532 83683 116580 178011 129994 122277 122438 139202
2309 139202 143082 181064 188784 143771 156786 181387 177457 145318 130286 134535 127579 151528 190786
2296 190786 155524 135482 161191 147142 151762 164245 159893 146462 170828 157272 164711 171678
2284 171678 187694 181030 150714 156976 143959 111230 103078 102269 91527 91172 126272 104493 116889
2271 116889 131672 122603 124239 175623 156964 143495 197102 154924 159104 112747 135687 83946
$$ packed form
2359B09948K8541J0696L220o48K6332j7718l2833m014j314J2758l5715L8681L8021
2346B75955n9709k6522N224P7385m1274k8742j6427j5793j5323P368k6957O7089
2334B02274L4347l7044O1K5267j7316o293r035N0007J7759k792j6710p449N0435
2321B83511k6533m848n9046l4504k7048m7849L2897O1431m8017p717J61J6764
2309A39202L880L7982P720m5013J3015K4601l930l2139j5032M249o956K3949L9258
2296A90786l5262k0042K5709j4049M620J2483m352j3431K4366j3556P439O967
2284A71678J6016o664l0316O262j3017l2729q152q09j0742l55L5100k1779J2396
2271A16889J4783r069J636N1384j8659j3469N3607m2178M180m6357K2940n1741
$$ plain form
2259 83946 32802 131073 155895 147867 87761 110606 95198 98705 80177 62989 161691 172446
2247 172446 132054 79774 104389 184906 205848 170376 124626 125970 146077 101979 115313 110566
2235 110566 138294 189186 178887 136578 118291 72415 83905 102357 114821 114906 138152 156124
2223 156124 113685 107516 177949 139436 92150 86802 90161 91340 101252 132433 164328 165330 125346
2210 125346 133201 130267 135656 131279 137232 103768 121586 105193 129192 53906 61026 125272 163849
2197 163849 168529 141029 138358 190586 193081 119960 88311 59787 134406 122270 71348 75879
2185 75879 133130 122211 55139 129898 128402 80309 89648 98102 97383 64758 92164 90410 149186
2172 149186 138831 166723 117464 102881 154543 174362 135176 124817 110988 56558 103074 159277
$$ packed form
2259H3946n1144R8271K4822q028o0106K2845j5408L507j8528j7188R8702J0755
2247A72446m0392n2280K4615Q0517K0942l5472m5750J344K0107m4098J3334m747
2235A10566K7728N0892j0299m2309j8287m5876J1490J8452J2464Q5K3246J7972
2223A56124m2439o169P0433l8513m7286n348L359J179R912L1181L1895J002l9984
2210A25346P855k934N389m377N953l3464J7818j6393K3999p5286P120O4246L8577
2197A63849M680k7500k671N2228K495p3121l1649k8524P4619j2136n0922M531
2185G5879N7251j0919o7072P4759j496m8093R339Q454p19l2625K7406j754N8776
2172A49186j0355K7892m9259j4583N1662J9819l9186j0359j3829n4430M6516N6203
$$ plain form
2160 159277 137915 104165 112799 153846 166854 176429 173221 195845 182723 161378 211506 193123
2148 193123 190482 227177 226566 250112 218564 204619 243428 249712 264897 227774 238525 231758 217156
2135 217156 268278 282927 263936 294592 337740 333807 253081 288058 288671 313156 394431 388875
2123 388875 392279 415755 373945 363177 380131 348028 374368 415295 421968 396301 382581 391781
2111 391781 446729 467625 504210 534894 565103 612386 615014 645539 633067 617939 689794 697593
2099 697593 720313 768006 804907 856087 868235 890779 969155 1013692 1032708 1081834 1092128 1125344
2087 1125344 1082353 1137404 1199321 1265623 1328096 1392564 1431180 1501126 1562689 1631016 1774451
2076 1774451 2004246 2161319 2311036 2551179 2767484 2836412 3041404 3290747 3588604 3984916
$$ packed form
2160A59277k1362l3750Q634M1047J3008R575l208K2624j3122k1345N0128j8383
2148A93123k641L6695o11K3546l1548j3945L8809O284J5185l7123J0751o767j4602
2135B17156N1122J4649j8991L0656M3148l933q0726L4977O13K4485Q1275n556
2123C88875L404K3476m1810j0768J6954l2103K6340M0927O673k5667j3720R200
2111C91781N4948K0896L6585L0684L0209M7283K628L0525j2472j5128P1855P799
2099F97593K2720M7693L6901N1180J2148K2544P8376M4537J9016M9126J0294L3216
2087A125344m2991N5051O1917O6302O2473O4468L8616O9946O1563O8327J43435
2076A774451K29795J57073J49717K40143K16305O8928K04992K49343K97857L96312
$$ plain form
2066 3984916 4515373 5091296 5839411 6890673 8317385 10337121 12572390 14732780 18120056
2057 18120056 18707380 14781054 10814885 8003672 6350341 5205545 4301038 3630430 3145902
2048 3145902 2714899 2504055 2278942 2185105 2039890 1985080 1895333 1721066 1535210 1408461
2038 1408461 1301865 1220876 1156975 1095176 1062657 966519 906795 887057 837530 754176 692638
2027 692638 691902 660478 581021 583132 579550 543089 472175 476666 470047 459913 475349 443416 381989
2014 381989 388462 400892 415538 382846 327763 374185 347332 315788 304522 285971 283667 342462
2002 342462 305792 299883 298863 270225 264916 228242 185340 239179 238158 219930 204395 212917 250471
1989 250471 175251 130468 130051 110521 105468 144156 107909 108424 89234 100305 157267 168450 111174
$$ packed form
2066C984916N30457N75923P48115J051262J426712K019736K235269K160390L387276
2057A8120056N87324l926326l966169k811213j653331j144796r04507o70608m84528
2048C145902m31003k10844k25113r3837j45215n4810q9747j74267j85856j26749
2038A408461j06596q0989o3901o1799l2519r6138n9724j9738m9527q3354o1538
2027F92638p36l1424p9457K111l582l6461p0914M491o619j0134J5436l1933o1427
2014C81989O473J2430J4646l2692n5083M6422k6853l1544j1266j8551k304N8795
2002C42462l6670n909j020k8638n309l6674m2902N3839j021j8228j5535Q522L7554
1989B50471p5220m4783m17j9530n053L8688l6247N15j9190J1071N6962J1183n7276
$$ plain form
1976 111174 113899 125935 84002 124001 149834 139798 85482 65830 67224 65286 91681 118655
1964 118655 99645 28970 39385 73748 83365 85458 99310 46705 8235 45048 50427 35867
1952 35867 109778 86878 128030 113131 72641 44482 25948 31575 -7451 10418 -189 -16086
1940 -16086 11314 47282 31935 21355 7580 -5935 -296 -1372 35902 43146 25793 27851 -16703
1927 -16703 -27294 -32942 -17756 33949 -4496 -19373 -16964 2114 4319 33201 -8635 -49438
1915 -49438 -13692 -7754 -27378 15573 35582 34205 45808 -23417 -9290 -18251 -23238 14245 51075
1902 51075 28864 25626 393 5859 -5512 -9931 8199 -11413 -38884 -44504 -52845 -109302 -97583
1889 -97583 -54646 19182 24079 -27912 -35221 -23453 2166 53010 31116 5896 -21356 22445
$$ packed form
1976A11174K725J2036m1933L9999K5833j0036n4316j9652J394j938K6395K6974
1964A18655j9010p0675J0415L4363R617K093J3852n2605l8470L6813N379j4560
1952C5867P3911k2900M1152j4899m0490k8159j8534N627l9026J7869j0607j5897
1940a6086K7400L5968j5347j0580j3775j3515N639j076L7274P244j7353K058m4554
1927a6703j0591n648J5186N1705l8445j4877K409J9078K205K8882m1836m0803
1915d9438L5746N938j9624M2951K0009j377J1603o9225J4127q961m987L7483L6830
1902E1075k2211l238k5233N466j1371m419J8130j9612k7471n620q341n6457J1719
1889i7583M2937P3828M897n1991p309J1768K5619N0844k1894k5220k7252M3801
$$ plain form
1877 22445 35615 6232 6419 -8495 -1837 -18709 -52696 -58554 -47058 -38699 -22123 -27681 -19160
1864 -19160 -45060 -61563 -87394 -56945 -25233 -59719 -37810 -5157 -53857 -47071 6255 15919
1852 15919 5563 1515 -47781 -78291 -83700 -60830 -56989 -24694 -39662 -27213 -56730 -64497 -38640
1839 -38640 1108 -35717 -52615 -83989 -70251 -37941 -84149 -45408 -42726 -59708 -78730 -90593
1827 -90593 -117279 -90063 -89428 -72110 -83627 -94400 -98974 -78987 -38296 -85208 -105619 -41354
1815 -41354 -10008 -23532 -49131 -18200 -13111 -34562 -49266 -103470 -73724 -18424 -71032 -40575
1803 -40575 -47352 1707 -38472 -1709 16428 -12535 -34740 -10090 -22946 -81976 -103922 -104066
1791 -104066 -82826 -64687 -47041 -18647 12482 -8320 23462 28742 -23236 -37686 7039 -18929
$$ packed form
1877B2445J3170k9383J87j4914O658j6872l3987n858J1496Q359J6576n558Q521
1864a9160k5900j6503k5831L0449L1712l4486K1909L2653m8700O786N3326R664
1852A5919j0356m048m9296l0510n409K2870L841L2295j4968J2449k9517p767K5857
1839c8640L9748l6825j6898l1374J3738L2310m6208L8741K682j6982j9022j1863
1827i0593k6686K7216O35J7318j1517j0773m574J9987M0691m6912k0411O4265
1815d1354L1346j3524k5599L0931N089k1451j4704n4204K9746N5300n2608L0457
1803d0575o777M9059m0179L6763J8137k8963k2205K4650j2856n9030k1946j44
1791a04066K1240J8139J7646K8394L1129k0802L1782N280n1978j4450M4725k5968
$$ plain form
1779 -18929 3525 6441 -40952 -58295 -87586 -92564 -127617 -101120 -64987 -50148 -34197 -68464
1767 -68464 -110385 -94480 -105412 -95883 -95840 -71962 -83238 -89881 -60191 -75633 -55271 -52851 -46617
1754 -46617 -83032 -60674 -82466 -106587 -117864 -98221 -114837 -65037 -90768 -106610 -93706 -68968
1742 -68968 -77102 -38622 -57186 -73822 -55784 -57392 -74349 -79058 -99941 -114903 -52219 -65330
$$ packed form
1779a8929K2454K916m7393j7343k9291m978l5053K6497L6133J4839J5951l4267
1767f8464m1921J5905j0932R529M3K3878j1276o643K9690j5442K0362K420O234
1754d6617l6415K2358k1792k4121j1277J9643j6616M9800k5731j5842J2904K4738
1742f8968q134L8480j8564j6636J8038j608j6957m709k0883j4962O2684j3111
$$ [...]
##END NTUPLES=NMR SPECTRUM
##END=
