##TITLE=1H_EC-3299(III-3)
 CDCl3
 8 sc, 
 10.8.2023
##JCAMPDX= 6.0         $$ Bruker NMR JCAMP-DX V2.0
##DATA TYPE= NMR SPECTRUM
##DATA CLASS= NTUPLES
##ORIGIN= UXNMR, Bruker Analytische Messtechnik GmbH
##OWNER= root
$$ XWIN-NMR		Version 3.5
$$ Thu Aug 10 13:49:42 2023 Russian Standard Time (UT+4h)  she@DPX200
##.OBSERVE FREQUENCY= 200.13135
##.OBSERVE NUCLEUS= ^1H
##.ACQUISITION MODE= SIMULTANEOUS
##.ACQUISITION SCHEME= undefined
##.AVERAGES= 8
##.DIGITISER RES= 18
##SPECTROMETER/DATA SYSTEM= spect
##.PULSE SEQUENCE= zg30
##.SOLVENT NAME= CDCl3
##.SHIFT REFERENCE= (INTERNAL, CDCl3, 0, 15.737)
##AUDIT TRAIL= $$ (NUMBER, WHEN, WHO, WHERE, WHAT)
$$ ##TITLE= Audit trail, XWIN-NMR		Version 3.5
$$ ##JCAMPDX= 5.01
$$ ##ORIGIN= Bruker BioSpin GmbH
$$ ##OWNER= she
$$ F:/spectra/data/she/nmr/H-F/1/pdata/1/auditp.txt
$$ ##AUDIT TRAIL=  $$ (NUMBER, WHEN, WHO, WHERE, WHAT)
(   1,<2023-08-10 13:48:29.78 +0400>,<she>,<DPX200>,
      <created by zg, POWCHK disabled, PULCHK disabled
       configuration hash MD5:
       00 E9 B6 7A A2 85 ED C7 34 08 36 98 17 FE 4E 26
       data hash MD5: 16K
       10 63 9D 42 15 52 C0 28 3A D8 B3 17 C3 0F 59 7E>)
(   2,<2023-08-10 13:48:32.07 +0400>,<she>,<DPX200>,
      <Start of raw data processing
       efp BC_mod = 2 LB = 0.24 FT_mod = 6 PKNL = 1 PHC0 = -21203.51 PHC1 = 11.85272 SI = 16K 
       data hash MD5: 16K
       C5 C8 EF B6 0A 52 88 63 6A 75 01 9E 5F 6E 3B 15>)
(   3,<2023-08-10 13:48:48.46 +0400>,<she>,<DPX200>,
      <pk PHC0 = 2.135684 PHC1 = -2 
       data hash MD5: 16K
       F3 83 17 A6 23 FD DE 3B 06 D1 EA E8 CF F1 5A D9>)
(   4,<2023-08-10 13:48:52.17 +0400>,<she>,<DPX200>,
      <abs ABSG = 5 
       data hash MD5: 16K
       A5 50 BA 03 0E 9B 84 49 DC 7D 0E BA 08 95 E2 04>)
$$ ##END=
$$ 
$$ hash MD5
$$ DA 28 96 96 70 A2 5D 6F 0F 3E 9C DD 88 6A B8 7B
##$RELAX= 
##$RELAX= 
##$RELAX= 
##$RELAX= 
##$RELAX= 
##$RELAX= 
$$ Bruker specific parameters
$$ --------------------------
##$DU= <F:/spectra>
##$EXPNO= 1
##$NAME= <H-F>
##$PROCNO= 1
##$TYPE= <nmr>
##$USER= <she>
##$AMP= (0..31)
100 100 100 100 100 100 100 100 100 100 100 100 100 100 100 100 100 100 
100 100 100 100 100 100 100 100 100 100 100 100 100 100 
##$AQSEQ= 0
##$AQ_mod= 1
##$AUNM= <au_zg>
##$AUTOPOS= <>
##$BF1= 200.13
##$BF2= 200.13
##$BF3= 200.13
##$BF4= 200.13
##$BF5= 200.13
##$BF6= 200.13
##$BF7= 200.13
##$BF8= 200.13
##$BYTORDA= 1
##$CFDGTYP= 0
##$CFRGTYP= 5
##$CHEMSTR= <none>
##$CNST= (0..31)
1 1 145 1 1 1 1 1 1 1 1 1 1 1 1 1 1 1 1 1 1 1 1 1 1 1 1 1 1 1 1 1 
##$CPDPRG= <>
##$CPDPRG1= <>
##$CPDPRG2= <>
##$CPDPRG3= <>
##$CPDPRG4= <mlev>
##$CPDPRG5= <mlev>
##$CPDPRG6= <mlev>
##$CPDPRG7= <mlev>
##$CPDPRG8= <mlev>
##$CPDPRGB= <>
##$CPDPRGT= <>
##$D= (0..31)
0 1.2 0 0 0 0 0 0 0 0.06 0 0.03 0 0 0 0 0.0002 0 0 0 0 0 0 0 0 0 0 0 0 
0 0 0 
##$DATE= 1691660909
##$DBL= (0..7)
120 120 120 120 120 120 120 120 
##$DBP= (0..7)
150 150 150 150 150 150 150 150 
##$DBP07= 0
##$DBPNAM0= <>
##$DBPNAM1= <>
##$DBPNAM2= <>
##$DBPNAM3= <>
##$DBPNAM4= <>
$$ [...]
##$SUBNAM3= <"">
##$SUBNAM4= <"">
##$SUBNAM5= <"">
##$SUBNAM6= <"">
##$SUBNAM7= <"">
##$SUBNAM8= <"">
##$SUBNAM9= <"">
##$SW= 18.05172834244
##$SWIBOX= (0..15)
0 0 2 0 0 0 0 0 0 0 0 0 0 0 0 0 
##$SW_h= 3612.71676300578
##$TD= 16384
##$TD0= 1
##$TE= 0
##$TE2= 300
##$TE3= 300
##$TEG= 300
##$TL= (0..7)
0 120 120 120 120 120 120 120 
##$TP= (0..7)
150 150 150 150 150 150 150 150 
##$TP07= 0
##$TPNAME0= <>
##$TPNAME1= <>
##$TPNAME2= <>
##$TPNAME3= <>
##$TPNAME4= <>
##$TPNAME5= <>
##$TPNAME6= <>
##$TPNAME7= <>
##$TPOAL= (0..7)
0.5 0.5 0.5 0.5 0.5 0.5 0.5 0.5 
##$TPOFFS= (0..7)
0 0 0 0 0 0 0 0 
##$TUNHIN= 0
##$TUNHOUT= 0
##$TUNXOUT= 0
##$USERA1= <user>
##$USERA2= <user>
##$USERA3= <user>
##$USERA4= <user>
##$USERA5= <user>
##$V9= 5
##$VALIST= <valist>
##$VCLIST= <CCCCCCCCCCCCCCC>
##$VD= 0
##$VDLIST= <DDDDDDDDDDDDDDD>
##$VPLIST= <PPPPPPPPPPPPPPP>
##$VTLIST= <TTTTTTTTTTTTTTT>
##$WBST= 1024
##$WBSW= 4
##$XGAIN= (0..3)
0 0 0 0 
##$XL= 0
##$YL= 0
##$YMAX_a= 171854
##$YMIN_a= -97925
##$ZGOPTNS= <>
##$ZL1= 120
##$ZL2= 120
##$ZL3= 120
##$ZL4= 120
##$ABSF1= 15.73036
##$ABSF2= -2.321489
##$ABSG= 5
##$ABSL= 3
##$ALPHA= 0
##$AQORDER= 0
##$ASSFAC= 0
##$ASSFACI= 0
##$ASSFACX= 0
##$ASSWID= 0
##$AUNMP= <proc_1d>
##$AZFE= 0.1
##$AZFW= 0.1
##$BCFW= 0
##$BC_mod= 2
##$BYTORDP= 0
##$COROFFS= 0
##$CY= -3
##$DATMOD= 1
##$DC= 0
##$DFILT= <>
##$DTYPP= 0
##$F1P= 0
##$F2P= 0
##$FCOR= 1
##$FTSIZE= 16384
##$FT_mod= 6
##$GAMMA= 0
##$GB= 0
##$INTBC= 1
##$INTSCL= 3.70164e-10
##$ISEN= 128
##$LB= 0.24
##$LEV0= 0
##$LPBIN= 0
##$MAXI= 10000
##$MC2= 0
##$MEAN= 0
##$ME_mod= 0
##$MI= 1.114404
##$NCOEF= 0
##$NC_proc= -8
##$NLEV= 6
##$NOISF1= 3.799351
##$NOISF2= 2.8
##$NSP= 0
##$NTH_PI= 0
##$NZP= 0
##$OFFSET= 15.73697
##$PC= 1
##$PHC0= -21201.38
##$PHC1= 9.85272
##$PH_mod= 1
##$PKNL= yes
##$PPARMOD= 0
##$PSCAL= 0
##$PSIGN= 0
##$REVERSE= no
##$SF= 200.130006918466
##$SI= 16384
##$SIGF1= 3
##$SIGF2= 2
##$SINO= 5.538805
##$SIOLD= 16384
##$SREGLST= <1H.CDCl3>
##$SSB= 0
##$STSI= 16384
##$STSR= 0
##$SW_p= 3612.71676300578
##$SYMM= 0
##$S_DEV= 0
##$TDeff= 16384
##$TDoff= 0
##$TI= <>
##$TILT= no
##$TM1= 0
##$TM2= 0
##$TOPLEV= 0
##$USERP1= <user>
##$USERP2= <user>
##$USERP3= <user>
##$USERP4= <user>
##$USERP5= <user>
##$WDW= 1
##$XDIM= 16384
##$YMAX_p= 387477314
##$YMIN_p= -1349347
$$ End of Bruker specific parameters
$$ ---------------------------------
##NTUPLES= NMR SPECTRUM
##VAR_NAME=  FREQUENCY,     SPECTRUM/REAL,   SPECTRUM/IMAG
##SYMBOL=    X,             R,               I
##VAR_TYPE=  INDEPENDENT,   DEPENDENT,       DEPENDENT
##VAR_FORM=  AFFN,          ASDF,            ASDF
##VAR_DIM=   16384,         16384,           16384
##UNITS=     HZ,            ARBITRARY UNITS, ARBITRARY UNITS
##FACTOR=    0.220516191357247, 1,           1
##FIRST=     3149.4399045319, 0,             0
##LAST=      -463.276858473885, 0,           0
##MIN=       -463.276858473885, -1349347,    0
##MAX=       3149.4399045319, 387477314,     0
$$ Real data points
##PAGE= N=1
##DATA TABLE= (X++(R..R)), XYDATA
$$ [...]
$$ plain form
7213 -121700 369336 565302 913415 784673 216982 -14108 318098 408545 431931 544510
7203 544510 923642 978793 438594 -93458 138572 507648 436910 472595 831633 797391
7193 797391 469790 504336 281558 142665 39301 95606 574594 755850 680672 683246 500840
7182 500840 118360 -234606 -555950 -245444 300829 525416 677745 698490 370269 -8908
7172 -8908 -413317 -262022 -422099 -340946 20129 158481 306018 272058 277274 239704 -126222
7161 -126222 -370805 -442012 -127752 48071 526258 700769 623964 441700 239858 255134
7151 255134 64683 49048 -239814 -162160 139137 270511 324880 -23507 -96849 227730
7141 227730 118768 139868 98413 286597 197467 224036 -96426 74323 9281 -18735 -52911
$$ packed form
7213a21700M91036J95966L48113j28742n67691k31090L32206R0447K3386J12579
7203E44510L79132N5151n40199n32052K32030L69076p0738L5685L59038l4242
7193G97391l27601L4546k22778j38893j03364N6305M78988J81256p5178K574j82406
7182E00840l82480l52966l21344L10506N46273K24587J52329K0745l28221l79177
7172h908m04409J51295j60077Q1153L61075J38352J47537l3960N216l7570l65926
7161a26222k44583p1207L14260J75823M78187J74511p6805j82264k01842J5276
7151B55134j90451j5635k88862P7654L01297J31374N4369l48387p3342L24579
7141B27730j08962K1100m1455J88184q9130K6569l20462J70749o5042k8016l4176
$$ plain form
7130 -52911 -286637 -181876 -90138 -157229 -75181 197013 139417 136096 37210 -147763 -231452
7119 -231452 -165977 -360179 -247012 -217103 165282 156630 70078 48326 91895 -2215 -112704
7108 -112704 -148925 -34023 225950 402901 359120 372203 206502 99466 -129471 -246697
7098 -246697 -90573 95768 279456 578697 777632 713158 526358 474000 179491 179857 224966
7087 224966 238668 184966 123591 217451 312397 297171 264924 504493 323269 114799 -159807
7076 -159807 -248633 -432134 -354848 -114724 441476 633781 596462 377130 67165 -407604
7066 -407604 -569919 -732194 -502533 -98512 259364 624126 781403 287320 -362846 -353812
7056 -353812 -608481 -660008 -537520 34177 300501 403417 413039 332033 71012 -121593
$$ packed form
7130e2911k33726J04761R1738o7091Q2048K72194n7596l321r8886j84973q3689
7119b31452O5475j94202J13167K9909L82385q652q6552k1752M3569r4110j10489
7108a12704l6221J14902K59973J76951m3781J3083j65701j07036k28937j17226
7098b46697J56124J86341J83688K99241J98935o4474j86800n2358k94509L66M5109
7087B24966J3702n3702o1375R3860R4946j5226l2247K39569j81224k08470k74606
7076a59807q8826j83501P7286K40124N56200J92305l7319k19332l09965m74769
7066d07604j62315j62275K29661M04021L57876L64762J57277m94083o50166R034
7056c53812k54669n1527J22488N71697K66324J02916R622q1006k61021j92605
$$ plain form
7046 -121593 109512 -72087 -343795 -139397 190941 433775 439691 291369 417875 300457
7036 300457 188193 298271 309447 215803 27997 -338256 -181556 618 -23392 133544
7026 133544 352188 480661 418282 61435 42633 50829 -231332 -192782 126884 569275 745217
7015 745217 796279 691799 467343 86988 -337053 -537798 -240943 111726 350360 537746
7005 537746 749595 629704 454403 230026 -39173 -171120 -437738 60364 153116 83787
6995 83787 306940 571382 424677 213278 98727 132945 -44754 -250873 -255226 -70082
6985 -70082 -103270 -20686 545938 857241 781703 545231 435657 250034 73746 -184274
6975 -184274 -65822 316508 660562 574755 361172 563134 432387 -43197 -260899 -97878
$$ packed form
7046a21593K31105j81599k71708K04398L30338K42834N916j48322J26506j17418
7036C00457j12264J10078J1176r3644j87806l66253J56700J82174k4010J56936
7026A33544K18644J28473o2379l56847j8802Q196k82161L8550L19666M42391J75942
7015G45217N1062j04480k24456l80355m24041k00745K96855L52669K38634J87386
7005E37746K11849j19891j75301k24377k69199j31947k66618M98102R2752o9329
6995H3787K23153K64442j46705k11399j14551L4218j77699k06119m353J85144
6985g0082l3188Q2584N66624L11303p5538k36472j09574j85623j76288k58020
6975a84274J18452L82330L44054q5807k13583K01962j30747m75584k17702J63021
$$ plain form
6965 -97878 93882 -54453 288566 340571 165810 -148469 -205074 18107 57234 -69147
6955 -69147 315213 529516 384611 437006 639254 369195 385565 553774 647819 1011506
6945 1011506 749889 540710 42347 -274569 -115622 69821 164686 372665 174615 541852
6935 541852 689263 515060 580859 35923 -135332 257932 364880 437170 750182 910326
6925 910326 903498 862948 947267 586148 262726 115117 171755 373616 725732 962661 691177
6914 691177 484304 550102 544118 681239 591604 609659 1025969 1169464 1123302 1156386 1253773
6903 1253773 877844 789902 562160 443347 273696 541155 739478 435945 580762 541926
6893 541926 525306 253758 519954 327763 159533 324168 521131 707124 793678 813060
$$ packed form
6965i7878J91760j48335L43019N2005j74761l14279n6605K23181L9127j26381
6955f9147L84360K14303j44905N2395K02248k70059J6370J68209R4045L63687
6945A011506k61617k09179m98363l16916J58947J85443R4865K07979j98050L67237
6935E41852J47411j74203O5799n44936j71255L93264J06948P2290L13012J60144
6925I10326o828m0550Q4319l61119l23422j47609N6638K01861L52116K36929k71484
6914F91177k06873O5798n984J37121q9635J8055M16310J43495m6162L3084R7387
6903A253773l75929q7942k27742j18813j69651K67459J98323l03533J44817l8836
6893E41926j6620k71548K66196j92191j68230J64635J96963J85993Q6554J9382
$$ plain form
6883 813060 721219 647134 489376 579732 556230 746529 971954 1233148 1315407 1073980 864908
6872 864908 631386 358669 462439 626265 939717 1269289 1549018 1436725 1531047 1439652
6862 1439652 1001880 537628 480052 961413 1507936 1879264 2122273 2519223 2448539 2184725
6852 2184725 1864555 1154552 508839 406322 666040 1067110 1662764 1670955 1388452 995894
6842 995894 599235 449173 -269174 -349648 -10115 366151 844705 1109066 1249423 1207159
6832 1207159 779281 167354 -162358 -304168 -19043 227736 68558 263962 443866 641281
6822 641281 379415 259376 249950 -24547 -11376 125799 290115 431611 582210 846052
6812 846052 1218444 766324 363663 463935 474464 382686 175098 25721 143721 159811
$$ packed form
6883H13060r1841p4085j57758R0356k3502J90299K25425K61194Q2259k41427k09072
6872H64908k33522k72717J03770J63826L13452L29572K79729j12293R4322r1395
6862A439652m37772m64252n7576M81361N46523L71328K43009L96950p0684k63814
6852B184725l20170p10003o45713j02517K59718M01070N95654Q191k82503l92558
6842I95894l96659j50062p18347q0474L39533L76266M78554K64361J40357m2264
6832A207159m27878o11927l29712j41810K85125K46779j59178J95404J79904J97415
6822F41281k61866j20039r426k74497J3171J37175J64316J41496J50599K63842
6812H46052L72392m52120m02661J00272J0529r1778k07588j49377J18000J6090
$$ plain form
6802 159811 372011 691633 995306 914328 690712 365870 111674 277189 -156021 275061
6792 275061 825929 763208 572403 687732 588864 599293 313353 171086 488185 576727
6782 576727 189751 239955 703424 936990 455521 249700 338535 114516 189559 390252
6772 390252 499175 711359 287122 374713 677243 615266 514672 295737 522990 560004
6762 560004 257159 227402 587931 583630 95979 -151464 -161850 -82710 -106651 28382 416743
6751 416743 454186 404165 390017 629778 399095 -3153 -249446 -119830 65543 302931
6741 302931 442942 1039392 1135612 712136 224987 -3007 -340320 -524268 -244685 714219
6731 714219 994049 1291616 1150107 1091119 555427 -94876 -362845 -342160 -465463 -68353
$$ packed form
6802A59811K12200L19622L03673q0978k23616l24842k54196J65515m33210M31082
6792B75061N50868o2721j90805J15329r8868J0429k85940j42267L17099Q8542
6782E76727l86976N0204M63469K33566m81469k05821Q8835k24019P5043K00693
6772C90252J08923K12184m24237Q7591L02530o1977j00594k18935K27253L7014
6762E60004l02845k9757L60529m301m87651k47443j0386P9140k3941J35033L88361
6751D16743L7443n0021j4148K39761k30683m02248k46293J29616J85373K37388
6741C02931J40011N96450R6220m23476m87149k27994l37313j83948K79583R58904
6731G14219K79830K97567j41509n8988n35692o50303k67969K0685j23303L97110
$$ plain form
6721 -68353 567093 1084690 1352865 881634 566912 22559 -287481 -586607 -307800 557142
6711 557142 949070 1077136 1237159 1376905 604803 106183 -199200 -198217 -221612 133642
6701 133642 666538 1298515 1184199 536635 275324 179731 306747 147885 413279 937758
6691 937758 954614 400791 325799 431215 296422 200995 280254 514071 852545 755502 815389
6680 815389 307227 -234174 -551636 -511797 -53582 369732 976570 1586098 1462339 1412839
6670 1412839 521735 -282675 -353595 -351136 -183905 614891 1325380 1745269 1423038 1322179
6660 1322179 1078876 270644 -389092 -111537 441020 773840 935119 1359925 1390177 997165
6650 997165 521604 379766 92407 -337870 -144644 284017 940002 1140747 600099 751769
$$ packed form
6721f8353O35446N17597K68175m71231l14722n44353l10040k99126K78807Q64942
6711E57142L91928J28066J60023J39746p72102m98620l05383R83k3395L55254
6701A33642N32896O31977j14316o47564k61311r5593J27016j58862K65394N24479
6691I37758J6856n53823p4992J05416j34793r5427P9259K33817L38474r7043N9887
6680H15389n08162n41401l17462L9839M58215M23314O06838O09528j23759m9500
6670A412839q91104q04410p0920K459J67231P98796P10489M19889l22231j00859
6660A322179k43303q08232o59736K77555N52557L32820J61279M24806L0252l93012
6650I97165m75561j41838k87359m30277J93226M28661O55985K00745n40648J51670
$$ plain form
6640 751769 725150 213237 48585 533309 645152 661665 675929 477722 440404 222718
6630 222718 -14875 104703 474011 595893 589857 633247 733947 764794 284718 80797
6620 80797 76989 -116151 -32917 617229 1127720 1228913 1164098 952995 595664 75872 -363261
6609 -363261 -222989 162282 234740 676355 1217022 1660152 1355382 785650 297236 -58384
6599 -58384 -642536 -637468 -33772 863691 1511588 1564049 1552714 1343635 360147 -453539 -547065
6588 -547065 -266662 -219473 460358 1162153 1633626 1435480 633524 -52428 -245016 -370502
6578 -370502 -83521 371058 857899 1066436 1209830 1178754 1079257 807928 688716 893825
6568 893825 812642 769304 450569 343134 413589 889643 639837 790473 1119980 924183
$$ packed form
6640G51769k6619n11913j64652M84724J11843J6513J4264j98207l7318k17686
6630B22718k37593J19578L69308J21882o036M3390J00700L0847m80076k03921
6620H0797l808j93140Q3234O50146N10491J01193o4815k11103l57331n19792m39133
6609c63261J40272L85271P2458M41615N40667M43130l04770n69732m88414l55620
6599e8384n84152N068O03696Q97463O47897N2461j1335k09079r83488q13686r3526
6588e47065K80403M7189O79831P01795M71473j98146q01956o85952j92588j25486
6578c70502K86981M54579M86841K08537J43394l1076r9497k71329j19212K05109
6568H93825q1183m3338l18735j07435P0455M76054k49806J50636L29507j95797
$$ plain form
6558 924183 810764 554976 504894 358723 118531 283553 762622 1234671 1442721 1632583
6548 1632583 1457201 1023218 724446 494875 414191 429459 417608 556417 898476 1044229
6538 1044229 967499 975677 1237097 983805 489647 165740 443275 805942 809622 842517 763067
6527 763067 958012 1027770 853400 947418 601508 487429 318547 141347 197775 754300
6517 754300 1192279 1671710 1574249 1475760 996750 482924 389073 357752 312815 730446 1283444
6506 1283444 1626871 1491972 1307729 915685 579556 382832 308361 631186 939401 1264369
6496 1264369 1123962 1039974 929053 743746 579605 411328 544883 544531 607092 965723
6486 965723 878613 660873 513089 894166 667704 340707 561982 936682 968422 1035030
$$ packed form
6558I24183j13419k55788n0082j46171k40192J65022M79069M72049K08050J89862
6548A632583j75382m33983k98772k29571q0684J5268j1851J38809L42059J45753
6538A044229p6730Q178K61420k53292m94158l23907K77535L62667L680L2895p9450
6527G63067J94945O9758j74370R4018l45910j14079j68882j77200N6428N56525
6517G54300M37979M79431r7461r8489m79010n13826r3851l1321m4937M17631N52998
6506A283444L43427j34899j84243l92044l36129j96724p4471L22825L08215L24968
6496A264369j40407q3988j10921j85307j64141j68277J33555l52O2561L58631
6486I65723q7110k17740j47784L81077k26462l26997K21275L74700L1740O6608
$$ plain form
6476 1035030 1178111 1317560 899407 808502 694890 911772 1246802 1222234 985128 1002203
6466 1002203 1017636 689449 433247 647725 986913 1072230 830515 988992 1092218 909954
6456 909954 895020 977545 1352925 1421807 1045622 1079398 1245379 958997 938932 1099730 1227235
6445 1227235 1214390 1199193 1503964 1718363 1417816 867746 862868 903502 842529 753589 1196274
6434 1196274 1259879 1211180 1106785 1087861 1005226 782418 790025 1239612 1597557 1435092 1357307
6423 1357307 1244565 913775 597404 740727 1003714 1426385 1460725 1376016 1349085 1102102
6413 1102102 1050391 766421 756173 996961 908152 952701 1431833 1694816 1503996 1109611
6403 1109611 911002 916583 923326 1115985 1668349 1967845 1939610 1578746 1203774 904412
$$ packed form
6476A035030J43081J39449m18153r0905j13612K16882L35030k4568k37106J7075
6466A002203J5433l28187k56202K14478L39188Q5317k41715J58477J03226j82264
6456I09954j4934Q2525L75380O8882l76185L3776J65981k86382k0065J60798J27505
6445A227235j2845j5197L04771K14399l00547n50070m878M0634o0973q8940M42685
6434A196274O3605m8699j04395j8924q2635k22808P607M49587L57945j62465p7785
6423A357307j12742l30790l16371J43323K62987M22671L4340q4709k6931k46983
6413A102102n1711k83970j0248K40788q8809M4549M79132K62983j90820l94385
6403A109611j98609N581O743J92659N52364K99496k8235l60864l74972k99362
$$ plain form
6393 904412 609772 695412 1145138 1487090 1670694 1938929 2362521 1911933 1291819 1231378
6383 1231378 1176261 1456716 1207426 1257710 1346490 1759026 1819068 1505764 1101938 1111412 1009931
6372 1009931 1002264 1361649 1669688 1484018 1317638 1537297 1691655 1404110 1416413 1627822
6362 1627822 1757441 1576639 1326833 1469027 1636619 1598648 1605517 1660143 1706499 1662241 1540447
6351 1540447 1339735 1461455 1519491 1544767 1643341 1562905 1636960 1459087 1667752 1383981
6341 1383981 1563387 1653224 1609558 2042514 2106163 2169494 2317700 2586582 2305895 2017224
6331 2017224 2098386 2118937 2089384 2215148 2196773 2287507 2182632 2154095 1726977 1479357 1696064
6320 1696064 1843363 1513887 1689720 1778453 1844263 1752947 1515218 1648927 1752854 1576116
$$ packed form
6393I04412k94640Q5640M49726L41952J83604K68235M23592m50588o20114o0441
6383A231378n5117K80455k49290N0284Q8780M12536O0042l13304m03826R474j01481
6372A009931p667L59385L08039j85670j66380K19659J54358k87545J2303K11409
6362A627822J29619j80802k49806J42194J67592l7971O869N4626M6356m4258j21794
6351A540447k00712J21720N8036K5276R8574q0436P4055j77873K08665k83771
6341A383981J79406Q9837m3666M32956O3649O3331J48206K68882k80687k88671
6331B017224Q1162K0551k9553J25764j8375R0734j04875k8537m27118k47620K16707
6320A696064J47299l29476J75833Q8733O5810r1316k37729J33709J03927j76738
$$ plain form
6310 1576116 1519096 1671109 1783582 1671243 1666637 1736328 2083373 1612420 1423593 1391646
6300 1391646 1342829 1600139 1730256 2238774 2387324 1981424 1786339 1780162 1520592 1411222
6290 1411222 1411786 2126234 2223923 2151234 2088768 2250581 2155475 1717278 1330100 1793852 1996478
6279 1996478 2194634 2061732 2492799 2549458 1975091 1937672 1779027 1843037 1892439 1922660
6269 1922660 2457831 2766756 2723021 2543523 2731129 2445675 2049356 1707002 1975764 2324134
6259 2324134 2341056 2167732 2441023 2576422 2005163 1894162 2060244 1973080 1965060 2174894
6249 2174894 2521152 2684890 2364161 2093787 2271518 2252053 1840688 1930612 2196928 2426788
6239 2426788 2473318 2456240 2441289 2253466 1750042 1842665 2209344 2074976 2392840 2487944
$$ packed form
6310A576116n7020J52013J12473j12339m606O9691L47045m70953j88827l1947
6300A391646m8817K57310J30117N08518J48550m05900j95085o177k59570j09370
6290A411222N64P14448R7689p2689o2466J61813r5106m38197l87178M63752K02626
6279A996478J98156j32902M31067N6659n74367l7419j58645O4010M9402L0221
6269A922660N35171L08925m3735j79498J87606k85454l96319l42354K68762L48370
6259B324134J6922j73324K73291J35399n71259j11001J66082q7164q020K09834
6249B174894L46258J63738l20729k70374J77731j9465m11365Q9924K66316K29860
6239B426788M6530j7078j4951j87823n03424R2623L66679j34368L17864R5104
$$ plain form
6229 2487944 2324583 2272065 1678012 1550169 1889330 2270282 2066040 2177815 2465373 2649555
6219 2649555 2285191 1827254 1836365 1936209 1971847 2076786 2270844 2835756 2764010 2491693
6209 2491693 2691808 2439161 1958069 1549829 1991347 2363763 2574575 2635479 3351926 3571100
6199 3571100 2618937 1983146 1716860 1854628 1954685 2046228 2490699 3097746 3486148 3172088
6189 3172088 2844486 2782987 2268744 1910397 2074227 2785389 3168045 2975911 3181446 3287235
6179 3287235 3246796 2801751 2341811 2497006 2399486 2382309 2693105 2892298 2737338 2584286
6169 2584286 2557303 2765586 2598292 2310813 2354172 2663883 2650573 2453083 2463214 2980192
6159 2980192 3018284 3148378 3292355 3248897 3036683 2647020 2386277 2407582 2394070 2299653
$$ packed form
6229B487944j63361n2518n94053j27843L39161L80952k04242J11775K87558J84182
6219B649555l64364m57937R111R9844L5638J04939J94058N64912p1746k72317
6209B491693K00115k52647m81092m08240M41518L72416K10812O0904P16447K19174
6199C571100r52163o35791k66286J37768J00057R1543M44471O07047L88402l14060
6189C172088l27602o1499n14243l58347J63830P11162L82656j92134K05535J05789
6179C287235m0439m45045m59940J55195r7520j7177L10796J99193j54960j53052
6169B584286k6983K08283j67294k87479M3359L09711j3310j97490J0131N16978
6159B980192L8092J30094J43977m3458k12214l89663k60743K1305j3512r4417
$$ plain form
6149 2299653 2644922 3249840 3522260 3242489 3180962 3285399 2766336 2375146 2237658 2400870
6139 2400870 2461497 2656216 3122660 3244262 3115395 2783978 2998565 2967969 2831192 2994037
6129 2994037 3064510 3083379 3109866 3085295 3152381 2993171 3119662 3053985 3468121 3549221 3452501
6118 3452501 3510498 3099431 3028871 3195636 3392253 3464458 3463318 3694013 3946038 3957578 3610583
6107 3610583 3448433 3232359 3234478 3446258 3717898 3828866 3915378 4155117 4019426 4133656
6097 4133656 4207320 4064800 4162028 4113808 4033214 3947159 4192210 4786462 4740802 4654653 4711830
6086 4711830 4838098 4782293 4674515 4843794 5113795 5402908 5533912 5909717 6504238 6503276
6076 6503276 6245679 6114873 6248172 6137756 5868509 5943932 6270181 6153965 6102973 6387264
$$ packed form
6149B299653L45269O04918K72420k79771o1527J04437n19063l91190j37488J63212
6139B400870O0627J94719M66444J21602j28867l31417K14587l0596j36777J62845
6129B994037P0473J8869K6487k4571O7086j59210J26491o5677M14136Q1100r6720
6118C452501N7997m11067p0560J66765J96617P2205j140K30695K52025J1540l46995
6107C610583j62150k16074K119K11780K71640J10968Q6512K39739j35691J14230
6097D133656P3664j42520R7228m8220q0594q6055K45051N94252m5660q6149N7177
6086D711830J26268n5805j07778J69279K70001K89113J31004L75805N94521r62
6076F503276k57597j30806J33299j10416k69247P5423L26249j16216n0992K84291
$$ plain form
6066 6387264 6812012 6946145 6587491 6457257 6579641 6954198 6969481 7371515 7915812 8318302
6056 8318302 8308270 8570444 9034547 9441614 9764234 10286194 11106694 11640687 12078793 12354896
6046 12354896 12443151 12545722 12586344 12494052 12047838 11458251 10940995 10475131 10092486 9788510
6036 9788510 9568138 9836627 10247814 10243138 10391026 10511482 10802716 10733280 11006048 11442796
6026 11442796 12306137 13046676 13466486 14279561 15277255 16180805 16705801 16666762 16783203 16774531
6016 16774531 16217820 15612013 14857094 13431174 12417979 11666277 11278768 10944405 10615246
6007 10615246 10600909 10593612 10417801 10032806 10143767 10224759 10297961 10376420 10757640 11388883
5997 11388883 12029240 12376825 12785281 13416222 13615461 13505282 13474402 13624561 13437049 12814612
$$ packed form
6066F387264M24748J34133l58654j30234J22384L74557J5283M02034N44297M02490
6056H318302j0032K62174M64103M07067L22620N21960Q20500N33993M38106K76103
6046A2354896Q8255J02571M0622r2292m46214n89587n17256m65864l82645l03976
6036I788510k20372K68489M11187m676J47888J20456K91234o9436K72768M36748
6026A1442796Q63341P40539M19810Q13075R97694R03550N24996l9039J16441q672
6016A6774531n56711o05807p54919j425920j013195p51702l87509l34363l29159
6007A0615246j4337p297j75811l84995J10961Q0992P3202P8459L81220O31243
5997A1388883O40357L47585M08456O30941J99239j10179l0880J50159j87512o22437
$$ plain form
5987 12814612 12278073 11777247 10990708 10065680 9154755 8790387 8777690 8293947 8215640 8553870
5977 8553870 8906013 8923052 8690641 8121139 8086220 8032182 7892573 8188870 8642727 9071183
5967 9071183 9273487 9054187 8880216 8803933 8602616 8674718 8713869 8488278 8533492 8459097
5957 8459097 8202583 8292170 7901949 7655628 7756456 7513180 7792172 7807075 7866721 7620790
5947 7620790 7233645 6924924 6326128 6286231 6430686 6446751 6531126 6721669 6728048 6646041 6131260
5936 6131260 5775369 5714726 5740860 5823830 6048889 6295607 5978041 6093035 6170974 6062169
5926 6062169 5820216 5343801 5488631 5685516 5565976 5954484 6174144 5837209 5693578 5655283
5916 5655283 5715790 5753673 5638649 5910525 6143417 6235174 6014477 5901020 5750262 5749617 5871493
$$ packed form
5987A2814612n36539n00826p86539r25028r10925l64368j2697m83743p8307L38230
5977H553870L52143J7039k32411n69502l4919n4038j39609K96297M53857M28456
5967I071183K02304k19300j73971p6283k01317P2102L9151k25591M5214p4395
5957H459097k56514Q9587l90221k46321J00828k43276K78992J4903N9646k45931
5947G620790l87145l08721n98796l9897J44455J6065Q4375J90543O379q2007n14781
5936F131260l55891o0643K6134Q2970K25059K46718l17566J14994P7939j08805
5926F062169k41953m76415J44830J96885j19540L88508K19660l36935j43631l8295
5916E655283O0507L7883j15024K71876K32892R1757k20697j13457j50758o45J21876
$$ plain form
5905 5871493 5939258 6237258 6128335 5985338 5968490 5830142 5736568 5486730 5439805 6112041
5895 6112041 6246770 6549248 6751292 6629760 6418392 6190108 5645589 5582847 5643848 6030071
5885 6030071 6464297 6777355 6999519 7309830 7070271 6443597 5866399 5408650 5507205 5950194
5875 5950194 6273400 6480992 7010890 7290254 7076374 6495361 5933578 5751098 5748057 6001538
5865 6001538 6054521 6446768 7006460 7443330 7341975 6925892 6722125 6418638 6100476 6100303
5855 6100303 6466192 6697844 7036932 7368306 7398979 6960335 6639638 6587057 6322527 6201074
5845 6201074 6525285 6720644 7108513 7403676 7363802 7067030 7029148 6628289 6330636 6409998
5835 6409998 6894223 6862864 7011482 7099069 6984162 7243200 7212579 7374500 7407817 7387644
$$ packed form
5905E871493O7765K98000j08923j42997j6848j38348r3574k49838m6925O72236
5895F112041J34729L02478K02044j21532k11368k28284n44519o2742O1001L86223
5885F030071M34226L13058K22164L10311k39559o26674n77198m57749R8555M42989
5875E950194L23206K07592N29898K79364k13880n81013n61783j82480l041K53481
5865F001538N2983L92247N59692M36870j01355m16083k03767l03487l18162j73
5855F100303L65889K31652L39088L31374L0673m38644l20697n2581k64530j21453
5845F201074L24211J95359L87869K95163l9874k96772l7882m00859k97653P9362
5835F409998M84225l1359J48618Q7587j14907K59038l0621J61921L3317k0173
$$ plain form
5825 7387644 7147258 7280539 7317318 7430044 7371766 7286103 7430502 7572084 7953415 8017198
5815 8017198 8136322 7950364 7535565 7104052 7218848 7480110 7602601 7821167 8249393 8616602
5805 8616602 8699089 8408048 8327142 8419630 8232506 7956225 7916400 7997757 7919297 8180116 8092251
5794 8092251 7827945 7709445 7618722 7743002 7977057 7963150 8136501 8298970 8327336 8260582
5784 8260582 8118107 8093964 8011891 8175956 8347670 8319978 8358210 8072370 8015029 8147191
5774 8147191 7957933 7943931 7987668 8413281 8739153 8671391 8566053 8205932 7985028 8020213
5764 8020213 7846651 8142228 8550956 8965177 9181055 9183408 9052728 8589881 7953530 7769355
5754 7769355 7952740 8356207 8533485 8964009 9365715 9112885 8486483 7951937 8236170 8204142
$$ packed form
5825G387644k40386J33281L6779J12726n8278q5663J44399J41582L81331O3783
5815H017198J19124j85958m14799m31513J14796K61262J22491K18566M28226L67209
5805H616602Q2487k91041q0906R2488j87124k76281l9825Q1357p8460K60819q7865
5794H092251k64306j18500r0723J24280K34055j3907J73351J62469K8366o6754
5784H260582j42475k4143q2073J64065J71714k7692L8232k85840n7341J32162
5774H147191j89258j4002M3737M25613L25872o7762j05338l60121k20904L5185
5764H020213j73562K95577M08728M14221K15878K353j30680m62847o36351j84175
5754G769355J83385M03467J77278M30524M01706k52830o26402n34546K84233l2028
$$ plain form
5744 8204142 8234577 8418243 9076000 9512604 9058124 8941235 8879597 8617565 8330666 8389790
5734 8389790 8932994 9070536 9041253 9535309 9568407 9285762 9043195 8825932 9009569 9291827
5724 9291827 9471841 9738615 10108223 10113167 9530873 9061629 9002478 9084842 8922825 8920664 9290396
5713 9290396 9670319 9682428 9312110 9304104 9054774 9045256 8758572 8851688 9004914 9257923 9282901
5702 9282901 9650264 10106572 10027735 9792873 9740022 9761299 9619863 9426947 9698161 10440586
5692 10440586 10569147 10687990 11166578 10994287 10450805 9831752 9563568 9801092 9645906
5683 9645906 9958383 10564383 11263545 10939594 10666363 10551362 10000005 9477956 9160286 9339685
5673 9339685 9876795 10185374 10564100 10798612 10864350 10091878 9535237 9463853 9756746 9625942
$$ packed form
5744H204142L0435J83666O57757M36604m54480j16889o1638k62032k86899N9124
5734H389790N43204J37542k9283M94056L3098k82645k42567k17263J83637K82258
5724I291827J80014K66774L69608M944n82294m69244n9151Q2364j62017k161L69732
5713I290396L79923J2109l70318q006k49330r518k86684R3116J53226K53009K4978
5702I282901L67363M56308p8837k34862n2851K1277j41436j92916K71214P42425
5692A0440586J28561J18843M78588j72291n43482o19053k68184K37524j55186
5683I645906L12477O06000O99162l23951k73231j15001n51357n22049l17670J79399
5673I339685N37110L08579L78726K34512O5738p72472n56641p1384K92893j30804
$$ plain form
5663 9625942 9407806 9815409 10110667 10222222 9692225 9547620 9822972 9794993 9854394 10306017
5653 10306017 10336435 10062503 9595571 9693150 9940483 9916564 9751233 10087588 10702014 10421162
5643 10421162 9898206 9795051 9932229 10049268 9660399 10074102 11027195 11176579 11093445 10901907
5633 10901907 10836949 10563493 9922422 9700339 9798860 10225260 10501128 11068405 11691658 11391965
5623 11391965 10677128 10104853 10155882 10281197 10459705 10880381 11509522 11597477 11394401 11191259
5613 11191259 10989480 10667857 10457044 10612742 11299310 11884876 11845680 12064153 12142033 11972551
5603 11972551 11330958 11271714 11881144 11922838 12048903 12583920 13105728 13151769 12800758 12864718
5593 12864718 13374883 13795458 13742536 14106594 14618827 14924775 14711428 14521994 14393457 14433243
$$ packed form
5663I625942k18136M07603K95258J11555n29997j44605K75352k7979N9401M51623
5653A0306017L0418k73932m66932R7579K47333k3919j65331L36355O14426k80852
5643A0421162n22956j03155J37178J17039l88869M13703R53093J49384q3134j91538
5633A0901907o4958k73456o41071k22083R8521M26400K75868N67277O23253k99693
5623A1391965p14837n72275N1029J25315J78508M20676O29141Q7955k03076k03142
5613A1191259k01779l21623k10813J55698O86568N85566l9196K18473P7880j69482
5603A1972551o41593n9244O09430M1694J26065N35017N21808M6041l51011O3960
5593A2864718N10165M20575n2922L64058N12233L05948k13347j89434j28537L9786
$$ plain form
5583 14433243 14189426 14067035 13996298 13892667 13442824 13010363 13048661 13024198 12724180 12704176
5573 12704176 12931080 12906802 12625863 12171616 12148741 11882185 11778570 11774187 12015034 12281074
5563 12281074 12376754 12416676 12627969 12373251 12062758 11845753 12037906 12323020 12638284 13240142
5553 13240142 13738761 14145393 14067263 13597845 13070202 12853832 12354157 12150992 12527783 12779204
5543 12779204 12704585 12441639 12376810 12448545 12254054 12082876 12180214 12179883 12120949 11876251 12324264
5532 12324264 12720396 12703701 12692304 12775597 12723513 12635443 12233085 12157490 12501642 12907058
5522 12907058 12892636 13151469 13655500 13888839 13527291 13374055 13294756 13144530 13202702 13334785
5512 13334785 13539621 13750486 13770172 14278658 14741145 14779613 14786240 14457912 14518245 14807846
$$ packed form
5583A4433243k43817j22391p0737j03631m49843m32461L8298k4463l00018k0004
5573A2704176K26904k4278k80939m54247k2875k66556j03615m383K40847K66040
5563A2281074R5680L9922K11293k54718l10493k17005J92153K85114L15264O01858
5553A3240142M98619M06632p8130m69418n27643k16370m99675k03165L76791K51421
5543A2779204p4619k62946o4829P1735j94491j71178R7338l31n8934k44698M48013
5532A2324264L96132j6695j1397Q3293n2084q8070m02358p5595L44152M05416
5522A2907058j4422K58833N04031K33339l61548j53236p9299j50226N8172J32083
5512A3334785K04836K10865J9686N08486M62487L8468O627l28328O0333K89601
$$ plain form
5502 14807846 15312287 16187512 17301834 18471029 19956557 21189706 20929848 19623489 18096326
5493 18096326 16622449 15993374 15812476 15966889 16052406 16464277 16392915 15863304 15579171 15389506
5483 15389506 15192439 15224200 15602354 16198528 17055812 17765143 18084672 18493935 18597762 18755276
5473 18755276 19086186 20189351 21684363 23590024 25981366 28757251 31624391 34809543
5465 34809543 37055227 35480992 31870385 27938488 24930306 23558165 22586653 21783948
5457 21783948 21128038 20661150 19989989 19676351 19017652 18818486 19442015 20055669 20459639
5448 20459639 20800056 21319841 21937373 21741007 21750025 22446196 23270572 24307445 25511583
5439 25511583 27332677 29017485 31111515 33747153 36611138 39934463 42167013 40424920
$$ packed form
5502A4807846N04441Q75225J114322J169195J485528J233149k59858j306359j527163
5493A8096326j473877o29075j80898J54413Q5517M11871p1362n29611k84133j89665
5483A5389506j97067L1761L78154N96174Q57284P09331L19529M09263J03827J57514
5473A8755276L30910J103165J495012J905661K391342K775885K867140L185152
5465C4809543K245684j574235l610607l931897l008182j372141r71512q02705
5457B1783948o55910m66888o71161l13638o58699j99166O23529O13654M03970
5448B0459639L40417N19785O17532j96366R018O96171Q24376J036873J204138
5439B5511583J821094J684808K094030K635638K863985L323325K232550j742093
$$ plain form
5431 40424920 36797255 33303797 30953208 29604611 28575240 27873350 27392674 26845072 26473326
5422 26473326 26587997 26616295 26905110 27609646 28465747 29053566 29453901 29914067 30686432 31314066
5412 31314066 31937982 32942172 34022070 35222478 36350633 37807405 39530718 41186780
5404 41186780 43112059 45603839 48415331 50380738 51185173 52388831 54166338 56035646
5396 56035646 58579750 62104684 66095282 70580897 75553777 81978393 89456761 97431812
5388 97431812 106142073 115521048 124770506 133637512 141971351 149537530 157692158 165428398
5380 165428398 172449206 177462608 178359439 174145200 166090100 156103433 145312149 134390857
5372 134390857 123731009 113001087 102064001 91370605 81459347 72548464 64796741
$$ packed form
5431D0424920l627665l493458k350589j348597j029371p01890m80676n47602l71746
5422B6473326J14671K8298K88815P04536Q56101N87819M00335M60166P72365O27634
5412C1314066O23916J004190J079898J200408J128155J456772J723313J656062
5404D1186780J925279K491780K811492J965407Q04435J203658J777507J869308
5396E6035646K544104L524934L990598M485615M972880O424616P478368P975051
5388I7431812Q710261R378975R249458Q867006Q333839P566179Q154628P736240
5380A65428398P020808N013402Q96831m214239q055100r986667j0791284j0921292
5372A34390857j0659848j0729922j0937086j0693396r911258q910883p751723
$$ plain form
5365 64796741 58085086 52762433 48234310 44510337 41520235 39061035 36765247 34570928
5357 34570928 32624246 30497764 28729430 27562715 26445599 25240887 24371543 23674240
5349 23674240 22926383 22043116 21461924 20589503 20111230 19217197 18617455 18507675 17997627
5340 17997627 17558797 17637336 17440048 17114982 16690075 16463745 16297990 15928332 15697789 15585620
5330 15585620 15590361 15942752 15811967 15679244 15531926 15044624 14634274 14144565 13966329 14063291
5320 14063291 13975344 13965402 14290617 14248758 13935457 13510193 13203613 13251000 13182746 13213512 13503783
5309 13503783 13949775 14081063 13577334 13124329 12846522 12188042 11913128 11806119 11946021
5300 11946021 12570997 12532923 12631460 12725486 12599632 12245154 12054860 12415795 12538597 12673381
$$ packed form
5365F4796741o711655n322653m528123l723973k990102k459200k295788k194319
5357C4570928j946682k126482j768334j166715j117116j204712q69344o97303
5349B3674240p47857q83267n81192q72421m78273q94033n99742j09780n10048
5340A7997627m38830P8539j97288l25066m24907k26330j65755l69658k30543j12169
5330A5585620M741L52391j30785j32723j47318m87302m10350m89709j78236R6962
5320A4063291q7947r942L25215m1859l13301m25264l06580M7387o8254L0766K90271
5309A3503783M45992J31288n03729m53005k77807o58480k74914j07009J39902
5300A1946021O24976l8074R8537R4026j25854l54478j90294L60935J22802J34784
$$ plain form
5290 12673381 12970612 13191417 13513789 13538015 13641597 13747738 13842292 13761552 13830221 13833703
5280 13833703 13733897 13466471 13332963 13272268 13130767 13013655 12847176 13016706 13269321 13207532
5270 13207532 13232487 12753263 12706805 12752723 12858173 13269694 13726477 13959579 14043537 14153458
5260 14153458 14507987 14846850 15141979 15670837 16099680 16738291 16957753 17593934 18355305
5251 18355305 19214706 20111091 21052485 22180761 22923977 23491445 24056801 23837733 23191853
5242 23191853 22797927 22634667 22519683 22399564 22411170 22301976 22436182 21795588 21348695 21235796
5232 21235796 21377774 21629490 21785440 22466826 23376958 24657422 25595162 26934861 28651652
5223 28651652 31019669 33991064 37781538 42581444 48615058 50740374 47656954 43803557
$$ packed form
5290A2673381K97231K20805L22372K4226J03582J06141R4554q0740O8669L482
5280A3833703r9806k67426j33508o0695j41501j17112j66479J69530K52615o1789
5270A3207532K4955m79224m6458M5918J05450M11521M56783K33102Q3958J09921
5260A4153458L54529L38863K95129N28858M28843O38611K19462O36181P61371
5251A8355305Q59401Q96385R41394J128276P43216N67468N65356k19068o45880
5242B3191853l93926j63260j14984j20119J1606j09194J34206o40594m46893j12899
5232B1235796J41978K51716J55950O81386R10132J280464R37740J339699J716791
5223B8651652K368017K971395L790474M799906O033614K125316l083420l853397
$$ plain form
5215 43803557 40006762 37172172 35702674 35030048 34227824 33558227 33271551 32809198 32281108
5206 32281108 32158628 31741914 31021549 29975222 28576821 26766352 24853011 23369348 21695050
5197 21695050 20289481 19331570 18537940 18359430 18371317 18254198 18118855 18093995 17989484 17808945
5187 17808945 17965544 18638250 19388646 20229205 20629929 21143461 21132485 20892657 20581943 20581035
5177 20581035 20797603 20713853 20638313 20636744 19992746 18809653 17382744 15806206 14138625
5168 14138625 12519584 11495491 10678588 10294026 9730194 9454631 9493224 9496812 8941926 8200770
5158 8200770 7687415 7678857 7504821 7544559 7837059 7836412 7588391 7500716 7132641 6717779 6522795
5147 6522795 5960107 6027587 6722472 6587580 6785930 6619358 6268556 5881593 5403063 5280086
$$ packed form
5215D3803557l796795k834590j469498o72626q02224o69597k86676m62353n28090
5206C2281108j22480m16714p20365j046327j398401j810469j913341j483663j674298
5197B1695050j405569r57911p93630j78510J1887j17119j35343k4860j04511j80539
5187A7808945J56599O72706P50396Q40559M00724N13532j0976k39828l10714r08
5177B0581035K16568q3750p5540j569o43998j183093j426909j576538j667581
5168A4138625j619041j024093q16903l84562n63832k75563L8593L588n54886p41156
5158H200770n13355q558j74036L9738K92500o47k48021q7675l68075m14862j94984
5147F522795n62688O7480O94885j34892J98350j66572l50802l86963m78530j22977
$$ plain form
5137 5280086 5529960 5543197 5605116 5896490 6174718 6173987 5382957 5002631 4742351 4715590 4901122
5126 4901122 5446084 5779782 5732694 5493318 5346832 4910272 4468826 4567761 4907867 5013496
5116 5013496 5310956 5695745 6019442 6062365 5417654 4940019 4981247 4794409 4440078 4796451
5106 4796451 5442040 5740133 5702791 5538270 5344397 5105970 4819226 5082255 5133061 5241603
5096 5241603 5269696 5051823 5384233 5198667 4962479 5097680 5189921 5865132 6122682 6046541
5086 6046541 6056433 6091541 5761511 5407374 5738964 6294882 6328391 6187631 6599336 6680950
5076 6680950 6444900 6165940 6336658 6292334 6136643 6060046 6411380 6543767 6511460 6551813
5066 6551813 6527749 6457096 5984456 5680901 5704400 5789496 5732547 5695027 6033888 6601752 6704100
$$ packed form
5137E280086K49874J3237O1919K91374K78228p31p91030l80326k60280k6761J85532
5126D901122N44962L33698m7088k39376j46486m36560m41446R8935L40106J05629
5116E013496K97460L84789L23697M2923o44711m77635M1228j86838l54331L56373
5106D796451O45589K98093l7342j64521j93873k38427k86744K63029N0806J08542
5096E241603K8093k17873L32410j85566k36188J35201R2241O75211K57550p6141
5086F046541R892L5108l30030l54137L31590N55918L3509j40760M11705Q1614
5076F680950k36050k78960J70718m4324j55691p6597L51334J32387l2307M0353
5066F551813k4064p0653m72640l03555K3499Q5096n6949l7520L38861N67864J02348
$$ plain form
5055 6704100 6565709 6786828 6626741 5903310 5359948 5424272 5842066 6440098 7008685 7607562
5045 7607562 7859433 7496096 7117809 6542567 6221095 6199856 6371841 7110194 7785168 8003473
5035 8003473 7792084 7657938 7399001 6718600 6268802 6374200 6598383 6737604 7499149 8153881
5025 8153881 8437662 8473329 8329795 8389858 8345182 8117071 7774487 8007222 8522254 8514483
5015 8514483 8493545 8604001 8581950 8742146 8783490 8760265 8962863 9085943 9152674 9416573
5005 9416573 9665434 9561211 9699407 10296940 10658011 11173743 11635298 12016139 12529551 12481723
4995 12481723 12477805 12998370 13760873 14983893 16008002 16947722 18266458 19640403 20854336
4986 20854336 21926668 23258464 24037461 24601443 24966958 24941137 24701998 23963811 23702827
$$ packed form
5055F704100j38391K21119j60087p23431n43362O4324M17794N98032N68587N98877
5045G607562K51871l63337l78287n75242l21472k1239J71985P38353O74974K18305
5035H003473k11389j34146k58937o80401m49798J05398K24183J39221P61545O54732
5025H153881K83781L5667j43534O0063m4676k28111l42584K32735N15032p771
5015H514483k0938J10456k2051J60196M1344k3225K02598J23080O6731K63899
5005I416573K48861j04223J38196N97533L61071N15732M61555L80841N13412m7828
4995A2481723l918N20565P62503J223020J024109R39720J318736J373945J213933
4986B0854336J072332J331796P78997N63982L65515k5821k39139p38187k60984
$$ plain form
4977 23702827 23344500 22721922 21944068 21509724 21290131 20924614 20399604 20274667 20509395
4968 20509395 20792691 21129047 21328696 21498439 21915151 22548173 23384454 24693250 26036410
4959 26036410 27310648 28627804 29775949 30309720 30157345 29975473 29972742 29627844 29269409
4950 29269409 29232736 29124617 28929243 28755822 27958506 27254236 26791970 26800519 26303751 26233657
4940 26233657 25635437 24686398 23719196 22311194 20876839 19737348 18955595 18569139 18478310
4931 18478310 18432177 18340905 18206872 18268637 18328330 18427731 18483691 18823513 19309304 19721981
4921 19721981 20191756 20557436 20588036 20532245 20765522 21006542 20849244 20158546 19411424 18172539
4911 18172539 17294356 16481473 15550503 14988917 14151419 13561953 12739536 12038552 11635476
$$ packed form
4977B3702827l58327o22578p77854m34344k19593l65517n25010j24937K34728
4968B0509395K83296L36356J99649J69743M16712O33022Q36281J308796J343160
4959B6036410J274238J317156J148145N33771j52375j81872k731l44898l58435
4950B9269409l6673j08119j95374j73421p97316p04270m62266Q549m96768p0094
4940B6233657n98220r49039r67202j408002j434355j139491p81753l86456r0829
4931A8478310m6133r1272j34033O1765N9693R9401N5960L39822M85791M12677
4921A9721981M69775L65680L0600n5791K33277K41020j57298o90698p47122j238885
4911A8172539q78183q12883r30970n61586q37498n89466q22417p00984m03076
$$ plain form
4902 11635476 11136326 10833990 10676092 10689421 10928735 10973468 11130939 10976445 10632639 10410375
4892 10410375 10062894 10044960 9879888 9774279 10094079 10723829 11117835 11195147 11556798 11179988
4882 11179988 10888652 10465645 10517815 10750385 10849700 11352324 11827953 12240418 12045459 11554778
4872 11554778 11005852 10569977 10030433 9933211 10055107 10509299 11014246 11513112 12132477 12092017
4862 12092017 11893750 11279219 10667804 10148651 10241681 10484407 10908163 11347177 11683435 11536655
4852 11536655 11309777 10976374 10718347 10544639 10707435 11321709 11720474 12204343 12337478
4843 12337478 12588736 12449192 12160535 11979785 12183595 12538992 12610938 12519283 12742545 12936253
4833 12936253 12731787 12503521 12570444 12999599 13678791 14169857 14584899 14961147 15159138 15387485
$$ packed form
4902A1635476m99150l02336j57898J3329K39314M4733J57471j54494l43806k22264
4892A0410375l47481j7934j65072j05609L19800O29750L94006P7312L61651l76810
4882A1179988k91336m23007N2170K32570R9315N02624M75629M12465j94959m90681
4872A1554778n48926m35875n39544r7222J21896M54192N04947M98866O19365m0460
4862A2092017j98267o14531o11415n19153R3030K42726M23756M39014L36258j46780
4852A1536655k26878l33403k58027j73708J62796O14274L98765M83869J33135
4843A2337478K51258j39544k88657j80750K03810L55397P1946r1655K23262J93708
4833A2936253k04466k28266O6923M29155O79192M91066M15042L76248J97991K28347
$$ plain form
4823 15387485 15275118 15531931 15624721 15760668 16361187 17431089 17924671 18167590 18544495
4814 18544495 19097370 19464975 19339096 19618438 20282693 20874632 21558917 22515973 23499048
4805 23499048 23749082 23948089 24543380 24852703 25042460 25591542 26266345 27548528 28717248
4796 28717248 29674424 31139634 32763268 33984578 35325522 37339720 39928460 42734426
4788 42734426 46254257 50535666 55572137 61559988 68094608 76287568 87096549 101375265
4780 101375265 119294471 142852044 168293960 181734038 182014186 167463285 139269998
4773 139269998 111295493 88511503 72782878 62278841 54553269 48480137 44574439
4766 44574439 41558580 39097017 36875304 35196801 33709894 32264538 31423924 30895449
$$ packed form
4823A5387485j12367K56813R2790J35947O00519J069902M93582K42919L76905
4814A8544495N52875L67605j25879K79342O64255N91939O84285R57056R83075
4805B3499048K50034J99007N95291L09323J89757N49082O74803J282183J168720
4796B8717248R57176J465210J623634J221310J340944K014198K588740K805966
4788D2734426L519831M281409N036471N987851O534620Q192960J0808981J4278716
4780A01375265J7919206K3557573K5441916J3440078K80148j4550901k8193287
4773A39269998k7974505k2783990j5728625j0504037p725572o073132l905698
4766D4574439l015859k461563k221713j678503j486907j445356q40614n28475
$$ plain form
4758 30895449 30570341 30316620 29920267 29925935 29932818 29638755 29293514 29154192 29167092 29519121
4748 29519121 29354155 29457272 30171191 30438772 30491406 30740608 30806205 31100005 31289177 31649053
4738 31649053 32275761 32969618 33725604 34411982 35255406 36049056 36446191 37598586 39078091
4729 39078091 40710896 42746801 44891351 47631909 50679082 53868146 57902905 63062501
4721 63062501 68537398 75645131 84840180 97350088 113006873 132029618 156160971 174561602
4713 174561602 177500639 175048438 164821821 141956779 116845688 95696487 80454786
4706 80454786 70231127 62826646 56888716 52494330 49252480 46350511 44201619 42533541
4698 42533541 41568303 41092582 40504095 39928631 39451464 38940145 38116060 37472604 37133708
$$ packed form
4758C0895449l25108k53721l96353N668O883k94063l45241j39322J2900L52029
4748B9519121j64966J03117P13919K67581N2634K49202O5597K93800J89172L59876
4738C1649053O26708O93857P55986O86378Q43424P93650L97135J152395J479505
4729C9078091J632805K035905K144550K740558L047173L189064M034759N159596
4721F3062501N474897P107733R195049J2509908J5656785J9022745K4131353J8400631
4713A74561602K939037k452201j0226617k2865042k5111091k1149201j5241701
4706H0454786j0223659p404481n937930m394386l241850k901969k148892j668078
4698D2533541r65238m75721n88487n75464m77167n11319q24085o43456l38896
$$ plain form
4689 37133708 37006197 37235631 37391265 37764784 37873772 37745293 37561768 37771834 38158070
4680 38158070 38428908 38707175 39283926 40073079 40886035 41420987 42273011 43172073 43797167
4671 43797167 44578681 45286606 46219869 46970551 47510408 47799519 48044840 48718012 49506725
4662 49506725 50307547 51552800 53146134 54430818 56271078 57963996 59339499 60565830
4654 60565830 61597377 62278906 62888974 63145286 63184876 63173899 63394122 64055858 64981701 66018549
4644 66018549 68025880 70031364 72615994 75862326 79585575 83591984 87657762 92743262
4636 92743262 98941558 105907516 113449479 121443814 129373738 135473583 137687258 136148926
4628 136148926 132350789 128049237 124329993 122991107 123547212 125648896 129363452 134901615
$$ packed form
4689C7133708j27511K29434J55634L73519J08988j28479j83525K10066L86236
4680C8158070K70838K78267N76751P89153Q12956N34952Q52024Q99062O25094
4671D3797167P81514P07925R33263P50682N39857K89111K45321O73172P88713
4662D9506725Q00822J245253J593334J284684J840260J692918J375503J226331
4654F0565830J031547O81529O10068K56312L9590j0977K20223O61736R25843J036848
4644F6018549K007331K005484K584630L246332L723249M006409M065778N085500
4636I2743262O198296O965958P541963P994335P929924O099845K213675j538332
4628A36148926l798137m301552l719244j338886N56105K101684L714556N538163
$$ plain form
4620 134901615 142132890 150339937 158996473 167675954 175559615 181262966 183971948 184363429
4612 184363429 183514504 180985819 177334794 174276526 171173440 168012190 165368085 162726289
4604 162726289 160019060 156901855 152844446 148637752 144438185 140060716 135941766 132107584
4596 132107584 128552827 124461868 120221508 116375831 113017913 110071449 107515194 106009231
4588 106009231 104671930 103035917 100173615 96518724 92606358 88364049 84141092 80480536
4580 80480536 77157693 74154923 70782913 67755070 64561549 61445581 58222259 55849804
4572 55849804 54193148 53185953 51828105 50641114 50482975 50123460 49417540 48550884 48073382
4563 48073382 47438411 46298363 44978700 44140018 42863997 41461780 40148274 39363557 38412570
$$ packed form
4620A34901615P231275Q207047Q656536Q679481P883661N703351K708982L91481
4612A84363429q48925k528685l651025l058268l103086l161250k644105k641796
4604A62726289k707229l117205m057409m206694m199567m377469m118950l834182
4596A32107584l554757m090959m240360l845677l357918k946464k556255j505963
4588A06009231j337301j636013k862302l654891l912366m242309m222957l660556
4580H0480536l322843l002770l372010l027843l193521l115968l223322k372455
4572E5849804j656656j007195j357848j186991j58139l59515p05920q66656m77502
4563D8073382o34971j140048j319663q38682j276021j402217j313506p84717r50987
$$ plain form
4554 38412570 37214535 36292528 35385791 34591503 33656180 33120107 32511058 32073671 31709038
4545 31709038 31115632 30787619 30405818 29553924 28712432 28157520 27674815 27034946 26316242
4536 26316242 25815240 25666540 25241411 24595083 23991659 23299257 22938053 22524688 22188436
4527 22188436 22380095 22367606 22154787 22271938 22232979 21989279 21551027 21318106 21403335 21367973
4517 21367973 21392694 21697140 22043690 21838269 21608035 21396483 21280863 21153365 21064347 21100048
4507 21100048 21301011 21343562 21407577 21398043 21379676 21502611 21265805 21760219 21877702 22146712
4497 22146712 22192276 22692795 23346440 23548460 23603250 23494337 23761941 24050019 23990537 24107167
4487 24107167 24358785 24764767 24796295 24880089 25123625 25303636 25271891 25532854 25759173 26396248
$$ packed form
4554C8412570j198035r22007r06737p94288r35323n36073o09049m37387l64633
4545C1709038n93406l28013l81801q51894q41492n54912m82705o39869p18704
4536B6316242n01002j48700m25129o46328o03424o92402l61204m13365l36252
4527B2188436J91659j2489k12819J17151l8959k43700m38252k32921Q5229l5362
4517B1367973K4721L04446L46550k05421k30234k11552j15620j27498q9018L5701
4507B1100048K00963M2551O4015r534j8367J22935k36806M94414J17483K69010
4497B2146712M5564N00519O53645K02020N4790j08913K67604K88078n9482J16630
4487B4107167K51618M05982L1528Q3794K43536J80011l1745K60963K26319O37075
$$ plain form
4477 26396248 26707729 27059120 27414471 27775009 27945585 28404301 29021058 29562016 30313158
4468 30313158 30730194 31599897 32530599 32711630 32777466 32897045 33266868 33652276 34019844 34274513
4458 34274513 34773104 35335180 35485397 35743412 35814390 36573490 37303871 38266040 39438793
4449 39438793 40695320 41654167 42306098 43333042 44328868 44820096 45536373 46631048 47966704
4440 47966704 49498553 51284159 52963819 54768113 56356551 57850893 59461308 61401222
4432 61401222 63766739 66555479 69551043 72695635 76239469 80336808 84792147 90028365
4424 90028365 95985450 102424955 109632134 118201037 127983773 139538460 153308715 169276185
4416 169276185 188707206 212676590 242082314 276928682 315270938 353846134 384135877
$$ packed form
4477B6396248L11481L51391L55351L60538J70576M58716O16757N40958P51142
4468C0313158M17036Q69703R30702J81031O5836J19579L69823L85408L67568K54669
4458C4274513M98591N62076J50217K58015P0978P59100P30381R62169J172753
4449C9438793J256527R58847O51931J026944R95826M91228P16277J094675J335656
4440D7966704J531849J785606J679660J804294J588438J494342J610415J939914
4432F1401222K365517K788740K995564L144592L543834M097339M455339N236218
4424I0028365N957085O439505P207179Q568903R782736J1554687J3770255J5967470
4416A69276185J9431021K3969384K9405724L4846368L8342256L8575196L0289743
$$ plain form
4409 384135877 387477314 357834305 309986076 260211956 217913441 184837723 158835069
4402 158835069 138385081 122929490 110306270 100580930 92730817 86875694 81233453 75855139
4394 75855139 71351648 67193820 63131731 59150752 56116732 53332173 50990492 49332396
4386 49332396 48099158 47041413 46015773 44742650 43463927 42336037 41027466 39652155
4378 39652155 38956433 38331729 37870843 37019442 35924933 35097819 33933660 32644034 31852179
4369 31852179 31254095 30332228 29672289 29071347 28487893 27811173 26858214 26384534 25945049
4360 25945049 25881966 25532981 25468088 25622341 25431907 24877405 24582900 24473556 24235164 24339206
4350 24339206 24557303 24992069 24982852 24431198 23845894 23573344 23317369 22558183 22333021 22472719
$$ packed form
4409C84135877L341437k9643009m7848229m9774120m2298515l3075718k6002654
4402A58835069k0449988j5455591j2623220r725340p850113n855123n642241n378314
4394G5855139m503491m157828m062089l980979l034020k784559k341681j658096
4386D9332396j233238j057745j025640j273123j278723j127890j308571j375311
4378C9652155o95722o24704m60886q51401j094509q27114j164159j289626p91855
4369C1852179n98084r21867o59939o00942n83454o76720r52959m73680m39485
4360B5945049o3083l48985o4893J54253j90434n54502k94505j09344k38392J04042
4350B4339206K18097M34766r217n51654n85304k72550k55975p59186k25162J39698
$$ plain form
4340 22472719 22417263 22139793 21716184 21297295 20410749 19836567 19745629 19946238 20122922 20193699
4330 20193699 20077425 20496480 20294305 19817778 19289181 19291321 19771044 19453430 19626453 20013636
4320 20013636 20014097 19505563 19613285 19703232 19417773 19434573 19536350 19933672 20078611 19712964
4310 19712964 19575573 19063933 18485731 18187956 18262774 18641589 19004528 18976457 18993713 18762312
4300 18762312 18657597 18242694 17814586 18088299 18023234 18163960 18631615 19202087 19801867 20398234
4290 20398234 20854308 21125151 20836847 20259383 19566355 19178960 19135696 19133697 19171671 19578075
4280 19578075 19955927 19266788 18347683 17349118 16883793 16391221 16254527 16185769 15972515 15899214
4270 15899214 15676676 16110864 16602210 17020519 17303594 17610776 17607972 17419481 16730550 16387748
$$ packed form
4340B2472719n5456k77470m23609m18889q86546n74182r0938K00609J76684P0777
4330B0193699j16274M19055k02175m76527n28597K140M79723l17614J73023L87183
4320B0013636M61n08534J07722Q9947k85459J6800J01777L97322J44939l65647
4310A9712964j37391n11640n78202k97775P4818L78815L62939k8071J7256k31401
4300A8762312j04715m14903m28108K73713o5065J40726M67655N70472N99780N96367
4290B0398234M56074K70843k88304n77464o93028l87395m3264j999L7974M06404
4280A9578075L77852o89139r19105r98565m65325m92572j36694o8758k13254p3301
4270A5899214k22538M34188M91346M18309K83075L07182k804j88491o88931l42802
$$ plain form
4260 16387748 16377096 16141772 16145175 16268837 16215797 15963989 15738102 15311414 15218751 15520418
4250 15520418 15835184 16498219 17238239 17337847 17551714 17331823 17022301 17305865 17518710 17760173
4240 17760173 18414537 19058617 19589898 20140486 20649726 20786665 20638886 20661647 21069112 22078980
4230 22078980 23658535 25322151 27244513 29130148 29510545 28044410 25953788 24037385
4222 24037385 22473889 21239236 20565195 20269176 20223396 20052707 19849336 20022316 19884048
4213 19884048 19612916 19641995 20133951 20420873 21044962 21306462 21933327 22543321 23169861 24198726
4203 24198726 25278132 26509620 27574893 28393379 29055439 29098752 28522692 27910947 27018365
4194 27018365 26367894 25480589 24444807 23681342 22695746 21237700 20202620 19783913 19060925
$$ packed form
4260A6387748j0652k35324L403J23662n3040k51808k25887m26688r2663L01667
4250A5520418L14766O63035P40020R9608K13867k19891l09522K83564K12845K41463
4240A7760173O54364O44080N31281N50588N09240J36939j47779K2761M07465J009868
4230B2078980J579555J663616J922362J885635L80397j466135k090622j916403
4222B4037385j563496j234653o74041k96019m5780j70689k03371J72980j38268
4213A9884048k71132K9079M91956K86922O24089K61500O26865O09994O26540J028865
4203B4198726J079406J231488J065273Q18486O62060M3313n76060o11745q92582
4194B7018365o50471q87305j035782p63465r85596j458046j035080m18707p22988
$$ plain form
4185 19060925 18664755 18440896 18334798 17935114 17324281 17222555 17098572 16590199 16257756
4176 16257756 16337157 16468644 16087176 16013186 15794138 15938163 15772920 15453933 15761452 16331732
4166 16331732 16531381 16601328 16971288 17021403 16846211 16890211 17116802 17211492 17792830 18115751
4156 18115751 18689020 19406170 19278717 19285209 19218275 19464206 19965428 20119402 20374594 20227983
4146 20227983 20161809 19612879 19091998 18651468 17869556 17180371 16616442 16173375 16070506 16055309
4136 16055309 16279633 16369243 16098416 15900244 15657958 15408576 15262351 15230095 15702005 15884616
4126 15884616 16223344 15938632 15401662 14874253 14156269 13739450 13427913 13408650 13591320 13645135
4116 13645135 13869749 13830329 13743462 13831403 13478029 13289264 13300327 13329708 13899155 14238090
$$ packed form
4185A9060925l96170k23859j06098l99684o10833j01726j23983n08373l32443
4176A6257756P9401J31487l81468p3990k19048J44025j65243l18987L07519N70280
4166A6331732J99649O9947L69960N0115j75192M4000K26591R4690N81338L22921
4156A8115751N73269P17150j27453O492o6934K45931N01222J53974K55192j46611
4146B0227983o6174n48930n20881m40530p81912o89185n63929m43067j02869j5197
4136A6055309K24324Q9610k70827j98172k42286k49382j46225l2256M71910J82611
4126A5884616L38728k84712n36970n27409p17984m16819l11537j9263J82670N3815
4116A3645135K24614l9420q6867Q7941l53374j88765J1063K9381N69447L38935
$$ plain form
4106 14238090 14057774 13898783 13629575 13143668 12799771 12434627 12547980 12472510 12472231 12542277
4096 12542277 12613819 12399300 12229884 12183851 12146176 12063406 11840374 12103402 12363845 12667433
4086 12667433 12584156 12679055 12814525 12837258 13158494 13411304 13269166 13349001 13595440 14289792
4076 14289792 14727660 14863192 14969160 15383441 16020648 16591056 16514431 16668224 17047266 17366218
4066 17366218 17927956 18609309 19098133 19496551 19972189 20339445 20669774 21083522 21916979
4057 21916979 22886102 24043007 24191415 24546672 25223532 25241078 24969926 24772976 24732186 24906662
4047 24906662 25200537 25843303 26897891 27577895 27839252 28297035 28678190 28310947 27728985
4038 27728985 27130617 27143912 27006799 26871388 26537000 26714759 26344410 26033950 26165054 26203718
$$ packed form
4106A4238090j80316j58991k69208m85907l43897l65144J13353p5470k79P0046
4096A2542277P1542k14519j69416m6033l7675q2770k23032K63028K60443L03588
4086A2667433q3277R4899J35470K2733L21236K52810j42138P9835K46439O94352
4076A4289792M37868J35532J05968M14281O37207N70408p6625J53793L79042L18952
4066A7366218N61738O81353M88824L98418M75638L67256L30329M13748Q33457
4057B1916979R69123J156905J48408L55257O76860J7546k71152j96950m0790J74476
4047B4906662K93875O42766J054588O80004K61357M57783L81155l67243n81962
4038B7728985n98368J3295j37113j35411l34388J77759l70349l10460J31104L8664
$$ plain form
4028 26203718 26231172 25833925 25521205 24770893 23938162 22869192 21924885 21538609 21001161
4019 21001161 20237187 19847274 19497558 18781499 17997998 17539413 17294505 16655212 16073555
4010 16073555 15748913 15654652 15307436 14613467 13942662 13306380 12497626 11967950 11800331 11895232
4000 11895232 11912396 11683862 11364654 11103996 10537641 9832711 9402401 9117036 8726768 8388137
3990 8388137 8453725 8650920 8507144 8052885 7785759 7616587 7250430 6926105 7113034 7071467
3980 7071467 7149333 6968169 7019880 6720786 6240762 6232630 6275979 6236827 5998403 5887163 6061799
3969 6061799 6042952 6057962 6039010 5919957 6129793 6355693 6547518 6721915 6870646 6812526
3959 6812526 6422561 6288663 6476765 6231780 5806716 5664193 5405434 5200133 4883646 4873704
$$ packed form
4028B6203718K7454l97247l12720p50312q32731j068970r44307l86276n37448
4019B1001161p63974l89913l49716p16059p83501m58585k44908o39293n81657
4010A6073555l24642r4261l47216o93969o70805o36282q08754n29676j67619R4901
4000A1895232J7164k28534l19208k60658n66355p04930m30310k85365l90268l38631
3990H388137O5588J97195j43776m54259k67126j69172l66157l24325J86929m1567
3980G071467P7866j81164N1711k99094m80024q132M3349l9152k38424j11240J74636
3969F061799j8847J5010j8952j19053K09836K25900J91825J74397J48731n8120
3959F812526l89965j33898J88102k44985m25064j42523k58759k05301l16487r942
$$ plain form
3949 4873704 5010225 4724274 4279466 4242723 4654013 4367150 4052660 4073570 3922679 3595307
3939 3595307 3562960 3722532 3765894 3610574 3028083 3042550 3205032 2932991 3087304 3519703
3929 3519703 3666734 3641381 3394440 3087418 2936762 2922808 2955328 3051389 2853584 2850306 2759867
3918 2759867 3145169 3320151 3102143 3070984 3094157 2818159 2343083 2247880 2552168 2717620
3908 2717620 2694168 2742134 2914551 2789090 2262614 2240229 2233211 2265008 1882024 2017813 2493304
3897 2493304 2970455 2620640 2266098 2371051 1852105 1538442 1349154 1652367 1928190 2142339
3887 2142339 2646211 2942869 2658803 2208845 1792029 1659814 1499317 1350094 1571168 2192725
3877 2192725 2546308 2285921 1978319 2191391 2085077 1660163 1752912 2090790 2242611 2089932
$$ packed form
3949D873704J36521k85951m44808l6743M11290k86863l14490K0910j50891l27372
3939C595307l2347J59572M3362j55320n82491J4467J62482k72041J54313M32399
3929C519703J47031k5353k46941l07022j50656j3954L2520R6061j97805l278r0439
3918B759867L85302J74982k18008l1159K3173k75998m75076r5203L04288J65452
3908B717620k3452M7966J72417j25461n26476k2385p018L1797l82984J35789M75491
3897B493304M77151l49815l54542J04953n18946l13663j89288L03213K75823K14149
3887B142339N03872K96658k84066m49958m16816j32215j60497j49223K21074O21557
3877B192725L53583k60387l07602K13072j06314m24914R2749L37878J51821j52679
$$ plain form
3867 2089932 2443876 2435933 2014258 1588447 1566990 1919344 2217555 2264858 2215084 2402141
3857 2402141 2623704 2390871 2312884 2416352 2395184 2232707 2307437 2544169 2690554 2551702
3847 2551702 2466692 2398908 2102138 1561011 1344260 1603889 2219874 2351938 2450895 2542433
3837 2542433 2269076 1964411 2097046 1680985 1642832 1826450 1822250 2138827 2259504 2322171
3827 2322171 2588810 2674440 2395169 1901440 1632870 1867378 1992676 2177671 2321250 2869139
3817 2869139 3008789 2783325 2770086 2371952 2189020 2296745 2270488 2881624 3089181 3070596
3807 3070596 3162972 3094510 2781190 2273911 1787599 1919672 2051026 2604182 2592475 2470060
3797 2470060 2316163 1890806 1834286 1422761 1526668 1762119 1694934 1908975 2022859 2074517
$$ packed form
3867B089932L53944p943m21675m25811k1457L52354K98211M7303m9774J87057
3857B402141K21563k32833p7987J03468k1168j62477P4730K36732J46385j38852
3847B551702q5010o7784k96770n41127k16751K59629O15985J32064R8957R1538
3837B542433k73357l04665J32635m16061l8153J83618m200L16577J20677O2667
3827B322171K66639Q5630k79271m93729k68570K34508J25298J84995J43579N47889
3817B869139J39650k25464j3239l98134j82932J07725k6257O11136K07557j8585
3807C070596R2376o8462l13320n07279m86312J32073J31354N53156j1707j22415
3797B470060j53897m25357n6520m11525J03907K35451o7185K14041J13884N1658
$$ plain form
3787 2074517 2156639 1940099 1508321 1424066 1817697 1802495 1873032 2043864 2040906 1954486 1546728
3776 1546728 1527364 1266304 981156 1201708 1757446 2316228 2457706 1927036 1328480 1101129
3766 1101129 983497 895759 1027508 1607635 1754326 1977776 2147518 2162524 1698131 1244834
3756 1244834 1183142 1043048 1084243 1487114 2270025 2629997 2436827 2138228 1821847 1607482
3746 1607482 1177967 1033121 1603237 2029940 2296997 2686744 2778444 2424518 1705659 1317146
3736 1317146 1264898 1204207 1428655 2102373 2726255 2630501 1952537 1814577 1967571 1785895
3726 1785895 1378765 1330632 1964167 2167160 2145367 2220998 2495282 2335587 1976338 1827555
3716 1827555 1769857 1875141 1816134 1942846 2265357 2278071 2039744 1835776 2221659 2038870
$$ packed form
3787B074517Q2122k16540m31778q4255L93631j5202P0537J70832k958q6420m07758
3776A546728j9364k61060k85148K20552N55738N58782J41478n30670n98556k27351
3766A101129j17632q7738J31749N80127J46691K23450J69742J5006m64393m53297
3756A244834o1692j40094M1195M02871P82911L59972j93170k98599l16381k14365
3746A607482m29515j44846N70116M26703K67057L89747R1700l53926p18859l88513
3736A317146n2248o0691K24448O73718O23882r5754o77964j37960J52994j81676
3726A785895m07130m8133O33535K02993k1793P5631K74284j59695l59249j48783
3716A827555n7698J05284n9007J26712L22511J2714k38327k03968L85883j82789
$$ plain form
3706 2038870 1791542 1588912 1452520 1696749 1919256 2204928 2577882 2584770 2484472 2124758
3696 2124758 2265937 1878978 1640383 1797178 2097953 2207752 2377318 2798533 3017471 3095227
3686 3095227 2731363 2834097 2842027 2761588 2027084 2180701 2970567 3393139 3247444 3359269
3676 3359269 3712419 3410609 2805331 2901153 2846210 2935288 3127546 3485647 3665997 3975137
3666 3975137 3933975 3853269 3726812 3032804 2510613 2903220 3437828 3965109 4304495 4508733
3656 4508733 4141324 3939033 3634001 3443565 3614674 3627937 3748754 3986460 4750289 4921727
3646 4921727 4750728 4571520 4572637 4211524 4045667 4335206 4721907 4900568 5220479 5826587
3636 5826587 5913875 5750965 5315872 5145181 5522878 5722915 6353927 7091943 7233808 6993445
$$ packed form
3706B038870k47328k02630j36392K44229K22507K85672L72954O888j00298l59714
3696B124758J41179l86959k38595J56795L00775J09799J69566M21215K18938P7756
3686C095227l63864J02734P930q0439p34504J53617P89866M22572j45695J11825
3676C359269L53150l01810o05278R5822n4943Q9078J92258L58101J80350L09140
3666C975137m1162q0706j26457o94008n22191L92607N34608N27281L39386K04238
3656D508733l67409k02291l05032j90436J71109J3263J20817K37706P63829J71438
3646D921727j70999j79208J117l61113j65857K89539L86701J78661L19911O06108
3636E826587Q7288j62910m35093j70691L77697K00037O31012P38016J41865k40363
$$ plain form
3626 6993445 6663144 6607690 6271404 5828054 5690458 6194519 6683033 6838101 7027902 6800037
3616 6800037 6175643 5582734 5426899 5341118 5461574 5497278 5586495 5634994 5680172 5122952
3606 5122952 4983346 4678148 4371644 4498787 4671969 4934021 5057363 5167580 5069690 4973784
3596 4973784 5037890 4595117 4538402 4750514 4726455 4646308 5022098 5149976 4983274 4806754
3586 4806754 4570371 4768700 4840434 4700096 4879242 4973679 4769623 4878240 4982222 4980883
3576 4980883 4743609 4706820 4915001 5120384 5242706 5193768 5433873 5391677 5307240 5270532
3566 5270532 5759065 5745892 5405525 5235339 5555416 5971821 5551934 5472267 5602067 5730002
3556 5730002 5398264 5112406 5748681 6259223 6153993 5820135 6275612 6641400 6347745 6545865
$$ packed form
3626F993445l30301n5454l36286m43350j37596N04061M88514J55068J89801k27865
3616F800037o24394n92909j55835q5781J20456L5704Q9217M8499M5178n57220
3606E122952j39606l05198l06504J27143J73182K62052J23342J10217r7890r5906
3596D973784O4106m42773n6715K12112k4059q0147L75790J27878j66702j76520
3586D806754k36383J98329P1734j40338J79146R4437k04056J08617J03982j339
3576D980883k37274l6789K08181K05383J22322m8938K40105m2196q4437l6708
3566E270532M88533j3173l40367j70186L20077M16405m19887p9667J29800J27935
3556E730002l31738k85858O36275N10542j05230l33858M55477L65788k93655J98120
$$ plain form
3546 6545865 6548338 6740289 6856906 6836489 7216775 7380996 6991504 6928093 7268968 7765155
3536 7765155 7698543 7645859 8005819 8246872 7712153 7740905 8299354 8634408 8209794 8217737
3526 8217737 8802151 8870750 8853007 8803054 9124884 9198517 8990354 8808294 9195608 9597670
3516 9597670 9487057 9743737 10165100 10399931 9936787 9702023 9902093 10017158 9752666 9785089
3506 9785089 10305571 10487481 10614911 10981692 11282391 10923962 10468879 10497849 11046148 11160127
3496 11160127 11149989 11693621 12280257 12593088 12497108 12985590 13218155 12687816 12177037 12322139
3486 12322139 12757110 13069260 13646895 14265149 14806314 15245098 14681371 14591288 14855063 15107789
3476 15107789 15180209 15515537 16201269 16818287 16908689 17192281 17509337 17526781 17235314 17154290
$$ packed form
3546F545865K473J91951J16617k0417L80286J64221l89492o3411L40875M96187
3536G765155o6612n2684L59960K41053n34719K8752N58449L35054m24614P943
3526H217737N84414O8599j7743m9953L21830P3633k08163j82060L87314M02062
3516I597670j10613K56680M21363K34831m63144k34764K00070J15065k64492L2423
3506I785089N20482J81910J27430L66781L00699l58429m55083K8970N48299J13979
3496A1160127j0138N43632N86636L12831r5980M88482K32565n30339n10779J45102
3486A2322139M34971L12150N77635O18254N41165M38784n63727r0083K63775K52726
3476A5107789P2420L35328O85732O17018R0402K83592L17056J7444k91467q1024
$$ plain form
3466 17154290 17983319 18083357 18199117 18514748 19119813 19195228 19029094 18978164 19607843 19825683
3456 19825683 19725906 19968964 20486868 20487033 20256408 20729286 21051281 21556091 21660213 22263832
3446 22263832 23015581 23063995 22748747 22914894 23193774 22812653 22790665 23150177 24027695 24363237
3436 24363237 24379976 24660149 24858154 24115907 23794149 23524016 23636767 24078858 23778235 23984332
3426 23984332 24070791 23488140 23033890 22603132 22591847 22161496 21581819 21444462 21686207 21565633
3416 21565633 21038935 21074326 21241994 20783026 20393267 19986135 19712582 19466368 19392608 19734953
3406 19734953 19790792 19739510 19921291 20062684 20214521 19990406 19651450 19682219 19675623 19544472
3396 19544472 19370275 19722874 20370566 20647845 20305882 20278450 20265934 20014545 19829841 19847430
$$ packed form
3466A7154290Q29029J00038J15760L15631O05065P5415j66134n0930O29679K17840
3456A9825683r9777K43058N17904J65k30625M72878L21995N04810J04122O03619
3446B2263832P51749M8414l15248J66147K78880l81121k1988L59512Q77518L35542
3436B4363237J6739K80173J98005p42247l21758k70133J12751M42091l00623K06097
3426B3984332Q6459n82651m54250m30758j1285m30351n79677j37357K41745j20574
3416B1565633n26698L5391J67668m58968l89759m07132k73553k46214p3760L42345
3406A9734953N5839n1282J81781J41393J51837k24115l38956L0769o596j31151
3396A9544472j74197L52599O47692K77279l41963k7432j2516k51389j84704J7589
$$ plain form
3386 19847430 20378480 20453317 20836797 21462835 21637274 21181272 20516125 20709228 20655791 20760732
3376 20760732 20803322 21169637 21837808 21957592 21793797 21666559 21813107 22104799 22418178 22696435
3366 22696435 23275649 24100503 24648286 24984746 25568109 26034524 25922371 26518620 27313849
3357 27313849 28096387 29094873 30172393 31519670 32522709 33315908 34559723 35897621 37535681
3348 37535681 39158552 41171461 43453065 45733791 48110518 50810712 53159976 55448799
3340 55448799 57449471 59093648 60314241 61421623 62183844 62540082 62977064 63351400 64071245
3331 64071245 64158008 64127659 64685363 65277879 65705631 66162548 66690629 66866009 66832970 66455257
3321 66455257 65320378 63617721 61754216 59928354 57790480 55954770 54523761 53408280
$$ packed form
3386A9847430N31050P4837L83480O26038J74439m56002o65147J93103n3437J04941
3376B0760732M2590L66315O68171J19784j63795j27238J46548K91692L13379K78257
3366B2696435N79214Q24854N47783L36460N83363M66415j12153N96249P95229
3357B7313849P82538R98486J077520J347277J003039P93199J243815J337898J638060
3348C7535681J622871K012909K281604K280726K376727K700194K349264K288823
3340E5448799K000672J644177J220593J107382P62221L56238M36982L74336P19845
3331F4071245Q6763l0349N57704N92516M27752M56917N28081J75380l3039l77713
3321F6455257j134879j702657j863505j825862k137874j835710j431009j115481
$$ plain form
3313 53408280 52920037 51964485 50902794 49911252 49438372 49129863 48367712 47929979 47947293
3304 47947293 48009233 48074557 48285599 49014329 49375616 49287786 49637881 50259837 50699494 51208270
3294 51208270 51887792 52790454 54013035 55169543 56183878 57572741 59271859 60198532 61373544
3285 61373544 62949156 64740335 66128518 67858888 69861807 71899975 73904873 75777186
3277 75777186 78426848 80725467 82412577 84590817 86851178 89436454 91810353 94106273
3269 94106273 96657105 98875919 100499349 102309611 104444196 106212724 107743912 109761970
3261 109761970 112147741 114549754 116904961 119719501 123063818 126192418 128683396 131995111
3253 131995111 135542836 138874329 142239174 145567580 149097509 152190058 154523462 156642884
$$ packed form
3313E3408280m88243r55552j061691r91542m72880l08509p62151m37733J7314
3304D7947293O1940O5324K11042P28730L61287q7830L50095O21956M39657N08776
3294E1208270O79522R02662J222581J156508J014335J388863J699118R26673J175012
3285F1373544J575612J791179J388183J730370K002919K038168K004898J872313
3277G5777186K649662K298619J687110K178240K260361K585276K373899K295920
3269I4106273K550832K218814J623430J810262K134585J768528J531188K018058
3261A09761970K385771K402013K355207K814540L344317L128600K490978L311715
3253A31995111L547725L331493L364845L328406L529929L092549K333404K119422
$$ plain form
3245 156642884 158696126 160279210 161830907 163616313 165867621 168645994 169180289 165224624
3237 165224624 159943272 154770768 150142590 146584987 143291189 139339111 134771314 130514831
3229 130514831 125992268 121279037 116136064 110987312 106373180 101655999 97070832 92822899
3221 92822899 89151976 85461528 81837664 79046239 77395705 76312117 75415732 74982806
3213 74982806 75433630 77305313 79907603 83099174 88020085 94283775 94702809 87007980
3205 87007980 77909761 69932268 64209087 60214420 57470135 55479900 53595939 52183746
3197 52183746 51755807 51118201 50482974 50178721 49934305 49732094 49448570 49033970 48955688 48641277
3187 48641277 47794305 47283659 47029917 47026628 47174824 47710953 48765445 50484890 52152909
$$ packed form
3245A56642884K053242J583084J551697J785406K251308K778373N34295l955665
3237A65224624n281352n172504m628178l557603l293798l952078m567797m256483
3229A30514831m522563m713231n142973n148752m614132m717181m585167m247933
3221I2822899l670923l690448l623864k791425j650534j083588q96385m32926
3213G4982806M50824J871683K602290L191571M920911O263690M19034p694829
3205H7007980r098219p977493n723181l994667k744285j990235j883961j412193
3197E2183746m27939o37606o35227l04253k44416k02211k83524m14600p8282l14411
3187D8641277q46972n10646k53742l289J48196N36129J054492J719445J668019
$$ plain form
3178 52152909 54243659 56961714 60095134 59803394 56331164 52672511 49813212 48109964
3170 48109964 46681315 45670555 45217671 44376093 43680395 43517157 43735832 43937194 44323132
3161 44323132 45370882 46291435 47080943 48006346 48758787 49519050 50349142 51458817 53431241
3152 53431241 55735754 58092423 60867077 63919747 66964993 69570171 72161702 75289646
3144 75289646 78025934 80455485 83047092 85476080 87258090 87948917 88445203 88667975 88464727
3135 88464727 88044510 87695569 87205647 86591645 86062428 85085964 84099818 83198908 82023094
3126 82023094 81101632 80430343 79692467 78616223 77255426 75731819 73431499 71089835 68846461
3117 68846461 66514973 64364478 62677600 61130581 59844677 58503064 57011167 55300607
$$ packed form
3178E2152909K090750K718055L133420k91740l472230l658653k859299j703248
3170D8109964j428649j010760m52884q41578o95698j63238K18675K01362L85938
3161D4323132J047750R20553P89508R25403P52441P60263Q30092J109675J972424
3152E3431241K304513K356669K774654L052670L045246K605178K591531L127944
3144G5289646K736288K429551K591607K428988J782010O90827M96286K22772k03248
3135H8464727m20217l48941m89922o14002n29217r76464r86146r00910j175814
3126H2023094r21462o71289p37876j076244j360797j523607k300320k341664k243374
3117F8846461k331488k150495j686878j547019j285904j341613j491897j710560
$$ plain form
3109 55300607 53994463 53032829 52700300 52262863 52148240 52528358 53057664 53499303 54066396
3100 54066396 54527102 54819609 55076291 55451689 55626260 56183566 56434237 56700346 56740333 56740550
3090 56740550 56571451 55307520 54047189 52858909 51570073 50004108 48492653 46984015
3082 46984015 45708948 44526357 43364073 42319376 41579966 40792480 39953989 39558276 39443864
3073 39443864 39218214 38986512 39363752 39860262 39804237 39833989 40053031 40464108 40144233 39614969
3063 39614969 39563818 39020346 38201025 37184089 36484299 35640556 34150120 32716348 31345671
3054 31345671 30328206 28869377 27237319 25967787 24866451 23274544 21826760 21173698
3046 21173698 20568293 19735833 19239420 19220807 19118544 17903356 16746011 16139964 15661368
$$ packed form
3109E5300607j306144r61634l32529m37437j14623L80118N29306M41639N67093
3100E4066396M60706K92507K56682L75398J74571N57306K50671K66109L9987K17
3090E6740550j69099j263931j260331j188280j288836j565965j511455j508638
3082D6984015j275067j182591j162284j044697p39410p87486q38491l95713j14412
3073C9443864k25650k31702L77240M96510n6025K9752K19042M11077l19875n29264
3063C9614969n1151n43472q19321j016936o99790q43743j490436j433772j370677
3054C1345671j017465j458829j632058j269532j101336j591907j447784o53062
3046B1173698o05405q32460m96413j8613j02263j215188j157345o06047m78596
$$ plain form
3037 15661368 15180650 14759165 14989566 15704654 15574915 15124585 14850396 14295761 13210043
3028 13210043 12443076 12414397 12684931 12631977 13025857 13362947 13375738 13003704 12615497 12483063
3018 12483063 12317471 11711757 11491777 11954752 12545884 12759624 12761196 13243930 13439907 13330451
3008 13330451 12889625 12910994 13032050 13245390 12918938 13133522 13537101 13411160 13055705 13211169
2998 13211169 13179303 12414033 11660784 11645908 11590014 11042541 11019383 11271039 11332975 10854516
2988 10854516 10663360 10581431 10534509 10476264 10259778 10634694 10952640 10828107 10997541 11685863
2978 11685863 11935082 11881971 12029757 12520008 12944313 12751800 12561012 12637838 12782298 12476454
2968 12476454 12246160 12476090 12673629 12315895 12100563 12170819 11961347 11474841 11570412 12145757
$$ packed form
3037A5661368m80718m21485K30401P15088j29739m50330k74189n54635j085718
3028A3210043p66967k8679K70534n2954L93880L37090J2791l72034l88207j32434
3018A2483063j65592o05714k19980M62975N91132K13740J572M82734J95977j09456
3008A3330451m40826K1369J21056K13340l26452K14584M03579j25941l55455J55464
2998A3211169l1866p65270p53249j4876n5894n47473k3158K51656O1936m78459
2988A0854516j91156q1929m6922n8245k16486L74916L17946j24533J69434O88322
2978A1685863K49219n3111J47786M90251M24305j92513j90788P6826J44460l05844
2968A2476454k30294K29930J97539l57734k15332P0256k09472m86506R5571N75345
$$ plain form
2958 12145757 12575883 12841184 13222381 13624949 13878497 13720122 13701065 13964684 13850836 13703887
2948 13703887 14001823 14587651 15278151 15964571 16069652 16150925 16462818 16371764 16246576 16739793
2938 16739793 17122016 17652465 18354324 19024477 19575466 19812371 20216483 20568317 20860415
2929 20860415 21003452 21751512 22697226 23808048 24761784 25888554 26649435 27110309 27887881
2920 27887881 28777804 29821484 31134152 32392226 33770868 35308377 36663062 38204101
2912 38204101 39838579 41915091 43723020 46009397 48424473 49788480 50311472 50471255
2904 50471255 49906335 49068807 48078110 47323362 46923656 47173648 47552107 47465957 47895699 48394903
2894 48394903 48429330 48458985 49033614 49729117 50506787 51996653 53593808 55184175 56741034
$$ packed form
2958A2145757M30126K65301L81197M02568K53548j58375j9057K63619j13848j46949
2948A3703887K97936N85828O90500O86420J05081Q1273L11893r1054j25188M93217
2938A6739793L82223N30449P01859O70153N50989K36905M04112L51834K92098
2929B0860415J43037P48060R45714J110822R53736J126770P60881M60874P77572
2920B7887881Q89923J043680J312668J258074J378642J537509J354685J541039
2912C8204101J634478K076512J807929K286377K415076J364007N22992J59783
2904E0471255n64920q37528r90697p54748l99706K49992L78459q6150M29742M99204
2894D8394903L4427K9655N74629O95503P77670J489866J597155J590367J556859
$$ plain form
2885 56741034 58401739 59940276 61724727 63722792 66116689 69463919 73252553 77050581
2877 77050581 81652730 86836439 92424754 98212363 104872125 113036511 122384143 132799210
2869 132799210 145024093 159069663 174326670 190931720 210406811 232913334 257939912
2862 257939912 283630686 306638440 320789375 320171871 305728520 283731849 259755167
2855 259755167 236975215 217319501 200625636 186663944 173898168 161383496 148895121
2848 148895121 136228141 123819784 112139609 102074524 93593967 86326371 79725329
2841 79725329 74547384 70488389 66236346 62039787 58508507 55234925 51962001 48553588
2833 48553588 46051092 44303884 42338231 40411405 38580795 37215072 35214947 33478291
$$ packed form
2885E6741034J660705J538537J784451J998065K393897L347230L788634L798028
2877G7050581M602149N183709N588315N787609O659762Q164386R347632J0415067
2869A32799210J2224883J4045570J5257007J6605050J9475091K2506523K5026578
2862B57939912K5690774K3007754J4150935o17504j4443351k1996671k3976682
2855B59755167k2779952j9655714j6693865j3961692j2765776j2514672j2488375
2848A48895121j2666980j2408357j1680175j0065085q480557p267596o601042
2841G9725329n177945m058995m252043m196559l531280l273582l272924l408413
2833D8553588k502496j747208j965653j926826j830610j365723k000125j736656
$$ plain form
2825 33478291 32268189 31315868 30180031 29117178 28309347 27787170 26977900 25876831 25020756
2816 25020756 24577078 23792899 22981859 22496901 22210169 21453092 20554966 19835216 19694072
2807 19694072 19551335 19056134 19027928 19428514 19486320 18993484 18143566 17686665 16797543 15908670
2797 15908670 15671785 15543524 15485130 15182908 15077350 14852827 13721849 12363446 11589520
2788 11589520 11014994 10776357 10809799 10680163 11017069 10650354 9884599 9486423 8857601 8364610
2778 8364610 8025794 8033918 8170284 8367375 8226645 7766436 7588945 6868747 6211731 6171207
2768 6171207 6337672 6349233 6092601 6323767 6333460 5929505 5277821 5131341 4929383 4492430
2758 4492430 4649690 4681259 4965327 4972117 4569653 4386631 3759237 3187925 2840248 3273396
$$ packed form
2825C3478291j210102r52321j135837j062853q07831n22177q09270j101069q56075
2816B5020756m43678p84179q11040m84958k86732p57077q98126p19750j41144
2807A9694072j42737m95201k8206M00586N7806m92836q49918m56901q89122q88873
2797A5908670k36885j28261n8394l02222j05558k24523j130978j358403p73926
2788A1589520n74526k38637L3442j29636L36906l66715p65755l98176o28822m92991
2778H364610l38816Q124J36366J97091j40730m60209j77491p20198o57016m0524
2768F171207J66465J1561k56632K31166R693m03955o51684j46480k01958m36953
2758D492430J57260L1569K84068O790m02464j83022o27394n71312l47677M33148
$$ plain form
2748 3273396 3594860 3942344 4291317 4310384 4258609 3692946 3004051 2729784 2743567 2727485
2738 2727485 3030336 3550567 3992557 3815037 3302780 2893718 2398918 2095784 2109704 2537515
2728 2537515 2702997 2516028 2631682 2408037 2249158 2142105 2150743 2225468 2079189 2203085
2718 2203085 2432066 2425980 2284181 2101600 2004383 2002907 1989362 1845543 2112847 2219389 2026345
2707 2026345 1759257 1303653 1197463 1185848 1066998 1348652 1856798 1867501 1894339 2162776
2697 2162776 2008966 1133028 854633 642905 686440 852457 1350407 2019590 2206140 2033654
2687 2033654 1587158 1324642 1237255 618972 291554 832456 1440483 1594215 1809180 2116551
2677 2116551 1928867 1297818 1004404 995932 733135 603493 813308 1282232 1345218 1190996
$$ packed form
2748C273396L21464L47484L48973J9067n1775n65663o88895k74267J3783j6082
2738B727485L02851N20231M41990j77520n12257m09062m94800l03134J3920M27811
2728B537515J65482j86969J15654k23645j58879j07053Q638P4725j46279J23896
2718B203085K28981o086j41799j82581r7217j476j3545j43819K67304J06542j93044
2707B026345k67088m55604j06190j1615j18850K81654N08146J0703K6838K68437
2697B162776j53810q75938k78395k11728M3535J66017M97950O69183J86550j72486
2687B033654m46496k62516q7387o18283l27418N40902O08027J53732K14965L07371
2677B116551j87684o31049k93414q472k62797j29642K09815M68924O2986j54222
$$ plain form
2667 1190996 1242178 1269295 1035151 453185 329451 466487 632101 638832 849394 1262485
2657 1262485 1426308 1048543 742589 1161554 919173 471812 431955 708005 709750 525324
2647 525324 356908 781055 1209534 897658 755788 656026 595329 300300 616887 798322
2637 798322 716033 338710 477477 721015 967538 896816 607559 809792 693792 580200
2627 580200 147750 447505 780580 569702 695800 1017959 1253825 1168553 955633 599944
2617 599944 298055 77252 139786 584743 786177 979762 798781 1192607 965607 332985
2607 332985 56611 134790 228267 132171 455136 911750 942004 1031359 1118062 1147217 900002
2596 900002 268200 204511 467527 551782 649366 1185578 1557961 1448162 1230043 1275637
$$ packed form
2667A190996N1182K7117k34144n81966j23734J37036J65614O731K10562M13091
2657A262485J63823l77765l05954M18965k42381m47361l9857K76050J745j84426
2647E25324j68416M24147M28479l11876j41870r9762o0697k95029L16587J81435
2637G98322q2289l77323J38767K43538K46523p0722k89257K02233j16000j13592
2627E80200m32450K99755L33075k10878J26098L22159K35866q5272k12920l55689
2617E99944l01889k20803O2534M44957K01434J93585j80981L93826k27000o32622
2607C32985k76374P8179R3477r6096L22965M56614L0254Q9355Q6703K9155k47215
2596I00002o31802o3689K63016Q4255R7584N36212L72383j09799k18119M5594
$$ plain form
2586 1275637 1153453 747747 428145 431767 1010616 1325470 1553993 1815644 2219874 2065213
2576 2065213 1434083 1158465 979000 1130562 1079401 1055077 1384761 1707391 1557340 1450464
2566 1450464 1259926 763838 644997 620818 609847 731739 877755 893210 1131266 1023823
2556 1023823 525263 196308 -46145 -125638 133170 324789 440948 832076 698997 420552
2546 420552 436539 254899 102201 105333 242534 191980 55030 34283 188228 161376 246405
2535 246405 183830 235466 235643 370818 290251 188367 191645 180046 288952 296804 234202 232945
2523 232945 233833 99986 -178957 -263451 -35777 -30451 2097 279211 176626 178089 404601
2512 404601 -11122 -196255 -208835 -480328 -234921 81529 268737 446327 372132 175392
$$ packed form
2586A275637j22184m05706l19602L622N78849L14854K28523K61651M04230j54661
2576B065213o31130k75618j79465J51562n1161k4324L29684L22630j50051j06876
2566A450464j90538m96088j18841k4179j0971J21892J46016J5455K38056j07443
2556A023823m98560l28955k42453p9493K58808J91619J16159L91128j33079k78445
2546D20552J5987j81640j52698L132J37201n0554j36950k0747J53945k6852Q5029
2535B46405o2575N1636J77J35175q0567j01884L278j1599J08906P852o2602j257
2523B32945Q88j33847k78943q4494K27674N326L2548K77114j02585J463K26512
2512D04601m15723j85133j2580k71493K45407L16450J87208J77590p4195j96740
$$ plain form
2502 175392 -103874 91702 17653 -8215 -77101 -235476 110171 169854 39988 3722 46529
2491 46529 87885 -30727 10527 -19932 -38639 -192046 -342399 -155719 -202150 -233249 27890
2480 27890 405264 308382 -130350 -118201 -323685 -114607 -78646 -15320 165567 228174 171982
2469 171982 68405 -193524 -267452 -539999 -541492 -71041 356558 95101 -57562 246801
2459 246801 485404 -109617 -259642 -295510 -164407 -273451 -368753 85476 108158 24252
2449 24252 -298370 -174163 -77880 -321444 -361050 -81271 225609 -26294 -222648 -95150
2439 -95150 -7195 -15375 85684 238327 230975 276112 -89678 -235692 -439291 -584262 -276092
2428 -276092 194138 575845 507784 190774 323210 65516 -270156 -642156 -707147 -435687
$$ packed form
2502A75392k79266J95576p4049k5868o8886j58375L45647N9683j29866l6266M2807
2491D6529M1356j18612M1254l0459j8707j53407j50353J86680m6431l1099K61139
2480B7890L77374r6882m38732J2149k05484K09078L5961O3326J80887O2607n6192
2469A71982j03577k61929p3928k72547j493M70451M27599k61457j52663L04363
2459B46801K38603n95021j50025l5868J31103j09044r5302M54229K2682q3906
2449B4252l22622J24207R6283k43564l9606K79779L06880k51903j96354J27498
2439i5150Q7955q180J01059J52643p352M5137l65790j46014k03599j44971L08170
2428b76092M70230L81707o8061l17010J32436k57694l35672l72000o4991K71460
$$ plain form
2418 -435687 -293625 -7702 361410 525733 286047 -263464 -407522 -702771 -530062 -196883
2408 -196883 160282 450437 423138 249779 27107 -386773 -596926 -742734 -569121 35984
2398 35984 360078 683975 724617 402821 230535 -123992 -360961 -154141 40378 28061
2388 28061 270187 444270 431001 165432 -404914 -510500 -520542 -133057 149128 557261
2378 557261 514363 657412 731362 355807 -37109 -36740 116945 322086 757974 1055597 1170785
2367 1170785 1020342 774283 417307 284971 406567 308604 314712 414934 285378 232279
2357 232279 318412 177114 43761 159604 370865 154337 54997 -42642 2740 300198
2347 300198 207967 179882 168393 240012 142764 59661 -79900 -60494 94803 358275 516915
$$ packed form
2418d35687J42062K85923L69112J64323k39686n49511j44058k95249J72709L33179
2408a96883L57165K90155k7299j73359k22672m13880k10153j45808J73613O05105
2398C5984L24094L23897M0642l21796j72286l54527k36969K06820J94519j2317
2388B8061K42126J74083j3269k65569n70346j05586j0042L87485K82185M08133
2378E57261m2898J43049P3950l75555l92916L69J53685K05141M35888K97623J15188
2367A170785j50443k46059l56976j32336J21596r7963O108J00222j29556n3099
2357B32279Q6133j41298j33353J15843K11261k16528r9340r7639M5382K97458
2347C00198r2231k8085j1489P1619r7248q3103j39561J9406J55297K63472J58640
$$ plain form
2336 516915 345332 249478 133097 -91957 -160959 -396455 -416071 -416506 -328454 -38254 182622
2325 182622 282901 147689 -105816 -171611 -390049 -92378 149649 52728 1134 -339115
2315 -339115 -186191 38082 20495 -130597 -77354 -27855 65378 -165575 -243847 216626 57374
2304 57374 34964 -9611 -147773 -166280 -169813 -217708 -110330 -267011 -229378 -175490 149392
2293 149392 96125 435614 221632 181512 168594 -16441 -184324 -164491 240051 374932
2283 374932 286895 381057 497667 353290 284117 310584 61676 -118968 -69526 -166092 134582
2272 134582 200553 424565 531722 567035 233841 151543 186213 -20898 -40506 154361 243221
2261 243221 614954 507791 546039 548905 336806 262172 -105697 52587 439787 595928
$$ packed form
2336E16915j71583r5854j16381k25054o9002k35496j9616m35Q8052K90200K20876
2325A82622J00279j35212k53505o5795k18438K97671K42027r6921n1594l40249
2315c39115J52924K24273j7587j51092N3243M9499R3233k30953p8272M60473j59252
2304E7374k2410m4575j38162j8507l533m7895J07378j56681L7633N3888L24882
2293A49392n3267L39489k13982m0120j2918j85035j67883J9833M04542J34881
2283C74932q8037R4162J16610j44377o9173K6467k48908j80644M9442r6566L00674
2272A34582O5971K24012J07157L5313l33194q2298L4670k07111j9608J94867Q8860
2261B43221L71733j07163L8248K866k12099p4634l67869J58284L87200J56141
$$ plain form
2251 595928 862057 682069 774626 623551 396833 477178 249038 -89108 -122678 136691
2241 136691 529316 801386 1044508 1079695 954298 623508 580396 547263 383836 251485
2231 251485 614026 895734 943946 938728 649515 451129 674200 803393 779415 602436
2221 602436 871309 1002846 830452 487016 506498 668246 991067 1116120 1138771 982726
2211 982726 938042 868461 730115 595445 682160 871946 1076738 1418329 1637288 1649475
2201 1649475 1627959 1076543 779580 716963 685407 1281379 1696570 1944721 2206222 2316980
2191 2316980 2227338 1867991 1241996 1234491 1252463 1679127 2325966 2357566 2508230 2635317
2181 2635317 2253787 1927327 1769041 1507224 1628016 2023977 2281200 2555746 2598201 2782236
$$ packed form
2251E95928K66129j79988R2557j51075k26718Q0345k28140l38146l3570K59369
2241A36691L92625K72070K43122L5187j25397l30790m3112l3133j63427j32351
2231B51485L62541K81708M8212n218k89213j98386K23071J29193k3978j76979
2221F02436K68873J31537j72394l43436J9482J61748L22821J25053K2651j56045
2211I82726m4684o9581j38346j34670Q6715J89786K04792L41591K18959J2187
2201A649475k1516n51416k96963o2617l1556N95972M15191K48151K61501J10758
2191B316980q9642l59347o25995p505J7972M26664O46839L1600J50664J27087
2181B635317l81530l26460j58286k61817J20792L95961K57223K74546M2455J84035
$$ plain form
2171 2782236 2742564 2654084 2662610 2550110 2655918 2900897 3029871 2948958 3103418 3048283 3307289
2160 3307289 3383806 3300106 3504711 3656508 3812246 3877744 3902802 3727726 3729048 4123386 4612674
2149 4612674 4606671 5407178 5677613 5665017 5722992 5540386 5209949 5488670 5659560 6352379
2139 6352379 7064933 7716336 8314083 8644786 8714427 8352832 8075432 8541144 8704419 9052246
2129 9052246 9705983 10598825 10834141 10960940 11005268 11461347 11700199 12703072 13920960
2120 13920960 15045041 16025527 17497448 19272808 21340190 22479291 23411620 24544684
2112 24544684 26739609 29198619 32448647 35688360 40583526 46707375 55801205 67685106
2104 67685106 85244965 103169754 126902808 142245879 124328294 97150437 71353551
$$ packed form
2171B782236l9672q8480Q526j12500J05808K44979J28974q0913J54460n5135K59006
2160C307289P6517q3700K04605J51797J55738O5498K5058j75076J322L94338M89288
2149D612674o003Q00507K70435j2596N7975j82606l30437K78721J70890O92819
2139F352379P12554O51403N97747L30703O9641l61595k77400M65712J63275L47827
2129I052246O53737Q92842K35316J26799M4328M56079K38852J002873J217888
2120A3920960J124081R80486J471921J775360K067382J139101R32329J133064
2112B4544684K194925K459010L250028L239713M895166O123849R093830J1883901
2104F7685106J7559859J7924789K3733054J5343071j7917585k7177857k5796886
$$ plain form
2097 71353551 54082138 43624417 36315549 30704918 26319401 23377217 20907831 18349461
2089 18349461 16561730 15152918 14483488 14105801 13268417 12192554 11560218 10656594 9942043
2080 9942043 9177492 8067234 7186909 6466380 6279431 6154417 5860424 5552870 5579401 5321750
2070 5321750 4713278 4358036 4097904 3990257 3811254 3586128 3319151 3478673 3500917 3276687
2060 3276687 3284959 3231059 2970212 2783066 2293298 2395014 2225127 1865282 2243273 2331752
2050 2331752 2268827 2416989 2469507 2436879 2189452 1946548 1503750 1130409 1074823 1171266
2040 1171266 1171417 1327255 1512822 1646466 1369241 1107398 976486 755319 652869 506630
2030 506630 911190 1065023 1335445 1162454 1198191 941538 868596 622777 44504 250432
$$ packed form
2097G1353551j7271413j0457721p308868n610631m385517k942184k469386k558370
2089A8349461j787731j408812o69430l77687q37384j075863o32336r03624p14551
2080I942043p64551j110258q80325p20529j86949j25014k93993l07554K6531k57651
2070E321750o08472l55242k60132j07647j79003k25126k66977J59522K2244k24230
2060C276687Q272n3900k60847j87146m89768J01716j69887l59845L77991Q8479
2050B331752o2925J48162N2518l2628k47427k42904m42798l73341n5586R6443
2040A171266J51J55838J85567J33644k77225k61843j30912k21167j02450j46239
2030E06630M04560J53833K70422j72991L5737k56653p2942k45819n78273K05928
$$ plain form
2020 250432 510870 604305 802744 722617 652078 594316 474781 396404 304417 468287 723622
2009 723622 696065 699435 821909 521117 240208 136421 -38580 294479 547704 722330
1999 722330 762560 654644 472774 44726 -33679 -45144 -159412 -66398 225407 700767
1989 700767 642229 565957 307527 -93604 -407727 -409189 -136251 27160 516964 602103 458790
1978 458790 296059 92375 -252347 -446507 -191002 -149309 -21516 415019 314459 76069
1968 76069 -193940 -281023 -52160 -150686 14677 70858 77109 -25205 -149201 -95593 -272494
1957 -272494 -348992 -170988 39428 460869 336845 473303 316596 -11495 -501911 -730245
1947 -730245 -446314 217533 418412 591260 1025833 732469 204952 -122485 -269306 -294274
$$ packed form
2020B50432K60438R3435J98439q0127p0539n7762j19535p8377r1987J63870K55335
2009G23622k7557L370J22474l00792k80909j03787j75001L33059K53225J74626
1999G22330M0230j07916j81870m28048p8405j1465j14268R3014K91805M75360
1989G00767n8538p6272k58430m01131l14123j462K72938J63411M89804Q5139j43313
1978D58790j62731k03684l44722j94160K55505M1693J27793M36535j00560k38390
1968G6069k70009q7083K28863r8526J65363N6181O251j02314j23996N3608j76901
1957b72494p6498J78004K10416M21441j24024J36458j56707l28091m90416k28334
1947g30245K83931O63847K00879J72848M34573k93364n27517l27437j46821k4968
$$ plain form
1937 -294274 -518680 -366089 62355 310210 460362 246258 252375 -115857 -495265 -615735
1927 -615735 -438869 110445 410195 295151 594174 568628 147060 -77279 -225386 -65439
1917 -65439 -93070 -206443 137888 282100 268358 152401 -134469 -216291 -377770 -201389
1907 -201389 -50824 -28841 24674 100558 508509 627448 279737 82110 -37633 57595
1897 57595 -93282 -271669 -91830 16061 -14995 -100643 150699 159644 -106837 -219227 -64729
1886 -64729 -162972 -187073 -189687 -62659 255014 -180545 -219609 -279483 -435828 -401491 -347319
1875 -347319 67875 272987 200312 -24169 96256 65329 -412014 -669986 -342596 57269
1865 57269 33378 -11265 26301 86734 74446 -52391 -71113 -22100 -90501 -451828 -166102
$$ packed form
1937b94274k24406J52591M28444K47855J50152k14104O117l68232l79408j20470
1927f15735J76866N49314K99750j15044K99023k5546m21568k24339j48107J59947
1917f5439k7631j13373L44331J44212j3742j15957k86870q1822j61479J76381
1907b01389J50565K1983N3515P5884M07951J18939l47711j97627j19743R5228
1897E7595j50877j78387J79839J07891l1056q5648K51342Q945k66481j12390J54498
1886f4729r8243k4101k614J27028L17673m35559l9064n9874j56345L4337N4172
1875c47319M15194K05112p2675k24481J20425l0927m77343k57972L27390L99865
1865E7269k3891m4643L7566O0433j2288j26837j8722M9013o8401l61327K85726
$$ plain form
1854 -166102 164382 94605 122315 209432 44923 113363 161564 199453 73491 -184872 61134
1843 61134 395653 582041 694231 662338 742889 518134 -103836 -333626 -14735 331566
1833 331566 551183 830367 1133587 1372696 873241 205451 8837 -93076 -210471 -39887
1823 -39887 182048 180976 123047 101440 396000 248370 -138748 -445189 -270266 -101100 -127576
1812 -127576 -91113 150324 344270 182726 219182 372526 301588 45809 14338 -29953 -292244
1801 -292244 -302531 -212446 113985 481652 761276 412997 427287 386006 -190026 -316279
1791 -316279 -208158 -350739 -487724 -320114 350216 845606 488483 -203690 -262010 -415614
1781 -415614 -563776 -215778 -94466 157255 233380 244830 163230 210112 -497359 -487862 -564030
$$ packed form
1854a66102L30484o9777K7710Q7117j64509O8440M8201L7889j25962k58363K46006
1843F1134L34519J86388J12190l1893Q0551k24755o21970k29790L18891L46301
1833C31566K19617K79184L03220K39109m99455o67790j96614j01913j17395J70584
1823c9887K21935j072n7929k1607K94560j47630l87118l06441J74923J69166k6476
1812a27576L6463K41437J93946j61544L6456J53344p0938k55779l1471m4291k62291
1801b92244j0287R0085L26431L67667K79624l48279J4290m1281n76032j26253
1791c16279J08121j42581j36985J67610O70330M95390l57123o92173n8320j53604
1781d15614j48162L47998J21312K51721P6125J1450q1600M6882p07471R497p6168
$$ plain form
1770 -564030 -302646 -270063 -258683 39731 168284 -1439 -177259 -118995 -214599 -385671
1760 -385671 -555977 -444590 -411395 -133300 -514267 -187054 -97597 -181824 -186445 -169972 -308579
1749 -308579 -593775 -636570 -508341 -219925 -111296 106947 267683 356186 132809 -105017
1739 -105017 90884 53861 -183948 -433886 -425573 -369899 -284996 -383449 -273545 -20246 -211500
1728 -211500 -211967 -102686 -210872 -334617 -319912 -351001 -232152 -196668 -60600 42825 -5268
1717 -5268 75495 -92196 -431599 -496585 -572793 -280663 -221499 -25359 -2621 -68946 71590
1706 71590 160221 -97913 -344198 -515235 -522234 -781287 -684925 -167338 153661 236213 237663
1695 237663 -175857 -365317 -603363 -689815 -463711 -294852 -98114 90606 63131 383084
$$ packed form
1770e64030K61384L2583J1380K98414J28553j69723j75820N8264r5604j71072
1760c85671j70306J11387L3195K78095l80967L27213Q9457q4227m621J6473j38607
1749c08579k85196m2795J28229K88416J08629K18243J60736Q8503k23377k37826
1739a05017J95901l7023k37809k49938Q313N5674Q4903r8453J09904K53299j91254
1728b11500m67J09281j08186j23745J4705l1089J18849L5484J36068J03425m8093
1717e268Q0763j67691l39403o4986p6208K92130N9164J96140K2738o6325J40536
1706G1590Q8631k58134k46285j71037o999k59053R6362N17587L20999Q2552J450
1695B37663m13520j89460k38046q6452K26104J68859J96738J88720k7475L19953
$$ plain form
1685 383084 244469 -132325 -197919 -278708 -472429 -606714 -175651 107460 90915 352800
1675 352800 290971 180771 40778 -302282 -297774 -443542 -300719 -47476 22319 199999
1665 199999 286913 -61241 -314517 -484738 -690076 -479132 -105942 48888 152260 331425
1655 331425 355971 12742 -76533 -365234 -306996 -177777 -61211 87172 573202 613131
1645 613131 187438 -147250 -568737 -820816 -547808 -439177 -7532 470421 620861 312912
1635 312912 -142090 -161729 -712273 -893043 -756883 -498363 57521 359253 451889 531905
1625 531905 290707 -44532 -310370 -525292 -373478 -213824 58275 142124 337737 155976
1615 155976 79138 -189629 -308412 -575603 -751989 -550918 -495277 -250497 93574 329338
$$ packed form
1685C83084j38615l76794o5594q0789j93721j34285M31063K83111j6545K61885
1675C52800o1829j10200j39993l43060M508j45768J42823K53243O9795J77680
1665A99999Q6914l48154k53276j70221k05338K10944L73190J54830J03372J79165
1655C31425K4546l43229q9275k88701N8238J29219J16566J48383M86030L9929
1645F13131m25693l34688m21487k52079K73008J08631M31645M77953J50440l07949
1635C12912m55002j9639n50544j80770J36160K58520N55884L01732R2636Q0016
1625E31905k41198l35239k65838k14922J51814J59654K72099Q3849J95613j81761
1615A55976p6838k68767j18783k67191j76386K01071N5641K44780L44071K35764
$$ plain form
1605 329338 521899 371606 105645 -161914 -392233 -562523 -551089 -405298 63993 438916
1595 438916 490806 272717 144800 -277333 -688875 -790451 -591071 -256739 -172554 334651
$$ packed form
1605C29338J92561j50293k65961k67559k30319j70290J1434J45791M69291L74923
1595D38916N1890k18089j27917m22133m11542j01576J99380L34332Q4185N07205
$$ [...]
##END NTUPLES=NMR SPECTRUM
##END=
