##TITLE=1H_EC-3299(II-3)
 CDCl3
 8 sc, 
 4.8.2023
##JCAMPDX= 6.0         $$ Bruker NMR JCAMP-DX V2.0
##DATA TYPE= NMR SPECTRUM
##DATA CLASS= NTUPLES
##ORIGIN= UXNMR, Bruker Analytische Messtechnik GmbH
##OWNER= root
$$ XWIN-NMR		Version 3.5
$$ Fri Aug  4 13:56:08 2023 Russian Standard Time (UT+4h)  she@DPX200
##.OBSERVE FREQUENCY= 200.13135
##.OBSERVE NUCLEUS= ^1H
##.ACQUISITION MODE= SIMULTANEOUS
##.ACQUISITION SCHEME= undefined
##.AVERAGES= 8
##.DIGITISER RES= 18
##SPECTROMETER/DATA SYSTEM= spect
##.PULSE SEQUENCE= zg30
##.SOLVENT NAME= CDCl3
##.SHIFT REFERENCE= (INTERNAL, CDCl3, 0, 15.7436)
##AUDIT TRAIL= $$ (NUMBER, WHEN, WHO, WHERE, WHAT)
$$ ##TITLE= Audit trail, XWIN-NMR		Version 3.5
$$ ##JCAMPDX= 5.01
$$ ##ORIGIN= Bruker BioSpin GmbH
$$ ##OWNER= she
$$ F:/spectra/data/she/nmr/H-F/1/pdata/1/auditp.txt
$$ ##AUDIT TRAIL=  $$ (NUMBER, WHEN, WHO, WHERE, WHAT)
(   1,<2023-08-04 13:54:44.12 +0400>,<she>,<DPX200>,
      <created by zg, POWCHK disabled, PULCHK disabled
       configuration hash MD5:
       00 E9 B6 7A A2 85 ED C7 34 08 36 98 17 FE 4E 26
       data hash MD5: 16K
       C2 B3 08 51 9B D4 6E 4C 20 FD BA 42 CB 35 60 AB>)
(   2,<2023-08-04 13:54:46.50 +0400>,<she>,<DPX200>,
      <Start of raw data processing
       efp BC_mod = 2 LB = 0.24 FT_mod = 6 PKNL = 1 PHC0 = -21040.51 PHC1 = 7.45272 SI = 16K 
       data hash MD5: 16K
       0B C8 A8 A5 21 C3 7F C7 92 77 A1 3F E4 74 1D 2D>)
(   3,<2023-08-04 13:55:16.06 +0400>,<she>,<DPX200>,
      <pk PHC0 = -5.376585 PHC1 = 5.2 
       data hash MD5: 16K
       28 8A 82 05 FB 81 F6 A1 60 36 86 12 43 85 F2 9B>)
(   4,<2023-08-04 13:55:19.68 +0400>,<she>,<DPX200>,
      <abs ABSG = 5 
       data hash MD5: 16K
       87 62 CC 57 F9 38 8A 0D 45 A8 E8 8A E4 8E 04 7F>)
$$ ##END=
$$ 
$$ hash MD5
$$ 9B D6 D4 DF E0 14 6A 6E B1 0D EF 10 BD 01 58 63
##$RELAX= 
##$RELAX= 
##$RELAX= 
##$RELAX= 
##$RELAX= 
##$RELAX= 
$$ Bruker specific parameters
$$ --------------------------
##$DU= <F:/spectra>
##$EXPNO= 1
##$NAME= <H-F>
##$PROCNO= 1
##$TYPE= <nmr>
##$USER= <she>
##$AMP= (0..31)
100 100 100 100 100 100 100 100 100 100 100 100 100 100 100 100 100 100 
100 100 100 100 100 100 100 100 100 100 100 100 100 100 
##$AQSEQ= 0
##$AQ_mod= 1
##$AUNM= <au_zg>
##$AUTOPOS= <>
##$BF1= 200.13
##$BF2= 200.13
##$BF3= 200.13
##$BF4= 200.13
##$BF5= 200.13
##$BF6= 200.13
##$BF7= 200.13
##$BF8= 200.13
##$BYTORDA= 1
##$CFDGTYP= 0
##$CFRGTYP= 5
##$CHEMSTR= <none>
##$CNST= (0..31)
1 1 145 1 1 1 1 1 1 1 1 1 1 1 1 1 1 1 1 1 1 1 1 1 1 1 1 1 1 1 1 1 
##$CPDPRG= <>
##$CPDPRG1= <>
##$CPDPRG2= <>
##$CPDPRG3= <>
##$CPDPRG4= <mlev>
##$CPDPRG5= <mlev>
##$CPDPRG6= <mlev>
##$CPDPRG7= <mlev>
##$CPDPRG8= <mlev>
##$CPDPRGB= <>
##$CPDPRGT= <>
##$D= (0..31)
0 1.2 0 0 0 0 0 0 0 0.06 0 0.03 0 0 0 0 0.0002 0 0 0 0 0 0 0 0 0 0 0 0 
0 0 0 
##$DATE= 1691142883
##$DBL= (0..7)
120 120 120 120 120 120 120 120 
##$DBP= (0..7)
150 150 150 150 150 150 150 150 
##$DBP07= 0
##$DBPNAM0= <>
##$DBPNAM1= <>
##$DBPNAM2= <>
##$DBPNAM3= <>
##$DBPNAM4= <>
$$ [...]
##$SUBNAM3= <"">
##$SUBNAM4= <"">
##$SUBNAM5= <"">
##$SUBNAM6= <"">
##$SUBNAM7= <"">
##$SUBNAM8= <"">
##$SUBNAM9= <"">
##$SW= 18.05172834244
##$SWIBOX= (0..15)
0 0 2 0 0 0 0 0 0 0 0 0 0 0 0 0 
##$SW_h= 3612.71676300578
##$TD= 16384
##$TD0= 1
##$TE= 0
##$TE2= 300
##$TE3= 300
##$TEG= 300
##$TL= (0..7)
0 120 120 120 120 120 120 120 
##$TP= (0..7)
150 150 150 150 150 150 150 150 
##$TP07= 0
##$TPNAME0= <>
##$TPNAME1= <>
##$TPNAME2= <>
##$TPNAME3= <>
##$TPNAME4= <>
##$TPNAME5= <>
##$TPNAME6= <>
##$TPNAME7= <>
##$TPOAL= (0..7)
0.5 0.5 0.5 0.5 0.5 0.5 0.5 0.5 
##$TPOFFS= (0..7)
0 0 0 0 0 0 0 0 
##$TUNHIN= 0
##$TUNHOUT= 0
##$TUNXOUT= 0
##$USERA1= <user>
##$USERA2= <user>
##$USERA3= <user>
##$USERA4= <user>
##$USERA5= <user>
##$V9= 5
##$VALIST= <valist>
##$VCLIST= <CCCCCCCCCCCCCCC>
##$VD= 0
##$VDLIST= <DDDDDDDDDDDDDDD>
##$VPLIST= <PPPPPPPPPPPPPPP>
##$VTLIST= <TTTTTTTTTTTTTTT>
##$WBST= 1024
##$WBSW= 4
##$XGAIN= (0..3)
0 0 0 0 
##$XL= 0
##$YL= 0
##$YMAX_a= 339795
##$YMIN_a= -329210
##$ZGOPTNS= <>
##$ZL1= 120
##$ZL2= 120
##$ZL3= 120
##$ZL4= 120
##$ABSF1= 15.73257
##$ABSF2= -2.31928
##$ABSG= 5
##$ABSL= 3
##$ALPHA= 0
##$AQORDER= 0
##$ASSFAC= 0
##$ASSFACI= 0
##$ASSFACX= 0
##$ASSWID= 0
##$AUNMP= <proc_1d>
##$AZFE= 0.1
##$AZFW= 0.1
##$BCFW= 0
##$BC_mod= 2
##$BYTORDP= 0
##$COROFFS= 0
##$CY= -3
##$DATMOD= 1
##$DC= 0
##$DFILT= <>
##$DTYPP= 0
##$F1P= 0
##$F2P= 0
##$FCOR= 1
##$FTSIZE= 16384
##$FT_mod= 6
##$GAMMA= 0
##$GB= 0
##$INTBC= 1
##$INTSCL= 3.70164e-10
##$ISEN= 128
##$LB= 0.24
##$LEV0= 0
##$LPBIN= 0
##$MAXI= 10000
##$MC2= 0
##$MEAN= 0
##$ME_mod= 0
##$MI= 1.114404
##$NCOEF= 0
##$NC_proc= -6
##$NLEV= 6
##$NOISF1= 3.799351
##$NOISF2= 2.8
##$NSP= 0
##$NTH_PI= 0
##$NZP= 0
##$OFFSET= 15.74358
##$PC= 1
##$PHC0= -21045.89
##$PHC1= 12.65272
##$PH_mod= 1
##$PKNL= yes
##$PPARMOD= 0
##$PSCAL= 0
##$PSIGN= 0
##$REVERSE= no
##$SF= 200.130005595562
##$SI= 16384
##$SIGF1= 3
##$SIGF2= 2
##$SINO= 5.538805
##$SIOLD= 16384
##$SREGLST= <1H.CDCl3>
##$SSB= 0
##$STSI= 16384
##$STSR= 0
##$SW_p= 3612.71676300578
##$SYMM= 0
##$S_DEV= 0
##$TDeff= 16384
##$TDoff= 0
##$TI= <>
##$TILT= no
##$TM1= 0
##$TM2= 0
##$TOPLEV= 0
##$USERP1= <user>
##$USERP2= <user>
##$USERP3= <user>
##$USERP4= <user>
##$USERP5= <user>
##$WDW= 1
##$XDIM= 16384
##$YMAX_p= 301067341
##$YMIN_p= -315991
$$ End of Bruker specific parameters
$$ ---------------------------------
##NTUPLES= NMR SPECTRUM
##VAR_NAME=  FREQUENCY,     SPECTRUM/REAL,   SPECTRUM/IMAG
##SYMBOL=    X,             R,               I
##VAR_TYPE=  INDEPENDENT,   DEPENDENT,       DEPENDENT
##VAR_FORM=  AFFN,          ASDF,            ASDF
##VAR_DIM=   16384,         16384,           16384
##UNITS=     HZ,            ARBITRARY UNITS, ARBITRARY UNITS
##FACTOR=    0.220516191357247, 1,           1
##FIRST=     3150.76272637695, 0,            0
##LAST=      -461.954036628827, 0,           0
##MIN=       -461.954036628827, -315991,     0
##MAX=       3150.76272637695, 301067341,    0
$$ Real data points
##PAGE= N=1
##DATA TABLE= (X++(R..R)), XYDATA
$$ [...]
14329 -34880 115 -31261 67277 72935 64998 132839 97976 4787 -7603 84604 178063 114040
14317 114040 -22414 -38165 -35130 -85117 -30175 -12025 42632 -27177 -87891 8454 -42200
14306 -42200 136558 94428 -5486 -103078 -21563 66776 4109 -121954 -49053 25279 -71750
14295 -71750 -64073 68685 132328 -55278 -78574 53167 37492 -40871 -16795 14921 40784
14284 40784 5589 -8923 89914 162876 138608 -12877 -75582 -84892 17638 40497 35898 55261
14272 55261 -10591 60759 21417 -121506 24715 11972 17112 -69504 -145013 77005 102771
14261 102771 91893 -32940 -142148 92565 181984 127770 59623 -24922 -77478 7611 58160
14250 58160 -2107 -14647 -34532 41151 -1696 -31997 -129807 -64955 -14584 -73551 -111507 -50705
14238 -50705 -49663 -88156 -67267 28892 53721 28072 -14419 -87146 1309 -42428 -99883 -72643
14226 -72643 38039 -68784 -38447 6700 -29391 -21755 43060 26634 63751 44757 -61775
14215 -61775 -32023 18369 -40712 -33386 27995 41167 -107861 -98243 57120 42304 89019 -1016
14203 -1016 80960 230772 228849 82614 62833 143674 126620 -823 -78762 -145918 -92986
14192 -92986 -73248 -72310 -105389 -20735 -48289 6872 -2672 -64795 -52305 -57069 -83871 -128074
14180 -128074 -125285 -31371 -14986 19241 -27549 -44395 -34304 2668 -52985 -68310 -7445 -4047
14168 -4047 -2425 33334 89449 -21332 8601 -87308 -32413 -29795 -83126 -114275 -141208 -14831
14156 -14831 6578 -4419 50321 62014 -25831 -98267 14149 -92931 -112672 -33126 86293
14145 86293 125385 106389 14862 46895 57405 68148 164478 107695 129701 110737 133771 23765
14133 23765 66864 50864 35621 38446 -57533 -32554 67411 148644 94551 28596 -33634 -49764
14121 -49764 -6482 116754 78037 -46690 -114949 -23030 -17146 -50003 10502 97383 129445
14110 129445 59418 119525 18050 -44395 106173 45585 -31795 -83513 -118543 11533 66202
14099 66202 59713 36034 23844 29165 32328 26417 87793 196134 189059 135301 60184 40025
14087 40025 -63584 -37906 43211 32497 20475 80248 -1586 -38846 35670 -15861 -10557 17941
14075 17941 -37815 -162365 -80858 -79383 49864 36551 26999 -1747 71061 43257 64902 -29457
14063 -29457 -99738 -120648 -120432 2188 42617 56211 -43823 -15778 -5271 53739 -5936 16619
14051 16619 -60135 -47870 -25249 -42096 12942 65989 130294 20603 1434 63911 118346
14040 118346 45119 52333 -9028 -32155 -40137 -74956 63532 92498 22117 -20876 93130
14029 93130 77889 68416 -85367 -78540 -78924 34002 34989 -52638 -37656 -103658 -75122 -89738
14017 -89738 -128484 -79472 -109058 -161671 -91292 -43882 12532 30566 -3081 -22174 -29354 -58638
14005 -58638 -35212 46656 54952 56671 69037 29779 -138480 -1207 -4771 -150129 -25322
13994 -25322 -51025 -50063 -5208 -9049 16717 -21640 42506 99763 97575 143362 88596 65017
13982 65017 77475 3117 -3087 122748 192852 126015 106314 -10257 -83842 48463 -46439
13971 -46439 -121270 -91559 -52755 -90299 -73661 -9860 55095 84326 84307 23232 6546 58499
13959 58499 28905 -17664 -17243 -78806 -91405 -18875 -59511 17789 -8488 17856 26858 21280
13947 21280 208333 166384 67867 -50751 -25448 -2610 32751 18243 17558 7588 -35989 -80780
13935 -80780 -56284 9266 44960 42008 113780 5814 -120971 -99180 -175037 -144773 -24651
13924 -24651 -50379 -22885 68280 -60693 -62294 -123907 -184959 -79167 6456 4969 4091 -55326
13912 -55326 24137 16611 -58699 54446 98249 106174 67227 46742 23578 53984 60120 -13890
13900 -13890 -58363 -109735 -146906 -124469 -70825 -72729 47572 -7510 -36999 -82864 -67903 -14800
13888 -14800 11298 17360 -18099 -34863 -42003 -6262 -86738 -121315 -98367 132990 264855 169807
13876 169807 91707 37762 65770 105 -30 -123841 -50232 26374 -28100 52054 9994 16999
13864 16999 -1698 35724 186 -129752 -113397 4273 62017 28009 -43045 -55027 -177886
13853 -177886 -153997 -182295 23153 93386 79155 24969 -52668 -67026 -79053 -34625 -52519
13842 -52519 -43597 9737 -86394 -53415 -78274 -186889 -136965 -3182 3149 18198 -28866 -2042
13830 -2042 35398 4123 -105049 -50227 -1451 -61128 31277 3082 61648 51347 -6301 1433
13818 1433 58369 13390 -172351 -174100 -95726 -58280 45425 -12569 -13782 -14584 4994 -64736
13806 -64736 -42090 -20818 -45503 -42969 81235 21801 42691 -47919 -78317 -80174 -18804 -53920
13794 -53920 -28293 70903 13026 -21132 -96349 -135426 -65165 -27671 -29303 22454 6201 -20146
13782 -20146 33289 -31698 -80296 -66734 -1211 -67359 -13152 -8000 -21900 -55936 -48209 -50548
13770 -50548 -88579 58523 43977 14516 -43568 -32848 -102086 -30357 22793 53004 133979
13759 133979 165601 55684 -43727 39955 95102 167335 107548 61703 104474 57279 20952
13748 20952 13830 -3280 24645 17886 -22849 92143 36287 -58807 -11534 71628 49368 42033
13736 42033 116267 63904 29790 -48600 -2284 -63557 -860 99178 29287 80948 98252
13725 98252 18407 30894 -30637 85205 67363 -65183 -38197 -32434 -17547 18038 41533
13714 41533 -7008 64643 22586 22128 -23719 58524 30851 81267 72727 80546 67571 75603 104361
13701 104361 109362 -32321 -100261 38995 -1585 -132410 -165912 7130 51578 -74965 -81518
13690 -81518 65181 84850 16465 30745 -5826 22923 -12354 -11359 -18715 -70467 -84865 -125028
13678 -125028 -96054 -71941 -84253 -132198 31253 128161 132242 32921 55505 105546 79823
13667 79823 84214 -24397 24492 -111419 -89615 -6020 82859 -25455 -40665 -69242 -150387
13656 -150387 -108821 -50924 -51470 -68052 19188 16514 -51355 119148 99828 118494 60437 -22717
13644 -22717 -51210 73857 167931 105270 155670 48290 -272 79439 160571 107559 41281
13633 41281 48030 -71098 -89063 27080 21295 102521 19339 -52465 -50168 24072 100697 137025
13621 137025 -14228 137 124480 89299 46709 166998 83012 -24400 -106078 29562
13611 29562 100893 136674 71147 58945 -59032 45235 88598 -2483 24136 -34126 -55464
13600 -55464 -113536 7596 28796 15229 29043 1221 -16921 -74362 -15100 -64854 -29291
13589 -29291 -34981 -60868 26477 74078 108164 -18828 45871 21095 -10686 -62461 24844 48545
13577 48545 24760 53136 78715 75391 -100559 -54638 45871 20840 -34314 -101541 -164583
13566 -164583 -140475 -146364 -126453 -73978 15499 69466 65515 -66378 -56280 -51102 7423 21741
13554 21741 29995 -25626 -26776 -22346 -41459 -45170 24047 55592 63380 93460 68027 44536 -28346
13541 -28346 -186885 -104842 -9782 -55453 -75494 71877 68400 -8710 94239 67284 70234
13530 70234 87317 72074 24118 116987 -21781 -80493 -34508 55338 -32323 -30825 139924
13519 139924 110341 28047 81081 29457 -14451 -69399 -54651 -90862 34561 53908 -88161
13508 -88161 -38643 76035 -22596 33733 27983 -83845 -108817 -111988 -29854 -72711 -57898 15021
13496 15021 -108765 -5245 -20848 -126512 -128263 -207396 -69776 -24180 -69810 13670 -101415
13485 -101415 -54138 -13200 -29097 26109 87509 137481 113118 19767 -65385 15846 57315
13474 57315 -140345 -196931 -34755 -43657 -87997 -108661 1552 38009 48651 47065 38898 -29956
13462 -29956 -79912 -86249 -106536 -10981 52065 -895 79309 -80294 -7545 -18109 -99683 -35258
13450 -35258 -136269 -151504 -200787 -169352 -28701 53904 -23762 -57481 -15809 -53620 -42087
13439 -42087 -76338 -139170 -129938 -129103 -29463 38763 -2441 22129 23966 7229 -34993 -100793
13427 -100793 -52752 -44690 -41304 -71004 -78406 -74167 -87138 -76682 -62483 -76439 -121245 -45167
13415 -45167 94442 31518 180878 149734 51852 74355 38747 12617 -28552 -25961 56829
13404 56829 -13115 -137344 833 20937 -105861 -133119 -30633 16791 49007 37675 -2244
13393 -2244 -71206 -73574 -5759 -18560 -127573 -39621 87817 -15392 -104979 -34843 230
13382 230 -35524 -83286 -119402 -132675 -74036 -57889 50663 21104 -7078 -115637 -108812 -66005
13370 -66005 153950 143182 53573 86829 -131875 -144357 -48959 -111772 -61474 51099 145141
13359 145141 102217 112958 79323 58847 28693 64156 43747 -66025 -86871 -80237 -115416
13348 -115416 -88291 -2116 12076 154094 20934 -727 -65754 -92619 -27580 -22789 14688
13337 14688 -82696 -40533 53172 106736 137520 -19668 -169110 -290453 -74931 -89196 -112347
13326 -112347 -115139 6716 -93171 -14799 45081 -183409 -36188 42265 19024 -85827 -56506
13315 -56506 -23098 14316 59596 60636 75993 127016 1145 -88974 -88371 -44558 -5945 19451
13303 19451 40923 4644 -103306 -94726 -3736 63656 95388 88704 69574 -39785 -19017 -54691
13291 -54691 -36643 -26223 -186074 -147854 -80181 -174844 -59889 -1411 23769 -45321 -123824
13280 -123824 -42209 -9686 82425 27791 25714 47137 -73528 -119320 -157244 -118837 -68784
13269 -68784 -121005 -36325 13166 30281 -90373 -110403 -52965 -63595 78068 -25964 -41992
13258 -41992 -18707 -75547 -219198 -119520 -33744 24890 -20542 -75874 -116636 -103952 -41791
13247 -41791 102256 -3216 -22418 131524 17086 -7078 -39088 21157 -84982 -101461 -88805
13236 -88805 -3163 -34662 603 -22814 -195832 -223246 -201167 -170345 -36957 -59613 -66670
13225 -66670 -3502 24077 -69214 -64795 -134432 -187709 -157766 -115591 -38127 -11734 22855 34101
13213 34101 12628 -41341 -29261 -183933 -68347 19864 -58832 -142650 -100460 -36861 -124041
13202 -124041 -42895 42630 -72351 -102710 -189107 -130153 50190 120954 -27922 43029 26661
13191 26661 -62535 9090 32809 14581 10163 59969 36586 -42120 -36409 -25901 -96667 24987
13179 24987 -90287 10230 45049 36362 -30171 7070 -14125 -44146 26723 -31136 -53725
13168 -53725 47627 14588 -9755 11948 -145220 -135432 -48522 34180 -48770 -120247 -145474
13157 -145474 -157863 -121431 -37659 -12696 -54694 -63114 -86035 -37495 -142413 -94635 -40665
13146 -40665 -24246 27920 -47706 -121640 -112652 -123768 -186748 -127491 -43577 -73294 -80550 -37377
13134 -37377 -102076 -4625 -36594 -51442 -48869 -74311 -118746 -108827 14954 -30335 -47192 -80954
13122 -80954 -135788 -153411 -76723 -80528 -138094 -93635 -89196 21100 41159 58631 4504 -73343
13110 -73343 36375 5905 43925 22653 -8270 59557 -57811 -47818 82116 -71530 -231487
13099 -231487 -179815 -48817 -104727 -73632 -73842 -187842 -69027 4851 -32421 -136493 90526
13088 90526 96826 -27125 -178751 -220006 -146968 -34817 -27242 -66591 -167010 -69474 66694
13077 66694 10781 -17807 -16873 47174 130326 27925 -75758 -128062 -79203 64554 140500
13066 140500 72445 -16107 7190 -65974 -54244 -91747 38140 9493 1477 34246 -15240
13055 -15240 -10445 -6012 -34085 44494 73032 128057 115567 79321 23163 -71670 -69781 -40379
13043 -40379 -46916 -9355 -66859 -80243 -106200 -49016 84826 42966 -80760 -56665 -102097
13032 -102097 -83279 -27882 -634 114877 115671 66317 43791 -19625 -30378 -22019 -60933 -165343
13020 -165343 -128223 -162830 -136847 -112614 -191995 -202027 -197885 -66806 -37722 -24988 -3852
13009 -3852 34617 72189 107160 64341 59317 -3704 -63863 -35681 32136 -5363 77029 34964
12997 34964 -10189 -25321 -23121 -50698 -45444 -121528 -91354 -61541 -19000 -130787 -191912 -76166
12985 -76166 -104835 -63976 -73101 -77879 -118549 -140631 -164835 -165849 -54004 74997 -58405 -99762
12973 -99762 -106216 -59997 -23635 39814 -22238 -29211 141776 51016 -115009 -225874 -193136
12962 -193136 -105842 -2347 -76495 -122290 -172088 -135861 -130305 -12315 26470 14058 19866
12951 19866 62852 60087 2878 42958 42882 95780 -5581 -16155 -48516 -100410 -86308 -86688 -20494
12938 -20494 23048 -37700 -56461 -65679 -81650 33060 22303 21251 -50843 -135084 -127453 -83538
12926 -83538 57918 -10688 -61631 -4750 757 -69134 -173521 -199192 -541 37572 -50782
12915 -50782 -84874 384 66726 -16753 -53081 -172795 -204229 -164970 -150983 -160322 -176398 -214306
12903 -214306 -278089 -198382 -146544 -31462 -87693 -43272 -26553 -16232 -57676 -112353 -100089
12892 -100089 -110145 -149975 -41136 -25460 -77513 -79716 -1629 55853 -30754 -37067 -29977 -25157
12880 -25157 -35359 -23867 -55454 59578 102431 53111 43104 40209 6038 -17132 25191 51397
12868 51397 -38076 595 -84700 -97932 -46603 -56763 21600 37954 -9353 -203576 -177544
12857 -177544 -109366 -50695 -75066 60897 177293 111536 31657 -5047 98494 162420 161898
12846 161898 78808 23497 -1236 -63278 -18418 68740 20469 147359 79156 128863 119365
12835 119365 38147 60208 -14458 54678 20331 -9969 -138160 -192236 -183629 -158634 -79082
12824 -79082 -38219 89265 25129 -55193 -110450 -143932 -122038 -57893 17744 23763 32023 136798
12812 136798 8368 -18470 -11198 -133590 -82384 20178 116727 56148 -51454 -62428 -70443
12801 -70443 14679 62946 10106 -69345 -95018 -85393 -166295 -204481 -120148 125025 131567 107584
12789 107584 39472 -89038 -7567 -10288 -19853 -21812 -105336 -97038 9815 48979 6395 20218
12777 20218 -1058 -30958 34707 108612 178877 64723 -8787 29810 5528 -86022 -81975 5884
12765 5884 7334 -36995 -5502 -135936 -155534 -96955 -53571 -38733 20055 -80352 -92216 8997
12753 8997 -60456 -26135 -57484 -36959 -100727 -140703 35762 68709 62278 78 -23555 22640
12741 22640 92306 79677 15193 -6418 -70531 40911 -40250 -103107 -105254 -94952 -60471 -50075
12729 -50075 -59001 -5397 -30859 28211 7347 45670 39031 -51160 -37292 -94071 -102855 -23507
12717 -23507 33283 10231 14558 -69168 -76590 -23091 73391 34268 -112134 -133275 -95454 -54043
12705 -54043 -205471 -211965 -107463 -57008 -126300 -57546 -30632 -41491 -26153 -95691 -144329
12694 -144329 -173170 -283012 -202049 -108862 -46843 125740 15140 -82594 -54790 -79746 -109671
12683 -109671 -83732 -78542 -48691 -7116 54783 -80660 -140820 -192411 -3733 19760 -107493
12672 -107493 -88734 -261 9084 -39483 -37641 -134541 -111300 -131378 -64689 35710 -43465 -91709
12660 -91709 -47744 -33881 55613 -1222 -34627 -95987 -112207 -68853 -164312 -182951 -127799 -226845
12648 -226845 -97161 8653 -17109 32092 -11836 114560 88979 -18720 -79098 -68444 -72267
12637 -72267 -66567 63885 89173 34587 49259 22518 -114849 -160056 -102705 -24985 37753
12626 37753 70104 -53349 -128744 -110851 -185211 -80269 -103076 -147741 -81866 -244396 -70069
12615 -70069 -3038 -74285 -74477 -62350 -56129 9777 -43056 -9727 -34869 -63316 7676 -101369
12603 -101369 9691 -9986 6517 46331 154762 83321 33038 -17100 -37842 18561 -48922
12592 -48922 -80470 -84550 -198992 -128801 -218308 -150547 -20423 -13694 -51681 -133314 -118247 -72413
12580 -72413 -41358 -10009 -63041 -86481 -149780 -186306 -152331 -129324 -96926 -13637 -74007 -42967
12568 -42967 9890 -133900 -39680 22900 -88535 -69082 -9041 -126573 49131 -134 -100639
12557 -100639 -142923 -105263 -155813 -171940 -157834 -97424 -149607 -116653 -117883 -132941 -50340 -3906
12545 -3906 -32935 25279 27102 -57998 -57724 -67593 -50892 -69535 -71419 -133324 -69610 -95431 -166112
12532 -166112 -93704 -116215 -128847 -54117 -128467 -67799 31906 1709 -34456 -83616 -69260
12521 -69260 -44360 12742 -35322 -130708 -216665 -276785 -219778 -149516 -128994 -108652 19620
12510 19620 -14682 22805 4138 59374 69258 55279 34213 -21385 112425 104645 177212 239600
12498 239600 47436 -22499 -105667 -2690 -28656 -95117 604 58866 -22300 -102493 -171664
12487 -171664 -145435 -105596 -265302 -272080 -155983 -42838 -63123 2076 -52979 -62071 119880
12476 119880 70147 -55288 -35925 32701 -55401 -97776 -194837 -162259 -80599 -138112 -83756
12465 -83756 -46102 1480 32550 64328 -16659 -95202 7783 33149 -61706 88332 83087
12454 83087 -54255 -208688 -150498 -179320 -126590 -33802 32321 59025 -121745 -186329 -121792
12443 -121792 -101921 -175461 -143010 -16333 4360 -17830 15040 8172 -26712 -37899 9265
12432 9265 -7261 -186928 -108824 -153121 -120391 -35210 -61715 -105017 -133366 -31520 -78716
12421 -78716 -60136 -47509 -56570 -55256 31544 48600 22433 -57302 -36211 -12801 -60879 62802
12409 62802 82470 123399 -22958 -103244 -90754 -55027 -14012 38475 -117775 -140127 6899
12398 6899 -61446 -140492 -163526 -192282 -135517 -81637 -190962 -197816 -75126 -3575 2118 29859
12386 29859 -91628 -37814 -38516 28040 -51467 -19180 -16595 -3706 -171605 -211275 -231150 -173333
12374 -173333 -109449 -145163 -87666 -70009 -16791 -15455 -65441 -20651 14729 -9367 -10298 -84967
12362 -84967 1330 11795 -109153 -108190 -70431 -63620 -109130 -90822 -120396 -142948 -104195 -24083
12350 -24083 -75743 47578 -5569 15462 46914 -127969 -171031 -120689 -71748 -163460 -123287
12339 -123287 -148950 -116014 -104545 -128710 -106723 -29419 -13887 -123331 -115902 -183593 -228638
12328 -228638 -92298 26477 72919 -55255 -160561 -109925 -84996 75773 98101 -102575
12318 -102575 -141679 -157375 -29153 -29988 -48222 -55346 -52475 -106657 -87018 -67139 -43449 -108533
12306 -108533 -57756 -63004 -110748 -135593 -177383 -132946 -29094 -13627 50292 13186 -6890
12295 -6890 -14524 79231 109908 -63744 -105153 -50456 -42248 -36656 106551 142820 54744 -27849
12283 -27849 -86436 -111377 -61797 18780 -61874 -139822 -105811 -95408 -116778 -14654 2471
12272 2471 -15904 -77810 -36073 -7804 12539 -33515 -99054 -125209 -195741 -53533 -46502 -35032
12260 -35032 27162 29998 18156 -21747 -28994 7690 99634 33854 -34529 -12488 25940 -10941
12248 -10941 -77498 -18216 -7471 15844 -3235 -69791 -23292 -25958 -97436 44819 25703 20038
12236 20038 35039 -7243 -27797 6659 -69099 -96827 -122269 -102314 -175043 -130622 -33613 -44407
12224 -44407 -11812 -5209 -62374 -77212 20499 48969 80574 10375 -33136 -94051 -65167 50090
12212 50090 -34417 -47318 28337 83832 -23909 44516 93214 -10979 39078 61574 57787
12201 57787 89762 79129 -5047 -64876 -1563 -24476 -39893 -120764 -62106 -43074 -141347 -92486
12189 -92486 -5929 -55525 -1884 8776 43480 -101727 -71884 -21851 -21168 99661 108841 28848
12177 28848 -81140 -56181 125486 164833 22491 -16921 -98495 -161461 -131161 -30665 -83220
12166 -83220 -35498 25711 48388 54266 122000 47156 3790 118945 111975 20245 30139 48056
12154 48056 48199 -52886 -25682 -71522 674 62670 85331 24624 120575 -37605 -122893 -36377
12142 -36377 -51898 47359 -2116 -110622 -95051 -81083 -92567 -53171 45248 120541 83226
12131 83226 128790 112674 17823 28334 -1258 -8007 -21117 -136064 -180853 -131668 -73246 -133448
12119 -133448 -130988 34835 62101 17816 67632 27879 7369 53858 166412 139508 100918
12108 100918 -18245 -32188 -9139 8340 63368 107659 101375 32164 4904 -84070 -55232
12097 -55232 -11940 -26739 -1599 -2680 -19608 -11647 11429 7671 15048 138515 164229 156881
12085 156881 62461 116683 25351 -29029 59000 39007 4716 2947 77617 -32887 -15729
12074 -15729 15157 37559 128452 187557 91800 58406 94105 57178 41599 99366 192293 202044
12062 202044 120797 49113 48882 23378 98957 34308 15694 154087 150397 151119 118043 93473
12050 93473 118392 64183 51153 64890 103 38322 19483 63351 -37846 3469 59964
12039 59964 107635 178051 99041 47751 107834 124295 98977 265947 282019 172327 205509
12028 205509 218759 226345 188827 56527 90949 134621 28085 83508 147445 252105 227249
12017 227249 73715 108914 171410 152195 192074 283718 172159 142853 191221 118924 236239
12006 236239 271151 199251 174152 83311 143000 189424 150279 190160 172708 250829 181733
11995 181733 146238 157597 196116 306686 185720 251307 267648 342632 441380 333993 286451
11984 286451 339998 297899 282507 367871 341986 346357 276387 284886 308283 202329 246935 295302
11972 295302 297263 339479 379796 303369 405581 366933 408627 423412 394129 299912 410333
11961 410333 560468 523701 427891 374025 413813 400919 322157 414227 400236 434937 534048
11950 534048 559371 555647 567356 597886 568609 578879 626058 544513 621945 681684 645227 550318
11938 550318 564925 751747 694114 707823 712859 767117 698134 700231 697930 768565 731373 816483
11926 816483 874965 891662 881093 885768 912813 1029301 1049686 1123650 1120097 985396 1065415
11915 1065415 1090723 1110663 1283006 1302592 1215639 1291823 1242920 1331565 1287876 1187725 1182632
11904 1182632 1092727 1124545 1157096 1173041 1103887 1030734 947504 1016902 902272 942033 952716
11893 952716 816186 780345 793907 811485 846890 903346 886876 911561 671786 594881 549861
11882 549861 520738 481960 543540 585303 514080 457075 434100 555090 512689 452703 471668
11871 471668 446116 472848 509814 545530 401743 436711 467608 319678 289107 276135 421252
11860 421252 472557 514958 470270 396670 366777 361205 314330 391172 492125 437123 393424
11849 393424 399415 396488 334694 429679 464660 439751 406524 410431 329113 340746 386737 401365
11837 401365 369096 360787 341092 389972 386153 260950 317910 298978 358026 384478 250784
11826 250784 305803 404261 372118 307397 320144 365500 473339 377665 376554 355902 379914
11815 379914 353629 326775 364908 245074 255101 220438 190341 180767 277766 324562 398658
11804 398658 218938 222582 294690 125098 113559 141874 177368 194890 303374 300098 340261
11793 340261 322845 283660 296299 238566 270046 290506 254535 261394 336757 171301 257750
11782 257750 238739 108426 226138 275673 311663 349063 348429 256630 305670 275459 292231
11771 292231 273290 364533 356116 333259 330328 304405 234771 321293 416796 440098 534310 327221
11759 327221 290876 299039 401732 327377 333708 376325 287890 320300 294484 157326 149907 268283
11747 268283 283780 196905 206181 334449 312901 278119 239158 261590 238639 288000 232445
11736 232445 214172 152929 134884 258275 157231 138960 233316 274157 203798 127691 94116
11725 94116 70748 198690 107413 105766 143992 132739 311609 275380 244568 289635 322656
11714 322656 268901 359273 362999 281702 253755 178002 170810 198379 105359 263920 274890 265920
11702 265920 158614 61520 80568 154886 307137 234831 187376 216828 190022 210542 125866
11691 125866 139908 176412 227396 168755 207100 239076 216924 193196 172131 61676 23989
11680 23989 167568 233908 230668 233936 273452 258615 233243 171763 255410 238517 292192 369152
11668 369152 286175 195151 284711 304826 329485 314035 289195 249803 84525 70944 205351
11657 205351 238576 106954 63021 111711 116926 217892 165394 178526 158122 191468 89007
11646 89007 131567 177206 241985 201936 196954 145782 102697 187215 114477 97016 165151 164080
11634 164080 122643 114193 210348 133469 200651 156026 78069 77502 -36384 34756 111721 124572
11622 124572 66481 127600 107518 68732 114434 89310 107328 118295 127733 229483 148364
11611 148364 137358 67383 206784 204966 95375 95797 50791 140351 165973 77129 71230 -8764
11599 -8764 -18476 205864 214358 26458 10415 107119 141854 108321 161746 191881 127130 129287
11587 129287 60701 40405 63998 89020 -1694 55743 146886 99477 147497 105921 128718
11576 128718 66597 -16220 -19727 46168 120094 125787 36226 78813 73730 33505 47813 82225
11564 82225 132683 175538 171690 169842 121326 21140 -2566 -32495 -4702 143177 112430 64134
11552 64134 59328 155816 132414 76571 114255 105362 131602 -32247 -120780 -19020 62227 7849
11540 7849 26681 159383 235440 247522 109471 71803 106874 152042 127429 142347 199227
11529 199227 159858 122743 155258 182026 146149 262999 178668 109920 134094 130189 226116
11518 226116 254641 265394 167676 156972 153316 118596 120959 95305 168638 75676 99927 -14645
11506 -14645 -37006 5342 85629 53956 169753 138861 41022 115560 100206 198958 44685
11495 44685 81927 128235 42077 27933 95003 187081 128027 -8090 -37557 137895 96398
11484 96398 53843 109627 50465 93186 178984 169765 22764 45971 33809 79967 94748 32154
11472 32154 132840 95089 49710 22593 20140 19722 -64068 -66268 59735 56382 39407 17348
11460 17348 -54785 -106477 -51095 -93192 -66180 5948 -13182 -16351 -65093 20691 -33709 -29533
11448 -29533 -5028 -45616 -69683 23592 52183 20869 -48465 -50661 397 -8823 45616 37736
11436 37736 86903 36061 -43518 -56044 -266 16052 -32327 -76750 -112600 -58111 -143293 -57227
11424 -57227 17228 24188 90133 72406 67218 104627 110899 33794 -143834 -150785 -107989 59560
11412 59560 -60424 -29561 4727 -79272 -94697 -35098 79419 -5771 -88604 -23281 11857
11401 11857 34802 16389 -24369 -37869 -77165 -46273 6875 42035 -87217 -8483 7409
11390 7409 41604 4602 -70694 -21292 17887 -48530 -21576 -32611 -57608 -134779 -160542 -129520
11378 -129520 -42423 -12417 -9183 -36259 20996 33765 -21975 -83151 -61045 -62030 -23408 -29947
11366 -29947 32273 62394 -88630 -62979 3038 -69857 -160972 -90462 -37814 -140670 -62159
11355 -62159 23763 57577 31454 -64500 -48623 -17630 -6636 14426 15078 -62339 -81928 -11799
11343 -11799 -39748 -6725 -107037 -4734 41168 -67631 -128689 14564 68695 44522 47756
11332 47756 79052 49633 -12764 1398 -3899 -38433 -98003 8167 -1432 72415 57540 21061
11320 21061 -80185 5570 117288 159745 -45906 -59266 -25552 -755 61183 97504 21477
11309 21477 -55105 -47873 -59113 -74848 -35669 -19317 54611 18183 -22520 -1883 9280 -33605
11297 -33605 -95716 40120 126402 133914 78281 110300 129092 -19484 -29832 72180 102699
11286 102699 125762 75642 76199 -2208 -65353 -129647 -246916 -136348 -8426 33680 57447
11275 57447 184467 100853 -63334 -8357 35954 -13374 -22271 38350 23742 -84999 -24857
11264 -24857 82511 110498 79332 142211 138514 236917 197939 148232 232592 101740 165557
11253 165557 225819 88617 72684 156194 194445 197993 221666 201020 198048 145668 85145 44642
11241 44642 19260 -26734 10386 48902 74716 83097 55573 -19020 -103227 9189 78517 79731
11229 79731 86706 11840 -52643 -102922 -116509 -27948 39729 67925 -1392 -36910 -40797 56588
11217 56588 91491 139090 183012 133540 110912 106110 154567 59929 7174 21703 23401 179020
11205 179020 259128 195680 84519 -802 -25883 40686 71187 43820 27564 67024 59987
11194 59987 -4038 8980 201912 171092 85724 -41324 48092 108840 64879 -80678 -90392
11183 -90392 79719 32900 26822 30142 49151 125861 115981 -11115 -53421 17298 36954 91023
11171 91023 30717 84967 89575 112015 69612 8113 -44309 -10532 -32967 -98556 -62511 -4538
11159 -4538 -33386 1540 15383 74419 63020 22419 14299 -5837 3487 -76035 -117243 -19239
11147 -19239 71419 34106 -24701 -12656 -164769 -74676 34262 32120 -48942 -5010 74436
11136 74436 91936 93987 8890 54630 -14869 54465 -20562 -31006 -36980 70048 -10454 -48533
11124 -48533 -58213 -76499 -90514 31672 -33101 -83885 -9646 9774 -45838 82417 30921
11113 30921 21325 12406 -54559 -84842 -149024 -145857 26011 -28346 -110481 -51374 -109673 -46815
11101 -46815 -58675 -97917 -125839 -30298 -34816 -79514 -79336 -35562 5090 -28766 -34351 -19817
11089 -19817 -10968 -13178 -110352 -103124 -147670 -116751 -87922 -89941 -105653 -43383 -3040 22372
11077 22372 -31987 -38060 10709 -4113 -10425 -57740 -16964 -2291 24308 -56920 -43574 -68556
11065 -68556 -21500 14801 101974 51430 37041 58108 16628 -5438 -5691 7234 56869 -49438
11053 -49438 -63861 -30814 -65754 -74900 -38708 -36326 -35087 -31203 -89328 75313 118655 104992
11041 104992 92478 33413 29777 -38530 15477 -14793 -9604 21581 -41975 -102984 -139317 -163174
11029 -163174 -117385 -51182 -89865 -75692 -9083 -57217 7483 2742 -63308 -57407 -15451 -35147
11017 -35147 -11870 26226 53825 -29280 -84002 -19191 -83219 -31152 30401 44237 -21343 60821
11005 60821 -102247 -45001 28174 13408 29683 30000 92177 44469 -7055 -13935 34450 -10203
10993 -10203 -39144 -8191 -68975 25590 28905 78244 37411 150112 29202 -40498 -94422
10982 -94422 -131937 -11427 -5860 -6729 -17114 -70580 95527 4665 -6171 -34089 -117646 -130815
10970 -130815 -158324 -89074 -34160 -7189 -117975 -104893 -107009 -70897 -89825 -33138 32478
10959 32478 10409 -143674 -84279 -17303 -39944 -136929 -184382 -89650 -99883 -34865 20582
10948 20582 -3868 59167 -8550 -50063 -74107 -56371 -50802 -208522 -277446 -94943 -6062
10937 -6062 -24942 -6788 -47497 2681 68122 15748 3829 -110292 -150660 -22180 -95347
10926 -95347 15852 19941 71649 39374 25168 -110309 -67570 -157976 -104421 -77819 -226441
10915 -226441 -171032 -140186 -37324 2372 -18279 -115706 -107473 -62917 -148819 -179478 -69630
10904 -69630 -85655 -138229 -129823 -84763 -180426 -75531 -18205 -10160 10772 -93918 -178545 -196070
10892 -196070 -71752 71978 86973 82308 -48051 -39443 -96049 -8632 -64429 -63074 15870
10881 15870 4237 -119052 -81852 -65750 -49119 -109061 -140964 -150473 -49472 82040 72187
10870 72187 44244 113560 54774 -59677 -68224 -80763 -37652 -114003 -89696 12178 -3312
10859 -3312 -71390 -129792 -117645 -66153 -54558 -42516 -16350 -34189 -16308 121827 50306 -54862
10847 -54862 -28103 34007 32708 -20776 102849 35023 -36585 -48288 -87678 -75574 -8146 10953
10835 10953 84477 141884 137361 87968 20251 -12967 146801 75137 47443 205211 148397
10824 148397 74656 52026 -27562 -14778 6920 35219 114486 -21955 -17186 -22281 -67817 4632
10812 4632 -7590 2310 200988 94701 -19560 -35322 -11092 50341 9194 22958 50028
10801 50028 84496 38051 -46186 41416 42234 68582 95433 173442 231620 194827 97256 65423
10789 65423 -12689 -8913 412 70672 71488 2441 76127 61100 -18571 -51085 -64290 35322
10777 35322 121135 154396 89261 20057 -5819 33937 88417 67797 10681 129259 156634
10766 156634 144434 136896 197418 131100 60178 92438 114378 111754 43904 35847 129490 180029
10754 180029 205526 47615 38159 1567 42813 42332 107872 210741 159754 62935 56726 97040
10742 97040 34610 150465 169154 160192 141426 115028 58181 128504 192294 222879 233310 174814
10730 174814 150751 170400 182775 135148 213467 245434 281725 207880 170063 156412 176010
10719 176010 161829 202192 289838 280949 256763 56185 -36678 101859 213583 202026 126155
10708 126155 91228 51068 92534 160644 109198 237262 283635 307111 136161 144293 133432
10697 133432 93365 236673 211132 195460 264355 180676 210266 197269 247541 437654 376879
10686 376879 252419 232278 193287 238568 228658 222822 218868 255254 214352 231834 218976 426081
10674 426081 323174 315659 278758 210971 295538 329297 311985 256827 375221 385578 416644
10663 416644 417142 417877 361635 301017 274968 325119 393413 441654 546546 579532 489196 523597
10651 523597 528201 569362 619756 598549 641719 571935 473438 455418 384588 377067 445759 562545
10639 562545 599180 605087 595512 577980 600924 565706 614211 628608 677866 659793 676507 628304
10627 628304 585246 682145 709173 708174 677931 618201 657138 558300 611498 763194 757513 795465
10615 795465 909458 1009343 943768 882942 927320 958864 961384 947852 972416 1006799 1120905
10604 1120905 1157937 1114186 1217666 1216369 1113549 1175375 1318600 1204992 1298615 1451650
10594 1451650 1417033 1424475 1478694 1425630 1537080 1627943 1521338 1500007 1512719 1663274 1639366
10583 1639366 1734961 1820201 1810762 1914375 2005433 2029363 2104015 2110707 2149198 2254247 2210441
10572 2210441 2261275 2335081 2344551 2439001 2524867 2511182 2565717 2715383 2957261 3046477 3206841
10561 3206841 3128623 3302665 3364623 3356960 3462348 3528007 3561696 3730676 3813895 4035120 4221912
10550 4221912 4373591 4530279 4567014 4666430 4916596 5207634 5333409 5476927 5683313 5775783
10540 5775783 6055724 6292090 6525540 6849530 7060880 7244229 7550285 7878964 8230496
10531 8230496 8616372 9050431 9444273 9808947 10369818 10960116 11335885 11620865 12024215
10522 12024215 12493798 13051991 13548224 13994191 14398373 14792622 15150399 15411373 15628206
10513 15628206 15684031 15769151 15777689 15560930 15518248 15327353 14925163 14705326 14359584 13834698
10503 13834698 13384910 12913835 12282440 11733792 11355425 10812308 10313489 9737898 9280116
10494 9280116 8802789 8466714 8008609 7629692 7371473 7113311 6796150 6444393 6092545
10485 6092545 5839090 5593448 5231516 5102757 4962249 4682281 4490609 4362217 4174912
10476 4174912 4004938 3901812 3801446 3646123 3488492 3314833 3175837 3113700 2940390 2896624
10466 2896624 2853470 2677276 2550494 2535850 2457514 2392479 2309342 2298353 2256860 2151112 2001279
10455 2001279 1814315 1882975 1952235 1793634 1817103 1777855 1635015 1588610 1495082 1501999 1511423
10444 1511423 1384751 1340441 1320321 1321941 1228809 1137461 1026415 1018922 1060972 1136788 1107655
10433 1107655 986116 1025272 907575 834826 807027 814985 922342 929764 892255 815933 838503
10422 838503 729126 869920 920063 831226 797968 654055 685962 652533 656603 654599 723112
10411 723112 690773 623646 512255 501362 545374 641346 588965 551515 539151 536953 445069
10400 445069 420283 448980 419267 389951 382530 431500 426915 478254 442079 392397 308428 401431
10388 401431 454493 414626 377329 354264 378492 322375 368068 393100 342526 342321 362966 330326
10376 330326 239397 274279 292831 286588 319955 249634 249392 279728 334278 191498 158368 219128
10364 219128 205413 233429 301581 292176 105217 67090 186240 254146 260684 307301 217713
10353 217713 177330 141488 129582 226477 140683 40117 -42216 110912 22244 -23270 90414
10342 90414 230804 181983 75521 81776 168920 157927 79459 41465 79298 235501 136527
10331 136527 60926 138752 102617 20262 29854 15600 23649 -89018 -37314 31577 -101001
10320 -101001 -22165 24370 58453 46211 7649 38571 76647 74283 12823 31627 -3468 -10114
10308 -10114 54364 160826 181581 65455 62169 182685 111095 149241 164530 44486 47803
10297 47803 69262 -78860 -45413 128743 122748 100074 64868 8846 -38439 10626 89525
10286 89525 102353 55209 7234 9078 -93923 38668 40801 -93322 27131 -66886 -100070
10275 -100070 46202 36868 -20827 -68544 -57687 -52798 -77398 -42678 -57611 -175104 -99445
10264 -99445 -70671 -39535 -181791 -189193 -74842 -68685 -40935 -14443 -105856 -139932 -64649 -156351
10252 -156351 -106607 -4331 5180 -14253 104124 48415 -57192 -111380 -108272 -83713 39634
10241 39634 -30531 -199956 -283333 -62221 44747 2277 -19650 -8512 -81722 -82002 2526
10230 2526 -40296 -8888 -49724 -35991 -59622 -85489 -145207 -177103 -69794 -7817 -118836
10219 -118836 -98822 -105206 -145999 -146514 -164696 -190459 -87177 -57618 -88483 -47155 -50010 -108786
10207 -108786 -159705 -161776 -198053 -171163 -49182 -134681 -286007 -286238 -66942 1504 -82540
10196 -82540 -132089 -66397 -89181 -83581 -22903 -61332 -76129 -31702 -20989 -91748 -38721 41167
10184 41167 -86641 -133626 -46378 -58088 -136135 -135123 -52959 16759 59302 -14022 -59503 -138196
10172 -138196 -62153 -79141 -99229 -81100 -100352 -112743 -45007 -207456 -185591 -36677 -135972
10161 -135972 -135026 -117803 -85152 -170731 -141408 -154069 -141286 -107935 -126343 -146558 42718 52303
10149 52303 -109954 -120204 -148305 -204875 -200738 -265664 -266123 -104838 -66655 -38457 -121370 -56673
10137 -56673 -48907 -40787 -119353 -122161 -103869 -150028 -162039 -53899 -18393 -72871 -76696 -167893
10125 -167893 -119734 -120285 -82727 -20512 33813 -73435 -62064 27879 -76423 -5212 -610 -184126
10113 -184126 -155549 33645 60318 -23972 -120726 -173548 -101228 -58873 -27206 -47773 -65081
10102 -65081 -11941 33378 -85129 -139898 -117321 -102182 -147399 -92871 -75645 -157293 -142079
10091 -142079 -55838 -62626 -14701 -116353 -178875 -62115 -15948 -28097 -12503 -67676 -82680
10080 -82680 -23598 -61195 -109233 -82355 -10085 26679 18767 23524 -44033 -87936 -113198 -195180
10068 -195180 -91814 -40318 10525 -26188 -44950 -99585 -85618 -77543 -19789 -98421 -72538
10057 -72538 -80685 -195700 -269586 -266259 -311375 -186938 -183638 -185199 -134999 -126040 -228401 -171536
10045 -171536 -67159 -31804 5896 -162113 -200848 -130305 -219670 -195171 -129862 -57121 -51782
10034 -51782 59380 99417 79890 40782 -54113 -168718 -301252 -156404 -75374 -106578 -135245
10023 -135245 -70120 477 -74520 -96952 -125659 -40767 17211 -77167 -126010 -183314 -103622
10012 -103622 -134774 -157061 -270433 -204974 -180366 -146319 -192346 -276697 -219824 -223182 -175636
10001 -175636 -202138 -151412 -55694 -48517 38200 -99543 -122864 -130810 -156701 -221085 -89813
9990 -89813 -107746 -205442 -139245 -143281 -216467 -114796 -32956 -85654 -107303 -114524 -72328 -46494
9978 -46494 -95836 -168737 -130927 -82872 -161959 -76504 -97972 -178908 -168340 -215588 -278889 -268023
9966 -268023 -195276 -124498 -155009 -245066 -55704 -33849 -198820 -179663 -72756 -63702 -200879
9955 -200879 -205817 -101924 -67351 -210259 -315991 -178940 -159068 -185001 -108777 -151300 -114735
9944 -114735 -54664 -80538 -46244 -129508 -66582 -54315 -207687 -206779 -244446 -101996 -69737 -112682
9932 -112682 -171501 -233150 -100218 -75564 -56626 -76199 -60143 -49627 -108195 -289549 -168492
9921 -168492 24348 -62219 6181 -59930 -137409 -246139 -245259 -276923 -297121 -209672 -154532 -13528
9909 -13528 -101712 -140518 -118588 24868 -1423 -26669 -3947 -77008 -99247 -32484 -22213 -59549
9897 -59549 -141809 -149327 -63000 -156812 -186799 -219211 -203151 -83855 -35098 -61735 -79371 -34259
9885 -34259 -68533 -95166 -51070 -113919 -111411 -49512 -157552 -128118 -42244 -25361 -156427 -182941
9873 -182941 -179480 -171485 -138813 -221520 -185335 -151619 -198560 -146170 -145406 -124817 -134399 59743
9861 59743 80338 -45393 -100876 -146381 -99700 -122411 -213996 -154785 -69752 -84890 14681 18847
9849 18847 -71755 -166272 -102709 -111697 -132558 -70438 23109 63506 -115280 -104617 -2247 8179
9837 8179 -58206 -78426 -142407 -115823 -99710 -37289 -96963 -135433 -50689 -66023 22800 18060
9825 18060 -34176 -16560 -128087 -99056 -188719 -204629 -149479 -143521 -76138 -20128 -71515 -141696
9813 -141696 -144118 -122093 -93633 -263959 -256207 -142767 -109940 -43786 -104782 -187117 -92725 -128478
9801 -128478 -29873 -67284 -78147 -52364 -20182 -144845 -124756 -58658 -38668 -49320 -50549 19118
9789 19118 -72673 -43449 -68098 -19294 19226 -62305 -70985 -77881 -96935 -190187 -118607 -50652
9777 -50652 30932 -119719 -104785 39474 41545 58350 -50010 -20464 -68607 -125196 -20283
9766 -20283 -67746 -24155 68943 -37423 -198222 -221353 -78571 4552 45094 7694 -42730
9755 -42730 -88013 -53787 74672 84195 39114 53002 46891 -47437 23 33089 80759 -12473
9743 -12473 36701 39387 -773 49413 88648 669 36966 6060 80905 83026 107003 170479
9731 170479 101586 263673 291028 172262 143820 204642 168903 133377 132218 92605 80514
9720 80514 39058 -16645 49993 -9477 -61644 53993 114871 38982 62853 -10728 -27411 -24987
9708 -24987 -71424 -125174 -114525 -106501 43312 31012 -32283 -97063 21696 -52404 -79314 -50824
9696 -50824 -68727 -144052 -152720 -54448 -31388 -47559 -4354 -104347 -86224 -39074 -99882 31131
9684 31131 17682 -31006 -79945 11269 -17756 -39945 -97196 -92984 -79414 -84280 -7789 -69733
9672 -69733 32840 43562 -42596 -44873 -57067 -62747 -71044 -82627 -54957 -127162 -124523 -26812
9660 -26812 -72505 -80947 1661 12688 -141843 -196585 -70170 910 -60129 -4301 64237 -10076
9648 -10076 -108907 -208956 -277492 -262366 -136424 -74707 -111466 -68101 -82614 -46619 19269
9637 19269 84216 23809 -93705 -119131 -183862 -179158 -127726 -181981 -136206 -42773 -54069 -173668
9625 -173668 -150506 -121500 -149940 -99796 -36662 5530 62753 61676 7379 -34661 -33127 -8328
9613 -8328 -23892 -18496 -138223 -63425 31847 108928 36626 488 13917 5833 18241 9847
9601 9847 -23142 2317 45077 -64767 -141291 -110368 -63639 13020 88392 52836 -16864 -33457
9589 -33457 -28700 9719 12166 -57003 21318 -28805 -29358 2720 -22791 -100723 -84948 64304
9577 64304 85582 80962 51663 -53802 70021 57612 -119811 -45646 65939 56639 39069
9566 39069 10215 21502 -21212 -128910 -77872 -19541 52295 -2399 -58992 -62098 -184839 -190219
9554 -190219 -83358 -8196 -35173 -97954 -78542 58735 35184 -16519 102748 102934 89246
9543 89246 -16451 -19053 46821 22060 96722 18207 -5463 118909 74342 7987 21815 73356
9531 73356 92974 38882 59305 17822 -33096 -52578 -16566 100336 71657 85510 51935 -19881
9519 -19881 88208 65202 150834 84050 97411 55969 -42022 -82003 -90951 -27506 12020 79508
9507 79508 36568 7075 -2718 -110266 -79040 39083 -36766 -145701 -179552 -6451 144976
9496 144976 173129 108528 49807 -3071 69077 52376 106853 2036 -70419 -13706 5216
9485 5216 24954 -39323 -80682 -24264 42161 32472 140494 92437 125034 199754 76665 30815
9473 30815 44192 40659 10414 60734 60594 53060 107530 129107 164768 188147 160621 113372 280404
9460 280404 260314 146284 141904 194448 360040 294506 141689 207106 125007 115758 157573
9449 157573 171882 185635 159182 122994 139054 133841 30099 27388 19648 29312 37888 173523
9437 173523 158309 83356 132485 147747 68719 74350 56925 67603 173418 243263 177211 115696
9425 115696 123743 260162 229831 78619 157103 255819 174399 201179 224995 167358 258957
9414 258957 218889 201480 179997 181712 164591 137416 190084 187940 88541 145606 226223 213417
9402 213417 194747 142435 224855 200478 181868 109277 124992 253332 311814 372446 369655 422575
9390 422575 443057 389975 358260 367039 294980 289118 364875 361301 380718 537358 533703 417252
9378 417252 382157 515727 611856 652284 834324 886563 899165 987201 984976 1099519 1327247
9367 1327247 1458615 1557227 1634380 1866883 2019457 2110621 2377288 2463079 2448532 2459469 2300786
9356 2300786 2109001 2004772 1876801 1718259 1580568 1341701 1264921 1122188 1031623 899087
9346 899087 789434 818578 741794 819995 845335 746140 630445 561630 541358 503893 463480
9335 463480 617771 561962 378235 336371 374692 382031 392514 482844 369169 237522 161062
9324 161062 239370 384562 352631 195434 213709 279785 265197 203617 215293 327205 406295
9313 406295 502798 327837 191280 100781 49410 58398 183786 130149 -13768 19472 169488
9302 169488 244027 187684 282159 212461 179051 196685 152493 163646 254647 171483 146752 156192
9290 156192 86644 123838 252239 314458 209281 210599 175959 266752 300138 236825 221915
9279 221915 155380 209217 236904 113343 117711 101273 48859 177118 197905 166985 177991
9268 177991 180656 213656 218122 269798 277951 267074 237991 296863 317353 201329 124213 107061
9256 107061 178215 177082 217861 191837 278573 321219 236663 88058 23384 65657 94530 89235
9244 89235 184405 167548 188604 283275 266689 295958 273134 337127 323613 262270 85659 133894
9232 133894 95503 123514 127760 179181 -23719 69761 199037 207522 240702 114697 -4795
9221 -4795 -24196 158407 136427 140265 209627 214654 252319 262748 195720 230894 258829 323295
9209 323295 307763 226727 199850 232832 150849 121043 207121 243448 242898 222032 169111 221621
9197 221621 138568 197761 285733 212452 195351 235414 221458 312718 299809 379066 535966
9186 535966 510934 431923 568105 500748 558848 588337 534023 643806 835185 735350 722813
9175 722813 970241 1223043 1667468 1811181 1669153 1361525 1107919 862932 756561 645712
9165 645712 594135 535449 556053 414592 405072 370144 387860 411800 275329 323758 435053
9154 435053 405480 333297 406721 476468 510998 409207 433928 418134 329966 295347 294887 399469
9142 399469 468986 457386 442220 473652 545669 437648 444728 500804 478313 559123 707228
9131 707228 813770 862769 892960 808975 892776 833397 775448 769316 650996 690037 831431
9120 831431 884718 790074 776366 664501 726176 727562 682353 631884 608693 577174 492086 495248
9108 495248 532161 571751 575300 573017 634781 644130 665745 599005 674736 711672 547132 565511
9096 565511 596424 722029 772878 798467 873102 996506 974811 975763 948016 917201 940689 850491
9084 850491 737620 732406 712468 711071 668647 599032 621633 556427 557733 607074 610731 627463
9072 627463 595560 606990 683825 724562 656057 643192 704082 650123 666439 673607 685914 767859
9060 767859 703660 724372 670857 708636 700527 832101 794448 667869 753877 665649 647017
9049 647017 596882 782040 834710 871860 855441 817790 786172 784841 777962 794329 805951 685738
9037 685738 632322 695056 711139 706908 847836 919701 907642 1002852 978016 910658 1016271
9026 1016271 1118156 1014524 968212 988893 1016748 1033690 1030365 1107601 1140977 1124559 1093295
9015 1093295 1081815 1132861 1300296 1266710 1206388 1167363 1272078 1260708 1331560 1315665 1363602
9004 1363602 1439599 1535479 1598750 1578289 1687320 1756284 1693010 1666192 1676363 1678577 1737473
8993 1737473 1734786 1767394 1873557 1970885 2020667 1901664 1977980 2020863 2032691 1968718 1875939
8982 1875939 1952101 2057964 1961780 1889407 1796890 1809788 1840427 1831994 1868188 1889045 1760834
8971 1760834 1837535 1843098 1769562 1919354 1903533 1956845 1926176 1764067 1799774 1785876 1705255
8960 1705255 1813923 1923818 1888888 1879710 1877263 1931711 1964017 2018995 1940347 1930426 1986121 1943229
8948 1943229 2085705 2091210 2137589 2099822 2141853 2168964 2320983 2334957 2378524 2563925 2617228
8937 2617228 2445772 2456314 2550302 2593354 2619104 2753240 2830815 2932155 3048624 3220245
8927 3220245 3207089 3400517 3429298 3440093 3469920 3409311 3443918 3628437 3749100 3804171 3806046
8916 3806046 3890849 3926400 4061308 4162825 4281004 4420753 4519393 4627811 4737580 4728118
8906 4728118 4565357 4529650 4474911 4445188 4589582 4714635 4715086 4739217 4583270 4422846 4287849
8895 4287849 4173609 4055610 4010857 3856264 3709940 3529395 3586239 3568912 3403023 3432651
8885 3432651 3475432 3551160 3471326 3518317 3589762 3530112 3407705 3195812 3127699 3291434 3219265
8874 3219265 3226207 3184220 3133236 3122822 3035168 3167989 3164487 3135888 3265327 3301542 3246135
8863 3246135 3151899 3151440 3197314 3223443 3319613 3433302 3404591 3408999 3488244 3611753 3675445 3726409
8851 3726409 3738261 3844385 3910086 3877977 3903392 3962441 4059940 4209412 4336250 4362969 4416292
8840 4416292 4421774 4491682 4504486 4447590 4442900 4426127 4391448 4514543 4464595 4564751 4444495
8829 4444495 4466193 4554516 4648109 4568277 4618339 4697649 4771076 4803914 4871704 4944694 5162010
8818 5162010 5199671 5199532 5285836 5439699 5411389 5516505 5435772 5422965 5492578 5606530 5730242
8807 5730242 5908756 5913311 6052836 6109344 6278162 6326122 6393992 6531123 6614204 6804496 6809605
8796 6809605 7107801 7433411 7684093 7943473 8031367 8297826 8613746 8760124 8958438 9175087
8786 9175087 9412019 9786377 10048955 10326536 10788959 11174022 11407613 11666397 12093729 12475945
8776 12475945 12888302 13232285 13664902 14100217 14719472 15426742 16247259 17136677 18081557
8767 18081557 19250647 20549892 22119389 24084735 26523739 29625909 33381675 37163693
8759 37163693 40309101 42298933 42862668 42171579 40802774 39910434 40220288 41545305 43485065
8750 43485065 44882280 44890753 43512703 40624664 36798051 33026709 29953449 27447850 25578688
8741 25578688 24393091 23516917 22857261 22535115 22307467 22488396 22729585 22972460 23178202
8732 23178202 23426509 23563371 24075538 24422014 25033807 25686054 26473975 26934425 27429586
8723 27429586 27901959 28401394 29072594 30135308 31025208 32460323 33801144 35681603 37937431
8714 37937431 41044384 44037574 47581247 51432416 56129372 61203621 67808377 75495584
8706 75495584 85534147 98084917 116979384 144115884 187377519 243492439 296383066
8699 296383066 301067341 246328689 185240899 139134059 109671795 89327807 74820166
8692 74820166 63746685 55573365 48855560 43718593 39376699 35979640 33065108 30824544
8684 30824544 28994313 27627962 26139857 24832707 23616819 22603545 21593489 20723372
8676 20723372 19780072 18883108 18097080 17629096 17158282 16793393 16300397 15516771 14778410
8667 14778410 14276465 13782238 13441249 13113884 12949158 12727788 12462803 12194229 11915469
8658 11915469 11737814 11524498 11257900 10973056 10853459 10597799 10476288 10375174 10231218
8649 10231218 10039906 9953956 9909327 9851861 9672462 9443726 9135398 8975467 8787943 8789777
8639 8789777 8663904 8445785 8282489 8169670 8042083 7957834 7962607 7925953 7941940 8019699 8087259
8628 8087259 8178330 8241498 8343419 8479907 8477975 8406141 8361667 8233504 8362895 8342210 8466775
8617 8466775 8657890 8972783 9268354 9713021 9918806 10162651 10544710 11135096 11850628 12840978
8607 12840978 14092052 15809044 18310303 21077490 23470400 24704184 24603320 23539367
8599 23539367 21253700 18700017 16380903 14614803 13369037 12390356 11639441 11097633 10678232
8590 10678232 10493934 10368710 10293342 10365439 10367890 10216540 10161484 10086549 9960007 10027984 10174406
8579 10174406 10385064 10852223 11223684 11606440 12071952 12734300 13584899 14472101 15639125
8570 15639125 17065992 18919779 21507597 25038110 29385159 34222176 38200522 39924091
8562 39924091 39516212 36932632 32370988 27229138 22886015 19586672 17102564 15142737
8554 15142737 13652406 12537526 11666869 10956316 10361385 9914346 9589871 9218582 8800780
8545 8800780 8601977 8351499 8131771 7860893 7675329 7529947 7490976 7318732 7104059 7013443
8535 7013443 6944381 6834215 6801866 6832952 6733982 6750148 6818282 6780019 6840110 6643145 6642035
8524 6642035 6720885 6719150 6861099 6857742 6819544 6832182 6954533 6989569 6965778 7097645 7090117
8513 7090117 7254630 7344255 7450192 7571272 7532753 7756938 7861113 8058009 8258355 8420432
8503 8420432 8582013 8823272 9118068 9536743 9996202 10441065 10958455 11579799 12184722 12933774
8493 12933774 13973874 15273917 16973879 19238429 22337167 26005988 29246158 30673046
8485 30673046 29709039 27404361 25314139 24132176 24072317 24982705 26803853 28574350 29017116
8476 29017116 27006961 23747435 20591201 17962070 15951613 14476483 13276055 12292565
8468 12292565 11544935 11078097 10672291 10294431 9953795 9797471 9625537 9579731 9584241 9541014
8458 9541014 9713194 9860574 10091485 10356146 10736488 11288715 12047251 13212354 14761869
8449 14761869 16515111 18098172 18535818 17826354 16546301 15638494 15157922 15320417 15886123
8440 15886123 16622447 17307203 17279542 15970537 14008478 12233099 10711162 9630982 8837503
8431 8837503 8182158 7775827 7390294 7013530 6668864 6444559 6243910 6025952 5737289 5466440
8421 5466440 5287175 5218364 5024002 4766079 4575063 4422222 4398366 4089899 3908308 3789832
8411 3789832 3729377 3688955 3578215 3566230 3329381 3248865 3215173 3145717 3155377 3255636 3250314
8400 3250314 3111937 2971371 2934833 2835689 2664614 2704581 2605183 2512614 2437351 2382820 2457031
8389 2457031 2519307 2491741 2329988 2270776 2212775 2031455 2071712 2009454 2115750 2076719 1969053
8378 1969053 1961331 1843078 1872855 1859477 1775457 1676646 1593977 1549914 1481203 1503606 1328814
8367 1328814 1317371 1278350 1359251 1262663 1195531 1144866 1075779 1122599 1196406 1157734 1040900
8356 1040900 1115843 1067740 1026215 1015280 1031073 1010675 1023508 1019543 1107231 1125465 926825
8345 926825 855212 959577 930812 874118 740711 706318 814357 839908 828545 798089 777627
8334 777627 731907 661334 732865 721160 737258 760970 810333 741493 805845 876941 822319 803031
8322 803031 687955 699254 698188 651855 669063 646714 675350 691089 624367 642605 602680 530602
8310 530602 565928 502088 527764 455241 511207 571589 687639 716610 589759 565470 624982
8299 624982 512625 347796 346423 372814 372860 360770 347665 304332 315271 442798 473188 352700
8287 352700 269105 273794 343844 304347 311964 236690 254538 416719 425693 321195 389420 385471
8275 385471 288771 396097 452207 374217 390046 418801 355505 305842 304218 477238 361957
8264 361957 336542 433215 437114 375785 405602 465875 453516 452255 297386 326395 328482 329223
8252 329223 297020 265544 380177 327848 332178 414465 387294 251648 308361 383737 345281
8241 345281 491371 409962 376482 522753 612881 593384 526272 495049 636308 667733 763683
8230 763683 786979 746211 795515 878344 934721 1197398 1567219 1745879 1749437 1594910 1226727
8219 1226727 1004322 806953 641355 530835 477006 499168 359596 434971 549789 494319
8209 494319 399764 307336 289359 302193 288281 185748 268596 313344 306844 262249 120187
8198 120187 184162 112362 210332 107209 88949 -60008 368548 790825 547966 566760 372878
8187 372878 446794 442679 381668 357676 291255 316233 264682 254961 257888 158641 232350 166324
8175 166324 116741 168566 77399 47639 43265 97298 100369 70417 112946 190096 216382 196010
8163 196010 236980 207657 252559 295228 156564 137521 211612 230070 247345 213860 70599
8152 70599 74054 119182 4983 64345 115857 154587 176163 253965 294362 234018 121232 106185
8140 106185 203556 194791 93574 94283 181148 111461 164202 158139 256198 255336 161571 154058 152910
8127 152910 179394 312016 227041 272950 307410 190915 298716 317574 308377 188642 207643
8116 207643 297105 154084 312847 354317 406636 470172 483446 620188 741844 708792 750378
8105 750378 846409 683678 642765 587794 489916 545089 516703 439195 401027 379119 364467
8094 364467 373278 433301 319491 379491 213326 131357 181155 85604 144290 213117 102922
8083 102922 178183 229294 229127 200590 244592 355329 298322 417740 385637 494195 548806
8072 548806 500898 429149 453059 630558 675906 662097 627613 560435 622993 518568 475551
8061 475551 498087 509286 544517 429087 376116 304396 209465 149438 126167 111998 89568
8050 89568 144537 130299 73644 152328 191799 113527 114899 84265 62171 147663 142072 137399
8038 137399 149214 13961 24064 62342 20922 30900 27038 131429 16104 25303 20441 111129
8026 111129 145561 17969 -27024 -27119 -24204 58452 116855 -46299 -22691 -116681 -100257 15059
8014 15059 -48724 -32520 8167 -29114 -22301 49052 32847 32185 87819 162552 143797 163146
8002 163146 163615 203989 72877 34379 19487 41597 101854 91882 -2046 16523 107169 51322
7990 51322 -28298 -105724 -36969 -68668 23514 96154 161221 119383 37135 7007 30872 -31980
7978 -31980 -133786 -86576 74019 68852 -8678 19782 -59981 -17438 -67199 -15675 90361
7967 90361 71752 9233 -71461 -91590 -52910 17504 -102133 -15384 -59092 -161368 -52851
7956 -52851 -3358 13824 -3627 23506 128766 176880 71169 5749 -41853 -11696 20426
7945 20426 62125 86291 64377 4591 15458 25023 112073 128827 212583 152741 12257 105186
7933 105186 90920 129311 67104 9056 63933 193529 324348 232790 102905 27283 27559
7922 27559 90053 -33438 -40202 15549 42807 109700 71175 69162 67835 -31535 153 578 -58260
7909 -58260 -106088 -71545 -13688 -31135 15655 112486 111804 54572 -45408 25140 42178 -40977
7897 -40977 22759 5651 63669 123664 17149 1605 -59939 -74294 20927 -85905 -28076
7886 -28076 -120521 -16347 15690 -96588 -36521 -47012 -17582 -8031 77077 -19465 -97262 -95667
7874 -95667 -120695 -66269 -70332 -82903 108553 206610 122956 49281 -7867 55151 -40224 -35484
7862 -35484 -109475 -91861 -88097 -104980 -145772 -94395 -71969 -95219 -23332 -59906 13940 -37150
7850 -37150 -58274 -30643 2708 3295 6579 4590 -3500 -64111 -9518 18145 36637 -110525 -53243
7837 -53243 -85993 -155813 -13795 58517 -17445 -49976 80964 64991 80212 121327 179920
7826 179920 137789 -70955 -147890 -41936 -25960 83213 121402 -1239 -25489 -15756 38888
7815 38888 -34177 -40132 -50287 31130 56154 2298 48694 46811 3797 7043 -3483 34863
7803 34863 -20452 72383 100807 44695 52565 78157 56821 86032 39722 -61585 -67793 -67085
7791 -67085 -44378 -12163 7810 14243 70509 -19544 66714 148944 130179 62847 -8288 -49752
7779 -49752 36857 41576 -7800 2976 108981 51009 -6535 -46194 -78659 -75616 -74129 -66992
7767 -66992 -6271 189315 130475 36422 -38872 -26462 -86860 -137915 -92097 -99170 17052 70061
7755 70061 -73387 -78661 65631 -12018 21249 26728 84147 13277 11464 19067 58733 5959
7743 5959 -1689 51201 55663 -10276 -31985 35031 13908 -18986 -85865 -608 3768 -191765
7731 -191765 -95542 104152 129005 103698 52967 70072 64520 -68535 -105710 -75377 -21626
7720 -21626 3651 42307 29796 29621 24389 -33480 -25988 31144 -118189 -70962 33315 -42429
7708 -42429 -13285 -28545 33140 66098 16179 7899 110356 189041 78281 50958 33371 -21093
7696 -21093 32033 -3730 -8841 9906 76910 36187 41236 23643 116587 74819 -15176 48771
7684 48771 43340 50975 91356 23507 -24699 52223 -15638 -116769 12905 33594 173356 112506
7672 112506 54058 88128 30435 -78747 -27861 -68653 -14805 -8677 15334 59008 120010 50996
7660 50996 67481 174242 182328 219936 104421 65072 130918 192083 205491 145444 90921 114963
7648 114963 175216 200161 81539 95590 63543 53580 58205 33304 184832 90109 90075 153418
7636 153418 109555 74953 118242 76439 60571 102461 88304 217257 278859 273902 179799 185353
7624 185353 93040 182600 111657 24275 101936 115173 163739 211988 45355 5553 30494
7613 30494 58781 96244 99588 136786 183238 153263 82461 93333 124314 131275 136064 255324
7601 255324 202133 117045 79013 93400 126855 158216 146940 89643 43722 -7460 84121 31144
7589 31144 -8107 -13531 -93170 -59496 -74586 -116221 -48527 -35659 -4628 46192 78606 14193
7577 14193 -8860 -38328 126218 167828 160249 219986 193772 182522 176473 20352 49681 84667
7565 84667 102248 161621 135795 139481 245307 277201 204899 181205 114459 139936 183477 144027
7553 144027 198461 118865 74060 11823 33436 24204 13819 127714 127725 246826 213126 176854
7541 176854 124417 181406 137392 219232 231014 34743 120578 173621 247002 144165 61874
7530 61874 271590 239342 135026 165175 128963 115701 271450 175716 147944 94428 169370
7519 169370 140070 106341 187345 129062 141483 203568 184319 212356 246182 283850 252135 262549
7507 262549 234636 76229 122524 115275 117343 203767 265679 239362 210001 275769 284448 199473
7495 199473 211571 206875 153796 158643 131078 142343 188770 179436 248613 209969 100107 183308
7483 183308 163929 134241 208892 262551 67841 121724 191600 213624 171403 174281 284964
7472 284964 233551 261283 298184 345083 288615 212965 313905 324938 357482 261314 231569
7461 231569 216989 198994 305164 197469 261823 410177 408855 230772 165992 125346 141001
7450 141001 251770 258872 241864 250860 336987 291407 212323 303158 306198 278126 237273 206699
7438 206699 194558 269212 260513 376168 314461 212922 310614 402505 356033 312991 264513
7427 264513 168250 244156 274600 225089 185600 277648 361885 215050 237174 322129 273462
7416 273462 238134 216474 289938 256132 338801 370337 283047 228426 169113 293668 338423
7405 338423 301926 269067 347372 311655 284792 415634 393549 328055 372822 354002 251462
7394 251462 173463 258646 302297 282128 325129 389219 442104 319339 328041 324605 310274 402866
7382 402866 372339 276118 372271 382146 294374 348244 340126 320423 349240 334153 350375 213183
7370 213183 174493 211643 173990 265024 433857 472404 343955 289940 234334 222504 199247
7359 199247 429754 432324 373930 293505 303595 357932 359997 420308 347859 420217 346784 324453
7347 324453 429836 415415 303673 213894 280019 511845 376939 444018 510537 506256 371153
7336 371153 410913 403872 435588 564410 504273 509139 435020 480596 377025 505066 514951 390803
7324 390803 332427 385591 362211 390339 336353 296659 493098 453255 476152 608831 546267
7313 546267 527167 534408 467786 407058 583985 523582 494212 614581 632548 634834 503526
7302 503526 523827 603557 573252 481130 581953 475759 549023 595975 529378 614638 683168
7291 683168 591143 477454 538995 554381 547048 677391 667756 642495 642101 518549 535220 628498
7279 628498 645221 572844 494977 502878 527174 506392 431482 432474 421169 429444 533343 520604
7267 520604 581234 633021 688478 697659 632070 535611 572347 603020 694522 715857 757733 743457
7255 743457 562297 537595 579958 680881 626763 694043 682489 701402 739836 722607 815045
7244 815045 707930 623647 549630 657425 649809 623298 623476 653523 578746 550504 640085 739559
7232 739559 715846 730935 727437 570112 752422 847956 780573 744378 732873 717449 749769
7221 749769 724620 725296 758193 811244 768589 799526 751160 787836 657205 632355 735060 660922
7209 660922 658176 869236 774612 744949 942732 890531 759706 745227 799327 866846 920790
7198 920790 988336 1032121 989264 1035508 972284 918600 920376 877681 936652 1012854 963214 956468
7186 956468 870888 960696 897443 899413 990219 994121 1089654 1056800 973873 856159 928449 1022457
7174 1022457 1069694 1165283 1098952 1035858 1004891 1026746 1058548 929545 902975 945603 1011109
7163 1011109 961258 891751 900198 926933 951095 843550 846735 798166 832989 855295 848702 940803
7151 940803 918600 885891 975823 881061 856522 890205 946743 998855 925611 964795 945477 963390
7139 963390 864123 884959 930488 894939 956054 905773 882600 884933 838286 899115 937791 822811
7127 822811 968821 957733 859033 891810 915633 899900 870146 776461 833947 804889 887703
7116 887703 969099 862836 851126 966986 974647 961986 895118 871184 803651 769376 870917
7105 870917 897749 976021 1067371 1062209 972483 1054510 1096954 1096924 1136498 1151624 1014722 993193
7093 993193 1041797 1055727 1087359 1025872 1065287 1085802 1094831 1174818 1196977 1181850 1166492 1185582
7081 1185582 1187921 1155465 1121693 1098106 1147524 1191885 1218465 1242935 1127004 1060040 963582
7070 963582 1079478 1158697 1083539 1166831 1195673 1181423 1130559 1177145 1159258 1292148 1260088
7059 1260088 1167881 1306022 1303502 1238765 1207332 1243182 1223691 1313763 1224180 1377098 1400303
7048 1400303 1452088 1410455 1385541 1339216 1220887 1292992 1297598 1278742 1349203 1479543 1437848
7037 1437848 1187389 1278915 1396000 1359365 1299345 1275089 1364415 1371362 1369250 1431608 1479830
7026 1479830 1388603 1412305 1430395 1387995 1415527 1419834 1384113 1367949 1460844 1459674 1396359 1382039
7014 1382039 1370945 1308317 1300989 1298303 1360732 1393905 1498612 1395551 1358307 1446138 1472088
7003 1472088 1422888 1347718 1390205 1540492 1529088 1457674 1512285 1466823 1582143 1664220 1689177
6992 1689177 1617077 1649125 1743230 1771426 1766666 1716128 1619254 1710099 1796363 1820952 1754375 1753910
6980 1753910 1651672 1664010 1675115 1571913 1707702 1772566 1782997 1666325 1622791 1730006
6970 1730006 1643246 1742576 1727108 1779142 1793848 1855342 1788122 1795859 1902774 1877515 1864434
6959 1864434 1793379 1833239 1812371 1791200 1658563 1631004 1751486 1833103 1863968 1790963 1806178
6948 1806178 1759529 1845486 1946385 2040853 2028003 2095941 2074555 1996634 2072977 2102510 2126968
6937 2126968 2139149 2144621 2091575 2158455 2162290 2098452 2152311 2116292 2118685 2150640 2041108 2081338
6925 2081338 2190458 2183538 2183145 2165816 2121706 2136937 2189628 2225067 2297432 2349238 2318340 2271286
6913 2271286 2205621 2248336 2264612 2294517 2328477 2260925 2362956 2367246 2415576 2435915 2465580
6902 2465580 2403362 2372411 2418383 2355003 2414253 2450061 2471689 2622321 2607716 2589017 2609167
6891 2609167 2451469 2435075 2508553 2530188 2541446 2611525 2652842 2709746 2705032 2710643 2647811 2636794
6879 2636794 2652457 2617882 2719293 2760450 2646332 2717527 2760900 2807805 2840978 2675640 2648310
6868 2648310 2731588 2753378 2826546 2943432 2842925 2879367 2922976 2896246 2941317 2894914 3055323
6857 3055323 3112775 3155753 3157768 3192694 3216628 3271717 3198778 3285588 3325797 3121248 3110361
6846 3110361 3167462 3144038 3178370 3073395 3189372 3220295 3223029 3083615 3171521 3317936 3321464
6835 3321464 3189755 3177665 3282243 3278674 3276614 3247557 3312662 3268417 3213296 3115223 3144907
6824 3144907 3236085 3204580 3272521 3416435 3385315 3421920 3467693 3561013 3603970 3475111 3483146
6813 3483146 3535279 3486604 3499013 3547451 3524657 3564193 3496267 3514417 3668479 3666884 3674550 3775797
6801 3775797 3581809 3609681 3780662 3725473 3733648 3703980 3637940 3703741 3825867 3926142 3859733
6790 3859733 3735135 3791943 3814849 3939238 3991272 3978236 3918765 4029823 4076675 4190009 4231801
6779 4231801 4207510 4330201 4314137 4222583 4320750 4279606 4244493 4197304 4190566 4085155 4194335
6768 4194335 4258294 4167348 4224947 4315871 4273243 4116882 4094796 4365061 4344867 4329809 4300014
6757 4300014 4327290 4499116 4496153 4384243 4477634 4601651 4527176 4501082 4613775 4490074 4529208
6746 4529208 4664382 4656105 4636002 4640839 4706056 4718094 4694405 4796157 4797929 4738949 4682234 4806903
6734 4806903 4835662 4779836 4860357 4881158 4929329 4965365 4927963 4921100 5044723 4976073 4960591
6723 4960591 4873814 4839642 4893676 5051735 5106422 5036346 5052270 5075619 4978731 5131674 5231552
6712 5231552 5184436 5126977 5191008 5194910 5220359 5280577 5320613 5292267 5375774 5441428 5395491 5397061
6700 5397061 5371304 5346494 5344775 5438290 5395493 5304654 5430009 5468890 5383512 5404704 5369028
6689 5369028 5464927 5629553 5537569 5440886 5470647 5537215 5616173 5661011 5704673 5676968 5695543
6678 5695543 5757522 5730312 5716646 5619252 5626943 5709031 5820259 5733592 5567996 5632124 5710098
6667 5710098 5663426 5720961 5736555 5851686 5873615 5886522 5948580 5873061 5903493 5888339 5800640
6656 5800640 5804740 5877231 5882031 5910857 5950477 5978705 6014931 6013649 5970884 5927698 6037292 5975745
6644 5975745 6062544 6067338 6068709 6083986 6107222 6115575 6022065 6033270 6058112 5988101 5952870 6064928
6632 6064928 6119282 6092110 6234665 6146631 6092736 6155036 6058913 6054027 6029587 5955858 5972205
6621 5972205 6139504 6175990 6118000 6146160 6226622 6172195 6199709 6109775 6048200 6141415 6236004
6610 6236004 6169041 6130426 6103055 6110457 6067763 6029336 6022805 6047074 6092874 6104244 6139181 6072807
6598 6072807 6059707 6145768 6145600 6195941 6040068 6047713 6109341 6204106 6045420 5947629 6003745 5972162
6586 5972162 5985621 5997687 6012857 5966011 5922290 5946725 6000930 6049651 5974166 5817188 5929698
6575 5929698 5971514 5942060 5981799 5880692 5871282 5857767 5754448 5822278 5788470 5766170 5764387
6564 5764387 5685717 5658226 5723810 5736992 5722301 5770651 5799056 5764680 5635602 5554212 5537412
6553 5537412 5524314 5524783 5470082 5560753 5570825 5587910 5497259 5403227 5461669 5483136 5493734 5598150
6541 5598150 5643278 5502857 5493808 5445316 5497970 5461947 5500439 5560550 5452312 5421930 5438394
6530 5438394 5402287 5329326 5348387 5327718 5277968 5198910 5318344 5423575 5243080 5273160 5317805
6519 5317805 5364442 5294810 5309597 5204689 5075226 5104542 5055741 5059081 5013803 4983838 4972040
6508 4972040 5020852 5046816 5040600 4965182 4986741 5043353 5005593 4939409 4800915 4686734 4744055
6497 4744055 4831394 4830770 4859826 4875845 4769243 4678021 4687742 4830949 4727989 4704037 4767659
6486 4767659 4750832 4628846 4584061 4659504 4615279 4655602 4673561 4562922 4427812 4528741 4532935
6475 4532935 4485520 4478720 4451580 4431969 4419052 4355234 4323860 4364401 4414980 4450113 4347062
6464 4347062 4290884 4338782 4314865 4301118 4320452 4303225 4289595 4184695 4172667 4123733 4193465
6453 4193465 4134582 4210192 4184030 4160720 4086144 4076281 4183016 4167788 4108599 4062668 3985376
6442 3985376 4031828 4038438 3971438 3891207 3955607 3883907 3899492 3876931 3800434 3883627 3862398 3839607
6430 3839607 3785302 3852431 3785609 3739448 3647922 3652318 3646217 3663221 3629872 3687101 3706283 3628622
6418 3628622 3572912 3623814 3631604 3589162 3619914 3573867 3466191 3520032 3606194 3580581 3434363
6407 3434363 3444351 3545436 3701859 3624592 3544658 3483290 3466177 3469888 3333324 3380810 3411968
6396 3411968 3407317 3370190 3456516 3444615 3290836 3162574 3189727 3369527 3342073 3314275 3157463
6385 3157463 3130839 3195513 3255367 3263927 3248606 3150721 3091985 3222858 3192943 3137042 3185936
6374 3185936 3192286 3165412 3178880 3081533 2963527 3024317 2987649 2999307 2887666 3043122 3070183
6363 3070183 2994669 3034167 2947762 2859919 2858167 2818075 2959758 2984674 2907469 2925248 2933997 2858475
6351 2858475 2841946 3021812 2883069 2858808 2856958 2885341 2882471 2839036 2824857 2852828 2774378
6340 2774378 2870384 2835735 2788195 2858098 3006678 2939186 2953108 2913572 2830897 2983819 3103860
6329 3103860 2945148 2938694 2901122 2875700 2832635 2794622 2714409 2671744 2569033 2570982 2661457
6318 2661457 2726409 2752279 2718236 2599580 2578156 2620817 2627172 2660737 2634472 2649559 2586774
6307 2586774 2528289 2469147 2465506 2460499 2420521 2395439 2401536 2369347 2392971 2497207 2383672 2326411
6295 2326411 2276038 2365528 2297842 2159309 2259329 2327090 2418629 2352652 2392686 2364979 2315817
6284 2315817 2220724 2354187 2395522 2417416 2311155 2197248 2149443 2235603 2427566 2404492 2336505
6273 2336505 2333144 2343586 2388128 2397089 2262646 2156682 2309744 2392380 2415624 2308137 2340237
6262 2340237 2272142 2195700 2172800 2141836 2158966 2264444 2237368 2244892 2198217 2093344 2175635
6251 2175635 2188100 2231370 2277751 2359668 2215731 2195019 2183265 1984314 2080901 2146118 2169620
6240 2169620 2117915 2044099 1933707 1929432 1987025 2117193 1994610 2097558 2096923 2044208 2122985
6229 2122985 2041617 2037171 2090759 2154732 2114465 2109962 2070751 2062871 2038374 2082606 2041268 2069055
6217 2069055 2133755 2142607 2096159 2106322 1994562 2101025 2167621 2150730 2158188 2245545 2260733
6206 2260733 2301322 2256778 2169399 2126314 2176840 2142520 2201369 2186222 2192932 2018868 1947134
6195 1947134 2069188 2080476 2134508 2125226 2213019 2254171 2175846 2099647 1996003 2085012 2136636
6184 2136636 2057473 1897100 1860491 1916100 1928261 1984354 2032844 2064998 2040117 2106484 2110926
6173 2110926 2106983 2122696 2012926 1980958 2034651 2037072 2148127 2097402 2087295 2099223 2127581
6162 2127581 2167949 2196592 2056406 2012957 2018597 2018642 2042152 2045440 2134991 2184203 2224372 2216821
6150 2216821 2251802 2227790 2190871 2223980 2262917 2300066 2364454 2342418 2451510 2491214 2342959
6139 2342959 2455118 2466565 2468650 2573396 2561913 2700952 2774405 2809501 2821547 2759495 2799478
6128 2799478 2955667 3071291 3195019 3366444 3345760 3367288 3569541 3660927 3875565 4001283
6118 4001283 4219434 4403888 4588150 4808192 4828712 4941518 4931744 4838634 4929756 4948250 4895204
6107 4895204 4840145 4788180 4990552 4959429 5007831 5137276 5183881 5343151 5528369 5697255
6097 5697255 5964987 6223090 6619114 7008458 7443831 7964852 8701931 9382187 9968991 10574436
6087 10574436 10928624 11099624 11012141 10696346 10373962 10034531 9732465 9284001 8870978 8609098
6077 8609098 8391704 8219264 8146299 8127294 8224435 8344699 8489011 8870512 9020782 9252393
6067 9252393 9852118 10374046 11047617 11799747 12742523 13697832 14545859 15167168 15670517 15825357
6057 15825357 15397009 14782757 13892656 12950208 12135232 11299557 10613561 10105971 9588289
6048 9588289 9198682 8947581 8769617 8563277 8387587 8298531 8431533 8490017 8629020 8824463
6038 8824463 9090767 9485698 9873323 10299912 10747311 11177875 11610456 11751565 11583675 11102904
6028 11102904 10580772 9985490 9345134 8600895 7859062 7250436 6769779 6275742 5907455
6019 5907455 5673564 5300226 5119570 4988146 4885487 4785620 4723597 4690402 4603554 4627438
6009 4627438 4710470 4696557 4821633 4882791 4851669 4973753 4842251 4706530 4533440 4320037
5999 4320037 4106724 3885474 3728535 3611841 3449881 3288032 3114969 2994174 2876596 2806364
5989 2806364 2692992 2632388 2636210 2483206 2405610 2377804 2321812 2296948 2178623 2213768 2327687
5978 2327687 2256961 2282625 2239192 2167752 2213897 2207809 2152375 2199982 2099143 2057032 2003193
5967 2003193 2025218 2111939 2154272 2132696 2100040 2143025 2180392 2090445 2103675 2176614 2115788
5956 2115788 2191841 2281793 2311333 2119821 2002927 1951186 2054414 2271032 2277983 2244305 2114991
5945 2114991 2059391 2127845 2135525 2067604 1981300 1885286 1916770 1929989 1915863 1889246 1768836
5934 1768836 1695536 1686783 1672756 1661081 1574804 1467650 1525287 1552621 1653885 1674405 1653287
5923 1653287 1566762 1530435 1576715 1565476 1526869 1423928 1435372 1432474 1464957 1468262 1470526 1421130
5911 1421130 1476390 1377003 1279655 1349767 1413241 1352448 1405152 1389834 1411949 1372959 1288271
5900 1288271 1392854 1502459 1304216 1268683 1342080 1331093 1299091 1196274 1242327 1249036 1378499
5889 1378499 1436432 1277135 1283660 1359534 1342697 1372814 1314659 1266884 1251406 1241084 1161957
5878 1161957 1187461 1201780 1289906 1338015 1275221 1200637 1212725 1172084 1195363 1235140 1213417
5867 1213417 1257375 1295577 1157309 1145541 1247471 1240906 1188803 1261347 1181889 1229586 1381677
5856 1381677 1324543 1250669 1220308 1167277 1244301 1267547 1287959 1254961 1121076 1097476 1167976
5845 1167976 1150565 1174299 1333673 1328978 1346953 1240617 1218807 1249700 1232006 1170898 1129998
5834 1129998 1184363 1170468 1091036 1220846 1249263 1323749 1293961 1295939 1360873 1356199 1337862 1213587
5822 1213587 1137710 1203098 1116818 1156682 1237282 1149943 1242376 1302299 1236167 1272549 1356343
5811 1356343 1348716 1356490 1373472 1350447 1321330 1422650 1480884 1452299 1510683 1536523 1660255
5800 1660255 1713383 1804195 1966229 2019252 1853886 1743333 1718210 1627620 1694154 1515566 1448607
5789 1448607 1402454 1421364 1388710 1422722 1393351 1439168 1477158 1549787 1566253 1427797 1507130
5778 1507130 1574811 1603766 1594895 1473473 1460294 1500843 1470196 1428010 1494359 1485671 1498607 1494878
5766 1494878 1462680 1532616 1601691 1685716 1615322 1586992 1625987 1742342 1733013 1690773 1691999 1708639
5754 1708639 1793145 1695824 1690165 1801923 1851702 1833316 1870004 1822485 1815616 1812848 1869700 1855039
5742 1855039 1862367 1979510 1966876 1934281 1934505 1979881 1899909 2007491 2132104 2107599 2054937
5731 2054937 2112312 2099899 2016387 2009422 2149866 2164627 2125699 2082315 2159545 2182744 2309905
5720 2309905 2340279 2384318 2383212 2311825 2311396 2459646 2494245 2431888 2530370 2581572 2482261 2498514
5708 2498514 2592187 2635305 2616222 2601531 2543967 2580581 2575948 2639146 2734093 2717106 2773958 2775513
5696 2775513 2770826 2797502 2859733 2971008 2975122 2906100 2934745 2968548 3011684 3172732 3159278
5685 3159278 3225231 3275176 3377971 3357949 3368039 3425231 3417517 3397430 3375604 3516441 3607626
5674 3607626 3686975 3577106 3632294 3537553 3631916 3679418 3668599 3455831 3489628 3538365 3423696
5663 3423696 3377730 3491483 3454206 3500190 3526474 3414976 3416096 3526911 3364300 3360716 3490412
5652 3490412 3564941 3507429 3367732 3411627 3461171 3622318 3656147 3508280 3412834 3464929 3506891
5641 3506891 3455079 3451365 3499617 3425561 3421714 3540321 3454906 3450141 3565873 3620968 3586176 3535979
5629 3535979 3602420 3657109 3689593 3692932 3759720 3644318 3613989 3635075 3722333 3790681 3796322 3784825
5617 3784825 3897941 3849739 3859042 3910490 3889521 3920198 3993289 4042738 4083344 4195756 4190389
5606 4190389 4213826 4131753 4180082 4259556 4429687 4543629 4683894 4822094 4827997 4992530 5092345
5595 5092345 5113801 5357192 5588055 5960177 6254652 6371464 6449545 6647347 6779328 6789830
5585 6789830 6766682 6587486 6386935 6101387 5893314 5642012 5504877 5410416 5247635 5047359
5575 5047359 4974886 4820095 4756602 4664606 4662833 4532748 4391167 4481856 4506308 4374354 4264953
5564 4264953 4283049 4298744 4198474 4308828 4266738 4230155 4204102 4319838 4341401 4451941 4434594
5553 4434594 4479959 4579367 4682081 4920769 5158371 5500500 5638581 5654807 5573520 5367680
5543 5367680 5107377 5112607 4978968 4906493 4945515 5082867 4968214 4865276 4917045 4960088 5088841
5532 5088841 5203285 5210250 5226509 5227928 5324465 5391717 5406421 5468251 5404353 5404565 5521319 5473544
5520 5473544 5514527 5731403 5727158 5667706 5625525 5646787 5737595 5682013 5848429 5956853 6018864
5509 6018864 6043660 5985470 6175259 6326634 6412772 6473470 6461526 6664281 6959883 7229591
5499 7229591 7462562 7871342 8681997 9749497 10873858 11535926 11465565 10496035 9442990
5490 9442990 8682943 8340747 8064870 7816982 7575314 7418973 7444033 7279149 7242361 7320653
5480 7320653 7440480 7597523 7633609 7769086 7882462 8092296 8608653 8843652 9137154 9512735
5470 9512735 9964421 10554451 11473120 12552064 14159458 16286380 19256510 22592149 24804180
5461 24804180 23935669 20936918 17811859 15300857 13665907 12472501 11662574 11089903 10722668
5452 10722668 10329242 10161318 10156275 10025604 9798037 9808984 9962506 10136815 10228530 10419337
5442 10419337 10649706 10933001 11384225 11875740 12382952 13131949 13967281 15149752 16710671
5433 16710671 18943360 22090325 25510187 27436561 25968364 22539603 19276100 16919934
5425 16919934 15496902 14389222 13447583 12717127 12412341 12165015 11987114 11783865 11661447
5416 11661447 11741654 11879660 12130888 12213569 12339687 12610850 12857499 13069170 13348010 13715665
5406 13715665 14072868 14463414 14983852 15739693 16645170 17823542 19228595 20622028 21426260
5397 21426260 21067653 20311749 19787075 19583382 19631249 19921865 20414533 21080639 21770884 22800433
5387 22800433 24026865 25412365 26942615 28898277 31064059 33689221 36497135 39728215
5379 39728215 43313805 47004447 50851242 54893670 58878809 62765425 66478401 69907373
5371 69907373 72410927 73324718 72609934 70123019 66657265 62303894 57657706 53091068
5363 53091068 48774702 44401655 40357679 36690630 33449882 30549512 28068501 25925584
5355 25925584 24112345 22474605 21142062 19921014 18847994 17943495 17086495 16501755 15877389
5346 15877389 15310656 14791140 14338014 13897585 13480334 13236610 12898753 12668463 12320075
5337 12320075 12196244 11950708 11776304 11775410 11589489 11458844 11372971 11308684 11261374 11218417 11243738
5326 11243738 11328550 11187364 11094802 11239216 11277067 11153166 11196320 11304927 11437061 11391382
5316 11391382 11403849 11535621 11644678 11745307 11881369 12000250 12165048 12196901 12217391 12219833
5306 12219833 12290795 12500717 12656958 12830906 13093393 13434759 13766488 14109799 14649615 15251199
5296 15251199 15924789 16799453 17815751 18928824 20128385 21342774 22447527 23278134 23729750
5287 23729750 23749127 23445389 23050889 22836487 22564774 22221799 21870633 21590752 21215579 20685995
5277 20685995 20193000 19733484 19230891 18875834 18752700 18691357 18655336 18731640 19101562 19435879
5267 19435879 20050099 20760290 21741806 22754048 24032024 25471306 26873562 28165336 29140333
5258 29140333 29945426 30485497 30939123 31172707 31335501 31390946 31502054 31625213 31740661 31881494
5248 31881494 31974922 31898117 31535885 30650043 29287406 27718671 26093547 24506544 23059697
5239 23059697 21850837 20825506 19994644 19442670 19121299 18961319 18948299 19117670 19411870
5230 19411870 19928423 20521229 21167249 21761040 22516610 23157475 23774714 24428267 25135958
5221 25135958 26163711 27440990 28954576 30849110 33497991 36734796 39834349 40612234
5213 40612234 36731739 30876829 25943517 22355890 19582045 17431775 15736875 14372997
5205 14372997 13312115 12301373 11523023 10918630 10492855 9985720 9579408 9179307 8816268
5196 8816268 8525808 8173312 7810158 7585782 7297580 7139705 6959616 6720683 6613063 6481625
5186 6481625 6365557 6317909 6161878 5996159 5804384 5737153 5620190 5467045 5381022 5348758
5176 5348758 5323267 5287847 5138574 4963451 4961896 4810470 4645337 4613872 4642429 4658519 4591258
5165 4591258 4553354 4394664 4367573 4326363 4393603 4350323 4177138 4076002 4095657 4003395 4015302
5154 4015302 4145771 4160943 4056372 3973022 3903221 3951702 3909487 3861572 3754032 3685215 3729356
5143 3729356 3635623 3512910 3454193 3553710 3605516 3592669 3568283 3494058 3493957 3532518 3451089 3357585
5131 3357585 3375971 3344851 3215223 3338509 3321768 3348312 3350446 3303802 3327665 3395329 3199499
5120 3199499 3264614 3329788 3315716 3387602 3396578 3427739 3463774 3468286 3493183 3492944 3499182 3665540
5108 3665540 3712927 3665161 3790079 3705924 3776500 3738849 3686200 3805188 3738014 3609730 3771029
5097 3771029 3869640 3822202 3831643 3805510 3777863 3776430 3927288 4081988 4169191 4109077 4073235
5086 4073235 4185313 4311923 4412356 4416884 4507204 4652271 4719624 4838792 5006708 5066741
5076 5066741 5183979 5308256 5248616 5342025 5395014 5536204 5631099 5782816 5918098 5999370
5066 5999370 6122472 6378377 6387662 6492946 6651527 6821954 7108247 7357373 7582520 7686189
5056 7686189 7885332 8142298 8310638 8650223 8996185 9460193 10064765 10596764 11145379 11801836
5046 11801836 12610339 13465923 14407243 15696963 17034155 18353773 19857876 21209302 22146539
5037 22146539 22724255 22921672 22680793 22113287 21544641 21044314 20618568 20347555 20118306
5028 20118306 19652775 19261086 18845950 18451879 18189399 17982980 17861556 17927290 18174160 18534711
5018 18534711 19191935 19930433 20885870 22119511 23354412 24577047 25906660 26967787 27558197
5009 27558197 27745184 27637726 27516416 27337467 27118862 27010519 26725390 26575746 26291797
5000 26291797 25750692 25349360 25192616 24842164 24600379 23993641 23253183 22349977 21247650
4991 21247650 20048656 18842596 17816082 16951202 16291135 15812809 15377843 15102003 14989182
4982 14989182 14991151 15148177 15395871 15683022 15855300 16110600 16397648 16701391 16846852 16991089
4972 16991089 17217159 17443676 17750488 17967432 17650935 17006221 16099833 15030620 13837975
4963 13837975 12704366 11742074 10942376 10250185 9694292 9221665 8773749 8389057 8036807
4954 8036807 7847510 7544592 7393387 7284482 7028547 6905993 6689565 6406377 6315566 6302762
4944 6302762 6213525 6134745 6101374 6006340 6003377 5848295 5728851 5659609 5575509 5562744 5406090
4933 5406090 5321023 5308912 5253913 5199419 5130029 5102910 5019832 4966597 4952724 4844463 4875700
4922 4875700 4863208 4853346 4775005 4768093 4730770 4788003 4750918 4731932 4676092 4739337 4849651 4834617
4910 4834617 4725406 4552123 4523868 4558392 4566479 4519743 4569149 4541275 4459183 4463185 4469724 4363359
4898 4363359 4310004 4420349 4491710 4420809 4389925 4446102 4470551 4386843 4281107 4228161 4225188
4887 4225188 4346884 4378818 4311142 4197498 4071415 4172115 4193430 4164379 4118250 4184894 4254521
4876 4254521 4178141 4221849 4267234 4330950 4307913 4392835 4424446 4379269 4365457 4317356 4242047
4865 4242047 4241919 4285793 4223495 4256077 4170214 4116825 4163547 4230957 4117886 4178510 4190267 4080583
4853 4080583 4007770 3995335 3993793 3860705 3881753 3918776 3950259 4038924 4001085 4038124 4085151
4842 4085151 4023649 4013114 3968848 4103825 4131099 4081280 4093510 4195356 4161125 4107470 4167584
4831 4167584 4135387 4126290 4077782 4105320 4200381 4334598 4355338 4284844 4230885 4264435 4258900 4302720
4819 4302720 4414607 4418610 4437010 4385860 4465515 4595367 4621226 4540224 4602818 4788768 4704165
4808 4704165 4763922 4884918 4908216 4784605 4776915 4834752 4947175 5184064 5218244 5313124 5387525
4797 5387525 5443663 5436691 5524667 5615308 5729272 5876530 5959130 5954037 6025731 6311603 6502058
4786 6502058 6612573 6883158 7156410 7458335 7782631 8247650 8766591 9288670 10027451 10980975
4776 10980975 12362854 14305943 16405782 17951933 18438337 17760816 15834277 13779594
4768 13779594 12052678 10854981 10069838 9474962 9198224 8924619 8799228 8735413 8590229
4759 8590229 8408373 8402186 8433172 8457140 8443264 8517316 8583959 8617289 8644145 8740229 8756385
4748 8756385 8919038 8926002 8915551 9136721 9264418 9438779 9543448 9635135 9799985 9807718 9918920
4737 9918920 10058396 10280907 10426722 10566227 10613407 10791059 11011912 11227326 11441704 11644678
4727 11644678 11895759 12073545 12329047 12487904 12578208 12823286 13069831 13396071 13795489 14170498
4717 14170498 14620750 15024368 15566386 16168133 16926316 17932092 19335948 21098562 23038924
4708 23038924 24392432 24825844 24647082 23805337 22285296 20572960 19239721 18462999 18003670
4699 18003670 17751593 17559153 17402283 17287123 17137505 17091967 17080446 17003602 16989141 16944521
4689 16944521 16931193 17038618 17188904 17280252 17258044 17403550 17665475 17856909 18150156 18428172
4679 18428172 18538970 18845047 19080836 19211171 19347339 19539850 19726163 19919833 20234959
4670 20234959 20601002 20796690 21041018 21395204 21678308 22050758 22414943 22874161 23229173
4661 23229173 23815763 24374701 25041109 25725353 26488549 27400325 28058548 28824220 29489149
4652 29489149 30180145 30985105 32010479 33142790 34328250 35687006 37302981 39144709
4644 39144709 41233746 43510640 46102008 49131233 52645565 56651505 61463827 67081514
4636 67081514 73720737 81185067 89159152 97348900 105084373 112205717 118505605 124031160
4628 124031160 128274345 131056474 131821441 130088356 125943713 119982817 112922106 105477548
4620 105477548 97846755 90262208 83101618 76301509 70137048 64520383 59597460 55309494
4612 55309494 51576806 48110676 45000107 42241412 39664806 37532836 35553813 33807022
4604 33807022 32068106 30626658 29315522 28379217 27237916 26264479 25337115 24485912 23799239
4595 23799239 23128094 22431491 21760706 21165303 20636224 20153144 19651388 19221643 18734064
4586 18734064 18301942 17907204 17564882 17294334 16921547 16499923 16377936 16059175 15834235
4577 15834235 15633350 15486092 15281088 15064261 14952173 14736094 14568700 14447471 14245726
4568 14245726 14108655 14022880 13975620 13924570 13773589 13738975 13625963 13502938 13456936 13295897
4558 13295897 13250202 13044271 12995588 12863841 12772046 12779784 12618115 12447116 12409034 12418694 12240736
4547 12240736 12276224 12281847 12180870 12179494 12192127 12169849 12172960 12258004 12187329 12322341 12407119
4536 12407119 12316753 12432300 12363282 12389192 12545957 12559465 12559076 12555366 12488749 12529483 12409072
4525 12409072 12227066 12221479 12267417 12292526 12175911 12035836 11857228 11787086 11673003 11530933
4515 11530933 11443312 11451601 11321832 11297782 11211798 11141978 11053211 11157362 11218527 11148242 11136840
4504 11136840 11175053 11107107 11158826 11136866 11202116 11120194 11077308 10995789 10934926 10968688 10882610
4493 10882610 10909538 11086225 11140589 11141738 11303962 11414544 11344244 11356655 11535408 11605758 11643317
4482 11643317 11752941 11830957 11893223 11873824 11821255 12035355 11975024 11929164 11973584 12095221 12111239
4471 12111239 12044293 12224113 12341963 12354918 12430167 12630591 12850980 13086819 13395767 13751750
4461 13751750 13962225 13865303 13744066 13643730 13488349 13346103 13482008 13582441 13733035 13830127
4451 13830127 14082678 14324525 14481396 14588946 14891995 15130519 15272517 15513527 15773164
4442 15773164 16072289 16324650 16520197 16726604 16970273 17274139 17628159 18055272 18247684
4433 18247684 18637463 19129508 19687590 20184198 20652982 21117106 21690755 22244357 22801396
4424 22801396 23320192 24065717 24727714 25479588 26156096 26764243 27613028 28613105 29630756
4415 29630756 30730778 32210089 33935317 35893627 38079993 40477792 43203436 46186501
4407 46186501 49547179 53686716 58503831 64355304 71524332 80453285 91648384 105688398
4399 105688398 122225551 138817263 150960466 153396130 144228700 128081713 110518361
4392 110518361 94935870 81993255 71530298 63224125 56506639 51146207 46743523 43038933
4384 43038933 40015587 37384189 35023750 33085232 31459274 30036125 28795403 27533924
4376 27533924 26569923 25589772 24714593 23818530 22920307 22237722 21605951 21045668 20446779
4367 20446779 19963195 19253143 18639067 18148214 17623750 17178828 16839018 16348393 15989610
4358 15989610 15736499 15602087 15348145 15122453 15004009 14791675 14758579 14625906 14380450 14212978
4348 14212978 14126165 13958831 13753711 13592435 13364348 13104269 12957808 12785077 12654512 12474734
4338 12474734 12149812 11937824 11929239 11658043 11404723 11303355 11205181 10987503 10879655 10680169
4328 10680169 10592764 10422098 10243341 10196537 9972484 9855015 9877920 9829528 9690715 9647467
4318 9647467 9574889 9563992 9625955 9579614 9647696 9532661 9573988 9585215 9524048 9394101 9441777
4307 9441777 9564565 9490650 9512152 9592068 9630231 9612233 9551667 9531965 9676213 9743021 9755373
4296 9755373 9784083 9755771 9817949 9785444 9657591 9616195 9564637 9555248 9728166 9775514 9846236
4285 9846236 9984870 10133775 10269015 10452450 10360389 10200890 10186904 10191927 10397424 10719232
4275 10719232 10844044 10648640 10383228 10204296 10097821 9926788 9978531 9984789 10033422 10014810
4265 10014810 10011849 10074496 10338287 10465224 10483526 10560744 10675847 10748339 10829415 10730182 10677175
4254 10677175 10749619 10740084 10772592 10803587 10883749 11001333 11007440 11209089 11356313 11600797 11770720
4243 11770720 11880257 11969136 11989887 12143498 12348882 12467069 12638754 12838976 12937696 13103863
4233 13103863 13177946 13339055 13555427 13816559 14113213 14469038 14951859 15501023 16022325 16787085
4223 16787085 17624167 18654335 19879239 20587897 20997753 20814549 20228752 19431249 18653615
4214 18653615 17796078 16863976 16136607 15441147 14750581 14271971 13835123 13527519 13363949
4205 13363949 13227565 12978893 13013291 12949012 12976001 13073991 13077363 13124616 13129784 13065223 13065091 12853708
4193 12853708 12475694 12346200 12120567 11872114 11716069 11560492 11325984 11219681 11198387 11150906
4183 11150906 11050920 11081872 10895776 10782325 10715663 10728300 10739752 10721929 10759974 10685208 10601791
4172 10601791 10674432 10736691 10915165 11057225 11090605 11303423 11463413 11645253 11791637 11957903
4162 11957903 12234565 12318167 12450757 12512743 12535417 12552650 12621116 12659047 12758353 12766230 12918067
4151 12918067 12963444 12958094 12984531 13055661 13079618 13024240 12910379 12793141 12582248 12381765 12242399
4140 12242399 11986253 11780373 11698757 11676687 11523200 11536256 11764461 11812452 11765282 11666931
4130 11666931 11413561 11169867 10781211 10555235 10467280 10226065 10172893 10093586 10024130 10036421
4120 10036421 9999467 10074664 9979056 9852917 9838732 9793630 9729823 9710041 9707481 9776392 9850015
4109 9850015 9883904 10010429 10180433 10269228 10380592 10409959 10469893 10497479 10515335 10736987 10820334
4098 10820334 10958418 11146953 11378326 11462955 11509489 11748298 11966600 12045754 12198033 12264697
4088 12264697 12335227 12446874 12570290 12728434 12999706 13444325 13764883 14064810 14506544 14895110
4078 14895110 15094186 15386022 15651858 15780683 16049579 16345816 16673891 17044786 17660038
4069 17660038 18203318 18839921 19455362 20038086 20774789 21295505 21689875 21835987 21879885 22080733
4059 22080733 22263091 22418311 22681884 22963994 23478302 23951096 24462141 25106525 25686337
4050 25686337 25960735 26071409 25984300 25864272 25494607 25086010 24726562 24461173 24230143 24186906
4040 24186906 24286763 24364749 24291977 24387444 24267636 24099929 23730547 23193980 22477364 21819659
4030 21819659 21014341 20373786 19947441 19441068 19035335 18607501 18127988 17795424 17384523
4021 17384523 16862640 16448869 15945667 15338446 14824158 14147912 13567397 13227334 12782494
4012 12782494 12380568 11921378 11615023 11116169 10863915 10573134 10286461 10004973 9605868
4003 9605868 9252838 9017290 8712831 8430529 8208900 8030748 7821716 7525167 7316186 7235628
3993 7235628 6952101 6781884 6605354 6395034 6324185 6335685 6160023 6056035 5924219 5751379
3983 5751379 5522868 5463826 5421978 5283649 5280964 5392107 5224901 5055841 4907319 4741959
3973 4741959 4601709 4487629 4432253 4427106 4360128 4220911 4156215 4018717 3959885 3890798 3794559
3962 3794559 3830741 3876736 3863534 3813291 3807779 3768583 3704411 3669029 3707724 3768985 3819115 3859491
3950 3859491 3816891 3721823 3603535 3511850 3367750 3244042 3200061 3162878 3072707 3008645 2901358
3939 2901358 2796475 2776641 2781421 2802733 2896896 2777612 2799054 2764251 2822268 2831728 2791517
3928 2791517 2728424 2701077 2617162 2602644 2508007 2420960 2367165 2343814 2338744 2456606 2460040 2400281
3916 2400281 2348978 2337826 2117772 2211073 2316955 2364565 2377137 2336398 2282031 2268984 2267555
3905 2267555 2170788 2170328 2073055 2028265 1956692 1951817 1959999 1916846 1841222 1813709 1796590 1725196
3893 1725196 1756207 1713870 1686762 1704571 1670186 1606880 1545176 1668269 1662358 1628359 1497006
3882 1497006 1476380 1508104 1638886 1568106 1482966 1547785 1456646 1458854 1653816 1508663 1531432
3871 1531432 1534215 1536901 1474364 1470481 1337963 1382837 1413247 1479583 1593637 1534820 1505470 1579075
3859 1579075 1631914 1550293 1486268 1622952 1596329 1625159 1651333 1591285 1610519 1526886 1538441
3848 1538441 1612628 1586429 1591465 1501322 1476781 1488872 1442652 1430507 1381060 1445744 1392646 1436872
3836 1436872 1398338 1319164 1374632 1482332 1488734 1545926 1586297 1472658 1418886 1464287 1479767
3825 1479767 1478401 1515050 1556241 1587224 1699223 1685477 1665865 1606842 1576862 1562930 1587183
3814 1587183 1751349 1710170 1663334 1712404 1700216 1716738 1704787 1780411 1820957 1817699 1883314
3803 1883314 1982615 2092629 2060370 2048778 2056060 2119441 1997024 2128705 2229109 2104288 2106303
3792 2106303 1986638 1946427 1895008 1899086 1872591 1790856 1761229 1843513 1723362 1679547 1553448
3781 1553448 1486457 1423403 1452693 1340530 1454492 1588233 1557538 1394919 1464608 1480623 1363499
3770 1363499 1426461 1495855 1398886 1448234 1531904 1425350 1244221 1373213 1538949 1551727 1511130
3759 1511130 1486589 1500896 1455076 1397429 1354335 1426545 1464421 1400740 1376951 1378727 1344975 1377448
3747 1377448 1419470 1494388 1429945 1338975 1399320 1488698 1481278 1521693 1415347 1503624 1570542
3736 1570542 1624891 1592528 1600254 1523327 1499935 1491835 1598562 1670976 1527704 1539897 1609230
3725 1609230 1526184 1533349 1550912 1656759 1657964 1478945 1481842 1557758 1562785 1565421 1522732 1605178
3713 1605178 1625371 1759475 1670635 1704271 1695402 1708198 1706637 1754902 1868168 1798744 1741135
3702 1741135 1756715 1889943 1921280 1845332 1765092 1885337 1951146 1890762 2001077 2051942 2095228
3691 2095228 2097480 2084275 2195444 2117986 2107564 2208448 2216062 2189598 2315751 2362915 2449618
3680 2449618 2564767 2678042 2687488 2735228 2669235 2625496 2592999 2653119 2687563 2755051 2707452
3669 2707452 2762955 2902453 2889029 2892371 2992242 3132310 3162124 3224793 3304083 3444858 3511475
3658 3511475 3455951 3529523 3650121 3744722 3884461 4073800 4217055 4334145 4565723 4647495
3648 4647495 4703119 4889236 4939628 4905803 4963626 5057557 5060906 5063906 5016120 4954294 4965886 4959774
3636 4959774 5015097 5063552 5043348 5131373 5190086 5253614 5241433 5332621 5353080 5164476 5029535
3625 5029535 5095216 5034868 4741814 4717522 4587872 4447038 4341988 4235288 4122535 4113779
3615 4113779 4150238 4192821 3991466 3870309 3894402 3818919 3719589 3812060 3831091 3773080 3747486
3604 3747486 3651637 3662349 3583668 3649024 3856465 3721615 3730152 3746620 3681116 3679139 3573889
3593 3573889 3586314 3569837 3602383 3610041 3609509 3628190 3731918 3869344 3983095 3914341 3829345
3582 3829345 3855038 3782138 3802890 3914487 3981727 3986381 4035028 4041475 3981569 4015256 4094754 4195247
3570 4195247 4282404 4333083 4303077 4278350 4372426 4492823 4543336 4625386 4778049 4786984 4782105
3559 4782105 4944891 4989299 5038630 5002230 5051620 5218597 5327036 5327932 5340522 5491634 5661920
3548 5661920 5710172 5842567 5822225 5990801 6198720 6269598 6360187 6680471 6799992 6851170
3538 6851170 6926834 7125472 7359719 7321998 7427362 7526114 7763168 7871954 7944614 8083017
3528 8083017 8160330 8283808 8466740 8518134 8586704 8589566 8671505 8874105 9019900 9098005 9131118
3517 9131118 9283099 9339961 9343085 9405795 9460080 9497029 9518280 9472929 9561329 9654851 9769904
3506 9769904 9942209 9990416 10130663 10149010 10213969 10266651 10370347 10495277 10583634 10584863 10643254
3495 10643254 10697856 10870282 10975417 11083314 11149329 11318739 11469561 11561089 11661273 11804580
3485 11804580 11953457 12108045 12258918 12419706 12635356 12734218 13051322 13177263 13322697 13552630
3475 13552630 13776600 13867431 13881761 14062655 14127876 14391501 14540803 14674419 14834536 14887868
3465 14887868 14960820 15101921 15140331 15283989 15458165 15521249 15648519 15847216 16090534 16199088
3455 16199088 16207964 16334498 16617340 16593979 16811809 17022134 17060813 17174002 17297789 17421053
3445 17421053 17535029 17446340 17424604 17420726 17368916 17353120 17293723 17199451 17101003 17115843 16969025
3434 16969025 16718091 16684947 16606825 16594384 16531406 16459136 16448409 16374013 16286550 16280234 16296705
3423 16296705 16170807 16065534 16010597 16144021 16131205 16164468 16168643 16083808 16192876 16255215 16275949
$$ [...]
##END NTUPLES=NMR SPECTRUM
##END=
