##TITLE=1H_EC-3299(2)
 CDCl3
 8 sc, 
 1.8.2023
##JCAMPDX= 6.0         $$ Bruker NMR JCAMP-DX V2.0
##DATA TYPE= NMR SPECTRUM
##DATA CLASS= NTUPLES
##ORIGIN= UXNMR, Bruker Analytische Messtechnik GmbH
##OWNER= root
$$ XWIN-NMR		Version 3.5
$$ Wed Aug  2 14:12:09 2023 Russian Standard Time (UT+4h)  she@DPX200
##.OBSERVE FREQUENCY= 200.13135
##.OBSERVE NUCLEUS= ^1H
##.ACQUISITION MODE= SIMULTANEOUS
##.ACQUISITION SCHEME= undefined
##.AVERAGES= 8
##.DIGITISER RES= 18
##SPECTROMETER/DATA SYSTEM= spect
##.PULSE SEQUENCE= zg30
##.SOLVENT NAME= D2O
##.SHIFT REFERENCE= (INTERNAL, D2O, 0, 15.7502)
##AUDIT TRAIL= $$ (NUMBER, WHEN, WHO, WHERE, WHAT)
$$ ##TITLE= Audit trail, XWIN-NMR		Version 3.5
$$ ##JCAMPDX= 5.01
$$ ##ORIGIN= Bruker BioSpin GmbH
$$ ##OWNER= she
$$ F:/spectra/data/she/nmr/H-F/1/pdata/1/auditp.txt
$$ ##AUDIT TRAIL=  $$ (NUMBER, WHEN, WHO, WHERE, WHAT)
(   1,<2023-08-02 14:11:01.07 +0400>,<she>,<DPX200>,
      <created by zg, POWCHK disabled, PULCHK disabled
       configuration hash MD5:
       00 E9 B6 7A A2 85 ED C7 34 08 36 98 17 FE 4E 26
       data hash MD5: 16K
       43 92 5C 81 05 D9 81 62 DE B4 0E C2 EC E6 10 D2>)
(   2,<2023-08-02 14:11:06.26 +0400>,<she>,<DPX200>,
      <Start of raw data processing
       efp BC_mod = 2 LB = 0.24 FT_mod = 6 PKNL = 1 PHC0 = -21196.53 PHC1 = 11.85272 SI = 16K 
       data hash MD5: 16K
       1E BD E6 EC B8 4C C7 BD 4E 91 78 4D 1F EC A3 66>)
(   3,<2023-08-02 14:11:26.07 +0400>,<she>,<DPX200>,
      <pk PHC0 = 159.0241 PHC1 = -0.4 
       data hash MD5: 16K
       42 91 E7 DD F4 93 99 89 E5 D8 01 7C 6D EF 1B CC>)
(   4,<2023-08-02 14:11:30.35 +0400>,<she>,<DPX200>,
      <abs ABSG = 5 
       data hash MD5: 16K
       D0 99 90 10 05 0D 6C 01 AC 80 56 F2 F5 20 A7 49>)
$$ ##END=
$$ 
$$ hash MD5
$$ 58 71 71 E5 2D DD B5 D9 55 03 F0 61 B3 9F D8 45
##$RELAX= 
##$RELAX= 
##$RELAX= 
##$RELAX= 
##$RELAX= 
##$RELAX= 
$$ Bruker specific parameters
$$ --------------------------
##$DU= <F:/spectra>
##$EXPNO= 1
##$NAME= <H-F>
##$PROCNO= 1
##$TYPE= <nmr>
##$USER= <she>
##$AMP= (0..31)
100 100 100 100 100 100 100 100 100 100 100 100 100 100 100 100 100 100 
100 100 100 100 100 100 100 100 100 100 100 100 100 100 
##$AQSEQ= 0
##$AQ_mod= 1
##$AUNM= <au_zg>
##$AUTOPOS= <>
##$BF1= 200.13
##$BF2= 200.13
##$BF3= 200.13
##$BF4= 200.13
##$BF5= 200.13
##$BF6= 200.13
##$BF7= 200.13
##$BF8= 200.13
##$BYTORDA= 1
##$CFDGTYP= 0
##$CFRGTYP= 5
##$CHEMSTR= <none>
##$CNST= (0..31)
1 1 145 1 1 1 1 1 1 1 1 1 1 1 1 1 1 1 1 1 1 1 1 1 1 1 1 1 1 1 1 1 
##$CPDPRG= <>
##$CPDPRG1= <>
##$CPDPRG2= <>
##$CPDPRG3= <>
##$CPDPRG4= <mlev>
##$CPDPRG5= <mlev>
##$CPDPRG6= <mlev>
##$CPDPRG7= <mlev>
##$CPDPRG8= <mlev>
##$CPDPRGB= <>
##$CPDPRGT= <>
##$D= (0..31)
0 1.2 0 0 0 0 0 0 0 0.06 0 0.03 0 0 0 0 0.0002 0 0 0 0 0 0 0 0 0 0 0 0 
0 0 0 
##$DATE= 1690971060
##$DBL= (0..7)
120 120 120 120 120 120 120 120 
##$DBP= (0..7)
150 150 150 150 150 150 150 150 
##$DBP07= 0
##$DBPNAM0= <>
##$DBPNAM1= <>
##$DBPNAM2= <>
##$DBPNAM3= <>
##$DBPNAM4= <>
##$DBPNAM5= <>
$$ [...]
##$SUBNAM3= <"">
##$SUBNAM4= <"">
##$SUBNAM5= <"">
##$SUBNAM6= <"">
##$SUBNAM7= <"">
##$SUBNAM8= <"">
##$SUBNAM9= <"">
##$SW= 18.05172834244
##$SWIBOX= (0..15)
0 0 2 0 0 0 0 0 0 0 0 0 0 0 0 0 
##$SW_h= 3612.71676300578
##$TD= 16384
##$TD0= 1
##$TE= 0
##$TE2= 300
##$TE3= 300
##$TEG= 300
##$TL= (0..7)
0 120 120 120 120 120 120 120 
##$TP= (0..7)
150 150 150 150 150 150 150 150 
##$TP07= 0
##$TPNAME0= <>
##$TPNAME1= <>
##$TPNAME2= <>
##$TPNAME3= <>
##$TPNAME4= <>
##$TPNAME5= <>
##$TPNAME6= <>
##$TPNAME7= <>
##$TPOAL= (0..7)
0.5 0.5 0.5 0.5 0.5 0.5 0.5 0.5 
##$TPOFFS= (0..7)
0 0 0 0 0 0 0 0 
##$TUNHIN= 0
##$TUNHOUT= 0
##$TUNXOUT= 0
##$USERA1= <user>
##$USERA2= <user>
##$USERA3= <user>
##$USERA4= <user>
##$USERA5= <user>
##$V9= 5
##$VALIST= <valist>
##$VCLIST= <CCCCCCCCCCCCCCC>
##$VD= 0
##$VDLIST= <DDDDDDDDDDDDDDD>
##$VPLIST= <PPPPPPPPPPPPPPP>
##$VTLIST= <TTTTTTTTTTTTTTT>
##$WBST= 1024
##$WBSW= 4
##$XGAIN= (0..3)
0 0 0 0 
##$XL= 0
##$YL= 0
##$YMAX_a= 274103
##$YMIN_a= -285784
##$ZGOPTNS= <>
##$ZL1= 120
##$ZL2= 120
##$ZL3= 120
##$ZL4= 120
##$ABSF1= 15.73036
##$ABSF2= -2.321489
##$ABSG= 5
##$ABSL= 3
##$ALPHA= 0
##$AQORDER= 0
##$ASSFAC= 0
##$ASSFACI= 0
##$ASSFACX= 0
##$ASSWID= 0
##$AUNMP= <proc_1d>
##$AZFE= 0.1
##$AZFW= 0.1
##$BCFW= 0
##$BC_mod= 2
##$BYTORDP= 0
##$COROFFS= 0
##$CY= -3
##$DATMOD= 1
##$DC= 0
##$DFILT= <>
##$DTYPP= 0
##$F1P= 0
##$F2P= 0
##$FCOR= 1
##$FTSIZE= 16384
##$FT_mod= 6
##$GAMMA= 0
##$GB= 0
##$INTBC= 1
##$INTSCL= 3.70164e-10
##$ISEN= 128
##$LB= 0.24
##$LEV0= 0
##$LPBIN= 0
##$MAXI= 10000
##$MC2= 0
##$MEAN= 0
##$ME_mod= 0
##$MI= 1.114404
##$NCOEF= 0
##$NC_proc= -7
##$NLEV= 6
##$NOISF1= 3.799351
##$NOISF2= 2.8
##$NSP= 0
##$NTH_PI= 0
##$NZP= 0
##$OFFSET= 15.75019
##$PC= 1
##$PHC0= -21037.51
##$PHC1= 11.45272
##$PH_mod= 1
##$PKNL= yes
##$PPARMOD= 0
##$PSCAL= 0
##$PSIGN= 0
##$REVERSE= no
##$SF= 200.130004272078
##$SI= 16384
##$SIGF1= 3
##$SIGF2= 2
##$SINO= 5.538805
##$SIOLD= 16384
##$SREGLST= <1H.CDCl3>
##$SSB= 0
##$STSI= 16384
##$STSR= 0
##$SW_p= 3612.71676300578
##$SYMM= 0
##$S_DEV= 0
##$TDeff= 16384
##$TDoff= 0
##$TI= <>
##$TILT= no
##$TM1= 0
##$TM2= 0
##$TOPLEV= 0
##$USERP1= <user>
##$USERP2= <user>
##$USERP3= <user>
##$USERP4= <user>
##$USERP5= <user>
##$WDW= 1
##$XDIM= 16384
##$YMAX_p= 533829770
##$YMIN_p= -555355
$$ End of Bruker specific parameters
$$ ---------------------------------
##NTUPLES= NMR SPECTRUM
##VAR_NAME=  FREQUENCY,     SPECTRUM/REAL,   SPECTRUM/IMAG
##SYMBOL=    X,             R,               I
##VAR_TYPE=  INDEPENDENT,   DEPENDENT,       DEPENDENT
##VAR_FORM=  AFFN,          ASDF,            ASDF
##VAR_DIM=   16384,         16384,           16384
##UNITS=     HZ,            ARBITRARY UNITS, ARBITRARY UNITS
##FACTOR=    0.220516191357247, 1,           1
##FIRST=     3152.08554819539, 0,            0
##LAST=      -460.631214810393, 0,           0
##MIN=       -460.631214810393, -555355,     0
##MAX=       3152.08554819539, 533829770,    0
$$ Real data points
##PAGE= N=1
##DATA TABLE= (X++(R..R)), XYDATA
$$ [...]
$$ plain form
5596 5980966 5996776 6048088 6269920 6399964 6467264 6563239 6722074 6871289 7126960 7284303
5586 7284303 7420265 7687255 7897614 8098257 8394259 8654695 9112243 9497598 9930451 10017569
5576 10017569 9853344 9857355 9813270 9742374 9386147 9178767 8977528 8667833 8308242 7923048
5566 7923048 7647757 7388779 7200817 7079093 7050939 6890600 6661093 6681466 6634424 6592737
5556 6592737 6556323 6336624 6365689 6313128 6358113 6320981 6372922 6440972 6336521 6561554 6511523
5545 6511523 6530324 6699061 6737228 6811393 6986398 7241708 7126074 6986295 6965631 6778445
5535 6778445 6656274 6575632 6592430 6558667 6556847 6534010 6585056 6681789 6704618 6734415 6848328
5524 6848328 6944243 6861829 6899375 6991169 6953404 6776490 6781018 6910367 6874431 6633797 6676237
$$ packed form
5596E980966J5810N1312K21832J30044O7300R5975J58835J49215K55671J57343
5586G284303J35962K66990K10359K00643K96002K60436M57548L85355M32853Q7118
5576A0017569j64225M011m4085p0896l56227k07380k01239l09695l59591l85194
5566G923048k75291k58978j87962j21724k8154j60339k29507K0373m7042m1687
5556F592737l6414k19699K9065n2561M4985l7132N1941O8050j04451K25033n0031
5545F511523J8801J68737L8167P4165J75005K55310j15634j39779k0664j87186
5535F778445j22171q0642J6798l3763j820k2837N1046R6733K2829K9797J13913
5524F848328R5915q2414L7546R1794l7765j76914M528J29349l5936k40634M2440
$$ plain form
5513 6676237 6882106 7028986 7102871 7063890 7044719 6957856 7022035 7264664 7201445 7205905 7175623
5502 7175623 7073994 7088651 7126231 7074749 7143160 7103562 7271012 7517766 7564383 7736209 8047159
5491 8047159 8446360 8959334 9624095 10119275 10038724 9544002 8940171 8529091 8197622 7957288
5481 7957288 7897676 7803514 7661214 7528778 7495124 7403979 7326557 7551952 7784081 7917586
5471 7917586 7960013 7968369 7989725 8174072 8440889 8683125 9038979 9390593 9739045 10372019
5461 10372019 11138388 11930237 13138692 14949288 17029258 17991961 17652595 16383574 14770476
5452 14770476 13243578 12076287 11406260 10959150 10401146 10118087 9931179 9877209 9978287
5443 9978287 10061036 10084023 10046085 10070000 10143195 10302297 10488787 10689458 10750248 10929698 11286014
$$ packed form
5513F676237K05869J46880P3885l8981j9171q6863O4179K42629o3219M460l0282
5502G175623j01629J4657L7580n1482O8411l9598J67450K46754M6617J71826L10950
5491H047159L99201N12974O64761M95180q0551m94722o03831m11080l31469k40334
5481G957288n9612r4162j42300j32436l3654r1145p7422K25395K32129J33505
5471G917586M2427Q356K1356J84347K66817K42236L55854L51614L48452O32974
5461A0372019P66369P91849J208455J810596K079970R62703l39366j269021j613098
5452A4770476j526898j167291o70027m47110n58004k83059j86908n3970J01078
5443I978287Q2749K2987l7938K3915P3195J59102J86490K00671O0790J79450L56316
$$ plain form
5432 11286014 11599207 12170781 12459499 13112397 14111302 15467740 17295646 19272047 20233922
5423 20233922 19545184 18063823 16184056 14687707 13730151 13104863 12802945 12458510 12432622
5414 12432622 12354035 12228379 12302308 12360184 12295414 12398400 12577286 12676416 12876023 12978789
5404 12978789 13294125 13623122 13959015 14200337 14509025 14905288 15320741 15835834 16323205
5395 16323205 17031169 17924685 18976992 19458101 19462969 19250120 19071002 19075627 19167791 19562744
5385 19562744 19995500 20466276 21126431 22075753 22923300 23956417 24950249 26219723 27744475
5376 27744475 29420913 31567638 33781999 36179205 38979063 42116723 45657820 49382467
5368 49382467 53618473 57640135 61966135 66352338 70379919 73914549 76204842 77053071
$$ packed form
5432A1286014L13193N71574K88718O52898R98905J356438J827906J976401R61875
5423B0233922o88738j481361j879767j496349r57556o25288l01918l44435k5888
5414A2432622p8587j25656P3929N7876o4770J02986J78886R9130J99607J02766
5404A2978789L15336L28997L35893K41322L08688L96263M15453N15093M87371
5395A6323205P07964Q93516J052307M81109M868k12849j79118M625R2164L94953
5385A9562744M32756M70776O60155R49322Q47547J033117R93832J269474J524752
5376B7744475J676438K146725K214361K397206K799858L137660L541097L724647
5368D9382467M236006M021662M326000M386203M027581L534630K290293Q48229
$$ plain form
5360 77053071 76301628 73786552 70208605 66150970 61910118 57506115 53198633 49128298
5352 49128298 45082444 41424720 38312509 35368710 32719306 30593014 28776689 27220898
5344 27220898 25946136 24873446 23898680 23162226 22574060 21911659 21508781 21216944 20718647
5335 20718647 20400342 20227101 19992549 19990105 19883730 19655484 19437823 19271535 19269079 19340883
5325 19340883 19405617 19494869 19484530 19665120 20021425 20279232 20564583 20954943 21185699 21412619
5315 21412619 21929616 22346915 22977333 23753720 24334088 25012845 26141416 27017423 28018947
5306 28018947 29083277 30517727 32134754 33802349 35588782 37299723 38766141 40072716
5298 40072716 41033637 41404317 41300640 41004197 40660496 40177688 39659147 39364028 39038944
$$ packed form
5360G7053071p51443k515076l577947m057635m240852m404003m307482m070335
5352D9128298m045854l657724l112211k943799k649404k126292j816325j555791
5344B7220898j274762j072690r74766p36454n88166o62401m02878k91837m98297
5335B0718647l18305j73241k34552k444j06375k28246k17661j66288k456P1804
5325A9340883O4734Q9252j0339J80590L56305K57807K85351L90360K30756K26920
5315B1412619N16997M17299O30418P76387N80368O78757J128571Q76007J001524
5306B8018947J064330J434450J617027J667595J786433J710941J466418J306575
5298D0072716R60921L70680j03677k96443l43701m82808n18541k95119l25084
$$ plain form
5289 39038944 38696010 38215308 37903345 37550482 37348953 37224756 36959844 37093619 37704527
5280 37704527 38252789 39016139 39982618 41376527 42973599 44674753 46814475 49143812 51677645
5271 51677645 54304654 56264559 57855270 59036087 59856444 60366029 60462663 60434077 60412862
5262 60412862 60477105 60495613 60431153 60142475 59768063 58730268 56877374 54278287 51463775
5253 51463775 48258270 45411572 42883508 40631579 38651276 37065595 35929751 35092972
5245 35092972 34488290 34162237 33954791 34209847 34689110 35354659 35957123 36638298 37185942
5236 37185942 37854070 38592973 38852284 39247355 39622979 39999041 40381108 40141731 39546967
5227 39546967 38342142 36527336 34475624 32056055 29579939 27356991 25402845 23539235
$$ packed form
5289C9038944l42934m80702l11963l52863k01529j24197k64912J33775O10908
5280C7704527N48262P63350R66479J393909J597072J701154K139722K329337K533833
5271E1677645K627009J959905J590711J180817Q20357N09585R6634k8586k1215
5262F0412862O4243J8508o4460k88678l74412j037795j852894k599087k814512
5253E1463775l205505k846698k528064k251929j980303j585681j135844q36779
5245C5092972o04682l26053k07446K55056M79263O65549O02464O81175N47644
5236C7185942O68128P38903K59311L95071L75624L76062L82067k39377n94764
5227C9546967j204825j814806k051712k419569k476116k222948j954146j863610
$$ plain form
5219 23539235 21856274 20638859 19731914 18827242 18097825 17525084 16971106 16892404 17195311
5210 17195311 17726351 18010762 17435964 16387149 15223984 14111534 13163025 12475144 12090186
5201 12090186 11597536 11050552 10762677 10442774 10195682 9844771 9535437 9208335 9145384 9036097
5191 9036097 8827305 8562314 8368487 8192374 7999398 7794107 7688824 7581797 7546642 7487095
5181 7487095 7327610 7190481 7078273 7069087 6937141 6657389 6499848 6597685 6506412 6448410
5171 6448410 6423203 6370580 6269097 6264047 6069261 6042162 6066908 6105054 6087388 5997104 5893625
5160 5893625 5884377 5895288 5792439 5811163 5659891 5727806 5602777 5574076 5453653 5318966 5454835
5149 5454835 5398819 5183839 5196355 5171504 5220565 5108120 5114813 5345467 5323841 5113471 4999939
$$ packed form
5219B3539235j682961j217415r06945r04672p29417n72741n53978p8702L02907
5210A7195311N31040K84411n74798j048815j163165j112450r48509o87881l84958
5201A2090186m92650n46984k87875l19903k47092l50911l09334l27102o2951j09287
5191I036097k08792k64991j93827j76113j92976k05291j05283j07027l5155n9547
5181G487095j59485j37129j12208r186j31946k79752j57541R7837r1273n8002
5171F448410k5207n2623j01483n050j94786k7099K4746L8146j7666r0284j03479
5160E893625r248J0911j02849J8724j51272O7915j25029k8701j20423j34687J35869
5149E454835n6016k14980J2516k4851M9061j12445O693K30654k1626k10370j13532
$$ plain form
5138 4999939 5086323 5266526 5190051 5174031 5347247 5198891 5173357 5070022 5005255 5242651
5128 5242651 5207740 5214459 5421536 5300351 5071863 5151037 5160101 5167157 5471619 5426794 5349833
5117 5349833 5435314 5386576 5235102 5407373 5461105 5358894 5394299 5445213 5414976 5440261 5622000
5106 5622000 5752167 5791198 6058552 6130329 6137636 6254469 6270497 6367203 6533202 6638381 6793761
5095 6793761 6737897 6857257 7015476 6962783 7196013 7258416 7443012 7588100 7660024 7583689
5085 7583689 7721775 8030027 8288375 8493440 8743400 8900029 9044495 9433414 9770998 10037438
5075 10037438 10261749 10450157 10598956 10782311 10915780 11406632 11767246 11993381 12423077
5066 12423077 12869627 13370257 13948280 14549337 15115934 15981458 16777140 17746830 18795339
$$ packed form
5138D999939Q6384J80203p6475j6020J73216j48356k5534j03335o4767K37396
5128E242651l4911O719K07077j21185k28488P9174R064P056L04462m4825p6961
5117E349833Q5481m8738j51474J72271N3732j02211L5405N0914l0237K5285J81739
5106E622000J30167L9031K67354P1777P307J16833J6028R6706J65999J05179J55380
5095F793761n5864J19360J58219n2693K33230O2403J84596J45088P1924p6335
5085G583689J38086L08252K58348K05065K49960J56629J44466L88919L37584K66440
5075A0037438K24311J88408J48799J83355J33469M90852L60614K26135M29696
5066A2423077M46550N00630N78023O01057N66597Q65524P95682R69690J048509
$$ plain form
5057 18795339 19855247 21102689 22540708 24040756 25774138 27702970 29799659 32336690
5049 32336690 34892680 37110714 39158004 40639991 41267083 41240231 40707258 40123182 39377544
5040 39377544 38702904 38003834 37406424 36673535 36191265 35434665 34689249 34218303 33751617
5031 33751617 33570258 33807280 34180540 34817231 35778309 37092133 38825396 40651803 42882845
5022 42882845 45278065 47370474 49315855 50839029 51753767 52149482 52096727 51980615 51841771
5013 51841771 51597130 51167919 50700539 49944110 49253366 48535238 47800317 47006446 46032271
5004 46032271 44646089 42935486 40960240 38744926 36738257 34692534 32695852 31389916
4996 31389916 30163341 29329538 28668447 28142586 28157774 28092843 28356380 28947961 29226356 29619881
$$ packed form
5057A8795339J059908J247442J438019J500048J733382J928832K096689K537031
5049C2336690K555990K218034K047290J481987O27092k6852n32973n84076p45638
5040C9377544o74640o99070n97410p32889m82270p56600p45416m70946m66686
5031C3751617j81359K37022L73260O36691R61078J313824J733263J826407K231042
5022D2882845K395220K092409J945381J523174R14738L95715n2755j16112j38844
5013E1841771k44641m29211m67380p56429o90744p18128p34921p93871r74175
5004D6032271j386182j710603j975246k215314k006669k045723j996682j305936
4996C1389916j226575q33803o61091n25861J5188o4931K63537N91581K78395L93525
$$ plain form
4986 29619881 30206571 30657133 31109381 31535858 31911002 32158024 32516352 32604987 32235390 31292916
4976 31292916 29812418 28061713 26078428 24055341 22025388 20318051 18936250 17683225
4968 17683225 16597968 15768491 14914014 14263181 13663873 13371755 13023075 12455786 12035530
4959 12035530 11661628 11444474 11302290 10988910 10645542 10542986 10384362 10126260 9775737
4950 9775737 9670435 9581808 9574550 9606542 9362275 9311884 9274038 9151740 8840435 8706248 8748005
4939 8748005 8736351 8643133 8576087 8530006 8607035 8535462 8407456 8577847 8319750 8310583 8144874
4928 8144874 8220567 8237027 8196708 8114480 8004993 7915119 7928209 8027312 8054647 7889747 7835379
4917 7835379 7849008 7711468 7669527 7735561 7671025 7630247 7538832 7427330 7315405 7242022 7289899
$$ packed form
4986B9619881N86690M50562M52248M26477L75144K47022L58328Q8635l69597r42474
4976C1292916j480498j750705j983285k023087k029953j707337j381801j253025
4968A7683225j085257q29477q54477o50833n99308k92118l48680n67289m20256
4959A2035530l73902k17154j42184l13380l43368j02556j58624k58102l50523
4950I775737j05302q8627p258L1992k44267n0391l7846j22298l11305j34187M1757
4939H748005j1654r3218o7046m6081P7029p1573j28006J70391k58097r167j65709
4928H144874P5693J6460m0319q2228j09487q9874J3090R9103K7335j64900n4368
4917G835379J3629j37540m1941O6034o4536m0778r1415j11502j11925p3383M7877
$$ plain form
4906 7289899 7306762 7234264 7097917 7114388 7179014 7175071 6977939 7117320 7188162 7015982 7169118
4895 7169118 7058372 7000535 7030991 6976790 6978407 6958022 7211468 7167680 7031977 6951841 7059376
4884 7059376 7012909 6922735 6883658 6828665 6960296 6966354 6861473 6932078 6753255 6790666 6941557
4873 6941557 7016438 7135175 7150568 7176244 7257814 7294661 7397054 7394945 7644228 7557890 7538581
4862 7538581 7757829 7654506 7675379 7782227 7761992 7608411 7680564 7758031 7745288 7678849 7705000
4851 7705000 7793660 7797011 7829797 7812583 7775209 7778244 7904977 7744168 7786980 8002474 8080102
4840 8080102 8121756 8154352 8178040 8378277 8375955 8387080 8426543 8325910 8444490 8313221 8359723
4829 8359723 8451792 8552387 8599086 8713583 8799444 8913213 9107452 9276552 9343071 9401817
$$ packed form
4906G289899J6863p2498j36347J6471O4626l943j97132J39381P0842j72180J53136
4895G169118j10746n7837L0456n4201J617k0385K53446m3788j35703q0136J07535
4884G059376m6467r0174l9077n4993J31631O058j04881P0605j78823L7411J50891
4873F941557P4881J18737J5393K5676Q1570L6847J02393k109K49283q6338j9309
4862G538581K19248j03323K0873J06848k0235j53581P2153P7467j2743o6439K6151
4851G705000Q8660L351L2786j7214l7374L035J26733j60809M2812K15494P7628
4840H080102M1654L2596K3688K00237k322J1125L9463j00633J18580j31269M6502
4829H359723R2069J00595M6699J14497Q5861J13769J94239J69100O6519N8746
$$ plain form
4819 9401817 9535567 9704878 9729886 9915132 10001060 10158214 10033464 10205022 10585333 10767295
4809 10767295 10891969 10872415 11152543 11487857 11883965 12097753 12462070 12643310 12803581 13075405
4799 13075405 13366763 13723939 13968954 14364904 14826592 15261064 15757182 16087849 16373822
4790 16373822 16880145 17515098 18179589 18906536 19635268 20317704 21107331 22116973 23258489
4781 23258489 24575950 26076321 27774750 29704461 32196766 35145686 38213400 42050606
4773 42050606 46735587 52623938 60546364 72228033 89361915 108961638 123871523 130708388
4765 130708388 125678947 110042491 91553467 74396193 60986894 51693872 45184490
4758 45184490 40370004 36818061 34150486 32302683 30565598 29149132 27944205 27089019
$$ packed form
4819I401817J33750J69311K5008J85246Q5928J57154j24750J71558L80311J81962
4809A0767295J24674j9554K80128L35314L96108K13788L64317J81240J60271K71824
4799A3075405K91358L57176K45015L95950M61688M34472M96118L30667K85973
4790A6373822N06323O34953O64491P26947P28732O82436P89627J009642J141516
4781B3258489J317461J500371J698429J929711K492305K948920L067714L837206
4773D2050606M684981N888351P922426J1681669J7133882J9599723J4909885O836865
4765A30708388n029441j5636456j8489024j7157274j3409299r293022o509382
4758D5184490m814486l551943k667575j847803j737085j416466j204927q55186
$$ plain form
4750 27089019 26506668 25982130 25499314 25184360 25026729 24949780 24806485 24787901 24938477 24901650
4740 24901650 24802063 24924484 25179675 25250765 25338932 25564776 26074667 26300496 26583952 26963998
4730 26963998 27134186 27481252 27770374 27990227 28418441 28742414 29113613 29632891 30106010
4721 30106010 30773071 31512268 31919622 32754813 33602698 34517943 35676996 36855191 38529227
4712 38529227 40262249 42344179 44763317 47755765 51206391 55361255 60767969 67745126
4704 67745126 78010913 92741795 110366223 123404506 130271852 132621258 125658586 111386698
4696 111386698 95142690 79776148 68007601 59841921 54078094 49859697 46729412 44319953
4688 44319953 42488229 41029995 39715364 38749564 37847349 37212140 36623927 36166299 35994845
$$ packed form
4750B7089019n82351n24538m82816l14954j57631p6949j43295j8584J50576l6827
4740B4901650r9587J22421K55191P1090Q8167K25844N09891K25829K83456L80046
4730B6963998J70188L47066K89122K19853M28214L23973L71199N19278M73119
4721C0106010O67061P39197M07354Q35191Q47885R15245J159053J178195J674036
4712C8529227J733022K081930K419138K992448L450626M154864N406714O977157
4704F7745126J0265787J4730882J7624428J3038283O867346K349406o962672j4271888
4696A11386698j6244008j5366542j1768547q165680n763827m218397l130285k409459
4688D4319953j831724j458234j314631r65800r02215o35209n88213m57628j71454
$$ plain form
4679 35994845 35924121 36071637 36040529 36073952 36212502 36311456 36479608 36834181 37137754 37590270
4669 37590270 37878722 38243741 38724384 39154884 39533927 40116167 40840786 41542379 42235774
4660 42235774 43097293 44197905 45397530 46798394 48327645 49896592 51741054 54060041
4652 54060041 56439210 59329029 62697136 66410036 70366160 74854400 79764570 85386605
4644 85386605 91829081 98792948 106138085 113818486 121537576 128907756 135444707 140772463
4636 140772463 143836658 144513738 142891323 139030082 133121070 125472357 116410338 106741635
4628 106741635 96949126 87723559 79659734 72438831 66430917 61346230 56940732 53270389
4620 53270389 50292349 47805981 45449485 43539809 41936787 40284779 38772689 37517973
$$ packed form
4679C5994845p0724J47516l1108L3423J38550R8954J68152L54573L03573M52516
4669C7590270K88452L65019M80643M30500L79043N82240P24619P01593O93395
4660D2235774Q61519J100612J199625J400864J529251J568947J844462K318987
4652E4060041K379169K889819L368107L712900L956124M488240M910170N622035
4644H5386605O442476O963867P345137P680401P719090P370180O536951N327756
4636A40772463L064195O77080j622415l861241n909012p648713r062019r668703
4628A06741635r792509r225567q063825p220903o007914n084687m405498l670343
4620E3270389k978040k486368k356496j909676j603022j652008j512090j254716
$$ plain form
4612 37517973 36438321 35341519 34263391 33344058 32711736 31895252 31061895 30199137 29342225
4603 29342225 28825397 28364587 27728191 27033491 26560700 26151821 25651563 25245909 24843392
4594 24843392 24617438 24294463 23879586 23597139 23367388 23133462 22736023 22297949 21998806
4585 21998806 21861494 21681121 21322679 21122637 20950261 20779576 20776586 20684961 20522496 20299823
4575 20299823 20133697 19902805 19665808 19490952 19411170 19370588 19254961 19097029 18990616 18951869
4565 18951869 18906549 18708666 18572947 18504275 18380591 18521750 18585011 18748217 18748618 18628003
4555 18628003 18556786 18634686 18591467 18568315 18445010 18391877 18276750 18124900 18101401 18140723 18012829
4544 18012829 17721607 17704966 17612143 17581967 17539568 17445926 17282992 17190695 17114912 16992184 17019376
$$ packed form
4612C7517973j079652j096802j078128r19333o32322q16484q33357q62758q56912
4603B9342225n16828m60810o36396o94700m72791m08879n00258m05654m02517
4594B4843392k25954l22975m14877k82447k29751k33926l97439m38074k99143
4585B1998806j37312j80373l58442k00042j72376j70685k990r1625j62465k22673
4575B0299823j66126k30892k36997j74856p9782m0582j15627j57932j06413l8747
4565A8951869m5320j97883j35719o8672j23684J41159O3261J63206M01j20615
4555A8628003p1217P7900m3219k3152j23305n3133j15127j51850k3499L9322j27894
4544A8012829k91222j6641r2823l0176m2399r3642j62934r2297p5783j22728K7192
$$ plain form
4533 17019376 16988903 16966592 17012448 16942925 16922926 16850990 16643797 16854036 16914712 16931822 16896997
4522 16896997 16717128 16584483 16251335 16167113 16198656 16090431 15918647 15909497 15678850 15370484
4512 15370484 15371646 15276213 15061061 15065867 14773273 14579300 14599512 14454097 14445334 14371729 14245158
4501 14245158 14186148 14305887 14595247 14715255 14811910 14771481 14731576 14673710 14712836 14683280 14579486
4490 14579486 14691974 14726526 14604839 14683807 14664705 14784231 14617091 14378138 14574688 14599796
4480 14599796 14603964 14537696 14686527 14767115 14871918 14983838 15039192 15149271 15312944 15534625
4470 15534625 15577614 15811748 15891496 15879577 15939779 16083454 16096095 16205564 16400402 16496353
4460 16496353 16622471 16631073 16768591 17013431 17289595 17455980 17730915 17802491 17722485 17602006
$$ packed form
4533A7019376l0473k2311M5856o9523j9999p1936k07193K10239O0676J7110l4825
4522A6896997j79869j32645l33148q4222L1543j08225j71784r150k30647l08366
4512A5370484J162r5433k15152M806k92594j93973K0212j45415q763p3605j26571
4501A4245158n9010J19739K89360J20008R6655m0429l9905n7866L9126k9556j03794
4490A4579486J12488L4552j21687P8968j9102J19526j67140k38953J96550K5108
4480A4599796M168o6268J48831Q0588J04803J11920N5354J10079J63673K21681
4470A5534625M2989K34134P9748j1919O0202J43675J2641J09469J94838R5951
4460A6496353J26118Q602J37518K44840K76164J66385K74935P1576q0006j20479
$$ plain form
4450 17602006 17554293 17478625 17393634 17199200 17442514 17542282 17746646 18065161 18182184 18256384
4440 18256384 18489057 18898737 19092889 19300618 19463285 19913496 20227398 20473794 20775883
4431 20775883 21020243 21314078 21437208 21652882 22093193 22444132 22947934 23399824 23940944
4422 23940944 24288945 24840106 25489967 25992682 26601706 27217412 27933133 28513557 29125446
4413 29125446 29765775 30302592 30865214 31615242 32436353 33262098 34398996 35707557 37164192
4404 37164192 38768954 40512194 42260279 44235774 46511740 49071146 52096886 55714971
4396 55714971 59573720 64062737 69507509 76017156 84253916 94437776 106664762 121452464
4388 121452464 137698002 151428982 157676944 153940612 142216556 126205553 109838157
$$ packed form
4450A7602006m7713p5668q4991j94434K43314R9768K04364L18515J17023P4200
4440A8256384K32673M09680J94152K07729J62667M50211L13902K46396L02089
4431B0775883K44360K93835J23130K15674M40311L50939N03802M51890N41120
4422B3940944L48001N51161O49861N02715O09024O15706P15721N80424O11889
4413B9125446O40329N36817N62622P50028Q21111Q25745J136898J308561J456635
4404C7164192J604762J743240J748085J975495K275966K559406L025740L618085
4396E5714971L858749M489017N444772O509647Q236760J0183860J2226986J4787702
4388A21452464J6245538J3730980O247962l736332j1724056j6011003j6367396
$$ plain form
4381 109838157 95272865 83364024 73664300 65894043 59644333 54573218 50512524 47095829
4373 47095829 44112327 41726687 39531533 37796376 36282174 34844418 33743129 32709437
4365 32709437 31847898 31139262 30398559 29638525 29070908 28264879 27675150 26866448 26227653
4356 26227653 25717264 25238504 24819374 24303683 23759524 23262805 22855909 22326147 22009563
4347 22009563 21653704 21251563 20956493 20490098 20058300 19560883 19252407 18990812 18675676
4338 18675676 18410364 18055726 17955885 17849176 17569173 17351386 17166658 17125745 16924939 16828172
4328 16828172 16680569 16473436 16257938 16047192 15630246 15387735 15315502 14827080 14959921 14921154
4318 14921154 14802589 14516225 14294016 14401538 14457951 14473322 14338956 14309428 13973404 14005989
$$ packed form
4381A09838157j4565292j1908841r699724p770257o249710n071115m060694l416695
4373D7095829k983502k385640k195154j735157j514202j437756j101289j033692
4365C2709437q61539p08636p40703p60034n67617q06029n89729q08702o38795
4356B6227653n10389m78760m19130n15691n44159m96719m06896n29762l16584
4347B2009563l55859m02141k95070m66395m31798m97417l08476k61595l15136
4338A8675676k65312l54638r9841j06709k80003k17787j84728m0913k00806r6767
4328A6828172j47603k07133k15498k10746m16946k42511p2233m88422J32841l8767
4318A4921154j18565k86364k22209J07522N6413J5371j34366k9528l36024L2585
$$ plain form
4308 14005989 14078580 14068295 14113836 14241531 14543991 14449090 14267424 14440835 14733525 14733678 14778468
4297 14778468 15120276 15431580 15472479 15547330 15562290 15513461 15356734 15431936 15552036 15688645
4287 15688645 15834524 15878860 15933622 15849202 15793071 15909988 16057728 16154125 16092957 16323312
4277 16323312 16512381 16894159 17240028 17674990 17839572 17944689 17914054 17998597 18107332 18270093
4267 18270093 18285475 18063634 17945644 17764010 17676953 17649347 17752050 17815044 17893464 17999699
4257 17999699 18128057 18225705 18441095 18398295 18606355 19125987 19324175 19349671 19569245 19539896
4247 19539896 19718168 19760423 19617116 19731270 19986185 20025126 20108392 20281443 20704875 21215280
4237 21215280 21436850 21704447 22098645 22390972 22807889 23415572 24174797 24699355 25294093
$$ packed form
4308A4005989P2591j0285M5541J27695L02460r4901j81666J73411K92690J53M4790
4297A4778468L41808L11304M0899P4851J4960m8829j56727P5202J20100J36609
4287A5688645J45879M4336N4762q4420n6131J16917J47740R6397o1168K30355
4277A6323312J89069L81778L45869M34962J64582J05117l0635Q4543J08735J62761
4267A8270093J5382k21841j17990j81634q7057k7606J02703O2994P8420J06235
4257A7999699J28358R7648K15390m2800K08060N19632J98188K5496K19574k9349
4247A9539896J78272M2255j43307J14154K54915L8941Q3266J73051M23432N10405
4237B1215280K21570K67597L94198K92327M16917O07683P59225N24558N94738
$$ plain form
4228 25294093 26249488 27091230 27917967 29017713 29915210 30799926 31286173 31450768 31434656
4219 31434656 31220857 30728116 30148193 29234212 28561410 27947602 27237709 26803476 26042811
4210 26042811 25331271 24646722 23556681 22704887 22102832 21610796 21370327 21228494 21258597
4201 21258597 21114313 21003645 20950312 20981315 20785528 20687549 20569720 20352981 20142529 19988370
4191 19988370 19845865 19664304 19238926 18815058 18560543 18233128 17769284 17588017 17316008
4182 17316008 17094302 17081186 16923819 16796930 16752127 16817285 16844887 16689909 16760988 16750882
4172 16750882 16811405 16737243 16766206 16863296 17005871 17041747 17122649 17289753 17484887 17762493
4162 17762493 17970940 18200999 18434043 18834179 19053996 19263756 19502953 19742996 19999022
$$ packed form
4228B5294093R55395Q41742Q26737J099746Q97497Q84716M86247J64595j6112
4219C1434656k13799m92741n79923r13981o72802o13808p09893m34233p60665
4210B6042811p11540o84549j090041q51794o02055m92036k40469j41833L0103
4201B1258597j44284j10668n3333L1003j95787r7979j17829k16739k10452j54159
4191A9988370j42505j81561m25378m23868k54515l27415m63844j81267k72009
4182A7316008k21706j3116j57367j26889m4803O5158K7602j54978P1079j0106
4172A6750882O0523p4162K8963R7090J42575L5876Q0902J67104J95134K77606
4162A7762493K08447K30059K33044M00136K19817K09760K39197K40043K56026
$$ plain form
4153 19999022 20293129 20520046 20948284 21482365 21876381 22246094 22664392 22851027 23106008
4144 23106008 23155976 23306424 23631103 23826000 23961637 24024919 23912156 23655044 23191601 22963280
4134 22963280 22521329 22034493 21744172 21239767 20898408 20645621 20352239 20251672 20154190 19857730
4124 19857730 19700408 19573071 19136432 18686642 18267173 18000823 17790941 17778518 17714744 17614331
4114 17614331 17733799 17727684 17652933 17651976 17447146 17384117 17340782 17085204 17126321 17229773 17447367
4103 17447367 17482374 17583806 17741322 17926804 17879470 17838419 17836720 17904134 18130843 18369337
4093 18369337 18470740 18735158 18857049 19107037 19390603 19739635 20144499 20413849 20693056
4084 20693056 20931103 21290619 21772940 22076189 22445850 23042646 23650504 24386057 24909898
$$ packed form
4153A9999022K94107K26917M28238N34081L94016L69713M18298J86635K54981
4144B3106008M9968J50448L24679J94897J35637O3282j12763k57112m63443k28321
4134B2963280m41951m86836k90321n04405l41359k52787k93382j00567r7482k96460
4124A9857730j57322j27337m36639m49790m19469k66350k09882j2423o3774j00413
4114A7614331J19468o115p4751r57k04830o3029m3335k55578M1117J03452K17594
4103A7447367L5007J01432J57516J85482m7334m1051j699O7414K26709K38494
4093A8369337J01403K64418J21891K49988K83566L49032M04864K69350K79207
4084B0693056K38047L59516M82321L03249L69661N96796O07858P35553N23841
$$ plain form
4075 24909898 25475995 26099751 26555918 27024166 27599118 28092932 28632288 29242622 29901489
4066 29901489 30931696 32032280 33201138 34394620 35606913 36621782 37454743 38178708
4058 38178708 38430086 38600705 38886738 39231811 39525767 39935705 40665466 41584298 42602084
4049 42602084 43667631 44841797 45828308 46510714 46590205 46520294 46233237 45440854 44661885
4040 44661885 43979185 43598593 43215676 43054863 43023971 43079461 43326599 43379564 43032771 42476502
4030 42476502 41696320 40605908 39368143 38223388 36922411 35711094 34844127 34118594 33322527
4021 33322527 32656259 32027727 31392058 30657939 29787656 28864956 28019766 26985532 25976602
4012 25976602 24981909 23870398 23097490 22380957 21571174 20913688 20393802 19756116 19073868
$$ packed form
4075B4909898N66097O23756M56167M68248N74952M93814N39356O10334O58867
4066B9901489J030207J100584J168858J193482J212293J014869Q32961P23965
4058C8178708K51378J70619K86033L45073K93956M09938P29761R18832J017786
4049D2602084J065547J174166R86511O82406P9491o9911k87057p92383p78969
4040D4661885o82700l80592l82917j60813l0892N5490K47138N2965l46793n56269
4030D2476502p80182j090412j237765j144755j300977j211317q66967p25533p96067
4021C3322527o66268o28532o35669p34119q70283r22700q45190j034234j008930
4012B5976602r94693j111511p72908p16533q09783o57486n19886o37686o82248
$$ plain form
4003 19073868 18564699 17980258 17532433 17007613 16384028 15962175 15392116 14913799 14583631
3994 14583631 14124378 13707010 13350984 12953939 12850980 12582726 12260140 11806037 11575694
3985 11575694 11360002 10984688 10852575 10518693 10273209 10191835 10128685 10093142 9863916 9603676
3975 9603676 9456562 9291317 9193010 8971793 8796104 8841771 8702303 8472557 8320574 8068013
3965 8068013 7950820 7752016 7460696 7178123 7032376 6927935 6698233 6601132 6512736 6409480
3955 6409480 6322671 6161609 6082358 6114449 6051849 6037582 5829071 5866982 5769358 5728670 5778997
3944 5778997 5781519 5774394 5621160 5542568 5566231 5565519 5254116 5191823 5054815 5043534 4872263
3933 4872263 4785972 4685493 4478354 4335186 4408565 4301923 4246121 4351874 4395855 4293614
$$ packed form
4003A9073868n09169n84441m47825n24820o23585m21853n70059m78317l30168
3994A4583631m59253m17368l56026l97045j02959k68254l22586m54103k30343
3985A1575694k15692l75314j32113l33882k45484q1374o3150l5543k29226k60240
3975I603676j47114j65245r8307k21217j75689M5667j39468k29746j51983k52561
3965H068013j17193j98804k91320k82573j45747j04441k29702r7101q8396j03256
3955F409480q6809j61062p9251L2091o2600j4267k08511L7911r7624m0688N0327
3944E778997K522p125j53234p8592K3663p12l11403o2293j37008j1281j71271
3933D872263q6291j00479k07139j43168P3379j06642n5802J05753M3981j02241
$$ plain form
3923 4293614 4414232 4298216 4182125 4061166 3982063 4116808 4047281 3993008 3933631 3884227
3913 3884227 3653110 3607429 3620808 3502874 3441844 3590049 3655118 3590945 3447015 3393935 3305014
3902 3305014 3345706 3432997 3478908 3236748 3051176 2935263 3071282 3041812 2977431 2780153
3892 2780153 2904528 2928989 2723448 2834451 2859817 2880982 2950240 2819076 2875280 2803640 2839487
3881 2839487 2884379 2890869 2940450 2818127 2594194 2689601 2880518 2768215 2710732 2627898 2504171
3870 2504171 2464001 2544078 2512260 2499847 2594433 2643941 2479980 2559264 2492813 2291117 2416045
3859 2416045 2519836 2440844 2327016 2289561 2357942 2410746 2317298 2392705 2348818 2360992 2473437
3848 2473437 2384222 2397926 2453970 2362181 2404398 2514129 2375336 2499304 2476658 2555599 2551045
$$ packed form
3923D293614J20618j16016j16091j20959p9103J34745o9527n4273n9377m9404
3913C884227k31117m5681J3379j17934o1030J48205O5069o4173j43930n3080q8921
3902C305014M0692Q7291M5911k42160j85572j15913J36019k9470o4381j97278
3892B780153J24375K4461k05541J11003K5366K1165O9258j31164N6204p1640L5847
3881B839487M4892O490M9581j22323k23933R5407J90917j12303n7483q2834j23727
3870B504171m0170Q0077l1818j2413R4586M9508j63961P9284o6451k01696J24928
3859B416045J03791p8992j13828l7455O8381N2804r3448P5407m3887J2174J12445
3848B473437q9215J3704N6044r1789M2217J09731j38793J23968k2646P8941m554
$$ plain form
3837 2551045 2497019 2387044 2329098 2387308 2465240 2495599 2507090 2552484 2513420 2362768 2422432
3826 2422432 2463638 2378792 2398591 2470265 2352865 2233304 2268790 2332155 2428595 2509122 2444123
3815 2444123 2446388 2552315 2531255 2452976 2490579 2522527 2667816 2531755 2462999 2404102 2473928
3804 2473928 2638155 2632981 2630367 2505809 2546686 2745898 2938196 2862497 2721653 2831433 2895282
3793 2895282 2934851 3027513 3046002 3044510 3102655 3136446 3023368 2969015 3006921 3151498 3121998
3782 3121998 2913194 2824274 2903959 2837347 2702756 2519399 2530101 2491330 2519803 2313586 2209647
3771 2209647 2243568 2276531 2207344 2220972 2293927 2376743 2336248 2235161 2113201 2210886 2377986
3760 2377986 2222232 2156946 2227647 2145075 2095210 1968901 2006093 2033319 2108436 2257770 2173734
$$ packed form
3837B551045n4026j09975n7946N8210P7932L0359J1491M5394l9064j50652N9664
3826B422432M1206q4846J9799P1674j17400j19561L5486O3365R6440Q0527o4999
3815B444123K265J05927k1060p8279L7603L1948J45289j36061o8756n8897O9826
3804B473928J64227n174k614j24558M0877J99212J92298p5699j40844J09780O3849
3793B895282L9569R2662J8489j492N8145L3791j13078n4353L7906J44577k9500
3782C121998k08804q8920P9685o6612j34591j83357J0702l8771K8473k06217j03939
3771B209647L3921L2963o9187J3628P2955Q2816m0495j01087j21960R7685J67100
3760B377986j55754o5286P0701q2572m9865j26309L7192K7226P5117J49334q4036
$$ plain form
3749 2173734 2153987 2282208 2257202 2170235 2276603 2204231 2246339 2180275 2179186 2096293 2090252
3738 2090252 2073740 2135343 2268212 2169699 2102248 2062620 2110200 2276423 2159087 2200573 2268612
3727 2268612 2344291 2303086 2387303 2417873 2270658 2299434 2328569 2177699 2244218 2241310 2255073
3716 2255073 2288766 2248022 2369230 2419244 2455348 2364581 2384897 2366043 2246237 2481403 2517155
3705 2517155 2458905 2497930 2366709 2461575 2519911 2584256 2751106 2672913 2493936 2602832 2600684
3694 2600684 2462890 2520890 2868803 2741148 2808610 2910105 2893096 2875026 2801888 2820762 2842569
3683 2842569 3032805 3298282 3298372 3335938 3317067 3335711 3578962 3672087 3606140 3627991 3695246
3672 3695246 3681458 3829322 3885861 3878141 3986746 4065085 4089720 4164628 4247348 4307655 4291026
$$ packed form
3749B173734j9747J28221k5006q6967J06368p2372M2108o6064j089q2893o041
3738B090252j6512O1603J32869r8513o7451l9628M7580J66223j17336M1486O8039
3727B268612P5679m1205Q4217L0570j47215K8776K9135j50870O6519k908J3763
3716B255073L3693m0744J21208N0014L6104r0767K0316j8854j19806K35166L5752
3705B517155n8250L9025j31221R4866N8336O4345J66850p8193j78977J08896k148
3694B600684j37794N8000L47913j27655O7462J01495j7009j8070p3138J8874K1807
3683B842569J90236K65477R0L7566j8871J8644K43251R3125o5947K1851O7255
3672C695246j3788J47864N6539p720J08605P8339K4635P4908Q2720O0307j6629
$$ plain form
3661 4291026 4383564 4573726 4683500 4514524 4649563 4754515 4794782 4753176 4777122 4803823
3651 4803823 4973843 5069520 5091937 5159733 5178240 5369575 5668894 5933855 5878618 6048498
3641 6048498 6261010 6344855 6505509 6702490 7005041 7212772 7204738 7383557 7518053 7482842
3631 7482842 7573342 7681871 7653256 7837105 7969145 7895626 7902311 7994655 7997712 7991371 7867104
3620 7867104 7833255 7822632 7763714 7741013 7617371 7498573 7472493 7287021 7091172 6828454
3610 6828454 6680486 6655837 6489123 6366948 6426600 6319833 6278974 6338688 6197265 6249331
3600 6249331 6295066 6209907 6018582 6014242 6048754 6024036 6059288 5969125 6059422 6042675 5973574
3589 5973574 5972026 5872906 6015110 6129699 6032186 6031158 6089068 6112596 6170862 6310204 6435042
$$ packed form
3661D291026R2538J90162J09774j68976J35039J04952M0267m1606K3946K6701
3651D803823J70020R5677K2417O7796J8507J91335K99319K64961n5237J69880
3641F048498K12512Q3845J60654J96981L02551K07731q034J78819J34496l5211
3631G482842R0500J08529k8615J83849J32040p3519O685R2344L057o341j24267
3620G867104l3849j0623n8918k2701j23642j18798k6080j85472j95849k62718
3610F828454j47968k4649j66714j22175N9652j06767m0859N9714j41423N2066
3600F249331M5735q5159j91325m340L4512k4718L5252r0163R0297j6747o9101
3589E973574j548r9120J42204J14589r7513j028N7910K3528N8266J39342J24838
$$ plain form
3578 6435042 6419934 6426670 6454499 6505110 6655354 6803119 6857672 6801537 6697944 6890757 7117454
3567 7117454 7222695 7205522 7183410 7152387 7118742 7174405 7441822 7596115 7676681 7787925 7799154
3556 7799154 7799911 7822760 7885878 8053999 8146325 8305034 8199529 8370974 8712433 8676583 8690247
3545 8690247 8800900 8993266 9229250 9303677 9450654 9621596 9798911 9973342 10092778 10268054
3535 10268054 10527139 10774053 10997648 11255797 11343593 11552927 11770858 12004891 12210218 12283887
3525 12283887 12469674 12679383 12810648 13140300 13286945 13288571 13390602 13557031 13716518 13858274
3515 13858274 13891953 14049422 14390715 14522703 14577011 14782526 14894521 14963387 15019989 15319483
3505 15319483 15601375 15677922 15735090 15845383 15975757 16028005 16361691 16605056 16695023 16812098
$$ packed form
3578F435042j5108O736K7829N0611J50244J47765N4553n6135j03593J92813K26697
3567G117454J05241j7173k2112l1023l3645N5663K67417J54293Q0566J11244J1229
3556G799154P57K2849O3118J68121R2326J58709j05505J71445L41459l5850J3664
3545H690247J10653J92366K35984P4427J46977J70942J77315J74431J19436J75276
3535A0268054K59085K46914K23595K58149Q7796K09334K17931K34033K05327P3669
3525A2283887J85787K09709J31265L29652J46645J626J02031J66429J59487J41756
3515A3858274L3679J57469L41293J31988N4308K05515J11995O8866N6602K99494
3505A5319483K81892P6547N7168J10293J30374N2248L33686K43365Q9967J17075
$$ plain form
3495 16812098 16857048 17129362 17378708 17422707 17564963 17852561 18199611 18325204 18467061 18683947
3485 18683947 18845391 18998520 19141061 19281260 19580526 19731621 19977121 20326125 20472843
3476 20472843 20732153 21019038 21219406 21549487 21801473 21961951 22237477 22659638 22951965
3467 22951965 23190710 23353793 23429857 23622555 23690849 23845295 24014689 24115209 24134185 24114674
3457 24114674 24221551 24390140 24454799 24741095 25076834 25148923 25153958 25398470 25571979 25839854
3447 25839854 25934268 26213155 26394293 26467333 26798195 27107127 27494404 27961291 28132303 28495030
3437 28495030 28974259 29282960 29616548 29930226 30124208 30213973 30269676 30187470 30217488 30007530
3427 30007530 29865847 29786465 29774343 29665026 29398031 29192657 29013091 28810020 28466916 28297515
$$ packed form
3495A6812098M4950K72314K49346M3999J42256K87598L47050J25593J41857K16886
3485A8683947J61444J53129J42541J40199K99266J51095K45500L49004J46718
3476B0472843K59310K86885K00368L30081K51986J60478K75526M22161K92327
3467B2951965K38745J63083P6064J92698O8294J54446J69394J00520J8976j9511
3457B4114674J06877J68589O4659K86296L35739P2089N035K44512J73509K67875
3447B5839854R4414K78887J81138P3040L30862L08932L87277M66887J71012L62727
3437B8495030M79229L08701L33588L13678J93982Q9765N5703q2206L0018k09958
3427C0007530j41683p9382j2122j09317k66995k05374j79566k03071l43104j69401
$$ plain form
3417 28297515 28071765 28056876 28051350 28045263 28108544 28057323 27919631 27887416 28019206 28166160 28322316
3406 28322316 28473831 28694305 29023395 29432832 29771945 30087814 30582438 30896108 31103269
3397 31103269 31584824 31918951 32287338 32630174 33019823 33453074 33870903 34335590 34876893
3388 34876893 35558859 36371115 37099704 38206740 39384760 40407275 41567510 43067775 44452737
3379 44452737 46101157 48037053 50078426 52298065 54782601 57419338 60449881 63898436
3371 63898436 67493778 71547568 75728211 80094669 84192529 87919225 91174885 93513814
3363 93513814 95419809 96429941 96750793 96862612 96670974 96330297 96084415 95921071 95956173
3354 95956173 96455637 97073595 97549382 97696836 97617011 97006813 95698397 93591106 91105110
$$ packed form
3417B8297515k25750j4889n526o087O3281n1221j37692l2215J31790J46954J56156
3406B8322316J51515K20474L29090M09437L39113L15869M94624L13670K07161
3397C1103269M81555L34127L68387L42836L89649M33251M17829M64687N41303
3388C4876893O81966Q12256P28589J107036J178020J022515J160235J500265J384962
3379D4452737J648420J935896K041373K219639K484536K636737L030543L448555
3371F3898436L595342M053790M180643M366458M097860L726696L255660K338929
3363I3513814J905995J010132L20852J11819j91638l40677k45882j63344L5102
3354I5956173M99464O17958M75787J47454p9825o10198j308416k107291k485996
$$ plain form
3345 91105110 88230658 84834296 81346588 77873067 74421822 71324480 68598488 66316431
3337 66316431 64286643 62500292 61066455 59871008 58926107 58216223 57781603 57405403 57350503
3328 57350503 57340200 57447151 57623958 57804679 57920923 58026344 58265434 58718859 59100002 59289393
3318 59289393 59496867 59719330 59950341 60267628 60427507 60683457 60995788 61261009 61338790 61678319
3308 61678319 62057712 62399819 62812934 62985383 63459549 63766209 64208179 64706920 65275833
3299 65275833 65770266 66445310 67021653 67358567 68072594 68731647 69177984 69840953 70707721
3290 70707721 71473700 72179994 72968314 73881364 74787536 75872132 77052891 78235132 79598187
3281 79598187 81180730 82939207 84701152 86619699 88709739 90962291 93314329 95837849
$$ packed form
3345I1105110k874452l396362l487708l473521l451245l097342k725992k282057
3337F6316431k029788j786351j433837j195447r44901p09884m34620l76200n4900
3328E7350503j0303J06951J76807J80721J16244J05421K39090M53425L81143J89391
3318E9289393K07474K22463K31011L17287J59879K55950L12331K65221P7781L39529
3308F1678319L79393L42107M13115J72449M74166L06660M41970M98741N68913
3299F5275833M94433O75044N76343L36914P14027O59053M46337O62969Q66768
3290G0707721P65979P06294P88320R13050R06172J084596J180759J182241J363055
3281G9598187J582543J758477J761945J918547K090040K252552K352038K523520
$$ plain form
3273 95837849 98615942 101426594 104324447 107579803 110851830 114241567 117939672 121852801
3265 121852801 125841910 129966655 134090103 138521492 143285651 148445183 154030522 160075609
3257 160075609 166905996 174298339 182285731 191149472 200307093 209584750 218346223 226276519
3249 226276519 232883056 237949961 241173361 242549080 242706305 241958789 240403478 238657349
3241 238657349 237337746 236367643 236336039 236751634 237156261 237338139 236973389 235954661 234065362
3232 234065362 231634169 227285645 220181044 211299388 201437866 191702580 182413202 174055366
3224 174055366 166391551 159385978 153252880 147897677 142822656 138198787 134082497 130112720
3216 130112720 126272316 122598893 119191072 115752809 112245165 109038697 106201885 103543447
$$ packed form
3273I5837849K778093K810652K897853L255356L272027L389737L698105L913129
3265A21852801L989109M124745M123448M431389M764159N159532N585339O045087
3257A60075609O830387P392343P987392Q863741R157621R277657Q761473P930296
3249B26276519O606537N066905L223400J375719J57225p47516j555311j746129
3241B38657349j319603r70103l1604M15595M04627J81878l64750j018728j889299
3232B34065362k431193m348524p104601q881656r861522r735286r289378q357836
3224A74055366p663815p005573o133098n355203n075021m623869m116290l969777
3216A30112720l840404l673423l407821l438263l507644l206468k836812k658438
$$ plain form
3208 103543447 101375796 99406453 97578497 96475307 95872738 95868051 96737306 98791620 102117179
3199 102117179 103450689 101607257 97990361 93818327 90163394 87329822 85618767 84503597
3191 84503597 83704044 83285198 83241651 83417936 83969173 84802919 85757931 87067718 88657948
3182 88657948 90629863 93007225 95925295 99441703 103647987 108152744 113185089 119035034
3174 119035034 125032346 131558881 138575109 145717889 153167915 160591168 168020175 173885568
3166 173885568 177515200 179800866 180739199 181699054 182381116 182964731 183132710 183182171 182753453
3157 182753453 182074687 180842398 178996274 176589938 173490552 169643054 165129458 159966224
3149 159966224 153991290 147556427 140954472 134016609 126980874 120096727 113518491 107434794
$$ packed form
3208A03543447k167651j969343j827956j103190o02569m687Q69255K054314L325559
3199A02117179J333510j843432l616896m172034l654933k833572j711055j115170
3191H4503597p99553m18846m3547J76285N51237Q33746R55012J309787J590230
3182H8657948J971915K377362K918070L516408M206284M504757N032345N849945
3174A19035034N997312O526535P016228P142780P450026P423253P429007N865393
3166A73885568L629632K285666R38333R59855O82062N83615J67979M9461m28718
3157A82753453o78766j232289j846124k406336l099386l847498m513596n163234
3149A59966224n974934o434863o601955o937863p035735o884147o578236o083697
$$ plain form
3141 107434794 101782751 96539230 91684114 87299639 83230507 79446359 76210953 73465823
3133 73465823 70984837 68661437 66570821 64872487 63322903 62077508 61035951 60010318
3125 60010318 59107111 58362666 57815201 57318652 57117094 57027835 57134714 57379182 57602497 58110072
3115 58110072 58655693 59676440 60590945 61854905 63133979 64945233 66820492 68672956
3107 68672956 71016337 73433020 75711994 78418335 81079443 83614911 86145486 88430482
3099 88430482 90624825 92709781 94557067 96245266 97854793 99207159 100185094 100781541
3091 100781541 100974982 100594901 99678357 98242809 96337453 93891811 91335734 88783341
3083 88783341 86034568 83502537 81563891 79989651 78619542 77776553 77170585 77145664 77637270
$$ packed form
3141A07434794n652043n243521m855116m384475m069132l784148l235406k745130
3133G3465823k480986k323400k090616j698334j549584j245395j041557j025633
3125F0010318r03207p44445n47465m96549k01558q9259J06879K44468K23315N07575
3115E8110072N45621J020747R14505J263960J279074J811254J875259J852464
3107F8672956K343381K416683K278974K706341K661108K535468K530575K284996
3099H8430482K194343K084956J847286J688199J609527J352366R77935N96447
3091A00781541J93441l80081r16544j435548j905356k445642k556077k552393
3083H8783341k748773k532031j938646j574240j370109q42989o05968k4921M91606
$$ plain form
3074 77637270 78089743 78772842 79559002 80322784 80784591 81035798 80779315 80083400 79024967
3065 79024967 77439065 75161506 72595744 69760094 66624087 63617625 60279027 57103511
3057 57103511 54241496 51692625 49157888 46741029 44547191 42608297 40804128 39355549
3049 39355549 38026211 36592142 35317144 34219817 33162395 32123884 31394317 30627581
3041 30627581 29905211 29282219 28472404 27697156 27123742 26637822 26219182 25646831 25077031
3032 25077031 24676167 24346503 24116707 24097551 23975243 23738384 23408063 23253911 23335656 23316465
3022 23316465 23468881 23476014 23728945 24059637 24061983 24376902 24705265 25036186 25090795 25097998 25021462
3011 25021462 24946751 24894914 24692807 24212146 23785706 23343225 22606491 22033798 21397837 20978359
$$ packed form
3074G7637270M52473O83099P86160P63782M61807K51207k56483o95915j058433
3065G9024967j585902k277559k565762k835650l136007l006462l338598l175516
3057E7103511k862015k548871k534737k416859k193838j938894j804169j448579
3049C9355549j329338j434069j274998j097327j057422j038511p29567p66736
3041C0627581p22370o22992q09815p75248n73414m85920m18640n72351n69800
3032B5077031m00864l29664k29796j9156j22308k36859l30321j54152Q1745j9191
3022B3316465J52416P133K52931L30692K346L14919L28363L30921N4609P203p6536
3011B5021462p4711n1837k02107m80661m26440m42481p36734n72693o35961m19478
$$ plain form
3001 20978359 20529232 20115007 19812370 19431872 19062196 18560837 18346547 18180849 17984056
2992 17984056 17861285 17554481 17298638 17067471 16877777 16697146 16557919 16389059 16460146 16535432
2982 16535432 16383858 16365864 16208112 16274081 16427070 16558078 16391531 16286095 16370811 16353147
2972 16353147 16546436 16616768 16680976 16900556 17208783 17650730 17986988 18383892 18820281 19014330
2962 19014330 19244130 19347324 19340572 19286841 19252881 19219644 19067727 19001335 19000279 19144526 19262862
2951 19262862 19486787 19474486 19785987 20124796 20455104 20851149 21248333 21573966 21828754 22094774
2941 22094774 22496801 22929386 23274763 23661876 24090115 24277765 24679187 25122868 25417167
2932 25417167 25826916 26497312 27042985 27442192 27992910 28465620 29019920 29704803 30593771
$$ packed form
3001B0978359m49127m14225l02637l80498l69676n01359k14290j65698j96793
2992A7984056j22771l06804k55843k31167j89694j80631j39227j68860P1087P5286
2982A6535432j51574j7994j57752O5969J52989J31008j66547j05436Q4716j7664
2972A6353147J93289P0332O4208K19580L08227M41947L36258L96904M36389J94049
2962A9014330K29800J03194o752n3731l3960l3237j51917o6392j056J44247J18336
2951A9262862K23925j2301L11501L38809L30308L96045L97184L25633K54788K66020
2941B2094774M02027M32585L45377L87113M28239J87650M01422M43681K94299
2932B5417167M09749O70396N45673L99207N50718M72710N54300O84883Q88968
$$ plain form
2923 30593771 31338388 32048754 32789887 33555782 34622679 35798725 36728267 37817322 39124925
2914 39124925 40618727 42330650 44214277 46306407 48332071 50492541 52911170 55462263
2906 55462263 58018235 60585398 63480058 66493520 69214976 71994101 74184988 75689660
2898 75689660 77013122 77690935 77912021 77624309 77531834 77739775 77899934 78112007 78884952
2889 78884952 79890697 81124476 82624520 84299953 85986501 88002108 90360880 93082204
2881 93082204 96362605 100068578 104227135 108958713 114361703 120224421 126835088 134544495
2873 134544495 143054313 152764298 163898434 176741867 190914887 206945318 225368225
2866 225368225 246511766 271185520 300461895 335634551 377694138 425744358 474496275
$$ packed form
2923C0593771P44617P10366P41133P65895J066897J176046R29542J089055J307603
2914C9124925J493802J711923J883627K092130K025664K160470K418629K551093
2906E5462263K555972K567163K894660L013462K721456K779125K190887J504672
2898G5689660J323462O77813K21086k87712r2475K07941J60159K12073P72945
2889G8884952J005745J233779J500044J675433J686548K015607K358772K721324
2881I3082204L280401L705973M158557M731578N402990N862718O610667P709407
2873A34544495Q509818R709985J1134136J2843433J4173020J6030431J8422907
2866B25368225K1143541K4673754K9276375L5172656M2059587M8050220M8751917
$$ plain form
2859 474496275 514203281 533829770 527707971 500572484 461502877 420347921 383365564
2852 383365564 352892500 329019442 309896695 293972895 279374684 265311117 251389223
2845 251389223 237485117 223947106 211377286 199958913 189778536 180718882 171807751
2838 171807751 162413232 152445676 142661199 133432631 125107105 117452482 110621293 104597831
2830 104597831 99203422 94386419 89944366 86048339 82282517 78981845 75792402 72681037
2822 72681037 69800428 67016689 64516642 62201296 60030599 58101872 56379252 54821935
2814 54821935 53066599 51492644 49809983 48270214 46967673 45682220 44363364 43320242
2806 43320242 42274694 41167491 40193501 39294752 38275327 37421057 36738146 35977180 35065784
$$ packed form
2859D74496275L9707006J9626489o121799k7135487l9069607m1154956l6982357
2852C83365564l0473064k3873058j9122747j5923800j4598211j4063567j3921894
2845B51389223j3904106j3538011j2569820j1418373j0180377r059654q911131
2838A71807751r394519r967556r784477r228568q325526p654623o831189o023462
2830A04597831n394409m817003m442053l896027l765822l300672l189443l111365
2822G2681037k880609k783739k500047k315346k170697j928727j722620j557317
2814E4821935j755336j573955j682661j539769j302541j285453j318856j043122
2806D3320242j045548j107203r73990q98749j019425q54270o82911p60966r11396
$$ plain form
2797 35065784 34145442 33290815 32790182 32318897 31767184 31245245 30535661 29988422 29489006
2788 29489006 28955379 28376750 27786137 27246471 26621120 25989784 25624748 25200281 24614304
2779 24614304 24150782 23755961 23182511 22396213 21750489 21211352 20743110 20188932 19633028
2770 19633028 19048926 18432991 18012011 17552096 17098550 16719904 16336277 16049376 15669645
2761 15669645 15351685 14935429 14550926 14165040 13785901 13330276 12987274 12705949 12442092
2752 12442092 12244713 11827941 11647487 11650663 11441812 11277120 11081305 10737951 10729397 10475781
2742 10475781 10138523 9989431 9471415 9251086 9122138 9123081 8955740 8637869 8510893 8488908
2732 8488908 8435833 8371681 8078763 7970649 7949305 7811266 7819751 7724134 7477088 7428709 7360053
$$ packed form
2797C5065784r20342q54627n00633m71285n51713n21939p09584n47239m99416
2788B9489006n33627n78629n90613n39666o25351o31336l65036m24467n85977
2779B4614304m63522l94821n73450p86298o45724n39137m68242n54178n55904
2770A9633028n84102o15935m20980m59915m53546l78646l83627k86901l79731
2761A5669645l17960m16256l84503l85886l79139m55625l43002k81325k63857
2752A2442092j97379m16772j80454L176k08851j64692j95815l43354q554k53616
2742A0475781l37258j49092n18016k20329j28948R43j67341l17871j26976k1985
2732H488908n3075o4152k92918j08114k1344j38039Q485r5617k47046m8379o8656
$$ plain form
2721 7360053 7103686 7008687 6780065 6818591 6725180 6684766 6517814 6543624 6411009 6186066
2711 6186066 6094395 6103824 6076937 5922969 5874515 5778250 5722772 5737319 5593921 5310336 5311023
2700 5311023 5332800 5154485 5117887 5237207 5220875 5137358 5075676 5117672 5100522 5092224 5001048
2689 5001048 5004433 5026250 5010657 5065390 4927617 4942009 4811289 4701489 4579624 4613627 4562548
2678 4562548 4512115 4406800 4440123 4330118 4173315 4183610 4073393 4064205 4063790 4040710 3949442
2667 3949442 3912816 3876725 3726649 3774199 3871478 4002169 3671179 3473003 3478376 3267303 3280173
2656 3280173 3358368 3380889 3409661 3307628 3060837 2994637 2956037 2921749 2932637 2887647 2818304
2645 2818304 2751426 2789560 2801961 2750631 2590432 2575749 2695213 2725391 2571417 2453862 2395602
$$ packed form
2721G360053k56367r4999k28622L8526r3411m0414j66952K5810j32615k24943
2711F186066r1671R429k6887j53968m8454r6265n5478J4547j43398k83585O87
2700E311023K1777j78315l6598J19320j6332q3517o1682M1996j7150q298r1176
2689E001048L385K1817j5593N4733j37773J4392j30720j09800j21865L4003n1079
2678D562548n0433j05315L3323j10005j56803J0295j10217r188m15k3080r1268
2667C949442l6626l6091j50076M7550R7279J30691l30990j98176N373k11073J2870
2656C280173P8195K2521K8772j02033k46791o6200l8600l4288J0888m4990o9343
2645B818304o6878L8134J2401n1330j60199j4683J19464L0178j53974j17555n8260
$$ plain form
2634 2395602 2473017 2418591 2295227 2356959 2439151 2594082 2551679 2634779 2656825 2542324 2576244
2623 2576244 2594824 2512461 2602546 2503655 2642929 2729230 2688249 2665246 2466557 2213319 2355042
2612 2355042 2411205 2421316 2471654 2464047 2455761 2288990 2139094 2175487 2122517 2092191 2300344
2601 2300344 2236780 2232958 2278045 2277655 2382265 2396575 2341713 2431763 2417810 2405172 2420927 2397535
2589 2397535 2480877 2545323 2648567 2765028 2787624 2703410 2857054 2931619 2946018 3043919 3212627
2578 3212627 3364491 3683294 3913009 3868666 4001571 3979363 3938341 3900248 3785972 3477086
2568 3477086 3277030 3182800 3122876 2947899 2767891 2863203 2683375 2544832 2524453 2363191
2558 2363191 2431120 2286807 2226676 2307942 2257297 2071108 2070708 2117835 1904775 2085297 2063241
$$ packed form
2634B395602P7415n4426j23364O1732Q2192J54931m2403Q3100K2046j14501L3920
2623B576244J8580q2363R0085r8891J39274Q6301m0981k3003j98689k53238J41723
2612B355042N6163J0111N0338p607q286j66771j49896L6393n2970l0326K08153
2601B300344o3564l822M5087l90J04610J4310n4862R0050j3953j2638J5755k3392
2589B397535Q3342O4446J03244J16461K2596q4214J53644P4565J4399R7901J68708
2578C212627J51864L18803K29715m4343J32905k2208m1022l8093j14276l08886
2568C477086k00056r4230n9924j74977j80008R5312j79828j38543k0379j61262
2558B363191O7929j44313o0131Q1266n0645j86189m00M7127k13060J80522k2056
$$ plain form
2547 2063241 1995225 1942867 1868215 1788046 1795579 1798952 1784811 1579476 1540612 1617090 1686314 1535285
2535 1535285 1451675 1486824 1554431 1612737 1551862 1479015 1401674 1442807 1468773 1382816 1418678
2524 1418678 1465629 1440760 1517906 1416910 1296151 1306898 1294946 1242246 1305295 1142941 1122532
2513 1122532 1157293 1134939 1235790 1105948 1008765 1041329 1085660 1074194 1102888 1037377 1068826
2502 1068826 1138550 1006416 969018 974215 1021457 859959 911766 1009194 869463 855437 902883
2491 902883 978236 917090 693097 811925 872406 866117 874237 930314 974449 919861 842785 785221
2479 785221 875380 854299 895887 924780 1027116 966636 800979 854075 757462 854779 965252
2468 965252 917638 892237 942947 936710 956066 850842 868196 771664 847244 845516 834126 978423
$$ packed form
2547B063241o8016n2358p4652q0169P533L373j4141k05335l8864P6478O9224j51029
2535A535285q3610L5149O7607N8306o0875p2847p7341M1133K5966q5957L5862
2524A418678M6951k4869P7146j00996j20759J0747j1952n2700O3049j62354k0409
2513A122532L4761k2354J00851j29842r7183L2564M4331j1466K8694o5511L1449
2502A068826O9724j32134l7398N197M7242j61498N1807R7428j39731j4026M7446
2491I02883P5353o1146k23993J18828O0481o289Q120N6077M4135n4588p7076n7564
2479G85221R0159k1081M1588K8893J02336o0480j65657N3096r6613R7317J10473
2468I65252m7614k5401N0710o237J9356j05224J7354r6532P5580j728j1390J44297
$$ plain form
2456 978423 893003 885956 769816 920858 967936 903042 774553 644731 702249 695978 701259
2445 701259 658494 515090 502021 735796 765612 703784 805232 701224 481320 552398 588398
2434 588398 772788 723388 705272 711447 651580 772232 809068 782409 870026 705118 659886
2423 659886 622021 558426 548776 380984 470495 591968 661275 555830 607509 616340 612526 658031
2411 658031 733341 708485 516596 515799 459580 399366 408782 545655 504052 519174 553331 533671
2399 533671 483163 437538 495544 460847 493334 594623 642401 603426 512312 456397 434877
2388 434877 452472 486851 504155 588296 477679 424705 454616 504925 467920 600258 807146
2377 807146 631599 560943 527691 544660 567508 677742 660400 545640 717917 744388 791113
$$ packed form
2456I78423q5420p047j16140J51042M7078o4894j28489j29822N7518o271N281
2445G01259m2765j43404j3069K33775K9816o1828J01448j04008k19904P1078L6000
2434E88398J84390m9400j8116O175n9867J20652L6836k6659Q7617j64908m5232
2423F59886l7865o3595r650j67792Q9511J21473O9307j05445N1679Q831l814M5505
2411F58031P5310k4856j91889p97n6219o0214R416J36873m1603J5122L4157j9660
2399E33671n0508m5625N8006l4697L2487J01289M7778l8975r1114n5915k1520
2388D34877J7595L4379J7304Q4141j10617n2974K9911N0309l7005J32338K06888
2377H07146j75547p0656l3252J6969K2848J10234j7342j14760J72277K6471M6725
$$ plain form
2366 791113 670403 704677 788911 763402 760477 639748 546739 677012 754290 709432 701129
2355 701129 753881 610261 714517 617066 723120 822050 751870 667391 664523 589855 629864
2344 629864 524664 565435 678039 691531 579436 651389 684369 591629 540827 577690 487683
2333 487683 430852 466629 337689 565196 599970 666938 606362 473615 447702 542373 577852
2322 577852 490384 480784 636098 498040 426906 413735 369150 282446 246340 346225 450133
2311 450133 541088 457049 520558 574288 456764 357361 520396 541819 480234 412520 235061
2300 235061 301228 378462 362945 371409 375596 486927 404645 379954 405962 377547 571269 549484
2288 549484 528280 439122 514220 526354 447286 567505 703033 623382 513876 385477 361047
$$ packed form
2366G91113j20710L4274Q4234k5509k925j20729r3009J30273P7278m4858q303
2355G01129N2752j43620J04256r7451J06054R8930p0180q4479k868p4668M0009
2344F29864j05200M0771J12604J3492j12095P1953L2980r2740n0802L6863r0007
2333D87683n6831L5777j28940K27507L4774O6968o0576j32747k5913R4671L5479
2322E77852q7468r600J55314j38058p1134j3171m4585q6704l6106R9885J03908
2311D50133R0955q4039O3509N3730j17524r9403J63035K1423o1585o7714j77459
2300B35061O6167P7234j5517Q464M187J11331q2282k4691K6008k8415J93722k1785
2288E49484k1204q9158P5098J2134p9068J20219J35528p9651j09506j28399k4430
$$ plain form
2277 361047 295049 354896 477623 493799 569554 422852 312106 436589 358086 212111 208469
2266 208469 421161 412626 464104 458250 497721 545034 492895 590954 596713 448346 532950 708677
2254 708677 636600 585514 537069 490122 606430 478722 447458 275451 459929 589902 558263
2243 558263 654774 583937 483938 395728 393969 484376 606580 460199 397579 477807 479976 561972
2231 561972 596934 602576 543634 468781 388052 338502 340523 401410 424844 362931 452860 263596
2219 263596 271245 354808 447277 587304 675225 703728 579699 564671 644466 638535 503591
2208 503591 557080 476216 422456 583581 630790 706111 622396 673554 542701 452863 497383
2197 497383 614809 688352 787431 673335 584690 651150 737623 956706 916887 627136 646235
$$ packed form
2277C61047o5998N9847J22727J6176P5755j46702j10746J24483p8503j45975l642
2266B08469K12692q535N1478n854L9471M7313n2139R8059N759j48367Q4604J75727
2254G08677p2077n1086m8445m6947J16308j27708l1264j72007J84478J29973l1639
2243E58263R6511p0837r9999q8210j759R0407J22204j46381o2620Q0228K169Q1996
2231E61972L4962N642n8942p4853q0729m9550K021O0887K3434o1913Q9929j89264
2219B63596P649Q3563R2469J40027Q7921K8503j24029j5028P9795n931j34944
2208E03591N3489q0864n3760J61125M7209P5321q3715N1158j30853q9838M4520
2197D97383J17426P3543R9079j14096q8645O6460Q6473K19083l9819k89751J9099
$$ plain form
2186 646235 727819 838471 912790 859148 962212 975017 867429 789659 949409 1001703 1024349
2175 1024349 1113561 1072482 1045666 1133102 1328849 1186470 1250624 1305700 1317141 1396596 1292098
2164 1292098 1167934 1360501 1388102 1335600 1342120 1377758 1463042 1337537 1294242 1391600 1509600
2153 1509600 1717467 1746538 1786951 1749163 1910745 1945647 1880922 1830679 1952435 1933846 1916939
2142 1916939 2013897 2108326 2348916 2473285 2453529 2570071 2530658 2677743 2785661 2809828
2132 2809828 3042848 3107109 3246976 3367170 3542232 3675564 3683208 3853802 4040635 4121113
2122 4121113 4182603 4258453 4514567 4695673 5101929 5278375 5458289 5580626 5783685 5958626
2112 5958626 6377887 6640652 7013574 7339970 7940852 8541002 9251336 10237512 11146205 11587823
$$ packed form
2186F46235Q1584J10652P4319n3642J03064J2805j07588p7770J59750N2294K2646
2175A024349Q9212m1079k6816Q7436J95747j42379O4154N5076J1441P9455j04498
2164A292098j24164J92567K7601n2502O520L5638Q5284j25505m3295R7358J18000
2153A509600K07867K9071M0413l7788J61582L4902o4725n0243J21756j8589j6907
2142A916939R6958R4429K40590J24369j9756J16542l9413J47085J07918K4167
2132B809828K33020O4261J39867J20194J75062J33332P644J70594J86833Q0478
2122D121113O1490P5850K56114J81106M06256J76446J79914J22337K03059J74941
2112E958626M19261K62765L72922L26396O00882O00150P10334R86176R08693M41618
$$ plain form
2102 11587823 12264057 12947160 13983841 15027910 16658886 18552978 21014776 23770745
2094 23770745 27818654 33077686 41201619 53538661 71753218 82876826 77427862 65503167
2086 65503167 50437499 38549165 30571599 24938004 20822155 17852801 15464199 13700622
2078 13700622 12453247 11520065 10830159 10455652 10016683 9387388 8620356 7969306 7251184
2069 7251184 6724898 6295084 5994551 5809597 5415682 5275793 4983318 4652052 4511668 4325655
2059 4325655 4181131 4096135 3943209 3911400 3754063 3524172 3379775 3274659 3058381 2912610
2049 2912610 2805252 2675653 2493231 2513750 2551245 2351657 2170434 2153558 2245150 2276349
2039 2276349 2123032 2080250 2112887 1996908 2079786 1871051 1804274 1896503 1720351 1628329 1765300
$$ packed form
2102A1587823O76234O83103J036681J044069J630976J894092K461798K755969
2094B3770745M047909N259032Q123933J2337042J8214557J1123608n448964j1924695
2086F5503167j5065668j1888334p977566n633595m115849k969354k388602j763577
2078A3700622j247375r33182o89906l74507m38969o29295p67032o51050p18122
2069G251184n26286m29814l00533j84954l93915j39889k92475l31266j40384j86013
2059D325655j44524q4996j52926l1809j57337k29891j44397j05116k16278j45771
2049B912610j07358j29599j82422K0519L7495j99588j81223j6876R1592L1199
2039B276349j53317m2782L2637j15979Q2878k08735o6777R2229j76152r2022J36971
$$ plain form
2028 1765300 1817312 1630659 1487924 1452778 1409275 1296805 1492456 1338226 1359722 1229524
2018 1229524 1040956 1007159 952558 907852 941324 968858 1019296 1006082 901521 838184 1033336
2007 1033336 1018087 1041625 968110 976523 1047082 782638 845936 921484 988825 818407 823945
1996 823945 893353 785690 818230 843416 734922 766426 725792 703991 683099 697212 744781
1985 744781 669544 625396 554718 531689 501068 562881 683496 603243 462791 465503 487615
1974 487615 573647 511364 492573 381494 362349 412697 455307 539624 495921 439476 461457
1963 461457 523578 479008 523084 521231 524888 391024 472015 452883 283736 306455 419283
1952 419283 439479 427868 501948 550238 413157 342620 470261 559890 411906 471400 548169
$$ packed form
2028A765300N2012j86653j42735l5146m3503j12470J95651j54230K1496j30198
2018A229524j88568l3797n4601m4706L3472K7534N0438j3214j04561o3337J95152
2007A033336j5249K3538p3515Q413P0559k64444O3298P5548O7341j70418N538
1996H23945O9408j07663L2540K5186j08494L1504m0634k1801k0892J4113M7569
1985G44781p5237m4148p0678k3029l0621O1813J20615q0253j40452K712K2112
1974D87615Q6032o2283j8791j11079j9145N0348M2610Q4317m3703n6445K1981
1963D61457O2121m4570M4076j853L657j33864Q0991j9132j69147K2719J12828
1952D19283K0196j1611P4080M8290j37081p0537J27641Q9629j47984N9494P6769
$$ plain form
1941 548169 549627 402039 281443 265477 412866 565918 487046 423503 424939 413924 336219
1930 336219 251416 302946 337676 358107 338433 367763 427595 291491 186974 238012 219008
1919 219008 239437 193321 132760 225492 253255 335258 221573 283071 367484 343968 322943
1908 322943 107271 104608 141169 338764 278470 233243 337268 116990 137479 372176 301846
1897 301846 163397 359864 250068 226152 185903 252455 342624 449280 424867 345329 225938
1886 225938 160610 220688 209895 146267 109619 91593 58907 134324 301771 241402 106526
1875 106526 189279 280782 212996 154896 134269 -2162 1220 217558 263607 251817 147526
1864 147526 168007 203246 149499 196040 222462 215234 259980 242179 291728 121990 66655 152716
$$ packed form
1941E48169J458j47588j20596j5966J47389J53052p8872o3543J436j1015p7705
1930C36219q4803N1530L4730K0431j9674K9330N9832j36104j04517N1038j9004
1919B19008K0429m6116o0561R2732K7763Q2003j13685O1498Q4413k3516k1025
1908C22943k15672k663L6561J97595o0294m5227J04025k20278K0489K34697p0330
1897C01846j38449J96467j09796k3916m0249O6552R0169J06656k4413p9538j19391
1886B25938o5328O0078j0793o3628l6648j8026l2686P5417J67447o0369j34876
1875A06526Q2753R1503o7786n8100k0627j36431L382K16338M6049j1790j04291
1864A47526K0481L5239n3747M6541K6422p228M4746j7801M9549j69738n5335Q6061
$$ plain form
1852 152716 196419 181975 254442 453494 419927 258999 141259 177629 284052 276471 223684
1841 223684 151271 139116 134494 189320 136334 144730 228325 218027 109838 105642 254136 329590
1829 329590 361063 189393 294158 393759 504212 382310 368545 311433 327319 453006 478744
1818 478744 453353 427222 327835 289433 272361 306295 312346 274233 233909 264243 75909 147686
1806 147686 334846 319395 88100 107695 125636 206351 300419 123462 138232 138135 62469 105676
1794 105676 272453 249408 105466 -26944 -72 110280 153162 177434 70978 176153
1784 176153 292099 140879 41060 148749 258654 349841 223851 235465 187287 294401
1774 294401 208506 159696 331627 179419 187934 314462 337976 149824 190331 133177 96979
$$ packed form
1852A52716M3703j4444P2467J99052l3567j60928j17740L6370J06423p581n2787
1841B23684p2413j2155m622N4826n2986Q396Q3595j0298j08189m196J48494P5454
1829C29590L1473j71670J04765R9601J10453j21902j3765n7112J5886J25687K5738
1818D78744k5391k6131r9387l8402j7072L3934O051l8113m0324L0334j88334P1777
1806A47686J87160j5451k31295J9595J7941Q0715R4068j76957J4770r7p5666M3207
1794A05676J66777k3045j43942j32410K6872J10352M2882K4272j06456J05175
1784A76153J15946j51220r9819J07689J09905R1187j25990J1614m8178J07114
1774B94401q5895m8810J71931j52208Q515J26528K3514j88152M0507n7154l6198
$$ plain form
1763 96979 129467 79173 101845 260537 316335 252882 37228 19740 63939 50862 -84013
1752 -84013 -26305 161645 109095 -19372 64507 4176 17342 -57264 21474 148656 127769
1741 127769 117900 163891 56612 6879 47957 253496 25017 -126133 131811 96776 37444
1730 37444 814 31333 -29632 -62833 -167995 -172303 123456 126095 60634 74579 197425 140217
1718 140217 -13783 152284 177003 211772 340770 236484 164105 219269 141595 219047 234839
1707 234839 151256 170492 142041 81166 118468 64357 167906 123341 -92868 -53841 18870
1696 18870 36587 62914 161820 -16020 -102390 -68173 -18902 212782 149644 18078 -83631
1685 -83631 -44458 59520 -10484 31526 235 6914 42983 78068 21916 -58445 24113 -49088
$$ packed form
1763I6979L2488n0294K2672J58692N5798o3453k15654j7488M4199j3077j34875
1752h4013N7708J87950n2550j28467Q3879o0331J3166p4606P8738J27182k0887
1741A27769r869M5991j07279m9733M1078K05539k28479j51150K57944l5035n9332
1730C7444l6630L0519o0965l3201j05162m308K95759K639o5461J3945J22846n7208
1718A40217j54000J66067K4719L4769J28998j04286p2379N5164p7674P7452J5792
1707B34839q3583J9236k8451o0875L7302n4111J03549m4565k16209L9027P2711
1696A8870J7717K6327R8906j77840q6370L4217M9271K31684o3138j31566j01709
1685h3631L9173J03978p0004M2010l1291O679L6069L5085n6152q0361Q2558p3201
$$ plain form
1673 -49088 -68420 14598 103659 54749 4538 89527 200493 -4903 -189109 -32857 -8353
1662 -8353 49435 -26540 -93365 -115809 -185947 -61433 18440 -87859 -65459 32085 26270 165868
1650 165868 55837 53961 -514 161825 78685 103519 166364 -19572 76969 111590 72008
1639 72008 -12427 68987 115964 24613 67309 199382 160547 229416 110382 28592 97539
1628 97539 -26379 -32924 -79699 -84833 -21624 52559 10568 -19647 102846 237111 193527 75299
1616 75299 80329 132599 143860 188785 154694 -1917 -36476 7395 24511 -120979 -254491
1605 -254491 -50392 25347 43962 -41493 -104036 39463 -2402 -731 81644 115365 137486
1594 137486 28422 -21467 -83707 -186016 61330 225210 -11155 -58074 12985 70690 126376
$$ packed form
1673d9088j9332Q3018Q9061m8910n0211Q4989J10966k05396j84206J56252K4504
1662h353N7788p5975o6825k2444p0138J24514P9873j06299K2400R7544n815J39598
1650A65868j10031j876n4475J62339q3140K4834O2845j85936R6541L4621l9582
1639G2008q4435Q1414M6977r1351M2696J32073l8835O8869j19034q1790O8947
1628I7539j23918o545m6775n134O3209P4183m1991l0215J22493J34265m3584j18228
1616G5299N030N2270J1261M4925l4091j56611l4559M3871J7116j45490j33512
1605b54491K04099P5739J8615q5455o2543J43499m1865J671Q2375L3721K2121
1594A37486j09064m9889o2240j02309K47346J63880k36365m6919P1059N7705N5686
$$ plain form
1583 126376 -30777 8758 -25024 9912 27238 -246659 -114633 40106 165134 118891 10080
1572 10080 57898 -11116 83951 153569 162602 169763 104650 -7131 28125 57852 -6087 -17212
1560 -17212 130054 36469 -28249 -48417 104272 41804 -10471 -142265 -252209 5063 45545
1549 45545 36935 67933 107823 124561 60630 116072 143654 -49163 -252523 -168804 -44712
1538 -44712 -40940 -23037 -156780 -102026 -103216 -199036 -74952 55703 152962 122084 45995 33246
1526 33246 87596 107925 -106119 -245032 -138649 40880 -141982 -200660 -118577 -183960 -286432
1515 -286432 -281785 -98717 75174 -7204 -111112 -97620 36605 68516 5165 -68021 -38810
1504 -38810 -57362 53628 220217 131494 255343 115259 53384 31139 126078 13999 -74961
$$ packed form
1583A26376j57153L9535l3782L4936J7326k73897J32026J54739J25028m6243j08811
1572A0080M7818o9014R5067O9618R033P161o5113j11781L5256K9727o3939j1125
1560a7212J47266r3585o4718k0168J52689o2468n2275j31794j09944K57272M0482
1549D5545q610L0998L9890J6738o3931N5442K7582j92817k03360Q3719J24092
1538d4712L772J7903j33743N4754j190r5820J24084J30655R7259l0878p6089j2749
1526C3246N4350K0329k14044j38913J06383J79529j82862n8678Q2083o5383j02472
1515b86432M647J83068J73891q2378j03908J3492J34225L1911o3351p3186K9211
1504c8810j8552J10990J66589q8723J23849j40084o1875k2245R4939j12079q8960
$$ plain form
1493 -74961 -197360 -158812 30401 103245 88581 -124473 -94360 -17446 -5707 103685 -9356
1482 -9356 -10004 69194 77750 -32547 -143987 -24465 -160773 46834 174996 78047 132778
1471 132778 -59522 -92029 -129112 -181686 -52841 206493 186278 -17627 -68213 42423 110569
1460 110569 -46650 -196846 -5427 83411 87131 -55511 -130589 -34062 -56217 -54892 -216337
1449 -216337 -154832 -100361 -58092 -16430 -46787 -41939 61412 17147 96864 19656 -74822 8210
1437 8210 86690 -90166 -118528 -141001 -72142 10563 95827 109670 89316 -25537 -107699 67393
1425 67393 19540 -58613 -68628 -30276 -26272 -95061 -9689 66865 77695 49885 56754 63534
1413 63534 98038 17041 -111440 -64117 67958 12164 -24860 77857 57952 51030 163274
$$ packed form
1493g4961j22399L8548J89213P2844j4664k13054L0113P6914J1739J09392j13041
1482i356o48P9198Q556j10297j11440J19522j36308K07607J28162r6949N4731
1471A32778j92300l2507l7083n2574J28845K59334k0215k03905n0586J10636O8146
1460A10569j57219j50196J91419Q8838L720j42642p5078R6527k2155J325j61445
1449b16337O1505N4471M2269M1662l0357M848J03351m4265P9717p7208r4478Q3032
1437H210P8480j76856k8362k2473O8859Q2705Q5264J3843k0354j14853q2162J75092
1425F7393m7853p8153j0015L8352M004o8789Q5372P6554J0830k7810O869O780
1413F3534L4504q0997j28481M7323J32075n5794l7024J02717j9905o922J12244
$$ plain form
1402 163274 38127 2186 102205 31986 112665 38834 44115 -9839 -211922 -127365 59867
1391 59867 26382 13086 202634 217915 289267 204132 170528 176605 121914 92928 29976 -43763
1379 -43763 35826 60841 -19719 59893 -2988 3394 35575 143863 4115 -85897 -92862 -68338
1367 -68338 32233 172601 73478 -43485 -81081 -53030 -28347 56085 66286 110061 110034 -3445
1355 -3445 -66033 -27993 48650 67382 -138563 -180623 -76932 -28914 51695 34792 -39824 -114409
1343 -114409 -67600 -21155 66634 -36280 -46067 -3670 -2420 -54941 -326091 -169238 -31325
1332 -31325 -116885 81546 140979 122432 37803 73625 178038 162252 115816 158999 217855
1321 217855 83496 19273 8730 -47780 109580 -58283 -17550 26890 23649 57471 -18621
$$ packed form
1402A63274j25147l5941J00019p0219Q0679p3831N281n3954k02083Q4557J87232
1391E9867l3485j3296J89548J5281P1352q5135l3604O077n4691k8986o2952p3739
1379d3763P9589K5015q0560P9612o2881O382L2181J08288j39748r0012o965K4524
1367f8338J00571J40368r9123j16963l7596K8051K4683Q4432J0201M3775k7j13479
1355c445o2588L8040P6643J8732k05945m2060J03691M8018Q0609j6903p4616p4585
1343a14409M6809M6445Q7789j02914r787M2397J250n2521k71150J56853J37913
1332c1325q5560J98431N9433j8547q4629L5822J04413j5786m6436M3183N8856
1321B17855j34359o4223j0543n6510J57360j67863M0733M4440l241L3822p6092
$$ plain form
1310 -18621 -116606 -149825 -219897 -273525 -23043 26860 -38217 -288461 -238122 -141428 -128052
1299 -128052 -121499 -171027 -157920 32395 1308 -77181 -43602 -1502 52448 314841 90056
1288 90056 -43548 32423 -121274 -224832 -121891 147446 30365 74270 158128 22614
1278 22614 52722 29653 -27583 -44778 -150485 -173274 -148542 62461 25982 27554 -14513 -37796
1266 -37796 74263 59220 -8756 -9354 78162 -3845 -113632 311 37897 12315 138958
1255 138958 91056 123962 36298 -207877 -114576 -188456 -203700 79194 109093 -49715 -48504
1244 -48504 -14197 -20482 -24081 28683 140426 648 22140 90301 202471 74551 -93659
1233 -93659 121319 87621 -24060 -51805 -69870 -95001 -80845 -574 -16412 12597 19481 2448
$$ packed form
1310a8621r7985l3219p0072n3628K50482M9903o5077k50244N0339R6694J3376
1299a28052O553m9528J3107J90315l1087p8489L3579M2100N3950K62393k24785
1288I0056j33604P5971j53697j03558J02941K69337j17081M3905Q3858j35514
1278B2614L0108k3069n7236j7195j05707k2789K4732K11003l6479J572m2067k3283
1266c7796J12059j5043o7976n98Q7516q2007j09787J13943L7586k5582J26643
1255A38958m7902L2906q7664k44175R3301p3880j5244K82894K9899j58808J211
1244d8504L4307o285l599N2764J11743j39778K1492O8161J12170j27920j68210
1233i3659K14978l3698j11681k7745j8065k5131J4156Q0271j5838K9009O884j7033
$$ plain form
1221 2448 66777 -7463 1095 -2332 81866 -51927 -143934 -93452 28022 5794 -202110 -20768
1209 -20768 27951 -110817 -180861 -24235 -77393 -144768 -43696 -217178 -259412 -40571 123813
1198 123813 -3020 -51939 96447 116857 105108 193952 212629 200656 54401 27817 172150
1187 172150 108724 798 -75715 -49851 122678 -22910 -13029 21940 -7278 -58141 -204098
1176 -204098 -84984 6548 35109 68760 55197 -82463 41792 184593 218703 64587 -50102
1165 -50102 -5847 -130280 91116 86867 -87492 -64700 -21675 99318 35958 -32023 89307
1154 89307 44358 17574 -48118 -31510 -152847 -140947 -30411 47282 20479 -32996 3239
1143 3239 -43343 21774 133566 23611 91988 82064 -81275 -88175 -127355 -143266 -201565 -100375
$$ packed form
1221B448O4329p4240Q558l427Q4198j33793r2007N0482J21474k2228k07904J81342
1209b0768M8719j38768p0044J56626n3158o7375J01072j73482m2234K18841J64384
1198A23813j26833m8919J48386K0410j1749Q8844J8677j1973j46255k6584J44333
1187A72150o3426j07926p6513K5864J72529j45588R881L4969k9218n0863j45957
1176b04098J19114R1532K8561L3651j3563j37660J24255J42801L4110j54116j14689
1165e0102M4255j24433K21396m249j74359K2792M3025J20993o3360o7981J21330
1154H9307m4949k6784o5692J6608j21337J1900J10536P7693k6803n3475L6235
1143C239m6582O5117J11792j09955O8377r924j63339o900l9180j5911n8299J01190
$$ plain form
1131 -100375 -187847 -99064 -39782 48680 47293 99471 16820 -23956 127574 62993 -62513
1120 -62513 -90317 -139911 -1295 -68996 -132240 -55295 40415 119643 135282 145502 64601 187226
1108 187226 192581 93832 -28094 -86053 -12292 199181 34875 -14716 -25648 -58906 -57783
1097 -57783 -75250 -103454 -106054 -102228 48825 41557 -185259 -63494 -18251 -166324 -118358 -78646
1085 -78646 -66976 -41551 -30859 52985 59150 198833 80913 -113287 -117536 -118693 14547 -186965
1073 -186965 -286957 -163232 -134597 157712 198271 64404 81 88668 3199 -16823 -98327
1062 -98327 -72211 -77967 -60661 -102545 -12685 33653 -24336 -10026 93288 153314 -6761 23531
1050 23531 182697 116115 67961 -64072 -8243 33416 -172153 -171940 -20555 -26786 -2557 23697
$$ packed form
1131a00375q7472Q8783N9282Q8462j387N2178q2651m0776J51530o4581j25506
1120f2513k7804m9594J38616o7701o3244P6945R5710P9228J5639J0220q0901J22625
1108A87226N355r8749j21926n7959P3761K11473j64306m9591j0932l3258J123
1097e7783j7467k8204k600L826J51053p268k26816J21765M5243j48073M7966L9712
1085g8646J1670K5425J0692Q3844O165J39683j17920j94200m249j157J33240k01512
1073a86965r9992J23725K8635K92309M0559j33867o4323Q8587q5469k0022q1504
1062i8327K6116n756J7306m1884Q9860M6338n7989J4310J03314O0026j60075L0292
1050B3531J59166o6582m8154j32033N5829M1659k05569K13J51385o231K4229K6254
$$ plain form
1038 23697 -75806 -55759 96223 24002 1504 -98051 -131711 34965 -21238 -97117 -72577
1027 -72577 23161 82886 -8537 22471 -5541 21951 22376 -111844 -64416 54777 171837 93736
1015 93736 67390 -79703 -53685 -45744 -15454 15062 33969 -187593 -209628 -113238 16611
1004 16611 -191602 -193176 -123276 1228 92531 95099 7680 108051 195869 9190 -90294
993 -90294 -234478 -49473 174077 -124158 -82589 64609 21113 -68890 -129004 -95915 -57185
982 -57185 -42401 -67636 13366 -39271 -46983 49307 53583 -45082 -22807 -70843 -51462 -156629
970 -156629 -46823 50001 46077 43757 35711 71088 52667 -60949 -150849 -10434 54412 48095
958 48095 49231 -32380 -208849 -116264 -4912 -94006 -290780 -153437 -801 -84039 -48496
$$ packed form
1038B3697r9503K0047J51982p2221k2498r9555l3660J66676n6203p5879K4540
1027g2577R5738N9725r1423L1008k8012K7492M25j34220M7428J19193J17060p8101
1015I3736k6346j47093K6018P941L0290L0516J8907k21562k2035R6390J29849
1004A6611k08213j574O9900J24504R1303K568q7419J00371Q7818j86679r9484
993i0294j44184J85005K23550k98235M1569J47198m3496r0003o0114L3089L8730
982e7185J4784k5235Q1002n2637p712R6290M276r8665K2275m8036J9381j05167
970a56629J09806R6824l924k320q046L5377j8421j13616q9900J40415O4846o317
958D8095J136q1611j76469R2585J11352q9094j96774J37343J52636q3238L5543
$$ plain form
947 -48496 -31562 -32832 -108298 -31034 12043 -74066 -15720 -21804 -136688 -51195 -110599 -109153
935 -109153 -72280 149 -24082 -165759 -39709 23742 29403 37575 204799 -19439 -57637
924 -57637 30069 25964 16967 42392 31728 -30253 -275924 -98314 82168 -65368 -49775 12340
912 12340 13310 34367 -40422 -100840 -63048 -18547 -79368 -256809 -190450 -210446 -81592 39856
900 39856 120604 148358 86237 5788 -8837 -117628 -5307 -49836 -127918 -294304 -256231
889 -256231 -218301 70526 22796 66263 58449 22545 21719 26247 80146 -81657 -121141 -1761
877 -1761 -31609 49027 38718 -111191 -80218 -83524 -87364 -139438 -118773 -44604 -27207 -134164
865 -134164 -110440 -34150 18564 76165 -73159 -80830 -106779 -193817 -210292 -149782 -20940 31842
$$ packed form
947d8496J6934j270p5466P7264M3077q6109N8346o084j14884Q5493n9404J446
935a09153L6873P2429k4231j41677J26050O3451N661Q172J67224k24238l8198
924e7637Q7706m105q997K5425j0664o1981k45671J77610J80482j47536J5593O2115
912A2340R70K1057p4789o0418L7792M4501o0821j77441O6359j9996J28854J21448
900C9856Q0748K7754o2121q0449j4625j08791J12321m4529p8082j66386L8073
889b56231L7930K88827m7730M3467p814l5904q26M528N3899j61803l9484J19380
877a761k9848Q0636j0309j49909L0973l306l840n2074K0665P4169J7397j06957
865a34164K3724P6290N2714N7601j49324p671k5949q7038j6475O0510J28842N2782
$$ plain form
853 31842 -29480 -199189 -85675 -160816 -153658 -127160 2951 14139 -115235 -96722 -50816
842 -50816 -153354 -9892 -38400 60053 -114636 -235763 -45692 39390 6669 72733 24006
831 24006 -129275 44770 -44341 -98624 -150406 -24472 -116152 -73091 -5814 -137552 -292718
820 -292718 -270629 -216629 -226966 -257586 -152601 -189421 -164786 -60160 -140912 -203913 -242172
809 -242172 -102560 -34982 -6317 3581 -201222 -194944 52929 21597 83269 120766 28822 158284
797 158284 159185 62478 -77673 -66286 -41716 -155646 -177274 17580 33598 22657 -30404 -111348
785 -111348 49328 32446 48149 -78312 33507 -27040 21659 31064 69573 -166480 -215698
774 -215698 -103599 -3812 -8710 1745 -95159 -46084 2523 -98409 -68721 -17582 57469 89752
$$ packed form
853C1842o1322j69709J13514p5141P158K6498J30111J1188j29374J8513M5906
842e0816j02538J43462k8508R8453j74689j21127J90071Q5082l2721O6064m8727
831B4006j53281J74045q9111n4283n1782J25934r1680M3061O7277j31738j55166
820b92718K2089N4000j0337l0620J04985l6820K4635J04626q0752o3001l8259
809b42172J39612O7578K8665R898k04803O278K47873l1332O1672L7497r1944J29462
797A58284R01r6707j40151J1387K4570j13930k1628J94854J6018j0941n3061q0944
785a11348J60676j6882J5703j26461J11819o0547M8699R405L8509k36053m9218
774b15698J12099R9787m898J0455r6904M9075M8607j00932K9688N1139P5051L2283
$$ plain form
762 89752 -55542 -148831 -127997 -45894 19832 21573 -88163 -121627 23648 -51405 95737
751 95737 189094 142319 -96729 -143647 -51513 40329 44462 9234 110132 144921 109476 126255
739 126255 110955 136189 49226 20567 170097 138675 46395 -18029 -96137 -4776 -51784 -16630
727 -16630 54960 68420 219334 -114448 -173151 -43857 -40812 14611 14231 114114 149601 130449
715 130449 112706 12980 -150954 -90642 28760 58040 77554 55643 -78003 29547 -157
704 -157 52467 46913 54166 -111259 -73075 41601 -99229 -104998 -82318 -151210 -150021 -141155 -79008
691 -79008 52796 20592 162040 18141 9016 -54398 -32936 164019 165125 145346 29019
680 29019 -35486 -51558 -64626 30003 41291 19762 -44035 17213 75253 -146898 -88998 -51047
$$ packed form
762H9752j45294r3289K0834Q2103O5726J741j09736l3464J45275p5053J47142
751I5737R3357m6775k39048m6918R2134R1842M133l5228J00898L4789l5445J6779
739A26255j5300K5234q6963k8659J49530l1422r2280o4424p8108R1361m7008L5154
727a6630P1590J3460J50914l33782n8703J29294L045N5423l80R9883L5487j9152
715A30449j7743r9726j63934O0312J19402K9280J9514k1911j33646J07550k9704
704a57N2624n554P253j65425L8184J14676j40830n769K2680o8892J189Q866O2147
691g9008J31804l2204J41448j43899r125o3414K1462J96955J106j9779j16327
680B9019o4505j6072j3068R4629J1288k1529o3797O1248N8040k22151N7900L7951
$$ plain form
668 -51047 2915 45209 -45661 -132463 -32236 -179625 39759 168457 113071 54683 -46669
657 -46669 90843 187436 73150 8751 -110062 -194497 -23428 -35096 32773 -134386 -201959
646 -201959 -56419 74113 41199 -46396 110568 68950 -16491 44052 14242 -159991 -166210
635 -166210 -61944 -165745 -68612 -169539 -169527 -76518 -94812 -198727 -215211 -117525 -11065
624 -11065 10207 -22552 -71561 -23460 -15271 -66710 44859 214314 129172 -99564 -116470 59655
612 59655 67295 -5836 30114 -70294 -56180 -141240 -82437 35727 53574 17491 -155016 -272389
600 -272389 -173059 -154953 -95025 -139555 20132 60117 -5202 -165434 -291829 -120039 45891
589 45891 -46821 -12783 75327 30274 -77382 -148709 -9150 9096 89698 -66819 -61722 -82750
$$ packed form
668e1047N3962M2294r0870q6802J00227j47389K19384J28698n5386n8388j01352
657d6669J37512R6593j14286o4399j18813q4435J71069j1668O7869j67159o7573
646b01959J45540J30532l2914q7595J56964m1618q5441O0543k9810j74233o219
635a66210J04266j03801R7133j00927J2R3009j8294j03915j6484R7686J06460
624a1065K1272l2759m9009M8101Q189n1439J11569J69455q5142k28736j6906J76125
612E9655P640p3131L5950j00408J4114q5060N8803J18164J7847l6083j72507j17373
600b72389R9330J8106N9928m4530J59687L9985o5319j60232j26395J71790J65930
589D5891r2712L4038Q8110m5053j07656p1327J39559J8246Q0602j56517N097k1028
$$ plain form
577 -82750 -75664 42150 101443 -37941 -112242 -164456 -60171 -63694 -65687 69990 -17523 -50994
565 -50994 -135599 -73016 18646 25593 53693 21424 28378 70213 129486 -44885 -161554 -181215
553 -181215 16401 82664 -33704 -15420 52036 192115 23121 -79158 5549 -2707 -91862
542 -91862 -184679 -126739 88437 -39434 -80791 -50802 -89941 -36007 -29325 79545 -9306 -87048
530 -87048 68120 68999 20844 -84519 -106657 79576 -8073 -49532 57009 65725 -10578 -102045
518 -102045 -36562 -97544 -135086 -75040 -118225 38679 42116 107466 -55785 -84277 46399
507 46399 -38669 54190 -17019 -230931 -146371 -119720 -61495 -9280 63571 -102981 -168544 -122391
495 -122391 -100872 -117025 -191793 -89996 70146 93697 -12594 57685 112028 30188 1546
$$ packed form
577h2750P086J17814N9293j39384p4301n2214J04285l523j993J35677q7513l3471
565e0994q4605O2583R1662O947K8100l2269O954M1835N9273j74371j16669j9661
553a81215J97616O6263j16368J8284O7456J40079j68994j02279Q4707q256q9155
542i1862r2817N7940K15176j27871m1357K9989l9139N3934O682J08870q8851p7742
530h7048J55168Q79m8155j05363k2138J86233q7649m1459J06541Q716p6303r1467
518a02045O5483o0982l7542O0046m3185J56904L437O5350j63251k8492J30676
507D6399q5068R2859p1209k13912Q4560K6651N8225N2215P2851j66552o5563M6153
495a22391K1519j6153p4768J01797J60142K3551j06291P0279N4343q1840k8642
$$ plain form
484 1546 113491 82478 -49329 -23423 -50143 -16291 36437 -37037 -134752 -75813 -95099 25876
472 25876 103609 -67220 -111127 -158110 -128762 -162042 -113499 -137257 -94649 -170075 -181795 -80180
460 -80180 21881 66997 98440 -6907 -157615 -320498 -193969 -70154 36090 20245 -6011
449 -6011 -45102 -85739 -73995 -83820 -188975 -193065 -216175 -47851 -59487 -175391 -167887 -48049
437 -48049 86859 76999 85067 139948 28766 92108 94072 37669 67968 64845 61820 189036
425 189036 101340 -46175 4931 -66787 -73967 -121564 -208474 -140034 -174397 -94772 -40930 -153955
413 -153955 -34947 -3060 -92333 -99586 -46316 -17882 -70312 -170876 -181366 -98879 -61115 -141583
401 -141583 -123103 -124033 -149278 -291327 -205412 64270 10164 -61910 35276 65820 34111 -38364
$$ packed form
484A546J11945l1013j31807K5906k6720L3852N2728p3474r7715N8939j9286J20975
472B5876P7733j70829m3907m6983K9348l3280M8543k3758M2608p5426j1720J01615
460h0180J02061M5116L1443j05347j50708j62883J26529J23815J06244j5845k6256
449f011l9091m0637J1744r825j05155m090k3110J68324j1636j15904P504J19838
437d8049J34908r860Q068N4881j11182O3342J964n6403L0299l123l025J27216
425A89036q7696j47515N1106p1718p180m7597q6910O8440l4363P9625N3842j13025
413a53955J19008L1887q9273p253N3270K8434n2430j00564j0490Q2487L7764q0468
401a41583J8480r30k5245j42049Q5915K69682n4106p2074R7186L0544l1709p2475
$$ plain form
389 -38364 -8750 -143261 -25965 11572 75255 -21462 164691 196973 -48508 -28258 55755
378 55755 60838 -150416 -110947 59817 -49523 -101592 -113327 -206209 -285320 -234779 -174309 -166208
366 -166208 -44923 -146638 -184063 23196 28036 46360 42580 74116 73356 162472 -94286 -139585
354 -139585 -168479 -114238 119896 -54574 -78667 29791 -42717 -163559 -89253 -87517 -37157
343 -37157 4299 -68560 -58403 -72770 -27029 27176 -72919 -40283 -67662 -38914 -7573 -136200
331 -136200 -202436 -108246 72440 104960 -16460 33674 -52307 75403 -50113 -56368 8725
320 8725 12331 19336 -25401 -158541 -175372 99593 49764 58306 -82874 65230 23235 -159889
308 -159889 -298133 -265115 -168991 -188438 -57607 -85631 -124071 -89182 -166101 -132637 -173814
$$ packed form
389c8364K9614j34511J17296L7537O3683r6717J86153L2282k45481K0250Q4013
378E5755N083k11254L9469J70764j09340n2069j1735r2882p9111N0541O0470Q101
366a66208J21285j01715l7425K07259M840J8324l780L1536p60Q9116k56758m5299
354a39585k8894N4241K34134j74470k4093J08458p2508j20842P4306J736N0360
343c7157M1456p2859J0157j4367M5741N4205j00095L2636k7379K8748L1341j28627
331a36200o6236R4190J80686L2520j21420N0134q5981J27710j25516o255O5093
320H725L606P005m4737j33140j6831K74965m9829Q542j41180J48104m1995j83124
308a59889j38244L3018R6124j9447J30831k8024l8440L4889p6919L3464m1177
$$ plain form
297 -173814 -220985 -99328 -74330 -114994 -118287 -9246 -98244 12968 -101145 -109764 -129174
286 -129174 -138879 -171020 -121512 -113815 -248191 -135507 -147301 -164040 -109779 -80107 9870 136775
274 136775 -38451 -116835 -169383 -143858 -80520 -126769 -34987 85057 -60110 -23290 102452
263 102452 -23685 -71442 41963 -123857 -185251 -144111 -76354 -48908 -52351 -65650 4220
252 4220 -9245 -200990 -246167 -198505 -174286 -52546 16335 -54199 25385 -63547 -121919 -90589
240 -90589 98482 -97126 -145501 -116534 -191305 -181036 -117998 -23861 59230 -77947 -130321
229 -130321 -151685 -77231 -114511 -52590 19903 69298 -6320 -134536 -31838 -26010 64520 45216
217 45216 -92273 -176851 11955 -44656 -107219 -32341 -8691 -17773 -98483 -115060 -110271 42761
$$ packed form
297a73814m7171J21657K4998m0664l293J09041q8998J11212j14113q619j9410
286a29174r705l2141M9508P697j34376J12684j1794j6739N4261K9672Q9977J26905
274A36775j75226p8384n2548K5525O3338m6249R1782J20044j45167L6820J25742
263A02452j26137m7757J13405j65820o1394M1140O7757K7446l443j3299O9870
252D220j3465j91745m5177M7662K4219J21740O8881p0534P9584q8932n8372L1330
240i0589J89071j95608m8375K8967p4771J0269O3038R4137Q3091j37177n2374
229a30321k1364P4454l7280O1921P2493M9395p5618j28216J02698N828R0530j9304
217D5216j37489q4578J88806n6611o2563P4878K3650r082q0710j6577M789J53032
$$ plain form
205 42761 100830 23550 -2732 -72058 -81906 -33583 -92556 -105829 -23570 -123253 -67194 -45948
193 -45948 -126569 -101303 -135351 -133294 -47275 5595 -60491 -36540 -12782 32958 -963 -34284
181 -34284 -71363 -62712 -177628 -158068 -91607 -94622 131139 -47178 -61898 2662 -64930 -129637
169 -129637 -74065 -14995 11310 63960 -20749 -13271 12492 -104864 -44054 -13258 -21050 -54947
157 -54947 -254732 -233345 -204038 -140404 -68610 -44924 16532 -97463 -210054 -228768 -181459
146 -181459 -221386 -95340 -41248 51678 -10987 19784 15183 -101359 -137247 -121610 -43845 1601
134 1601 90158 63218 796 -58503 -174265 -203466 -109161 -63054 -16396 -149658 -55364 -75764
122 -75764 -140643 -226272 -177932 23950 -108774 -120296 -140889 -145684 -113656 -55726 -112490 -91548
$$ packed form
205D2761N8069p7280k6282o9326r848M8323n8973j3273Q2259r9683N6059K1246
193d5948q0621K5266l4048K057Q6019N2870o6086K3951K3758M5740l3921l3321
181c4284l7079Q651j14916J9560O6461l015K25761j78317j4720O4560o7592o4707
169a29637N5572N9070K6305N2650q4709P478K5763j17356O0810L0796p792l3897
157e4947j99785K1387K9307O3634P1794K3686O1456j13995j12591j8714M7309
146a81459l9927J26046N4092R2926o2665L0771m601j16542l5888J5637P7765M5446
134A601Q8557k6940o2422n9299j15762k9201R4305M6107M6658j33262R4294k0400
122g5764o4879q5629M8340K01882j32724j1522k0593m795L2028N7930n6764K0942
$$ plain form
110 -91548 -134608 -189143 -105793 -132016 -203996 -166184 -111656 -118144 -92321 -33349 17475 73990
98 73990 77392 -32842 15596 -142608 -150480 -59224 -120992 -158258 -271468 -189198 -137388 -203253
86 -203253 -110873 -125550 -14319 136382 49471 -10127 -21597 -114963 -182294 -164665 -189516 -47134
74 -47134 -22041 -149493 -140866 -50100 82113 58299 -77443 -53629 -40200 -128688 -128832 -122913
62 -122913 -161065 -8264 -100180 -79353 -73164 -176008 -43698 18648 41031 -6855 18606 -76803
50 -76803 -79668 -125561 -72785 -29897 -27549 -34786 -51552 -182277 -158132 -118605 -107427 -117597 -69426
37 -69426 -45726 -145382 -109801 -91072 -91942 -150214 -110104 -84751 -84143 -37216 -49210 44500 -2226
24 -2226 -44202 13553 -149198 -91020 -118516 -152141 -181639 -255328 -272300 -140259 -47929 -106419
$$ packed form
110i1548m3060n4535Q3350k6223p1980L7812N4528o488K5823N8972N0824N6515
98G3990L402j10234M8438j58204p872R1256o1768l7266j13210Q2270N1810o5865
86b03253R2380j4677J11231J50701q6911n9598j1470r3366o7331J7629k4851J42382
74d7134K5093j27452Q627R0766J32213k3814j35742K3814J3429q8488j44N919
62a22913l8152J52801r1916K0827O189j02844J32310O2346K2383m7886K5461r5409
50g6803k865m5893N2776M2888K348p237j6766j30725K4145L9527J1178j0170M8171
37f9426K3700r9656L5581J8729q70n8272M0110K5353O08M6927j1994R3710m6726
24b226m1976N7755j62751N8178k7496l3625k9498p3689j6972J32041R2330n8490
$$ plain form
12 -106419 -82516 -109636 -61716 -5361 -39617 -38621 -104719 -63919 -56705 -98634 -52671 -67360
0 -67360
$$ packed form
12a06419K3903k7120M7920N6355l4256R96o6098M0800P214m1929M5963j4689
0f7360
$$ Imaginary data points
##PAGE= N=2
##DATA TABLE= (X++(I..I)), XYDATA
$$ plain form
16383 -3072017 -2988055 -2865040 -2907744 -2989935 -2992455 -2879031 -2927038 -2926873 -2759817 -2620275 -2519475
16372 -2519475 -2459296 -2411215 -2525749 -2574331 -2476833 -2321916 -2236909 -2145885 -2083516 -2114006 -2120021
16361 -2120021 -2051915 -2039250 -2005576 -1809550 -1725692 -1827652 -1837977 -1783086 -1783139 -1719258 -1651291
16350 -1651291 -1669987 -1590310 -1534326 -1555913 -1500720 -1334300 -1397945 -1426460 -1430806 -1402493 -1324313
16339 -1324313 -1172819 -1061209 -1116197 -1066926 -1087511 -942927 -938989 -889646 -767863 -720787 -624684
16328 -624684 -713915 -681737 -550439 -525515 -488212 -525668 -590299 -567977 -433088 -392297 -260990
16317 -260990 -249711 -351953 -297654 -288941 -254125 -115758 25757 59677 52018 129552 116493
16306 116493 154075 123855 138449 203011 324341 402656 377922 396192 357847 407555 472790
$$ packed form
16383c072017Q3962J23015m2704q2191k520J13424m8007J65J67056J39542J00800
16372b519475O0179M8081j14534m8582R7498J54917Q5007R1024O2369l0490o015
16361b120021O8106J2665L3674J96026Q3858j01960j0325N4891n3O3881O7967
16350a651291j8696P9677N5984k1587N5193J66420o3645k8515m346K8313P8180
16339a324313J51494J11610n4988M9271k0585J44584L938M9343J21783M7076R6103
16328f24684q9231L2178J31298K4924L7303l7456o4631K2322J34889M0791J31307
16317b60990J1279j02242N4299Q713L4816J38367J41515L3920p659P7534j3059
16306A16493L7582l0220J4594O4562J21330P8315k4734J8270l8345M9708O5235
$$ plain form
16295 472790 492173 560319 616411 657990 655935 695537 631666 656860 699761 814536 924134
16284 924134 951021 952768 905990 969636 1006999 1019307 1084362 1009608 982777 1068984 1175480
16273 1175480 1206646 1204606 1294962 1246053 1203758 1293360 1237835 1316794 1399336 1612357 1695684
16262 1695684 1599409 1590411 1642026 1623924 1610880 1729006 1698204 1673057 1841603 1896137 1787122
16251 1787122 1772050 1928367 1898024 1939135 1943855 1827741 1891724 1901531 1975747 2003891 2091316
16240 2091316 2141576 2208666 2218877 2303806 2371124 2338224 2280199 2295314 2306035 2478948 2379246
16229 2379246 2307338 2247873 2341895 2401877 2333429 2277860 2401783 2456123 2487788 2557943 2577886
16218 2577886 2652270 2659248 2598380 2805945 2737783 2699993 2723868 2869776 2799260 2788447 2955684
$$ packed form
16295D72790J9383O8146N6092M1579k055L9602o3871K5194M2901J14775J09598
16284I24134K6887J747m6778O3646L7363J2308O5055p4754k6831Q6207J06496
16273A175480L1166k040R0356m8909m2295Q9602n5525P8959Q2542K13021Q3327
16262A695684r6275q998N1615j8102j3044J18126l0802k5147J68546N4534j09015
16251A787122j5072J56317l0343M1111M720j16114O3983R807P4216K8144Q7425
16240B091316N0260O7090J0211Q4929O7318l2900n8025J5115J0721J72913r9702
16229B379246p1908n9465R4022N9982o8448n5569J23923N4340L1665P0155J9943
16218B577886P4384O978o0868K07565o8162l7790K3875J45908p0516j0813J67237
$$ plain form
16207 2955684 2947983 2784716 2823167 2942404 2840298 2745262 2868364 2787343 2796287 2905674 3003482
16196 3003482 2980330 2877335 3043035 2952129 2992198 2962066 2939530 2801498 2920261 2977603
16186 2977603 3006012 3154720 3033309 3107933 3253700 3133789 3148025 3202226 3066683 2993132
16176 2993132 3142200 3140475 3287969 3205516 3166015 3121153 3135201 3269123 3269846 3174739 3251417
16165 3251417 3255835 3389774 3444373 3378865 3361063 3311122 3301724 3335023 3289139 3396410 3540678
16154 3540678 3444683 3364238 3572859 3527894 3449062 3481040 3660620 3647524 3734261 3780874 3620542
16143 3620542 3416595 3407166 3528623 3585589 3776116 3614973 3573012 3520452 3455446 3428654 3563131
16132 3563131 3601351 3587818 3544192 3552383 3577528 3609772 3460163 3495429 3432967 3535223 3627773
$$ packed form
16207B955684p701j63267L8451J19237j02106r5036J23102q1021Q944J09387R7808
16196C003482k3152j02995J65700r0906M0069l0132k2536j38032J18763N7342
16186B977603K8409J48708j21411P4624J45767j19911J4236N4201j35543p3551
16176B993132J49068j725J47494q2453l9501m4862J4048J33922P23r5107P6678
16165C251417M418J33939N4599o5508j7802m9941r398L3299m5884J07271J44268
16154C540678r5995q0445K08621m4965p8832L1978J79580j3096Q6737M6613j60332
16143C620542k03947r429J21457N6966J90527j61143m1961n2560o5006k6792J34477
16132C563131L8220j3533m3626Q191K5145L2244j49609L5266o2462J02256R2550
$$ plain form
16121 3627773 3655250 3741286 3748163 3605901 3667220 3675664 3588277 3683298 3619260 3682230 3707071
16110 3707071 3712997 3616083 3714418 3783574 3773542 3721007 3721882 3659267 3735655 3742262 3699576 3773983
16098 3773983 3895458 3895227 3823666 3815242 3547619 3612119 3831775 3957148 3974831 3910691 3744710
16087 3744710 3724421 3792193 3708940 3751661 3829643 3854739 3849603 3836025 3758778 3700845 3708534 3689858
$$ packed form
16121C627773K7477Q6036O877j42262O1319Q444q7387R5021o4038O2970K4841
16110C707071N926r6914R8335O9156j0032n2535Q75o2615P6388O607m2686P4407
16098C773983J21475k31p1561q424k67623O4500K19656J25373J7683o4140j65981
16087C744710k0289O7772q3253M2721P7982K5096n136j3578p7247n7933P689j8676
$$ [...]
##END NTUPLES=NMR SPECTRUM
##END=
