##TITLE=1H_EC-3299(1)
 CDCl3
 8 sc, 
 1.8.2023
##JCAMPDX= 6.0         $$ Bruker NMR JCAMP-DX V2.0
##DATA TYPE= NMR SPECTRUM
##DATA CLASS= NTUPLES
##ORIGIN= UXNMR, Bruker Analytische Messtechnik GmbH
##OWNER= root
$$ XWIN-NMR		Version 3.5
$$ Wed Aug  2 14:19:48 2023 Russian Standard Time (UT+4h)  she@DPX200
##.OBSERVE FREQUENCY= 200.13135
##.OBSERVE NUCLEUS= ^1H
##.ACQUISITION MODE= SIMULTANEOUS
##.ACQUISITION SCHEME= undefined
##.AVERAGES= 8
##.DIGITISER RES= 18
##SPECTROMETER/DATA SYSTEM= spect
##.PULSE SEQUENCE= zg30
##.SOLVENT NAME= D2O
##.SHIFT REFERENCE= (INTERNAL, D2O, 0, 15.7854)
##AUDIT TRAIL= $$ (NUMBER, WHEN, WHO, WHERE, WHAT)
$$ ##TITLE= Audit trail, XWIN-NMR		Version 3.5
$$ ##JCAMPDX= 5.01
$$ ##ORIGIN= Bruker BioSpin GmbH
$$ ##OWNER= she
$$ F:/spectra/data/she/nmr/H-F/1/pdata/1/auditp.txt
$$ ##AUDIT TRAIL=  $$ (NUMBER, WHEN, WHO, WHERE, WHAT)
(   1,<2023-08-02 14:18:39.51 +0400>,<she>,<DPX200>,
      <created by zg, POWCHK disabled, PULCHK disabled
       configuration hash MD5:
       00 E9 B6 7A A2 85 ED C7 34 08 36 98 17 FE 4E 26
       data hash MD5: 16K
       A0 C4 AD 19 D0 CB B0 85 54 32 ED 3D 3D F8 AF D1>)
(   2,<2023-08-02 14:18:42.26 +0400>,<she>,<DPX200>,
      <Start of raw data processing
       efp BC_mod = 2 LB = 0.24 FT_mod = 6 PKNL = 1 PHC0 = -21037.51 PHC1 = 11.45272 SI = 16K 
       data hash MD5: 16K
       CC 31 23 42 8F 50 4E C0 F9 88 E7 1B B3 63 4F F4>)
(   3,<2023-08-02 14:19:06.90 +0400>,<she>,<DPX200>,
      <pk PHC0 = -2.106419 PHC1 = 2.6 
       data hash MD5: 16K
       6D 4B B0 8D 38 81 FC CA 81 7B A7 2C 48 C1 80 2B>)
(   4,<2023-08-02 14:19:10.42 +0400>,<she>,<DPX200>,
      <abs ABSG = 5 
       data hash MD5: 16K
       1A 33 60 CD 2B A3 35 B9 1F 45 C8 46 BC BD 1A 00>)
$$ ##END=
$$ 
$$ hash MD5
$$ A7 79 0E F2 39 FF E5 C5 24 CE DC 36 AB 82 0F 4A
##$RELAX= 
##$RELAX= 
##$RELAX= 
##$RELAX= 
##$RELAX= 
##$RELAX= 
$$ Bruker specific parameters
$$ --------------------------
##$DU= <F:/spectra>
##$EXPNO= 1
##$NAME= <H-F>
##$PROCNO= 1
##$TYPE= <nmr>
##$USER= <she>
##$AMP= (0..31)
100 100 100 100 100 100 100 100 100 100 100 100 100 100 100 100 100 100 
100 100 100 100 100 100 100 100 100 100 100 100 100 100 
##$AQSEQ= 0
##$AQ_mod= 1
##$AUNM= <au_zg>
##$AUTOPOS= <>
##$BF1= 200.13
##$BF2= 200.13
##$BF3= 200.13
##$BF4= 200.13
##$BF5= 200.13
##$BF6= 200.13
##$BF7= 200.13
##$BF8= 200.13
##$BYTORDA= 1
##$CFDGTYP= 0
##$CFRGTYP= 5
##$CHEMSTR= <none>
##$CNST= (0..31)
1 1 145 1 1 1 1 1 1 1 1 1 1 1 1 1 1 1 1 1 1 1 1 1 1 1 1 1 1 1 1 1 
##$CPDPRG= <>
##$CPDPRG1= <>
##$CPDPRG2= <>
##$CPDPRG3= <>
##$CPDPRG4= <mlev>
##$CPDPRG5= <mlev>
##$CPDPRG6= <mlev>
##$CPDPRG7= <mlev>
##$CPDPRG8= <mlev>
##$CPDPRGB= <>
##$CPDPRGT= <>
##$D= (0..31)
0 1.2 0 0 0 0 0 0 0 0.06 0 0.03 0 0 0 0 0.0002 0 0 0 0 0 0 0 0 0 0 0 0 
0 0 0 
##$DATE= 1690971518
##$DBL= (0..7)
120 120 120 120 120 120 120 120 
##$DBP= (0..7)
150 150 150 150 150 150 150 150 
##$DBP07= 0
##$DBPNAM0= <>
##$DBPNAM1= <>
##$DBPNAM2= <>
##$DBPNAM3= <>
##$DBPNAM4= <>
##$DBPNAM5= <>
$$ [...]
##$SUBNAM3= <"">
##$SUBNAM4= <"">
##$SUBNAM5= <"">
##$SUBNAM6= <"">
##$SUBNAM7= <"">
##$SUBNAM8= <"">
##$SUBNAM9= <"">
##$SW= 18.05172834244
##$SWIBOX= (0..15)
0 0 2 0 0 0 0 0 0 0 0 0 0 0 0 0 
##$SW_h= 3612.71676300578
##$TD= 16384
##$TD0= 1
##$TE= 0
##$TE2= 300
##$TE3= 300
##$TEG= 300
##$TL= (0..7)
0 120 120 120 120 120 120 120 
##$TP= (0..7)
150 150 150 150 150 150 150 150 
##$TP07= 0
##$TPNAME0= <>
##$TPNAME1= <>
##$TPNAME2= <>
##$TPNAME3= <>
##$TPNAME4= <>
##$TPNAME5= <>
##$TPNAME6= <>
##$TPNAME7= <>
##$TPOAL= (0..7)
0.5 0.5 0.5 0.5 0.5 0.5 0.5 0.5 
##$TPOFFS= (0..7)
0 0 0 0 0 0 0 0 
##$TUNHIN= 0
##$TUNHOUT= 0
##$TUNXOUT= 0
##$USERA1= <user>
##$USERA2= <user>
##$USERA3= <user>
##$USERA4= <user>
##$USERA5= <user>
##$V9= 5
##$VALIST= <valist>
##$VCLIST= <CCCCCCCCCCCCCCC>
##$VD= 0
##$VDLIST= <DDDDDDDDDDDDDDD>
##$VPLIST= <PPPPPPPPPPPPPPP>
##$VTLIST= <TTTTTTTTTTTTTTT>
##$WBST= 1024
##$WBSW= 4
##$XGAIN= (0..3)
0 0 0 0 
##$XL= 0
##$YL= 0
##$YMAX_a= 353809
##$YMIN_a= -338780
##$ZGOPTNS= <>
##$ZL1= 120
##$ZL2= 120
##$ZL3= 120
##$ZL4= 120
##$ABSF1= 15.75019
##$ABSF2= -2.30166
##$ABSG= 5
##$ABSL= 3
##$ALPHA= 0
##$AQORDER= 0
##$ASSFAC= 0
##$ASSFACI= 0
##$ASSFACX= 0
##$ASSWID= 0
##$AUNMP= <proc_1d>
##$AZFE= 0.1
##$AZFW= 0.1
##$BCFW= 0
##$BC_mod= 2
##$BYTORDP= 0
##$COROFFS= 0
##$CY= -3
##$DATMOD= 1
##$DC= 0
##$DFILT= <>
##$DTYPP= 0
##$F1P= 0
##$F2P= 0
##$FCOR= 1
##$FTSIZE= 16384
##$FT_mod= 6
##$GAMMA= 0
##$GB= 0
##$INTBC= 1
##$INTSCL= 3.70164e-10
##$ISEN= 128
##$LB= 0.24
##$LEV0= 0
##$LPBIN= 0
##$MAXI= 10000
##$MC2= 0
##$MEAN= 0
##$ME_mod= 0
##$MI= 1.114404
##$NCOEF= 0
##$NC_proc= -5
##$NLEV= 6
##$NOISF1= 3.799351
##$NOISF2= 2.8
##$NSP= 0
##$NTH_PI= 0
##$NZP= 0
##$OFFSET= 15.78545
##$PC= 1
##$PHC0= -21039.62
##$PHC1= 14.05272
##$PH_mod= 1
##$PKNL= yes
##$PPARMOD= 0
##$PSCAL= 0
##$PSIGN= 0
##$REVERSE= no
##$SF= 200.129997214983
##$SI= 16384
##$SIGF1= 3
##$SIGF2= 2
##$SINO= 5.538805
##$SIOLD= 16384
##$SREGLST= <1H.CDCl3>
##$SSB= 0
##$STSI= 16384
##$STSR= 0
##$SW_p= 3612.71676300578
##$SYMM= 0
##$S_DEV= 0
##$TDeff= 16384
##$TDoff= 0
##$TI= <>
##$TILT= no
##$TM1= 0
##$TM2= 0
##$TOPLEV= 0
##$USERP1= <user>
##$USERP2= <user>
##$USERP3= <user>
##$USERP4= <user>
##$USERP5= <user>
##$WDW= 1
##$XDIM= 16384
##$YMAX_p= 270499409
##$YMIN_p= -166668
$$ End of Bruker specific parameters
$$ ---------------------------------
##NTUPLES= NMR SPECTRUM
##VAR_NAME=  FREQUENCY,     SPECTRUM/REAL,   SPECTRUM/IMAG
##SYMBOL=    X,             R,               I
##VAR_TYPE=  INDEPENDENT,   DEPENDENT,       DEPENDENT
##VAR_FORM=  AFFN,          ASDF,            ASDF
##VAR_DIM=   16384,         16384,           16384
##UNITS=     HZ,            ARBITRARY UNITS, ARBITRARY UNITS
##FACTOR=    0.220516191357247, 1,           1
##FIRST=     3159.14206087276, 0,            0
##LAST=      -453.574702133016, 0,           0
##MIN=       -453.574702133016, -166668,     0
##MAX=       3159.14206087276, 270499409,    0
$$ Real data points
##PAGE= N=1
##DATA TABLE= (X++(R..R)), XYDATA
$$ [...]
10540 2384 -37999 -31840 -29594 3572 -5521 -52059 -33384 -28753 -16247 666 8834 1243 -843
10527 -843 -19544 -4438 -24622 -20854 -22419 -26106 -21167 5073 21397 -10931 -25558 23598 17151
10514 17151 10430 -17409 -6721 -162 -40397 4900 -2281 -3480 -8614 -20709 -15954 19635 15960
10501 15960 -29954 -1740 41492 24875 21371 -12454 -542 12016 -8621 -1866 18515 -5727
10489 -5727 238 37104 32708 -5112 16150 30271 14736 -11813 2255 9653 -24271 -32829 -9221
10476 -9221 48127 6519 -34785 5263 -10157 -25971 -43167 -28652 -42827 -54605 -69117 -36921
10464 -36921 -30713 -46328 294 4191 -15743 -10095 -24736 3680 22883 40008 4846 -34114
10452 -34114 -13279 22404 20721 9632 16141 -3119 -3406 9825 33938 5902 -3852 -12953 37262
10439 37262 34579 -29339 -36765 -38610 -33473 -22907 -27962 -39047 -42374 -10721 -18825 -41188 -55357
10426 -55357 -33509 4118 32156 2429 -40093 -55316 -27338 10568 6855 -7500 8888 10914
10414 10914 -13225 -41000 4390 -576 -13736 -25345 15494 122 -46068 -18657 -14259 -6335
10402 -6335 1344 -6365 -50038 -20838 16890 57292 27096 -19578 -4278 -1082 6263 -8979 -37208
10389 -37208 -25595 32139 55367 20308 5950 4573 -22735 -26688 -39538 -6446 11556 -10863
10377 -10863 -11542 -5073 38565 40253 -13021 -50424 -20394 -12982 12059 38159 8402 -3380 -35659
10364 -35659 -9412 7194 4003 17043 17424 -20519 -53638 -24765 -7664 -3710 16309 16308 -7218
10351 -7218 -38141 -20217 22003 22039 8577 8416 -7163 -26270 -12685 -3390 1849 -18842 -32678
10338 -32678 -12560 782 8837 -12235 -3642 10773 -41655 -25850 -14050 -53884 -30004 -40459
10326 -40459 -4657 2355 -11775 -11916 -9660 -23284 -256 -18187 -34075 7409 -11412 -16266 1456
10313 1456 15457 15084 -7534 -11699 -34712 -64173 -26902 -27434 9561 19103 15218 19744 -6334
10300 -6334 -29292 -10758 -73108 -42904 -5838 -10769 -4437 -12992 -46754 -38950 5251 -11125 -15899
10287 -15899 20201 27038 36913 25942 49699 8855 -9610 -862 -17303 33215 15405 -4434
10275 -4434 -10888 -12081 -18936 -33892 -46371 -13964 17067 17766 4384 -23851 -8973 -30358 -32085
10262 -32085 -15680 -6351 -10265 -9482 -29323 3055 18139 -12702 -16395 -5967 13534 24254 -4331
10249 -4331 -2566 7050 -692 -4650 68 -10030 -7239 -20951 -22626 -1125 -37065 -31094 -32779 670
10235 670 28871 14438 -13924 -26836 1299 23770 8825 -12511 2335 28204 23896 16416
10223 16416 -21799 -29568 -13352 27691 -8530 -10723 -8024 -10530 -34065 -49412 -70844 -25413
10211 -25413 -37881 -32690 -26512 -23034 -1624 5717 14947 2101 -465 -24348 -34884 -41603 -54027
10198 -54027 -31832 3801 -38639 -29371 -23565 -28760 43194 57732 9607 15782 35644 19846
10186 19846 -667 10673 12595 -4069 -23617 -11709 -13015 -6941 -4654 5134 -43435 -13253 12634
10173 12634 6914 33759 28237 -1140 -7326 15973 42846 33470 20468 -16291 -43441 -28011
10161 -28011 14051 17241 55275 25733 -43560 -34728 -33425 -5569 10211 -10383 -1181 23510
10149 23510 4537 14869 20538 32935 20468 5469 -16937 13582 -29250 -22188 -8077 25112
10137 25112 39357 14602 8810 3440 18293 27959 1643 14592 25799 -27644 -43536 -12054
10125 -12054 31246 46539 26689 -6356 -6419 900 -16219 -6457 -32084 -25667 621 -23158 -30244
10112 -30244 -14099 -23754 7647 27946 -2836 4751 12795 1798 -9330 2451 -16228 -23462
10100 -23462 64902 38637 25193 15269 -31061 2031 -4061 1478 1368 33336 10450 9070 -11240
10087 -11240 13156 15875 23693 6494 9065 4470 -10664 24460 43997 47764 25533 12675 9514
10074 9514 14594 11120 25611 17629 -504 -10214 20146 38430 15480 -11178 1054 4980 10241
10061 10241 35311 20944 -21799 -44460 2763 -6580 5622 7237 29837 24970 -4994 5511
10049 5511 29707 -5791 707 -2385 23776 65450 91636 66350 3749 51065 57529 29011
10037 29011 9697 34888 40931 54291 42114 13618 13774 43666 27184 33789 59474 43766
10025 43766 38804 6259 14732 26748 12782 -9220 17443 11893 -3360 8785 -15759 -5688
10013 -5688 27791 25382 24213 23924 13971 -2643 13046 40560 3211 42135 29212 -13775 29043
10000 29043 37579 25582 -19238 -19657 4009 32287 28582 21071 22372 11771 57147 45624 36042
9987 36042 25233 33471 4782 -17507 53857 41455 -1252 2620 -15167 -6753 -9169 26173 5069
9974 5069 11595 43626 23872 16501 17224 -12272 13804 38012 11490 605 -6307 6779 37473
9961 37473 2453 37052 36101 32437 47072 46258 64762 31677 38027 28283 -2695 29819 33594
9948 33594 30182 61392 20950 33962 57445 43040 20035 55444 32690 19647 40313 30431
9936 30431 6249 18999 32513 19976 15744 51156 53477 40724 30615 45283 50813 27745
9924 27745 19523 49278 41115 41957 19992 21283 74776 49698 26497 6706 52873 43631 56642
9911 56642 26849 -4805 15400 49948 56937 52325 34790 69358 77459 51754 49707 47431 17189
9898 17189 -2812 620 38892 51462 48455 63518 42436 57115 46709 30161 57150 41531
9886 41531 34642 48975 23290 13374 30047 75039 71288 72529 66979 72584 62397 66148 57760
9873 57760 22018 269 46518 69922 61174 62175 15635 40161 41646 44618 59006 58838 39415
9860 39415 46109 70932 78275 54160 43101 78165 64837 80526 78807 73672 51653 83349 104187
9847 104187 106413 108123 106155 105390 84060 98516 85010 71147 93026 90368 61862 64985 95602
9834 95602 98123 77835 47548 36668 44634 104344 127742 96507 116884 116140 112096 94128 61050
9821 61050 70338 42549 76738 92261 101418 87276 113812 106914 97956 89063 136145 124743 98067
9808 98067 131838 157568 171792 176053 195246 172372 198031 220571 244094 202479 208150 193283
9796 193283 172036 183775 189993 133397 127670 121511 139055 111366 132594 152039 125509 141510
9784 141510 165630 171665 133816 135046 180362 209954 173248 154856 185643 215329 215473 234492
9772 234492 197097 251929 290320 291223 297101 284237 328102 351760 342089 343381 342896 343502 343206 336334
9758 336334 301028 268674 275016 284774 288185 276314 284864 257473 267259 288143 250436 260859 302281
9745 302281 328891 321774 326433 340942 323722 290322 258959 260999 240253 228171 245346 225739
9733 225739 200161 196334 178445 158784 156724 177110 180551 146433 170900 154581 145664 163307
9721 163307 172847 166196 153319 172317 184186 182310 158813 198248 149931 134164 113005 117472
9709 117472 115319 154906 167948 185083 185557 149066 126201 143100 143739 115381 108281 105975 100013
9696 100013 109556 114563 87935 56134 69804 92332 70897 77978 80174 113139 118240 134483 85932
9683 85932 80319 89154 122884 109881 111252 160761 126047 88534 84138 105878 118064 111283 89857
9670 89857 95616 94387 122109 133972 80749 89595 119765 120122 125129 116276 123928 167613 112796
9657 112796 82609 142991 127047 130110 125911 148514 136424 148985 142178 118015 158011 128824
9645 128824 134007 174659 218044 192379 181961 180235 168830 165318 187581 195650 210552 205198 182049
9632 182049 161786 189954 207546 191307 199275 205743 197647 181680 162472 168408 188698 200440
9620 200440 212565 231787 214019 233267 216114 223823 246119 248697 251936 247029 256618 233355 226829
9607 226829 200610 193045 206768 237477 273650 233307 277759 295084 304238 315337 306993 315799
9595 315799 317943 340415 323065 356407 379673 427104 453955 484628 485620 547469 598040 610641
9583 610641 628077 671584 689070 683260 669417 597275 533326 482299 474073 439147 398582 392252
9571 392252 376421 347054 343416 360320 361338 388621 378311 365095 369901 362989 399420 402646 400719
9558 400719 393776 417590 425455 451842 444949 441232 450428 444905 438682 429534 423510 431012 409439 384840
9544 384840 406921 394562 401874 388809 378040 415219 481160 499443 516822 533690 541978 561462
9532 561462 590722 607331 661828 699493 744666 813105 887667 874252 829179 800996 794589 715752
9520 715752 674847 645496 595818 565682 538247 554372 549701 525307 532163 490639 481238 496940
9508 496940 501320 536500 536055 537219 514888 495192 496797 490633 500364 482687 488888 506667 521109
9495 521109 539466 539173 555428 545125 520828 558549 525769 490376 528901 519047 542676 558772
9483 558772 552125 522851 524370 518248 512557 542561 584955 569777 588643 562821 564403 581903 586939
9470 586939 565856 604883 604507 617296 643430 646420 707267 701160 702228 709180 740781 773751 778042
9457 778042 788729 754936 770566 791649 813892 831428 880727 880020 859922 847407 867322 878747
9445 878747 864886 870305 912652 913739 938277 960833 979464 1008384 1020657 1054867 1082238 1112781
9433 1112781 1140610 1158808 1144496 1186888 1234063 1242497 1282574 1317303 1340020 1404326 1423088 1454897
9421 1454897 1464876 1527896 1564579 1654449 1745838 1803629 1826180 1869146 1886599 1919531 1948521 1986191
9409 1986191 2008242 2040604 2077147 2118014 2156496 2218163 2254716 2273519 2336801 2396342 2486866
9398 2486866 2553467 2578149 2612466 2639195 2646476 2712248 2766690 2863622 2956289 2989752 3089024 3177837
9386 3177837 3301177 3406042 3525149 3631423 3717960 3798831 3887282 4039494 4229959 4391515
9376 4391515 4495398 4648937 4817431 4946747 5111106 5313466 5502679 5700532 5958352 6190452
9366 6190452 6424257 6647489 6880753 7143542 7413088 7736680 8015467 8324764 8661126 9045213
9356 9045213 9449147 9907602 10382159 10893012 11495524 12145352 12841947 13663923 14540311 15625295
9346 15625295 16813253 18200330 19753728 21486637 23456067 25644194 28056136 30702408
9338 30702408 33518323 36415161 39273566 42014199 44485476 46477131 47854565 48414844
9330 48414844 48186270 47044216 45107327 42503115 39428999 36105723 32675746 29404999
9322 29404999 26347038 23567031 21129152 18947901 17114029 15518727 14121313 12925525
9314 12925525 11890868 10993971 10212624 9485973 8876371 8335704 7831884 7406041 6978456
9305 6978456 6634145 6311179 6007027 5716609 5502460 5274490 5072625 4900394 4699535 4522786
9295 4522786 4348581 4223392 4059032 3909655 3755245 3604900 3465930 3351923 3211138 3130516
9285 3130516 2994532 2909483 2816404 2681013 2652927 2573891 2456811 2389786 2321840 2221301 2158376
9274 2158376 2068830 2030718 1917033 1867295 1806014 1784373 1735025 1683493 1659579 1617727 1546546
9263 1546546 1504220 1485257 1448604 1397342 1308788 1321683 1297084 1274741 1265088 1203899 1186852 1155925
9251 1155925 1082357 1066338 1053674 1046386 1036138 1007598 993272 1016508 956133 926553 937727 899989
9239 899989 872500 851628 836976 826581 802238 765284 733312 700451 712945 691885 734380 702991
9227 702991 698922 663638 630175 654256 601624 568117 547621 553427 528960 537550 503186 525060
9215 525060 507902 525326 505785 540940 580457 546948 489342 452211 478920 485180 516537 506155
9203 506155 517199 488273 477242 497594 471438 454524 474976 473895 443844 470645 470336 496196
9191 496196 474368 448515 427658 427544 469055 469640 488938 503971 507269 489195 504703 457400 429421
9178 429421 465907 468102 509205 530340 615093 687487 718142 663212 587804 553897 475197 425553
9166 425553 437582 415377 387522 397400 350785 365082 377946 342740 326360 307778 334707 336646
9154 336646 329583 356715 384306 390761 359240 326519 326925 320556 330412 324245 337026 336020 359169
9141 359169 307881 312193 321353 280651 305365 305118 295131 303556 287988 273051 279100 316579 317613
9128 317613 304803 289870 307501 322869 294281 278005 250596 269851 291789 305280 269819 286699
9116 286699 317891 307016 300453 326960 290659 274625 279835 308026 312427 311024 318029 324108 294478
9103 294478 309726 317204 318363 308402 330755 327119 324493 294090 297846 325103 288465 320253 325666
9090 325666 325259 342063 325292 305245 293755 302070 305468 356349 326467 304355 306995 311557 273186
9077 273186 329556 309873 279064 282683 294824 305231 330244 318099 312391 300933 272569 263746
9065 263746 262300 270427 295836 267038 278871 303456 280449 299212 295244 322908 310565 324180
9053 324180 318134 310843 322570 335637 352064 367719 357601 319456 328664 339861 338885 314195 307443
9040 307443 340974 322359 342109 353281 336897 309482 362352 351755 342136 377711 387065 367546
9028 367546 320472 299476 307067 295984 328410 300417 338262 307732 308967 298390 319688 364523
9016 364523 363662 381940 409963 414569 388765 392924 421668 425256 384876 379423 384810 411382 414740
9003 414740 383484 384636 360776 389373 387773 375087 375916 379220 397964 421522 436334 458785 426883
8990 426883 403513 368466 387330 417368 363609 362874 404965 411621 443839 453219 454372 458424 470788
8977 470788 471587 442425 467385 500282 451049 441754 457748 446284 435716 442247 446479 450344 461831
8964 461831 479288 461024 440705 497648 462601 455275 476494 462252 440086 407462 430979 491106
8952 491106 499362 507216 472453 445331 442907 482948 497827 480575 483227 493413 495878 467864 467236
8939 467236 460652 483205 504820 517977 496977 517615 511005 453540 497354 522256 522326 515909 526202
8926 526202 536819 543606 536902 570163 576958 611929 598905 585716 616809 614218 615038 619952 616220
8913 616220 645364 641687 619853 633472 680602 701634 681799 692811 725605 793840 819713 824904
8901 824904 862457 863129 856913 852771 919455 918417 929369 949894 968969 1003242 1002174 990514 1016081
8888 1016081 1040985 1028949 988157 971197 1034864 1062471 1029962 1015341 1000283 1009518 981360 990605
8876 990605 981427 961202 935795 916840 907076 861378 839669 817126 852366 859785 818995 821051
8864 821051 816203 831687 821767 827704 846291 808546 834332 897632 910987 920292 902293 891855
8852 891855 941648 1000297 1016784 1021777 1054014 1084658 1071298 1067991 1053342 1036936 1034065 1041986
8840 1041986 1075991 1101855 1104044 1105963 1096628 1154260 1120455 1109614 1103954 1085572 1070615 1114860
8828 1114860 1136831 1132370 1149396 1178381 1195940 1201308 1239624 1247044 1248929 1253555 1264362 1289368
8816 1289368 1297076 1332710 1311352 1302412 1332569 1342096 1404419 1416483 1425471 1458499 1473394 1524286
8804 1524286 1500790 1471884 1490357 1453792 1455796 1477499 1494220 1482009 1530126 1542299 1565920 1564606
8792 1564606 1592674 1607416 1646306 1632475 1678111 1699646 1752189 1794584 1857544 1853440 1913354 1951228
8780 1951228 2010535 2000871 2049947 2065172 2082224 2135376 2168020 2190911 2234582 2241474 2245653 2251960
8768 2251960 2312138 2314716 2325860 2256315 2239473 2284506 2306297 2309447 2323956 2264038 2248052 2272362
8756 2272362 2262685 2265461 2301880 2337668 2410149 2463404 2549157 2561096 2602241 2659930 2664744 2713747
8744 2713747 2774990 2863455 2919838 2968870 3045491 3162998 3214486 3250295 3377009 3512227 3654057
8733 3654057 3758943 3909402 4035266 4198788 4360544 4500499 4625367 4785184 4942584 5095060
8723 5095060 5224245 5396260 5539169 5759625 6022238 6223407 6461259 6779768 7168085 7616942
8713 7616942 8184763 8854671 9695974 10677959 11764536 12947443 14390900 16194335 18496799
8704 18496799 21537551 25759930 31944543 41086753 51601807 59382812 55075004 44455748
8696 44455748 34178294 25804405 20445487 16614643 13979046 11911780 10387647 9167881
8688 9167881 8262628 7537690 7010801 6485794 6084228 5722610 5381007 5005297 4747111 4512152
8678 4512152 4332385 4124423 3986526 3822986 3690730 3519004 3422173 3318521 3196532 3093648
8668 3093648 3025410 2952006 2893274 2796331 2754522 2663616 2625036 2511151 2444217 2352376 2345904
8657 2345904 2302521 2296742 2214441 2192159 2165122 2158220 2063337 2045204 2014097 1999233 1952315 1913611
8645 1913611 1861869 1852382 1830300 1774823 1740740 1709868 1708725 1662998 1625057 1605678 1582037 1565956
8633 1565956 1526347 1534903 1490826 1499321 1499033 1503660 1479114 1450937 1440043 1486669 1477101 1480884 1531437
8620 1531437 1542588 1522261 1535333 1505529 1453658 1400330 1365801 1379398 1365677 1374291 1346662 1309116
8608 1309116 1294750 1290077 1283110 1262367 1285377 1246478 1238781 1258734 1252479 1213418 1224088 1268808
8596 1268808 1249111 1289330 1284354 1226552 1208672 1201097 1223407 1214268 1216854 1202685 1219413 1247326
8584 1247326 1213981 1214311 1207837 1225684 1195540 1182356 1088904 1077179 1191507 1183124 1162685 1176777
8572 1176777 1212987 1208697 1187261 1195739 1222417 1261414 1289716 1302896 1382466 1396685 1378498 1425849
8560 1425849 1414093 1400905 1380446 1335250 1348756 1352487 1360577 1372015 1427873 1426135 1363379 1378173
8548 1378173 1363526 1379080 1339045 1355615 1368913 1410823 1399511 1401800 1409918 1408796 1427799 1450317
8536 1450317 1432909 1478228 1493192 1458790 1444886 1420337 1362894 1323477 1252645 1243995 1241902 1194070
8524 1194070 1135658 1131039 1096398 1077894 1056607 1048641 1069733 1043351 1003676 971648 989739 983231
8512 983231 998627 979982 945220 942573 920790 932109 911723 921060 893012 874619 832977 822586
8500 822586 779401 766240 796897 783282 775475 743541 746742 730706 726568 742087 745607 760072
8488 760072 768194 788422 790493 773638 776944 747983 724270 741494 752737 707148 715420 718321 694876
8475 694876 676420 668272 667540 708097 718249 742607 735776 732805 763502 745836 736154 717265 723477
8462 723477 686048 699715 708066 668954 696055 662863 669457 680214 684306 686722 671012 648838
8450 648838 592889 597496 587605 598096 626303 625524 574209 590358 584828 578993 573902 585855 603706
8437 603706 574218 573166 586261 599442 576918 600602 576078 587431 568459 569141 585837 524794
8425 524794 575283 558831 530309 555952 514149 542102 594974 583652 585177 588934 625826 619758
8413 619758 588494 593255 598602 565700 509734 538085 543178 548129 568722 573097 572719 525926 497655
8400 497655 498407 503349 533738 502607 506315 500740 516720 506169 496658 461337 474972 475683 482342
8387 482342 509745 548541 550696 572142 564130 570693 612678 622141 612683 654455 628111 618495 576632
8374 576632 523093 560206 558580 524751 517221 498335 447775 419864 406715 446943 440063 411015
8362 411015 391084 395504 433708 423589 377770 368937 392455 406948 371917 368103 386329 388679
8350 388679 375004 350034 342343 340037 359246 354705 366509 367552 384344 404047 393437 375331
8338 375331 377728 398665 390068 363488 331850 300432 324406 311636 286251 288900 278996 295715
8326 295715 282374 290626 262460 271589 296066 296599 265111 268520 258016 232515 251404 265280 252274
8313 252274 239717 244748 261773 265233 270805 251043 245805 238913 249810 229708 210991 251091 254786
8300 254786 240487 244838 239147 225534 230570 198529 162138 209997 204465 189137 200662 220273
8288 220273 189939 236038 261664 243677 227273 210251 210984 220534 212195 238336 216193 212943 230230
8275 230230 260670 261856 254158 228315 221825 239483 208465 227403 222809 214923 242795 251231 268848
8262 268848 264224 281805 278468 229255 223171 259633 258383 250055 278179 244465 240366 243946 252278
8249 252278 264600 258955 222250 197905 216836 246481 259224 210367 191284 223511 216237 208666
8237 208666 233264 224785 241750 252573 203519 214920 256778 263981 254814 272087 294562 318369
8225 318369 336197 384819 437882 489237 504741 487603 409124 393598 338674 312081 327225 296532
8213 296532 281084 257592 198264 219881 224659 223000 189100 182397 190381 215149 255832 247266 239280
8200 239280 275552 307050 299661 275740 252730 309959 326199 312650 -89502 -100193 133842
8189 133842 138108 151370 171805 182503 132199 122013 136194 156997 92308 143300 195114 198572
8177 198572 173210 148589 136784 160056 141933 140970 152851 156184 145957 156821 148777 159614
8165 159614 187794 192483 242969 247507 253256 266765 237653 223153 239061 208123 206281 202112 186361
8152 186361 180359 164428 159458 211368 214139 187613 197339 211689 226059 230108 199990 173833 221361
8139 221361 208146 241000 218736 167814 153970 181301 156300 171456 174240 181260 192957 199978
8127 199978 196665 183036 157695 169215 188685 193111 218114 218664 187288 166934 167805 178706 161831
8114 161831 139975 144159 130508 115407 119464 118158 99599 127537 140620 125320 92512 91936 104955
8101 104955 105730 140933 152012 140138 104331 83338 81974 93333 138586 145536 170406 136378
8089 136378 123732 109649 128136 94902 72474 93051 68468 73496 106716 89262 69669 70456
8077 70456 90887 90923 108150 86022 96030 73324 59248 67133 80897 87688 99079 101811 114982
8064 114982 68731 69193 43430 26691 53158 65546 71909 50072 64075 66667 49665 23505
8052 23505 87102 108243 98737 112131 83172 93338 124591 90147 58523 59604 81246 47781
8040 47781 95040 99323 91884 94822 86515 86773 27139 28827 17351 33832 32336 39136 51129 35168
8026 35168 61551 66502 9806 -1672 16022 31206 23786 28328 33191 12054 -4700 12172 38566
8013 38566 61727 43701 20664 43058 32999 20455 14123 11305 27720 12629 3284 24364
8001 24364 31517 15369 42479 55397 38707 22449 38071 42194 13685 -3643 2700 38548
7989 38548 42654 31742 18391 -25065 13103 -12345 -2681 47710 10316 -1793 2838 31885
7977 31885 3196 7963 -5371 9173 -10250 21437 16725 15613 18321 14834 30772 29168 -19789
7964 -19789 7384 62313 17040 -941 29823 5253 2897 4187 11768 36940 63681 38750
7952 38750 19063 -30880 -14000 10320 24722 27287 16311 -8729 -18175 19847 40580 13002
7940 13002 7702 33884 20071 25101 13331 30993 9445 -1893 -16618 -10181 2492 -16030
7928 -16030 7694 -704 28504 37662 11406 46776 33814 8815 -35585 -34411 -21895 -33665
7916 -33665 12927 12946 7755 3451 -3430 34862 36506 52331 59298 63187 64727 59297 52995 35518
7902 35518 18202 28355 55479 63103 8224 -14584 -186 603 30213 14214 12840 6812 23653
7889 23653 5324 -14875 24400 23308 11055 2820 4878 -2819 4470 1339 -24743 -22625 8368
7876 8368 39306 34590 9610 42655 12708 8720 -11811 -12011 -8580 -24219 -4193 -8327 -40909
7863 -40909 -14238 3683 19204 34714 20034 3584 32617 12010 -22902 16899 33434 -24768
7851 -24768 -59128 -48582 -20359 -7221 -50752 -50034 -40146 -21277 -24016 -26424 1290 -15405 -40678
7838 -40678 -8686 -127 2064 9691 -11754 41142 28908 -23699 -8181 -43737 -27568 -51498
7826 -51498 -54330 -309 3026 4768 -2860 30175 28747 -10539 23680 33975 10718 49560 10801
7813 10801 -24176 -11490 -28657 -46561 -21452 -4672 -125628 -166668 -70941 -41991 -36345 -25896
7801 -25896 -57083 -44806 -30015 -49997 -60903 -43823 -19163 -31236 603 20752 8677 502
7789 502 -74899 -87519 -39059 -16804 3110 20173 13270 -3510 -51953 -40338 -27580 -46246
7777 -46246 -29999 -26911 9950 15624 2274 -19779 -5041 -9866 -30703 -23461 -48781 -42302 -30722
7764 -30722 -52626 -30483 -33349 -31047 -10027 -29985 -71203 -60287 -52679 -44629 -19035 -11022 -8505
7751 -8505 -6399 -4442 1038 -16573 34478 37261 -30142 -29274 -7665 -7938 -1159 -8183 -26392 4602
7737 4602 -5906 935 15781 -3777 -4375 31840 59290 18807 -4822 4241 -11193 15684 40167
7724 40167 36660 38764 79654 81676 64174 62322 61258 24172 17872 -3745 13942 -25016 -27603
7711 -27603 16672 41038 8924 1994 42840 9674 71 -4082 10156 12246 -23578 -71120 -21048
7698 -21048 7737 -48875 -19520 -39798 -53225 -25643 47370 26315 15087 17111 -4324 10583
7686 10583 -6876 -4054 36322 12943 17918 21873 26144 -18056 -29947 -21497 -35435 22109 71027
7673 71027 115260 97246 76110 93184 128027 126723 80410 37279 29447 30300 15225 33659 29509
7660 29509 42053 78206 33219 -638 11454 31147 34783 49434 38606 50742 77202 74198
7648 74198 36396 -4793 -12950 8529 -17088 -16422 -21448 -20987 737 -24131 -11636 -12392 -6916 5869
7634 5869 -9293 14225 5617 11829 10584 17540 21449 1995 -20668 -10465 13464 48547 11308
7621 11308 46400 24350 -15625 -13414 5315 35883 25848 28103 -8443 -43641 -45121 -25267
7609 -25267 -26839 -24715 9197 -10524 -5509 -5377 -8872 -18482 -10156 -35198 -13242 -3934 -3040 -6557
7595 -6557 -40301 -37878 12692 10472 13044 -17971 -2129 13702 24326 34929 27719 51786 50695
7582 50695 52761 55707 55427 63235 32724 22525 36759 22037 32137 -4944 -64900 -53243 -17264
7569 -17264 16562 48753 51558 56064 3015 15207 5501 -19516 -34028 -23224 -38587 -34568 -51772
7556 -51772 -24970 -20585 -35863 -20612 -9963 1242 -5623 -9089 -18104 -7603 10644 778 -6203
7543 -6203 -13478 -24910 -21876 -1870 14522 20905 54699 57457 -17047 -9067 35128 41766 6171
7530 6171 26558 25057 -16402 -35214 39168 35449 27846 25286 25672 30158 14277 -17999 -41191
7517 -41191 -20992 17164 10674 17724 34104 60202 55663 17853 26241 -1282 11409 -9400 -28990
7504 -28990 -1462 17511 16902 4372 -8648 -16886 -17810 -34713 -4211 -8424 3923 39383 42740
7491 42740 -21790 2410 -8242 -17627 5837 -6303 16378 39002 25532 -12375 -8015 -4272
7479 -4272 12145 51510 49940 32288 10435 -14816 8007 2958 10170 6696 10499 21878 14033
7466 14033 19358 44633 37577 42590 49849 33078 32876 29817 26017 37372 40354 20847 14488 24485
7452 24485 26362 42258 17917 18050 48488 70764 51744 56410 67761 102952 71668 95560 72069
7439 72069 78299 83288 89688 89666 93059 91499 87224 47253 36577 76286 94867 94300 96046 93004
7425 93004 96372 76423 88484 97900 83277 126997 166919 137995 87746 131986 145368 134502
7413 134502 132939 143559 124727 101085 113157 74830 86204 116956 135971 157138 137532 179299
7401 179299 165598 153694 181536 150388 141604 126832 142323 133108 148541 174115 122223 113181
7389 113181 103885 91532 126740 111593 137673 144982 133994 126005 134107 148887 116757 149211
7377 149211 186251 165629 181309 196308 169183 148099 135312 141233 117705 145295 156913 148430
7365 148430 165635 139330 117165 127813 122340 162232 171286 148727 110303 135756 127420 125585
7353 125585 123287 155179 129366 113496 92728 91915 105716 124549 119103 106569 92737 81317
7341 81317 86824 101985 104550 115704 114892 122122 149574 143893 116152 102686 113274 127134 120402
7328 120402 98152 93769 93906 115719 100591 108010 122405 139538 123315 80364 86207 101536 71251
7315 71251 90626 127866 153426 145702 119550 68780 66272 84765 46695 64434 66265 45672
7303 45672 75972 59540 69481 84798 114911 119972 96690 74502 43230 40342 52605 58466 70392
7290 70392 83440 70059 55795 35649 81655 54211 41236 41380 45558 63418 43450 54570
7278 54570 93744 45952 58867 52390 49134 59083 70633 95693 83654 97142 99557 52787 40346
7265 40346 57812 87519 104692 69318 44823 56430 46774 78127 105349 78759 81320 44207
7253 44207 45186 31068 62541 46644 63364 3658 -8155 40571 67368 83443 52423 56584
7241 56584 98367 62646 94427 130947 145343 157791 187170 146658 111073 84090 54260 45367
7229 45367 62257 53949 47055 44584 35761 43588 74799 26106 29789 85534 50504 21397 11878
7216 11878 47454 28061 32092 78959 83694 91323 95572 83715 93717 74424 68488 42859 68305
7203 68305 99175 88723 58084 63993 113033 110235 88776 114501 113813 128076 118364 110391 124054
7190 124054 127052 55982 73223 95939 88745 119111 165464 163748 179699 170339 149603 86396
7178 86396 62849 71201 96797 99241 72282 88699 74122 109396 93578 77478 94192 42554
7166 42554 9612 9352 47915 95571 129091 107638 87322 119341 90552 64495 62683 72705
7154 72705 76257 102366 140846 118315 81729 75575 58702 99117 86969 86078 86743 99494 120431
7141 120431 136486 111907 123363 93826 73173 116861 107448 90592 109086 113728 90422 100861
7129 100861 101847 130823 141238 185723 157319 196474 141578 118299 82379 86641 138989 129729
7117 129729 145932 131719 156563 135697 141822 137339 135221 137158 143160 138203 138677 114735 118003
7104 118003 97906 97431 105284 117494 110547 113347 110485 119234 169455 174922 178893 176302 161442 156983
7090 156983 133573 112273 112200 138776 131468 130976 108243 75305 88756 108386 144790 147941 114296
7077 114296 80818 104572 120703 128173 126343 106981 123090 104067 84777 83601 87302 83416 52556
7064 52556 86343 113681 136678 108643 80144 161841 142097 101705 84656 75765 41706 54115
7052 54115 55897 11944 58710 65091 78707 98956 119868 121182 100067 78956 54300 80781
7040 80781 86470 71568 78839 34552 39473 36783 50099 42262 50228 61962 69525 71267 71517 75930
7026 75930 64752 83349 60194 35210 32556 28561 31930 30877 53858 79944 82430 82768 65520
7013 65520 96857 82414 88386 99525 84656 70416 50142 85951 61545 46108 25966 15035
7001 15035 63217 71261 70787 76279 39595 49637 42280 53479 79215 89383 76070 70167 62631
6988 62631 48282 70349 68393 92515 88230 75709 81351 79153 95718 138864 154553 132747 102080
6975 102080 109445 114703 103700 102723 95176 98797 100250 82663 116863 103446 81367 94434 77004
6962 77004 78385 101092 78112 95239 74345 61939 71975 72819 82094 73702 57413 44113 78145
6949 78145 64390 63328 82844 73890 103487 108503 101828 86419 82954 81855 99913 132516 143057
6936 143057 100590 130186 113274 109564 115556 81251 78295 67855 88137 105344 152209 150520
6924 150520 145632 137654 124316 109021 110592 96783 108756 73556 95902 83171 96230 103415
6912 103415 97720 114068 105309 88144 101872 112979 70811 68773 94313 127179 116287 96445
6900 96445 73330 93186 106026 106921 41292 63389 107772 115268 112441 110510 113859 95926 107364
6887 107364 91899 137474 117533 108962 126201 61660 58230 96269 97282 83922 109364 105884
6875 105884 64083 103055 115524 93338 92211 69198 101128 117820 123087 121982 68665 98395
6863 98395 87717 81488 130435 99535 92644 96515 60629 72654 83282 77623 121884 130646 111808
6850 111808 101527 111516 112867 95603 99772 99377 83087 132847 131427 100332 92400 90840 110906
6837 110906 96117 94526 107986 112594 93497 56439 77725 79120 65208 72334 78271 92053 82591
6824 82591 61083 78328 120731 104331 116780 110602 72216 70636 90462 71071 94852 82333
6812 82333 78542 83563 48433 52339 96866 99381 64422 74307 59089 61610 71748 127883 123214
6799 123214 77699 89120 85807 105053 92082 93186 87703 78325 99560 47703 70172 102696
6787 102696 74880 68664 51681 96491 82996 85986 96497 75862 79316 55550 72980 75770
6775 75770 84311 91428 114190 117605 76619 58264 95945 93678 70917 70912 71459 110591 144389 109442
6761 109442 137869 148548 112155 149403 145451 94498 99205 119796 118893 130786 109419 91152
6749 91152 81198 63075 69251 100580 104125 86925 83526 108340 93445 53036 43598 60488 78464
6736 78464 79807 108492 77634 70338 101209 114165 129137 115623 82113 94894 118053 77112
6724 77112 78375 82995 102983 86270 89978 84351 91005 108835 96581 129839 105381 65017 96516
6711 96516 98117 66126 55736 47285 86430 87962 90761 114669 119449 77673 87151 124584 133071
6698 133071 110897 113166 115294 123927 126316 158338 169327 169562 158237 132402 126617 133860 126311
6685 126311 122191 95114 79651 120877 122195 105228 129326 147309 109630 109007 144112 200831
6673 200831 167556 167342 176718 156035 128319 99752 110492 146948 152650 123145 116367 126921 118830
6660 118830 96147 83197 66986 82399 140342 161636 151214 130248 124561 117288 146175 124186
6648 124186 123895 115433 106658 122729 136017 142397 142166 150322 135629 127740 152151 142736 112361 129079
6634 129079 162266 158357 164638 174032 164472 189434 166549 166817 160946 170508 150253 138751 161191
6621 161191 180972 151396 154486 144476 107093 104862 107117 144737 184150 135811 82932 117881
6609 117881 140620 194401 198994 155072 142368 128604 113986 114646 116379 140186 160703 155304 169555
6596 169555 211320 192024 231583 201685 148652 193964 217987 202839 187730 175136 182498 150633
6584 150633 129857 120305 140756 184589 150216 157256 154458 131991 118393 176755 183298 166992
6572 166992 159668 159109 185628 183756 179367 175428 164061 223110 219156 250516 234710 211757 205609
6559 205609 250232 264520 249558 236391 220820 228186 229849 238506 214922 213735 248250 265320
6547 265320 232617 230878 207269 250975 264240 235829 205103 185868 205026 216531 198460 203058
6535 203058 194989 176384 195169 208346 194520 182319 195661 241741 237954 202811 191486 205343
6523 205343 242735 229544 203466 220085 245497 242459 235141 256100 259177 236039 242332 247389 267889
6510 267889 269368 217006 251734 274175 310575 310400 289495 264850 276959 281819 311278 295751
6498 295751 304436 350862 352316 340127 314760 336846 357543 373739 330015 342155 374719 409131
6486 409131 367146 364555 388794 377775 368312 371649 389984 373949 343565 314650 359333 356647
6474 356647 346653 340154 387775 384316 382808 417856 390260 371322 388920 379697 409641 439759 440404
6461 440404 435576 433770 459682 464475 471677 443508 482090 470952 459447 513449 492018 450771
6449 450771 441051 481251 505749 455275 505847 498673 498700 536991 521710 502261 484670 456279 425273
6436 425273 424907 466013 490731 504317 493783 515018 502815 529813 576191 575253 593043 614622
6424 614622 588911 563940 604209 616854 569484 566787 556091 596049 637964 627734 641168 674469
6412 674469 715844 745223 740163 765274 797776 722752 714477 647136 584363 561892 580542 591199
6400 591199 609032 639823 601112 619271 624811 571050 574936 609535 566673 557018 513488 496167
6388 496167 509720 516460 494933 436404 463504 458058 463271 472692 457309 431190 466590 473555 463798
6375 463798 473819 461114 444656 409975 427346 487772 460530 432686 476877 469866 417619 426115
6363 426115 419474 381757 389234 394706 375587 371785 394267 430190 416531 405975 431707 443322
6351 443322 461859 469551 466326 475869 476692 490243 496100 513881 530765 558671 544441 574282 587670
6338 587670 621505 693968 777469 815076 855155 967387 988160 942541 900232 826148 743751
6327 743751 726952 673682 649011 622105 611111 626394 589868 615394 634941 625140 642930 646666
6315 646666 677634 646690 631446 615673 539715 546156 540598 563317 576306 548197 542517 534151
6303 534151 531344 526697 569434 554285 545165 569442 553637 519867 494223 505270 516657 516426 519399
6290 519399 575379 579508 554262 565166 542882 533178 517769 536615 546198 525177 528382 529217 497513
6277 497513 513869 519650 540810 491542 474309 519226 500857 481234 504630 486805 471206 508241
6265 508241 512934 484727 496725 471618 479721 488016 456254 423668 390627 423587 417435 410130 432653
6252 432653 400481 401432 400912 369017 398420 412185 421096 411987 404087 420925 407825 399317 425068
6239 425068 443861 415782 361539 366407 382742 392439 426937 426340 435886 417491 453267 451791 449412
6226 449412 456700 450076 485974 516891 506084 484941 567504 580861 540785 501186 491808 489314
6214 489314 490851 493735 535598 509915 534614 558147 549437 569930 552114 536081 554518 541495
6202 541495 521497 504547 481054 472250 467904 497884 506702 460360 467902 505405 480772 495825
6190 495825 522095 506740 528205 582490 630339 649819 661042 682173 693044 705035 720889 729318
6178 729318 736551 714434 684824 669623 691899 697113 720822 743981 721751 705449 646472 602335
6166 602335 580123 575776 552721 529136 567491 525280 464473 480763 500280 535800 584690 573103
6154 573103 524243 549516 585304 623544 634405 628545 636045 637329 678515 715189 732401 717174
6142 717174 703002 729134 723941 751925 732702 732536 696512 690329 722617 710649 729262 695079
6130 695079 684411 685137 691029 709876 678363 659076 676654 678299 660868 720968 737948 731041 776026
6117 776026 848842 859592 862433 888717 911379 940144 946593 1018350 1028626 1026630 1050068 1112003
6105 1112003 1135704 1192785 1177474 1128727 1049178 973744 897696 832024 790908 726587 679440
6094 679440 652003 633457 633861 655370 659428 651483 612659 641684 643954 627613 646707 647768 646820
6081 646820 638332 629758 620639 614087 600744 571659 524860 554202 563915 521698 516545 521275 517827
6068 517827 495524 513692 473654 460665 410227 414351 422721 440975 476988 437951 446254 447225 422789
6055 422789 435609 428642 448863 437908 430345 428599 400232 442724 447503 435444 445537 448006 419567
6042 419567 417786 435134 454075 433220 413927 461761 485953 500756 469424 457263 477562 495564
6030 495564 489916 478114 507532 512961 514811 571824 547848 534922 524580 533764 539959 530447 545675
6017 545675 523615 517917 527001 509852 535167 558368 534955 498692 491594 471741 464585 467984 439671
6004 439671 461422 486283 471968 507982 548374 574710 585241 529168 519919 557449 595275 603973
5992 603973 584148 524186 514238 552893 568319 561406 543824 526548 517858 506208 560268 530071
5980 530071 511125 538451 566258 562361 554239 522771 520890 506537 508803 533526 567979 594802
5968 594802 595207 613997 614660 639437 661173 650713 655881 663047 696110 742174 741524 733316 671436
5955 671436 588460 624372 638449 668873 632825 609486 574911 574251 573032 597191 602776 580537
5943 580537 609667 636501 636949 614236 621858 646839 668564 679320 747615 718994 710645 705934 744023
5930 744023 786817 788524 773614 775863 753767 762184 736729 749834 768794 738388 745399 762852
5918 762852 752183 711317 732137 731453 677252 704853 716922 709119 692908 721549 706393 672542
5906 672542 652322 682317 694827 704662 718177 724244 707638 682944 672781 683472 711297 728276
5894 728276 753440 759284 778392 809081 801961 811789 821450 792914 742510 756486 783680 730600
5882 730600 752410 770956 776204 760109 747660 743344 728243 740468 764313 747117 789869 780353
5870 780353 746586 750942 743809 778396 810628 806684 796756 791699 814733 835978 822084 853007 848998
5857 848998 845754 853549 851818 838670 817655 848458 898092 942521 943064 926029 953931 982205 995420
5844 995420 1016400 1011653 987156 981328 971622 931347 902725 870259 859429 879041 863517 908773
5832 908773 931451 903422 923034 922861 888283 915221 901308 873708 903033 885716 921264 892983
5820 892983 911427 971748 994224 976655 1016606 1064166 1069688 1049126 1083307 1044172 1026618 1035739
5808 1035739 1013551 1039668 1052294 1047471 1027009 959745 954687 965025 940616 943295 919916 917844
5796 917844 919074 923134 908159 920684 963643 964835 954959 998421 1028332 1071518 1040607 1037823 1063704
5783 1063704 1093734 1091164 1110526 1136962 1117464 1131891 1154181 1144136 1141413 1128104 1080797 1087146
5771 1087146 1083607 1108805 1122792 1113674 1140001 1139716 1177295 1171191 1162747 1155828 1177597 1230092 1250427
5758 1250427 1241735 1202161 1187497 1134733 1117204 1087265 1057613 1065581 1066019 1068321 1079433 1114797
5746 1114797 1140566 1132091 1120492 1143764 1098014 1134880 1188547 1225881 1220777 1284776 1290804 1295327
5734 1295327 1296043 1285653 1300278 1296591 1293856 1282998 1300091 1283925 1301374 1302479 1280256 1252791
5722 1252791 1255434 1244939 1186915 1163386 1157107 1160528 1181750 1168088 1192382 1191190 1191858 1197934 1182649
5709 1182649 1189629 1213918 1187384 1197967 1181366 1177714 1154754 1165928 1168058 1185193 1174949 1126819
5697 1126819 1123074 1142190 1161515 1144951 1157968 1140437 1141152 1177893 1159214 1175254 1202080 1221694
5685 1221694 1214433 1260934 1264491 1276577 1287236 1272415 1246851 1253646 1269887 1250148 1279335 1302381
5673 1302381 1275596 1262118 1295084 1278089 1282769 1265720 1265582 1249737 1287083 1316912 1319016 1279249
5661 1279249 1296061 1322956 1325791 1344025 1358321 1345670 1362664 1366644 1396565 1405991 1379001 1366866
5649 1366866 1420610 1420219 1413886 1420102 1415685 1447428 1456885 1452872 1444501 1478537 1500785 1493121 1451785
5636 1451785 1452066 1479816 1527312 1554327 1555508 1522235 1522821 1543457 1585983 1645155 1659631 1635627
5624 1635627 1644362 1680967 1696472 1689708 1667873 1720132 1727748 1709276 1802355 1823657 1775164 1777778
5612 1777778 1803309 1812579 1849195 1855324 1862555 1859724 1911067 1958509 1987321 1988970 2001507 2065900
5600 2065900 2114346 2154175 2213909 2247203 2329921 2347707 2376071 2452953 2514412 2582120 2639302
5589 2639302 2665349 2686084 2754284 2775586 2812411 2821261 2875640 2946968 3032032 3119233 3206406 3360426
5577 3360426 3500317 3578574 3699429 3775059 3816470 3878738 3945687 4009984 4066178 4190997 4281196
5566 4281196 4357876 4414285 4455528 4495996 4523207 4610117 4673331 4768367 4909159 5050802 5252505
5555 5252505 5442291 5616376 5794096 5929209 6011269 6046324 6026630 5983905 5895296 5767233
5545 5767233 5710499 5717249 5723732 5713346 5762686 5853072 5922151 6019328 6131394 6275338 6430791
5534 6430791 6579212 6703411 6772572 6852371 6845556 6803191 6796841 6801607 6764019 6714179 6673260 6668102
5522 6668102 6570857 6500235 6432630 6383347 6368022 6378334 6379183 6445247 6507075 6595294 6681168 6730669
5510 6730669 6732597 6656584 6526736 6312813 6097365 5819096 5652845 5518472 5409997 5339303
5500 5339303 5281150 5252024 5176951 5166855 5136033 5069469 5072830 5088954 5088485 5056918 5010845 4978714
5488 4978714 4899939 4780259 4702459 4570124 4416082 4236855 4073425 3951806 3794590 3692104
5478 3692104 3592123 3566516 3544485 3502071 3508105 3494451 3477495 3500028 3541556 3513178 3459198 3381631
5466 3381631 3304064 3225743 3139149 3030369 3000670 2929512 2888656 2873259 2861792 2854223 2808826
5455 2808826 2736680 2752082 2745337 2748100 2726142 2752088 2789777 2822001 2861733 2897449 2972937 3034906
5443 3034906 3096046 3198263 3320010 3419866 3523821 3589154 3705208 3802688 3860603 3960236 4051717
5432 4051717 4188197 4358324 4493753 4509160 4303785 4031355 3764251 3585437 3403017 3236160
5422 3236160 3181710 3116591 3073869 3057818 3077780 3096911 3179918 3227190 3290990 3403883 3524368
5411 3524368 3689310 3867255 4041334 4225493 4437938 4561711 4550593 4383150 4151944 3896620
5401 3896620 3648372 3448762 3322722 3172159 3044839 2987924 2900406 2860251 2844073 2828490
5391 2828490 2799647 2836632 2846205 2829310 2819037 2820196 2835362 2811149 2830078 2806885 2816457 2825413
5379 2825413 2871022 2862454 2846391 2878522 2911588 2991305 3116969 3116191 3052513 2991892 2935413 2876573
5367 2876573 2871587 2862600 2865957 2877886 2903233 2909590 2928376 2946237 2960152 2955876 2957661 2977186 2996209
5354 2996209 3041147 3090200 3122126 3166582 3250286 3343371 3429217 3474622 3519577 3609024 3686567
5343 3686567 3733793 3760551 3797683 3814643 3817976 3880528 3957812 4041620 4096944 4164597 4186294 4241983
5331 4241983 4267274 4297612 4328065 4351460 4452979 4543603 4615444 4700618 4794841 4933354 5030397
5320 5030397 5112151 5213796 5300967 5430442 5598617 5775047 5982971 6196103 6376258 6513491
5310 6513491 6666041 6846422 7028708 7203477 7421990 7727446 8021820 8337450 8724065 9190770
5300 9190770 9785284 10490290 11334168 12198316 13161820 14292928 15411668 16289961 16784466
5291 16784466 17092510 17369904 17688626 17970795 18097152 18044948 17958471 18083892 18454328 18903587
5281 18903587 19188033 18876183 18003971 16945083 15984773 15306945 14908056 14752715 14814376
5272 14814376 15005749 15155966 15096840 14908728 14709782 14586992 14630525 14847928 15136454 15289619
5262 15289619 15242246 15067405 14848031 14613328 14318168 13847507 13203557 12353422 11381956 10335683
5252 10335683 9276159 8355583 7622962 7049197 6565105 6163370 5819429 5518666 5337147
5243 5337147 5197777 5026222 4820707 4695942 4606777 4486090 4367844 4249680 4069393 3900421
5233 3900421 3786886 3668895 3613741 3522212 3394854 3303840 3228273 3127940 3094048 2994427 2955269
5222 2955269 2941761 2840300 2815599 2792035 2727816 2674343 2666041 2616674 2601674 2630024 2619996
5211 2619996 2553690 2481583 2385064 2348267 2331884 2322530 2253269 2226584 2210002 2195422 2148808 2064017
5199 2064017 2027111 1960116 1922986 1926404 1909922 1892568 1856185 1819676 1793981 1752858 1743364 1699107
5187 1699107 1682423 1700471 1709981 1699244 1665322 1635892 1623884 1629855 1643427 1616621 1603303 1622947
5175 1622947 1598617 1591662 1557421 1533953 1499614 1505047 1496743 1453431 1436485 1440509 1459386 1440918
5163 1440918 1424538 1405307 1382300 1423740 1436272 1428742 1441219 1416669 1415092 1448433 1476070 1448013
5151 1448013 1459269 1438590 1416846 1366997 1382909 1389868 1364271 1334677 1334307 1325264 1319468 1285862
5139 1285862 1254779 1306850 1321046 1315694 1320221 1296693 1246304 1233450 1228078 1253099 1266181 1251317
5127 1251317 1277844 1295585 1312624 1319384 1333483 1297513 1294546 1265104 1282225 1276586 1247539 1268979
5115 1268979 1253340 1255991 1268708 1278685 1264515 1218625 1232475 1261306 1284806 1275745 1241160 1253434
5103 1253434 1256211 1299276 1283229 1247274 1232332 1266594 1255274 1256612 1252189 1228940 1262419 1249542
5091 1249542 1228198 1245446 1272109 1321699 1321445 1294446 1328569 1340147 1334385 1301678 1295542 1315557
5079 1315557 1335391 1322652 1320674 1309884 1333277 1347641 1390926 1426461 1429846 1475728 1514861 1566267
5067 1566267 1644821 1689407 1802179 1871603 1986939 2146569 2307400 2519908 2633643 2653180
5057 2653180 2563079 2383578 2162430 2023584 1836210 1673213 1632464 1570456 1509031 1483726
5047 1483726 1420989 1414895 1411548 1397514 1381408 1371327 1375814 1375309 1365267 1338297 1336973 1293754 1278401
5034 1278401 1302626 1302100 1278913 1278614 1308377 1292749 1302295 1318489 1349142 1369971 1439375 1412889
5022 1412889 1376179 1362531 1408520 1433027 1437590 1419660 1418374 1457916 1409025 1410250 1446432 1435004
5010 1435004 1418675 1439789 1450384 1420165 1453017 1504902 1496660 1490076 1509623 1547654 1632735 1699728
4998 1699728 1709743 1699941 1770823 1865281 1938492 2032498 2150769 2276991 2420904 2611876 2721999
4987 2721999 2747179 2727469 2617238 2474704 2282548 2101265 2003641 1917722 1849463 1834329 1815937
4976 1815937 1770976 1767321 1787972 1783820 1768502 1755999 1746759 1700318 1718391 1763469 1802678 1795051
4964 1795051 1779897 1806429 1812226 1810213 1819861 1827234 1795437 1798674 1811136 1828767 1830139 1860510 1897706
4951 1897706 1892450 1936647 1959403 1969147 1970456 1930777 1947411 1980964 1998539 2035116 2044784 2056364
4939 2056364 2096939 2109079 2149211 2182285 2205883 2248701 2319973 2347149 2355023 2383523 2388981 2390118
4927 2390118 2410397 2475322 2468298 2461653 2461502 2451933 2502184 2505945 2490628 2485479 2525532 2573643 2567291
4914 2567291 2561635 2571510 2536926 2571496 2595689 2636279 2682000 2710832 2687215 2739153 2768862 2847213
4902 2847213 2847336 2909528 2979469 2964015 3033458 3110626 3162284 3223925 3294679 3374997 3417717 3477585
4890 3477585 3566604 3615986 3671385 3722460 3796472 3912834 4027493 4201082 4351526 4540869
4880 4540869 4727542 4908444 5163867 5377768 5562167 5725519 5798302 5791738 5733718 5625158
4870 5625158 5529503 5458144 5405153 5394461 5429421 5472700 5541974 5656425 5796320 6007497 6243714
4859 6243714 6492851 6692767 6814652 6902242 6905103 6828242 6680911 6524415 6427811 6330342 6234743
4848 6234743 6215658 6185251 6179653 6237273 6317581 6424722 6504654 6568405 6654548 6713918 6799036
4837 6799036 6925663 7053839 7215570 7387947 7502873 7614560 7746265 7932870 8056899 8262945
4827 8262945 8460611 8710103 8924116 9116565 9380827 9618140 9838654 10026207 10243679 10453833
4817 10453833 10710257 11016390 11333769 11692494 12043985 12467642 12949838 13382985 13727043
4808 13727043 14030386 14145479 14204394 14273097 14420565 14651081 14881649 15147794 15500902 15837789
4798 15837789 16239888 16635325 17018229 17450813 17838619 18266461 18769946 19283172 19732804
4789 19732804 20071801 20397691 20634152 20909201 21271298 21749338 22240650 22739419 23220695
4780 23220695 23796051 24432557 25140544 25904324 26731002 27583284 28487090 29479941 30512065
4771 30512065 31582435 32789480 34068406 35584493 37287356 39307044 41680175 44560333
4763 44560333 48020315 52220691 57188941 63124841 69975319 77828988 86989617 98362823
4755 98362823 113142719 132569860 154788301 180301615 210625962 242591160 265515898
4748 265515898 270499409 256538655 222992415 181975197 146107097 118352013 97966718
4741 97966718 83384336 72572763 64267984 57756363 52644954 48524125 45173745 42347692
4733 42347692 40050637 38106096 36398233 34920778 33691408 32617031 31715629 30971379
4725 30971379 30322175 29760260 29293776 28979673 28734923 28508267 28312754 28195182 28136229 28026045
4715 28026045 27996803 28022611 28075222 28174641 28410107 28672818 28985614 29400585 29861759 30384007
4705 30384007 30961241 31614831 32324794 33022760 33765650 34610551 35481736 36459648 37516340
4696 37516340 38676838 39997296 41524040 43277147 45249541 47566786 50423100 53898042
4688 53898042 58109809 63242140 69330703 76612814 85479574 96805528 111604840 129478618
4680 129478618 148171952 170898496 200050381 228786919 245635164 247508837 241749926
4673 241749926 223222065 189890024 154552948 125228640 102298482 85350925 73004888
4666 73004888 63638877 56261788 50355655 45651298 41871668 38773392 36180221 33870916
4658 33870916 31878414 30083136 28456043 27005514 25706885 24489572 23343523 22316052
4650 22316052 21374115 20552194 19796414 19181566 18658793 18172441 17689435 17279504 16857287
4641 16857287 16442120 16108745 15812017 15600785 15407773 15309496 15236505 15215818 15106755 15080173
4631 15080173 15068689 15012391 14927252 14768358 14526558 14253821 13919670 13617012 13270830 12919660
4621 12919660 12633962 12381261 12164010 11969483 11863616 11742766 11649470 11487021 11344002 11098916
4611 11098916 10808691 10483556 10160954 9867039 9650798 9444483 9229434 9035519 8825665
4602 8825665 8608428 8376158 8119644 7932973 7742955 7587505 7463111 7276800 7154341 7075102
4592 7075102 7004727 6935208 6876482 6887801 6890282 6912431 6848447 6776243 6742903 6673003 6516830
4581 6516830 6344569 6205280 6038479 5880831 5712898 5571643 5468171 5398584 5376454 5351630
4571 5351630 5373554 5388297 5368061 5372174 5372888 5332517 5285890 5218095 5182486 5111959 5053678 4923246
4559 4923246 4773730 4696666 4566863 4448203 4401404 4321534 4237093 4186969 4135562 4116341 4144857
4548 4144857 4138393 4130818 4110111 4065631 4039299 4009831 4000700 3934312 3844562 3723662 3633645 3587655
4536 3587655 3516610 3468270 3400016 3413928 3395589 3396864 3353628 3272066 3255114 3247376 3215817 3119617
4524 3119617 3051310 2983862 2952503 2922812 2909944 2923097 2892039 2836076 2809782 2820535 2818046 2811982
4512 2811982 2776489 2808497 2805214 2796688 2797483 2836389 2862447 2859679 2901236 2897592 2899037 2859418 2869721
4499 2869721 2789264 2730854 2712318 2657088 2617833 2548624 2544944 2565717 2516519 2514776 2553005 2547022
4487 2547022 2586455 2651213 2658854 2677331 2689036 2674611 2696497 2742453 2781009 2779659 2770848 2803367
4475 2803367 2836663 2826151 2800027 2771662 2756454 2797737 2828674 2839952 2795121 2828786 2874022
4464 2874022 2884507 2895405 2923476 2957943 2957038 2966273 2994632 3061505 3109440 3159431 3249735 3332950
4452 3332950 3452743 3538861 3665726 3831822 3994959 4228311 4454363 4725217 5006932 5313422
4442 5313422 5630436 5926178 6162864 6399873 6544038 6596419 6599328 6510381 6334098 6062298
4432 6062298 5701097 5330372 5012629 4781036 4649206 4545960 4497048 4481250 4511795 4529165
4422 4529165 4597981 4602615 4587452 4627065 4720955 4810425 4874084 4995722 5166601 5293919 5341212
4411 5341212 5476233 5608557 5761944 5971856 6174182 6388936 6628607 6939178 7289538 7661635
4401 7661635 8157781 8720863 9211341 9619722 9914649 9993347 9886838 9416593 8814029 8179692
4391 8179692 7615547 7219413 6896413 6689877 6577591 6513070 6431672 6302905 6141433 6049747
4381 6049747 5967659 5949514 5974898 6094978 6240716 6426753 6582884 6673909 6597495 6434419
4371 6434419 6222414 5976370 5801901 5692267 5657811 5699565 5865893 6076101 6343582 6621723
4361 6621723 6774786 6823565 6824677 6735881 6453423 6095145 5700156 5284642 4959497 4688749
4351 4688749 4458712 4290552 4144656 4050789 4009760 4016569 3962699 3941445 4026352 4094498 4178946
4340 4178946 4327631 4434709 4608050 4826013 5038089 5249423 5423910 5577164 5590441 5531238
4330 5531238 5339630 5079436 4738182 4402938 4122962 3894638 3702222 3527582 3360804 3216607
4320 3216607 3112556 3041552 2955417 2907159 2878212 2841182 2805524 2748352 2685021 2700476 2700875 2670425
4308 2670425 2701789 2711736 2727660 2752756 2781924 2811726 2876440 2939276 3027750 3169245 3268127
4297 3268127 3359303 3505246 3667803 3757140 3812443 3860095 3841561 3733408 3587232 3433241
4287 3433241 3302314 3209306 3074718 2950027 2842771 2747735 2677095 2580862 2502380 2446627 2409049
4276 2409049 2385934 2372065 2330427 2338775 2316904 2334638 2347781 2352613 2387136 2382697 2394905 2456450
4264 2456450 2505972 2526080 2541355 2571516 2569581 2517843 2465071 2401879 2359030 2298336 2271489 2243498
4252 2243498 2190347 2163559 2127454 2046897 2020165 2032850 1977661 1974414 1949042 1955371 1957851 1917506
4240 1917506 1895820 1880881 1884002 1896896 1902241 1906866 1910136 1888131 1913236 1903857 1867225 1864030 1810076
4227 1810076 1743042 1727126 1725510 1660889 1641697 1629398 1605124 1592043 1567410 1568284 1565833 1530139
4215 1530139 1478043 1469127 1441237 1455992 1438705 1390197 1388448 1397157 1410095 1432186 1415630 1436786
4203 1436786 1425040 1461912 1449839 1459169 1402768 1385618 1352232 1372979 1396611 1380305 1378260 1365478
4191 1365478 1386537 1350458 1347679 1363288 1371235 1372368 1402019 1436506 1401731 1394192 1410760 1396323
4179 1396323 1359740 1351807 1370064 1349488 1341660 1332023 1325442 1349723 1384916 1412154 1457571 1449862
4167 1449862 1449992 1472417 1480626 1451231 1452257 1479992 1465128 1460398 1474728 1486776 1465876 1469740 1482697
4154 1482697 1472947 1464618 1454912 1506238 1523492 1482659 1467055 1464828 1487919 1475631 1488847 1484036
4142 1484036 1473034 1482410 1501161 1519412 1527418 1586591 1600917 1576277 1514382 1590296 1619758 1639017
4130 1639017 1642358 1633562 1596245 1594612 1633768 1632024 1651304 1664128 1667058 1661219 1674627 1686064 1657198
4117 1657198 1683172 1707888 1725252 1718924 1755135 1810194 1793743 1759175 1720998 1723542 1686889 1644291
4105 1644291 1655133 1657172 1661696 1643670 1649905 1711292 1739795 1726720 1730345 1770917 1785560 1793816
4093 1793816 1816304 1804274 1784932 1810948 1855490 1892256 1920164 1934507 1964490 1967401 2002878 2055716
4081 2055716 2056515 2085668 2118023 2159804 2197751 2211916 2254221 2337922 2377831 2428601 2492825 2576954
4069 2576954 2653574 2716734 2749147 2782938 2812627 2879980 2978134 3096920 3157380 3264087 3343099
4058 3343099 3415908 3582074 3680839 3797999 3938311 4055421 4171395 4283214 4389738 4515505
4048 4515505 4624488 4736748 4878189 4998457 5123792 5264455 5424574 5560443 5701778 5878113
4038 5878113 6064646 6235868 6386600 6562619 6736511 6856961 6991958 7120882 7174455 7253144
4028 7253144 7281052 7293612 7383658 7436105 7515513 7591754 7735273 7846322 7905270 7903051 7895614
4017 7895614 7828991 7745398 7672724 7523123 7421229 7314456 7213172 7103727 7041375 7011001
4007 7011001 6976346 6874168 6788875 6674288 6557330 6337326 6150125 5968551 5748401 5574815
3997 5574815 5375676 5206021 5054583 4910945 4811628 4640020 4522438 4381943 4209459 4039121
3987 4039121 3884985 3734404 3564545 3414371 3263015 3182388 3040668 2953643 2824683 2730936
3977 2730936 2672679 2575665 2446372 2347999 2266295 2157090 2100673 2080055 2002802 1949597 1940317
3966 1940317 1894041 1854765 1822553 1790346 1783955 1768480 1744123 1681420 1625626 1590247 1556158 1505952
3954 1505952 1456932 1439108 1361933 1373534 1355063 1320601 1312147 1314438 1288350 1287123 1315442 1300496
3942 1300496 1256447 1242110 1217186 1198256 1187915 1187329 1173474 1179272 1208423 1210620 1211625 1234622
3930 1234622 1249496 1215081 1163241 1133843 1160048 1188492 1198656 1180846 1210903 1199947 1246564
3919 1246564 1288853 1298111 1325115 1355427 1358584 1355258 1360149 1408436 1460523 1515152 1557109 1535911
3907 1535911 1554127 1514482 1481325 1465785 1440125 1426834 1421882 1418144 1368595 1300282 1250898 1228962
3895 1228962 1204714 1145122 1088115 1096037 1065280 1079699 1073219 1004021 1018945 1024877 1040076 1010915
3883 1010915 994365 970883 936573 974144 953106 949921 959415 946506 950583 956031 948211 976647
3871 976647 985539 961222 967750 949329 961592 1009889 979816 966300 962782 1003913 997139 947442
3859 947442 951588 969394 1000321 978833 1000359 1011829 1004431 1017111 1042305 1031726 1025410 1020715
3847 1020715 1015062 1003863 1005862 1052863 1047968 1108379 1141926 1156398 1150243 1146301 1166117 1146771
3835 1146771 1164635 1151030 1115061 1135050 1151414 1135058 1157605 1168622 1179673 1151835 1152996 1144528
3823 1144528 1123086 1141629 1154371 1140007 1120695 1106033 1086208 1089785 1088554 1089146 1102926 1079291
3811 1079291 1079625 1083334 1039621 1065801 1087646 1081950 1107794 1099180 1042330 1046941 1071076 1096752 1096855
3798 1096855 1093779 1104918 1142692 1146378 1158656 1165652 1107930 1127344 1099774 1140304 1193958 1171784
3786 1171784 1181554 1208731 1216636 1236135 1273671 1236220 1262201 1302011 1315728 1341133 1373938 1378984
3774 1378984 1415379 1469768 1543708 1616768 1654331 1669702 1698035 1685690 1669521 1686368 1682555 1668681
3762 1668681 1673381 1722462 1733992 1788100 1837130 1867231 1941780 2029903 2069377 2107052 2101735 2181782
3750 2181782 2224160 2249928 2273308 2272843 2294426 2286030 2255552 2248009 2305301 2319505 2302288 2308469
3738 2308469 2273098 2256585 2258184 2231260 2186472 2149451 2100536 2038543 1996698 1965455 1930019 1880947
3726 1880947 1825620 1768255 1753399 1760598 1722011 1723237 1659160 1668116 1667832 1633033 1589651 1584257 1613191
3713 1613191 1610745 1582462 1535714 1570945 1566109 1549189 1555410 1540253 1550669 1541482 1545243 1571007
3701 1571007 1559099 1586208 1586722 1595940 1618829 1665405 1692741 1697687 1706978 1719122 1687017 1700875
3689 1700875 1717260 1734264 1758656 1791591 1821785 1822447 1818802 1840555 1858098 1866691 1837826 1867476
3677 1867476 1884344 1902496 1920997 1962110 1991385 1998839 2003776 2000153 1974141 2009912 2011535 2013188
3665 2013188 2042211 2047474 2053119 2108331 2165478 2175020 2193986 2223303 2221147 2201301 2264646 2318962
3653 2318962 2349373 2379084 2463240 2545044 2592616 2637652 2691576 2734731 2800900 2845341 2866922
3642 2866922 2885991 2884027 2898723 2872751 2862797 2858990 2802220 2760821 2726713 2673278 2698377 2675199
3630 2675199 2602794 2623586 2653063 2660180 2672780 2696299 2688301 2678977 2701376 2701740 2731956 2737488 2708496
3617 2708496 2738446 2763789 2773711 2799432 2846635 2899286 2893319 2955395 3009014 3044223 3071216 3088874
3605 3088874 3166199 3237896 3287063 3337625 3390587 3489972 3601513 3664940 3767424 3874128 3960969
3594 3960969 4080447 4169270 4273455 4385912 4396743 4498997 4570581 4674012 4714699 4812083
3584 4812083 4896494 5033931 5194298 5356546 5543614 5748190 5912177 6123917 6272180 6393265
3574 6393265 6529792 6559278 6603436 6575046 6528621 6461756 6329910 6181817 6079979 5948369
3564 5948369 5800435 5678181 5545614 5414839 5287299 5189437 5088916 4982608 4883813 4834569
3554 4834569 4764600 4709156 4716213 4708699 4740430 4680146 4671447 4657177 4617192 4598561 4605703 4584602
3542 4584602 4561270 4589542 4618013 4657417 4630544 4629494 4652232 4645231 4647417 4685356 4664358 4660527
3530 4660527 4694643 4739625 4758440 4833469 4896776 4915210 5015310 5108560 5215326 5254620 5334739
3519 5334739 5450276 5554640 5725907 5836854 5992845 6152946 6310124 6444971 6562339 6742988
3509 6742988 6925905 7079582 7136357 7250703 7337153 7372778 7446314 7531082 7608425 7662339 7739064
3498 7739064 7831256 7904158 7968447 7983953 8058309 8038530 8032695 8042971 8015940 7999675 7994519 7954781
3486 7954781 7974759 7979601 7925415 7894212 7870984 7856426 7855910 7824141 7826382 7827961 7872125 7906571
3474 7906571 8027104 8205265 8362922 8532249 8739554 8958824 9182423 9462177 9716970 9984545
3464 9984545 10257825 10578773 10880618 11221491 11551170 11831055 12079093 12271023 12395716 12503165
3454 12503165 12596902 12603552 12578582 12554800 12497312 12495126 12552459 12616879 12637584 12660117 12666657 12626312
3442 12626312 12578133 12472038 12304701 12128780 11911006 11667183 11393012 11163173 10929397 10671362
3432 10671362 10443012 10248619 10008579 9824675 9665772 9535063 9446446 9323481 9263061 9243065
3422 9243065 9234684 9195083 9166444 9104513 9015363 8994749 8925276 8828826 8768755 8763487 8735167 8670394
3410 8670394 8677249 8710094 8723459 8776424 8845405 8873597 8924692 8959578 8917950 8934257 8907863 8895067
3398 8895067 8870642 8815977 8777279 8708042 8599243 8531976 8488391 8470178 8436256 8395586 8382717
3387 8382717 8397435 8406581 8361227 8387051 8419298 8409513 8377489 8383448 8420574 8416166 8403846 8428787
3375 8428787 8448987 8476754 8484839 8487226 8539419 8634499 8700625 8789705 8874441 8924905 8994010 9065126
3363 9065126 9091439 9160966 9208853 9216203 9273394 9272841 9260386 9332413 9381010 9415328 9463444 9501004
3351 9501004 9539255 9540650 9525800 9531597 9533786 9574865 9598463 9699958 9766804 9837881 9914324 10036277
3339 10036277 10168730 10271777 10367577 10444203 10527832 10665468 10785324 10911741 11048754 11152224
3329 11152224 11273274 11439563 11643914 11795674 11988237 12208873 12455487 12678736 12864710
3320 12864710 13118290 13367564 13615880 13914462 14211837 14477769 14781409 15129955 15431265
3311 15431265 15739958 16016303 16293376 16611714 16898069 17084425 17287493 17493534 17694541
3302 17694541 17899391 18129262 18402161 18667222 18837635 19029195 19260876 19521313 19758716
3293 19758716 19991794 20195686 20395368 20590098 20769468 20923710 21034070 21151326 21264790
3284 21264790 21362595 21438794 21501914 21652238 21806638 21972519 22094718 22190705 22326902 22504039
3274 22504039 22678331 22891827 23125718 23351797 23619588 23898937 24125806 24300118 24564469
3265 24564469 24910729 25334352 25825707 26394989 27023561 27676363 28401080 29126892 29894745
3256 29894745 30729170 31617520 32582792 33579019 34621370 35745065 36873111 38053317 39292382
3247 39292382 40540882 41731128 42896215 44074362 45256888 46408058 47527526 48646211
3239 48646211 49746513 50849362 51989330 53138868 54285872 55486496 56725884 57977166
3231 57977166 59145765 60303651 61326368 62178682 62781289 63246213 63487656 63476774 63310855
3222 63310855 63063024 62731688 62393900 62100852 61846321 61674527 61605526 61546765 61511475 61445180
3212 61445180 61323455 61159950 60928525 60630337 60217924 59797376 59436888 59143045 59011894
3203 59011894 58890797 58865894 58794502 58558884 58050926 57148721 55813158 53999079 51814485
3194 51814485 49369166 46861621 44446457 42217561 40232832 38458082 36904309 35538831
3186 35538831 34306683 33203055 32219087 31346857 30576725 29835868 29161277 28544763 28039947
3177 28039947 27531009 26918487 26286328 25639771 25031815 24529570 24031910 23555980 23071771
3168 23071771 22620193 22200252 21753295 21376533 20996107 20593821 20173782 19791472 19450896
3159 19450896 19057134 18656245 18323935 17984139 17635899 17350157 17088013 16806000 16608742
3150 16608742 16445152 16268430 16137960 16059799 15961073 15911928 15807907 15709871 15592170 15480488
3140 15480488 15354056 15273388 15201717 15145869 15085409 15040256 14983170 15002075 14995657 14993540 14996906 15009327
3128 15009327 14993367 14974181 14945028 14884030 14727522 14638200 14526194 14352937 14233914 14119903
3118 14119903 13942846 13778292 13584613 13435589 13264371 13106919 12960697 12836169 12719633
3109 12719633 12577428 12437985 12292499 12185139 12014294 11886433 11754674 11679625 11566888 11512127
3099 11512127 11474262 11397956 11357901 11370711 11390960 11471214 11555643 11660416 11789994 11909999 12028119
3088 12028119 12178672 12276922 12412728 12598149 12773331 12964684 13156274 13379463 13597189 13827790
3078 13827790 14126469 14425918 14730292 15042632 15398664 15776953 16220300 16640101 17046176
3069 17046176 17402329 17761184 18123820 18385010 18613264 18831447 18927999 18911504 18864360 18811402
3059 18811402 18703699 18586448 18487072 18374025 18242359 18167921 18084481 17997217 17942771 17873774
3049 17873774 17755534 17568450 17370364 17130773 16786482 16395432 15946799 15422943 14822744
3040 14822744 14138641 13532215 12909210 12290710 11681862 11138734 10675860 10194385 9805231
3031 9805231 9392748 9012714 8677867 8419840 8199118 7975208 7789544 7597615 7423718 7280944
3021 7280944 7194388 7104892 6981809 6853641 6758671 6672083 6626255 6568245 6533019 6477042 6412053
3010 6412053 6392880 6380013 6327581 6316565 6297477 6260948 6297343 6304723 6274603 6321614 6363347 6387735
2998 6387735 6407252 6429511 6478322 6511997 6510622 6541641 6594643 6542367 6539306 6531115 6496054 6448665
2986 6448665 6364540 6294045 6206626 6141913 6053590 5968945 5877004 5843113 5783371 5766142 5745427
2975 5745427 5688037 5719254 5687774 5671541 5716449 5711238 5712051 5749006 5796857 5890496 5978278 6069594
2963 6069594 6116302 6153968 6225927 6309528 6386305 6500424 6564459 6628479 6727759 6791018 6808394
2952 6808394 6838561 6873890 6923925 6977653 7020030 7031130 7050514 7074493 7097209 7144080 7108293
2941 7108293 7134592 7172685 7243565 7311328 7365103 7471328 7609652 7745396 7873330 8020209
2931 8020209 8144696 8279154 8417894 8617609 8820391 9063025 9296213 9530330 9774839 10008784
2921 10008784 10207429 10402604 10568806 10773957 10858381 10850556 10892467 10941385 11023946 11124827
2911 11124827 11291995 11469047 11657148 11782390 11939781 12081898 12196642 12259150 12250235 12245729
2901 12245729 12226979 12219873 12303467 12461184 12674908 12864991 13091321 13371016 13699751 14056698
2891 14056698 14396219 14789113 15213080 15655792 16118040 16518052 16945524 17362162 17710662
2882 17710662 18069939 18406063 18687867 19030632 19423799 19832430 20263641 20722940 21106532
2873 21106532 21498950 21901690 22360015 22907203 23509529 24175158 24944325 25823326 26777300
2864 26777300 27820472 29023202 30410615 31870097 33365809 34894422 36351567 37439521
2856 37439521 37816823 37558787 37078270 36626704 36466281 36688394 37296444 38281673 39713353
2847 39713353 41601487 43902924 46677430 49923669 53686444 57891825 62364288 67159519
2839 67159519 72342716 77896113 83695111 89504728 95251152 100801244 105808578 109350839
2831 109350839 110273141 107862817 102448339 95091820 86914681 78909957 71692446 65384290
2823 65384290 59877286 54969685 50500668 46494844 42858081 39664238 36953464 34651323
2815 34651323 32637195 30923280 29430581 28067920 26877349 25772948 24736793 23821409
2807 23821409 22930270 22051234 21246962 20434573 19636206 18888993 18113195 17389290 16713867
2798 16713867 16076129 15476385 14890390 14347131 13827353 13319647 12886027 12493716 12124877
2789 12124877 11760937 11413522 11049785 10736530 10472018 10195641 9922688 9736527 9517386
2780 9517386 9305140 9073429 8864003 8649422 8410873 8203971 8004572 7781750 7580982 7372569
2770 7372569 7168207 7003615 6816498 6651946 6513034 6333011 6185440 6063803 5956587 5837590
2760 5837590 5657923 5514123 5402519 5293309 5185624 5084270 4964558 4875121 4825493 4724613
2750 4724613 4634604 4548572 4449276 4373344 4322654 4243020 4165685 4081487 3993425 3922740 3809076
2739 3809076 3767691 3685713 3617376 3560482 3498538 3415674 3325487 3275267 3223069 3149111 3117834
2728 3117834 3067666 3021342 2953381 2890744 2803093 2778504 2754353 2735579 2736876 2672197 2603134 2592152
2716 2592152 2573696 2556656 2525090 2498638 2456268 2434939 2404005 2350896 2337536 2289185 2224425
2705 2224425 2225155 2196719 2160080 2129818 2061591 2041326 2076327 2059573 2046936 2044811 2002113 1966265
2693 1966265 1928050 1911971 1881218 1848808 1787807 1765282 1755127 1719406 1725324 1707090 1673557 1678065
2681 1678065 1673769 1648018 1611914 1616651 1581103 1547181 1525473 1543659 1516093 1504547 1525084 1499964
2669 1499964 1472983 1428355 1420092 1423622 1377250 1386827 1401141 1335100 1288487 1298212 1260509 1222969
2657 1222969 1229911 1263825 1251267 1225771 1202873 1215599 1237485 1198150 1219522 1193847 1177330 1123204
2645 1123204 1140269 1177323 1161614 1169941 1166077 1146850 1127951 1154464 1188692 1193612 1168187 1147674
2633 1147674 1110994 1096903 1141456 1177877 1111429 1053066 1075792 1069719 1069952 1107628 1137301 1136103
2621 1136103 1095456 1084557 1073992 1091399 1098541 1115030 1086559 1067884 1109272 1137004 1164113 1163740
2609 1163740 1174854 1191499 1214120 1226690 1228385 1237499 1216969 1233844 1248032 1221004 1228460 1217078
2597 1217078 1237063 1274646 1318259 1274011 1262113 1261664 1238267 1239892 1267383 1343084 1329723 1335227
2585 1335227 1363271 1407061 1423788 1456909 1469203 1492975 1532305 1546782 1515933 1507841 1583613 1628218
2573 1628218 1633646 1646002 1663302 1677588 1671945 1647810 1670902 1656457 1680475 1634910 1625997 1633630
2561 1633630 1652894 1661880 1691126 1701997 1730642 1777424 1788697 1875038 1895100 1920796 1923446 1999582
2549 1999582 2022029 2076503 2105669 2098650 2094113 2133798 2174437 2172216 2123965 2048513 1949254 1898717
2537 1898717 1868559 1818776 1759827 1701677 1658399 1633806 1638528 1566905 1505678 1482548 1503388 1462065
2525 1462065 1463006 1432467 1435578 1419233 1430518 1381471 1379660 1363146 1335500 1328721 1322281 1350208 1365725
2512 1365725 1354926 1367534 1343784 1357495 1423715 1432533 1458802 1429589 1371895 1322027 1251244 1156985
2500 1156985 1133925 1080054 1064208 1044050 1012301 976895 944736 932938 935464 896696 860859 858704
2488 858704 853311 824613 846119 823873 804163 774505 782808 762636 769978 750493 724145 681673
2476 681673 638869 646846 663377 661840 673039 705173 738202 673949 647058 647547 632320 622751 583890
2463 583890 521620 489035 559174 493171 464125 471663 481962 469187 460007 433548 432919 463636
2451 463636 449491 392134 417701 410770 410184 432542 461582 415051 338400 313149 326303 324011
2439 324011 344796 378430 359659 358109 327818 292034 306111 307966 303836 285606 311945 347848
2427 347848 325753 302287 279788 305741 298539 278414 275821 298881 271337 252899 291504 263233
2415 263233 266645 274166 212062 229483 260921 233534 268713 219691 194073 209665 193900 240583
2403 240583 217354 215977 267965 248737 223822 231395 223488 189284 224715 230174 212409 236823
2391 236823 239634 231695 218917 206188 181949 184412 201645 210246 192833 179917 170466 202319 254572
2378 254572 230634 204618 240776 224871 206534 211828 204333 192636 204672 214198 190706 214412
2366 214412 226897 213698 194085 217507 226811 209243 208038 215309 192366 207234 236258 221442
2354 221442 161244 165898 180990 157907 200125 194946 149941 141274 178916 193723 238711 214488
2342 214488 171921 192260 204278 184961 183708 180680 196408 205642 216616 218550 193227 199173 231379
2329 231379 206308 204337 212572 220507 214702 233188 210816 192682 202424 188993 236783 237293 245800
2316 245800 214354 167893 129533 144189 154594 176442 202712 233493 207668 123417 130388 213335
2304 213335 192574 170484 195653 180044 190930 185845 177341 165032 112293 114583 157847 138328
2292 138328 106099 121985 138079 142801 135225 112390 133135 135683 145780 148093 142930 167480 185009
2279 185009 152379 146088 129117 143282 106601 103232 102763 102727 112317 98430 111919 138465 111197
2266 111197 138176 154850 158577 167750 167903 157775 166210 165056 176053 175124 147706 170512 163002
2253 163002 143384 112696 140185 132579 150859 183151 147538 152106 157864 153597 140574 130591 142620
2240 142620 137628 115637 112083 153784 140097 151915 136504 172477 132766 134252 156668 125093
2228 125093 130936 144089 140583 157943 178961 166426 155437 163722 169747 177559 119658 76772 100709
2215 100709 122030 142520 113526 131677 144286 152144 137315 136760 101561 106912 138460 157896
2203 157896 146974 158744 169586 157013 130531 116648 109418 75313 122260 137214 124736 114167
2191 114167 115209 122700 174396 169317 154835 142491 126333 106787 128250 157312 168461 117473
2179 117473 122962 154716 168333 155792 173140 168460 164406 177366 210147 170706 145465 188545
2167 188545 200319 229032 213178 226035 229696 220426 156128 144742 164784 167401 207284 214667
2155 214667 238863 262563 269991 238487 200204 233648 264902 284749 298254 264927 288705 280437
2143 280437 280725 274929 268344 342091 326068 319517 305835 340228 334237 369132 369319 398756 422138
2130 422138 400046 378217 381884 421766 395037 393771 411012 394264 397574 444092 444204 435796 479877
2117 479877 489605 477689 471988 474889 489194 534561 556597 600230 611660 602159 649879 665715
2105 665715 677328 685785 725637 741691 795931 796354 830352 873067 875950 931366 977402 972496 1033447
2092 1033447 1083843 1110606 1169172 1198670 1231011 1317808 1401691 1427250 1490705 1562716 1648070
2081 1648070 1707771 1753108 1836841 1953752 2075006 2209224 2385329 2601364 2814380 3075540
2071 3075540 3217812 3464687 3801688 4143141 4617981 5141733 5796767 6739695 8163032
2062 8163032 9967630 11341927 12919757 15336390 17949032 17914540 15082906 12028731 9465295
2053 9465295 7482305 6093799 5130177 4374079 3830578 3371279 3025418 2781681 2629693
2044 2629693 2494745 2446300 2333270 2127266 1916297 1749477 1618140 1517127 1432061 1338864
2034 1338864 1236295 1160647 1147363 1116595 1023213 988867 953472 953449 918043 893980 844916 814704
2022 814704 839626 796909 734292 724004 698691 670132 636631 603282 586200 602592 577997 547264
2010 547264 510007 472129 473278 507645 496505 466669 468305 471805 433207 462611 455026 412866
1998 412866 382528 394303 390216 358948 359391 368591 323659 320340 317326 343057 322761 298428 307685
1985 307685 283679 249190 264815 291376 304415 284158 264761 243578 248146 260929 245193 240159
1973 240159 233777 237247 212141 216794 190744 196577 195882 209813 210330 173982 150044 170793 149193
1960 149193 125829 138951 184111 156468 132467 149549 160469 130382 158877 164575 153576 194286
1948 194286 159846 106401 61097 81904 119345 133669 142961 160852 149585 144780 162937 152655
1936 152655 142987 146741 161674 119624 107117 87393 97252 95953 109888 120561 129698 145543 129981
1923 129981 140623 146615 127783 101592 122840 119549 119722 102010 110662 102612 93822 138081 143267
1910 143267 167531 109529 108611 111725 96211 62922 72063 101351 131326 138383 100563 77315 45905
1897 45905 37447 60771 81299 121771 133127 65158 55369 97457 88060 87359 108551 111804 150987
1884 150987 155764 123163 108611 92119 81924 103033 122048 106456 103332 53834 39189 57712
1872 57712 42596 81151 106426 77324 97748 80598 89391 97976 60015 67468 59802 74702 77658
1859 77658 70495 91751 95342 72524 92867 95775 72834 827 14655 30647 19242 59166
1847 59166 116741 129370 109984 91027 54600 43424 80696 67960 42150 25233 51850 62953
1835 62953 46267 73503 68358 124900 100020 43712 60371 61760 48426 71747 73923 78584 71652
1822 71652 45290 61983 92405 95603 41525 45992 54281 58532 65381 52605 80243 97888 61894
1809 61894 50926 17275 39786 59874 83792 64693 87283 128971 97056 92091 67478 91364
1797 91364 75686 77096 91448 71868 83116 94007 124402 143104 126546 119606 123225 108275
1785 108275 103831 113631 54341 47521 51524 41011 38140 18933 83206 119224 93426 77537 56837
1772 56837 46342 53348 52744 50870 58633 78918 56488 68605 49507 47814 44397 59251 73508
1759 73508 62481 63661 74879 67937 52944 71421 57170 74069 84342 89235 76567 77276 65920
1746 65920 35355 22607 5992 15205 51051 60584 45541 54580 58540 36717 47695 49360 67147
1733 67147 48428 30659 11595 -148 -3198 6490 28146 49449 51837 42204 30826 55042 72592
1720 72592 43066 58961 54840 61172 69411 44177 49210 60821 41004 47383 47205 55709 61802 45389
1706 45389 15412 39567 62221 68428 41366 30263 14053 3652 12596 55764 49578 47266 31168
1693 31168 14706 42144 19445 45810 63639 67986 67033 49307 1232 38212 14488 30933
1681 30933 39936 15917 11068 25609 33918 13890 -18320 -17306 48533 35645 25438 30825 51817
1668 51817 58136 67641 45101 19858 21699 35492 46118 20183 42199 27025 37966 22251
1656 22251 11159 21522 8706 20511 29276 43744 47192 23721 -12063 -7870 29434 34460 22748
1643 22748 12660 9647 30865 20915 26081 55178 83919 63234 52592 55244 3739 -20954 -25352
1630 -25352 -15604 31217 50935 48032 34743 18336 51016 54363 27838 17817 4433 43013
1618 43013 53748 51621 67908 49144 24520 33327 45843 41270 47611 59516 43665 35639 50343
1605 50343 22185 33248 13452 34421 6706 23281 14032 15208 36852 16503 39108 5368
1593 5368 37560 55605 25525 46400 7405 -47051 -63375 -17331 35316 10577 28018 46832
1581 46832 46434 62485 80031 59808 14155 -26020 -21069 10756 30180 34896 55557 39608 11921
1568 11921 -13365 25628 23670 36299 45901 41685 34292 62475 43307 35021 38966 16067 24017
1555 24017 35212 6120 40144 25336 14299 25535 9454 44047 29379 26405 47241 47932
1543 47932 22272 -9656 1666 31551 34774 46370 62451 38424 1197 42190 41635 41159 26152
1530 26152 976 -1943 26363 64553 54096 19388 -8762 -3360 -20 -4042 -1140 23118 25204
1517 25204 24931 28689 50368 110349 60713 72822 72522 48830 32923 -16293 -54255 -42224 128
1504 128 26566 67383 58170 41615 115 45305 87580 53676 46086 91749 72086 79893 68510
1491 68510 58208 94263 67852 53852 33155 3512 20876 30251 15568 19304 -8481 12858
1479 12858 21615 38548 33348 6765 -4863 16403 13522 9464 -19699 -23389 -3539 -11297 7135
1466 7135 30104 6642 7635 -523 -7479 24399 623 2421 -6189 5753 15486 9719 -5719 19491
1452 19491 30097 31096 41042 -3483 -23453 -921 -13763 -2137 27357 4695 40717 13076
1440 13076 -27488 -37451 23175 55137 21416 16645 678 -26888 32838 52782 -2767 13485
1428 13485 23116 -8567 38098 52894 12784 16082 18909 13088 1976 -14557 -6943 15348 -6670
1415 -6670 -15744 17361 50596 92254 39893 -27212 -22294 -24803 20038 -7003 13174 4941 11586
1402 11586 33567 -2026 -3140 43153 33562 26724 53492 27889 22650 7437 19830 38651 23121
1389 23121 18922 15050 30553 58744 41492 28814 35331 55068 23992 -14794 21924 48583
1377 48583 29505 16212 -17589 31884 14338 3741 2239 10040 17952 38490 37409 -39137 -47524
1364 -47524 -31160 8817 -1998 -30371 -5189 21383 -1871 -15565 -17755 15284 -13396 -22914
1352 -22914 -29075 -28295 -18961 -20590 -40678 -2113 3495 -29108 12788 22507 -14020 4165 -10823
1339 -10823 15618 17444 7739 13907 54483 -7079 7782 29652 -11770 6175 12718 -1292 2439
1326 2439 1599 -8264 21278 42349 36484 -16616 -40199 -28220 30829 27866 2351 -38507 -2797
1313 -2797 -15370 5794 5524 31015 45417 17031 29635 10595 2007 23314 36957 19568 -35836
1300 -35836 -29726 -35589 -35387 -5566 11178 17394 -7248 -10181 -11427 13665 27885 3784 -12827
1287 -12827 -12301 33874 27015 4772 21670 18000 -3051 -13976 -9021 -21697 -30409 -34160 -28125
1274 -28125 -63428 -73284 -30087 -5043 -21308 -10641 -3493 -27521 -859 -7066 6365 -1913 -25419
1261 -25419 -9651 10384 32933 24055 9039 31229 21296 10482 560 3560 5638 21180 21981
1248 21981 18933 17265 -2246 -6635 1267 -10892 -23182 -12758 8563 1863 -4736 34552 15058
1235 15058 15062 27375 46943 65678 34832 32943 20425 -34264 -30068 31276 36559 11818 9011
1222 9011 -2887 -25465 -42179 -48522 -26286 -6661 -22663 -9665 -5458 -22788 913 47319
1210 47319 -499 15837 -12179 -4931 -22470 -22750 -17115 10671 20121 -9366 -29448 -10190 -14329
1197 -14329 -14675 20703 8055 -12212 2413 18493 13691 49036 48336 35334 -75 -34124 -29232
1184 -29232 -24144 21018 14586 -9744 -16312 -3754 6861 11011 21879 30720 16219 -36030 -21342
1171 -21342 -56854 -39032 12461 46689 51493 21196 -5644 6177 -1743 3983 -9148 -7837 -17297
1158 -17297 -17737 -20089 5450 21867 8315 -29980 -32998 -36704 -21780 10953 6371 18134 16073
1145 16073 -49397 2618 50595 16473 -20213 -56942 -12232 13152 -13281 11548 31979 30184
1133 30184 32124 63226 50553 11843 9579 35452 35568 31431 26014 20760 3778 -30068 3866
1120 3866 45610 49417 16506 9685 -7048 7242 -2900 -30119 -47599 -40689 12640 6985 -11956
1107 -11956 -35704 -65190 -18613 -39065 -701 30787 -8225 -29553 -6434 33941 2147 -14619
1095 -14619 16787 4046 12452 30695 32103 -49267 -48291 -7548 6452 32375 32321 28970 7096
1082 7096 -42188 744 12694 -22486 -11572 -3225 4556 10362 3854 -35242 -20171 -17746 -671
1069 -671 -38317 -33073 -18414 -23830 11607 -10128 5488 8715 26886 26564 -10478 -15149 32053
1056 32053 40807 9317 -20641 -16284 24380 14007 47969 30117 -16079 -13069 -18929 -37892 -5107
1043 -5107 -7942 -25894 25875 29809 383 6284 9691 10563 26108 5863 -50545 -41954 -44967 -3028
1029 -3028 38180 24754 14797 -16298 -30172 10490 -332 -39557 -27914 -22933 -4626 -17938
1017 -17938 -15687 3213 -6946 -11316 -23534 2812 59094 -12149 -38274 2538 4628 4091 838
1004 838 4842 16264 -46024 -54148 -17425 -2353 36993 42798 5874 2441 -2577 -21911 -17695
991 -17695 -4409 16630 4181 16076 18717 40869 12325 5608 7309 -14204 -2786 20136 4671
978 4671 -18628 -22271 -4713 31901 65434 77148 14667 466 -11560 -25438 -1566 -17497
966 -17497 -11247 -6227 9244 -3656 11696 -9806 -4347 13022 -6340 1146 -15499 -33460 -45412
953 -45412 -19402 13291 14573 16951 13711 -12520 -7439 -17783 -19800 -6718 7339 -16654 -2654
940 -2654 8926 16471 -13820 16012 4149 -11022 -30076 -31836 8796 -2319 -9224 -5703 -27297
927 -27297 -49284 2601 25818 -1209 -19609 -16667 1093 11661 -1148 -15553 -35485 -8140
915 -8140 766 21323 36612 -1924 -7198 -17307 -1021 36959 -13387 -27935 -12700 20095 22066
902 22066 58091 31842 -32979 -4584 49774 -2488 -12514 16817 -3819 -47047 -56399 -31644
890 -31644 8412 17385 8933 -1788 -10825 -15177 8548 9595 25634 8852 24600 42070 20817
877 20817 34567 16003 7336 -37226 -23103 -36312 -5455 -4618 -22828 -16611 -18475 1200 22740
864 22740 47824 30723 -3968 -16059 3677 7286 -22109 -4878 -5766 400 -6920 5664 -2969
851 -2969 -2048 -25788 -15450 -28670 -53056 -48528 -24976 -11946 -49001 -55669 -29033 -10711 4838
838 4838 -5228 -6831 -24883 -44466 -16039 -22697 -7301 -50800 -55476 -63331 -36174 -18980 -31657
825 -31657 -6249 -21955 -21670 9426 30820 -4152 -7150 11090 -9689 -42195 -50019 -32625 -2145
812 -2145 -17614 -15738 -16345 -1388 -60191 -83444 -65937 -42252 -66728 -56012 -9444 -16624 18945
799 18945 19855 15949 32257 -15137 -13827 -1099 -4678 11912 -23451 -52809 -27380 -21863 -51181
786 -51181 -73 20333 12622 -26998 -2690 6287 -9777 -6642 32563 18302 -24527 -46496 -34867
773 -34867 11011 4308 -17184 5673 15494 38516 30069 13054 -1614 -4585 -20479 19967 4478
760 4478 -22635 -8419 -29706 -16982 11962 -4247 -12839 -28305 -20478 10031 10469 20721 15154
747 15154 -13219 -13866 1411 -7326 -10177 -15714 -37068 -41328 4589 12194 -4095 4591 -10255 -24010
733 -24010 -51302 -77949 -52749 -35947 -5954 27592 20549 6895 -24510 -26061 -138 627 12824
720 12824 -24143 -18341 -1868 -14729 -26657 -962 35378 4884 -20749 -18383 -22735 -19512 -33330
707 -33330 -56050 -35903 -1151 -11559 -3919 -8351 -41814 -45126 -41627 -39915 -26031 -9451 9407
694 9407 2249 -16292 -30778 -29760 -17296 -3676 -19015 25874 5980 -46124 1935 -14713 -4414
681 -4414 25760 -13225 19313 48620 12082 5562 1841 -16558 -22203 -28148 -7466 -21883 -9267
668 -9267 7592 21421 10205 19156 6961 6555 30991 -4932 -7526 29318 22990 19153 7105
655 7105 -20528 4327 -13262 -33785 -52865 -23533 509 -41153 -69946 -67582 -27050 -48561
643 -48561 -46367 -25417 -6406 3749 -20676 -26344 -36971 -41782 -53639 -53669 -10055 28584 -6158
630 -6158 3540 1551 13275 -25705 -2313 11962 -11436 23451 -40035 -44801 -23621 -17723 -16062
617 -16062 -42991 -50194 -60118 -40059 -51002 18487 694 -25943 -12213 20279 -21260 -24769 -5396
604 -5396 8931 5520 -10281 -13388 -3331 -8242 -61825 -8513 -12952 -4769 -21999 -16919 -11568 -27667
590 -27667 -45028 -26786 -23108 -23258 -21349 -39726 -18228 -43383 -44097 -35648 -29478 -58593 -52033 -19803
576 -19803 -26827 -14499 -19710 -14747 -33089 7120 -19175 -23076 660 19800 3294 -26297 -38388
563 -38388 -26141 7462 8261 31094 35042 4749 3679 49332 22550 -18061 -14268 28660 44927
550 44927 22695 -8147 6060 34380 -16608 -39190 -28989 -19448 -30848 -11586 7943 25032
538 25032 -8128 -51377 -24882 -8804 7746 -7665 -8576 -21994 -22923 -40931 -18073 -12553 -10991
525 -10991 -20359 -34894 -29093 -36396 -12413 -56464 -54208 -34269 -42800 -26721 -19338 -25814 -38637
512 -38637 -24583 -15586 -48734 -52627 -46172 -4798 -2704 -9374 -32355 5337 -12402 -864 397
499 397 -11756 -18285 -30783 -10157 -24102 1906 -4089 -3499 17846 17374 -18454 15678 -15863 -16741
485 -16741 -9312 3473 -8989 -11667 6780 -55148 -77752 -67058 -64475 -51270 -34215 -23270 284
472 284 26303 8294 -19135 -22000 -27577 -32161 -18601 -23525 -32902 -34513 -4576 44527 -12551 -39252
458 -39252 -32629 -18775 -23372 -8315 -31297 -42993 17405 -12443 -22961 -38090 -33536 -1063 -17323
445 -17323 -35163 -14408 31265 21402 -24980 -26122 -54670 -36560 -41015 -28700 -12872 -28881 -37783
432 -37783 -33388 -42297 -41156 -30332 -41715 -48747 -28154 -9264 -11165 -1945 -30599 -72699 -34064
419 -34064 -17514 -50162 -18746 -6293 -36409 -29812 -15284 -33953 -57141 -37815 -17224 -37427
407 -37427 -61432 -70220 -84353 -78662 -60760 -77278 -39983 -25068 -22042 64 -23273 -50061 -21036
394 -21036 -13246 -22252 -55371 -34991 -52203 -65516 -55741 -41391 1810 -31245 -55640 -75457 -31844
381 -31844 -19925 -70563 -94019 -74368 -73628 -63041 -78916 -81639 -71131 -66146 -43974 -23378 12574
368 12574 -23684 -21510 -30673 -46889 -49215 -47740 -40350 -15689 -33757 -53044 -46291 -58123 -59369
355 -59369 -50748 -30925 -46323 -89109 -64637 -65700 -93502 -74814 -49240 -72177 -46475 -35486
343 -35486 -54236 -54560 -41283 -12194 -38613 -30649 -38992 -46127 -60899 -57108 -63297 -117863 -74102
330 -74102 -16393 -27904 -34599 -17660 -27764 -32552 -43153 -32247 -40238 -52764 -40685 -52964 -56509
317 -56509 -83729 -79419 -43261 -56997 -48021 -21368 -31874 -36693 -56091 -35554 -60073 -63269 -41467
304 -41467 -10285 -5798 -34556 -45368 -39607 -46260 -30521 -29940 -61302 -62382 -57855 -45006 -48156 -40763
290 -40763 -17121 -39695 -34587 -47614 -40124 -55966 -78269 -58527 -59667 -76971 -72089 -55699 -32401
277 -32401 -44427 -43061 -15208 -50554 -29497 -51528 -46984 -59862 -52266 -92920 -93998 -73109 -61084
264 -61084 -51396 -43807 -35823 -61717 -60615 -39030 -22491 -21461 -21845 -59639 -57212 -44374 -65160 -67587
250 -67587 -67429 -53455 -63574 -60480 -75384 -79533 -55310 -74257 -50892 -17745 -44686 -58566 -51357
237 -51357 -36267 -51310 -56092 -38826 -66062 -63499 -30139 -39639 -53421 -73942 -114851 -93778 -102682
224 -102682 -90250 -65968 -49146 -42482 -34757 -49658 -84322 -74822 -48966 -48216 -34075 -48819 -73995
211 -73995 -81253 -91927 -94946 -48260 -53309 -42872 -43839 -47229 -12739 -17893 -11831 -13466 -30737 -22457
197 -22457 -45933 -58528 -59486 -84846 -68273 -56921 -101063 -77615 -65964 -59407 -44487 -47795 -58940
184 -58940 -76448 -70542 -29001 -22901 -9302 -54693 -65934 -27133 -30743 2291 -1035 -48527 -73276
171 -73276 -50952 -32973 -37152 -49533 -42802 -43350 -55421 -58380 -31361 -43770 -60858 -38876 -30700
158 -30700 -30339 -48523 -58231 -56407 -95429 -96396 -65593 -27866 -42787 -37512 -17291 -51710 -79881
145 -79881 -91426 -80382 -43861 -85252 -72017 -53396 -90053 -98276 -66384 -57003 -44596 -59066
133 -59066 -33700 -51968 -103222 -58224 -27265 -10744 -16869 -26482 -14163 -55185 -66673 -36940
121 -36940 18623 -25613 -43154 -69280 -57756 -48875 -69196 -40021 -35280 -36675 -67280 -52738 -46306
108 -46306 -77072 -61414 -55571 -64440 -81277 -98176 -83307 -72037 -76656 -82300 -73443 -39378 -45530
95 -45530 -49770 -42290 -71105 -108421 -95452 -89685 -84534 -74816 -71852 -57156 -74544 -65444 -59879 -45489
81 -45489 -39155 -51390 -64576 -18394 -10509 -30288 -43888 -64454 -88248 -69671 -70550 -32442 -29219
68 -29219 -42025 -58922 -35740 -26380 -27047 -22636 -57465 -62933 -23274 -57024 -62943 -39412 -41698 -31413
54 -31413 -37202 -66713 -72758 -58986 -69107 -70958 -76732 -86710 -75702 -102548 -97983 -73382 -62527
41 -62527 -55494 -57346 -32576 -39160 -55852 -77827 -75652 -68090 -88678 -89856 -79188 -70562 -41344 -17211
27 -17211 -30421 -50809 -74376 -90038 -78784 -67804 -65757 -71679 -37912 -34835 -62268 -51667 -42790
14 -42790 -55883 -65682 -48173 -41375 -60330 -59567 -40538 -9593 -37969 -70770 -65153 -72219 -70612 -72311
0 -72311
$$ Imaginary data points
##PAGE= N=2
##DATA TABLE= (X++(I..I)), XYDATA
16383 -852293 -846647 -812194 -813024 -836443 -803483 -778180 -775948 -760979 -767487 -763313 -762581 -744484 -717066
16370 -717066 -701626 -715264 -707423 -687718 -657495 -649690 -654734 -640116 -612997 -593269 -592779 -577265
16358 -577265 -573894 -568422 -564049 -549573 -519307 -499787 -482800 -468060 -434466 -431118 -418150 -428472
16346 -428472 -431821 -411749 -392051 -385759 -380663 -370322 -344886 -325400 -345250 -331676 -301351 -285293
16334 -285293 -266480 -244815 -260350 -233823 -222148 -175348 -185961 -191117 -161590 -156796 -179026 -163247
16322 -163247 -131587 -139210 -129581 -110741 -73722 -59389 -62099 -56351 -60994 -49305 -32266 -14887
16310 -14887 29536 8601 18673 38378 20029 49383 51485 68325 102164 86304 68359 84173
16298 84173 96276 103521 128216 149420 187156 181649 168320 173147 165377 167545 187235 222304 231415
16285 231415 244104 245711 259849 257466 274341 279033 287451 309850 290660 306956 339695 327388
16273 327388 337873 348888 361931 347784 350348 363071 396936 390600 395852 422267 414882 440721
16261 440721 453861 452072 458691 460144 445088 487268 473095 472714 478957 468755 495735 527016 529266
16248 529266 542609 532179 565071 576377 579150 568486 537748 551208 567930 596855 620939 613794
16236 613794 618582 615785 648319 642197 613255 632158 623444 651579 694864 684853 672278 695835
16224 695835 712239 706426 714560 747249 765725 728834 719786 720325 708096 748630 755260 731319 736352
16211 736352 758827 756645 750729 762397 766099 767454 790932 795772 803247 840260 862149 822435 823806
16198 823806 860206 879079 869906 848279 852801 856022 829189 839484 851616 852734 823557 866364
16186 866364 882941 858809 855552 861533 858736 872782 856860 866331 895040 889995 888206 878559 890999
16173 890999 914868 927114 920437 937189 952457 961118 912716 929665 932947 960369 953561 960626
16161 960626 965162 982789 979389 956920 968652 956711 966562 994717 950103 924324 929355 919773
16149 919773 946967 973362 1000269 978373 987546 967458 933259 951419 975390 1010590 1011225 1039217
16137 1039217 1050446 1046827 1056378 993615 1005305 1013073 1039449 995813 995019 983337 937334 947070
16125 947070 1025754 1068609 1028732 1027964 1014226 1031704 1049442 1081148 1063311 1042423 989058 1003727
16113 1003727 1069318 1071770 1057949 1044378 1090099 1102358 1075380 1041665 1046618 1019513 1045131 1055926
16101 1055926 1056593 1060549 1036310 1057530 1037406 1046787 1059379 1073213 1073452 1067909 1063675 1051061 1041866
16088 1041866 1083106 1113686 1093658 1058797 1081146 1087061 1076024 1078364 1055027 1078727 1059569 1052930
16076 1052930 1096175 1095226 1105776 1066039 1072601 1076078 1102349 1146609 1144458 1147053 1088810 1048714
16064 1048714 1050082 1076533 1081170 1097694 1092980 1048733 1093241 1089523 1051438 1037779 1075078 1077738
16052 1077738 1063008 1099747 1138667 1132039 1118708 1102483 1093412 1112687 1121215 1106299 1104709 1087220
16040 1087220 1077112 1156015 1124688 1087964 1140673 1146880 1101446 1057988 1050421 1092729 1097345 1111798
16028 1111798 1113167 1075851 1039153 1053599 1079431 1092652 1070959 1050259 1062944 1055278 1063910 1109339
16016 1109339 1090465 1104497 1106773 1098309 1105001 1114860 1135152 1109715 1096840 1112410 1116356 1084171
16004 1084171 1082476 1088928 1108576 1126266 1127399 1126441 1116458 1103179 1105841 1091336 1110403 1111708 1116386
15991 1116386 1110806 1091557 1076931 1108873 1105342 1071857 1110368 1106814 1089006 1115250 1122540 1103239
15979 1103239 1073188 1094206 1101405 1090348 1101475 1097722 1058514 1057103 1084269 1092058 1098582 1108555
15967 1108555 1097445 1091915 1091476 1093474 1094177 1101451 1110499 1081492 1071368 1080065 1093757 1062680 1109735
15954 1109735 1098315 1089984 1078054 1082375 1095294 1101428 1142260 1140328 1109776 1118979 1121576 1107385
15942 1107385 1107734 1086630 1050755 1064367 1086688 1119067 1125401 1127704 1133039 1088656 1069879 1090400
15930 1090400 1103711 1103743 1096907 1093937 1129813 1122372 1059157 1090821 1097162 1110251 1136645 1125167 1083515
15917 1083515 1057505 1080685 1082130 1129094 1118896 1138732 1115958 1084721 1083385 1071093 1053491 1056413
15905 1056413 1081096 1076916 1077749 1078083 1086045 1106972 1125358 1111244 1090260 1091916 1120079 1130152 1118115
15892 1118115 1128846 1128508 1116405 1143196 1104555 1060546 1075367 1060808 1088101 1123736 1130038 1125737
15880 1125737 1076855 1080945 1118626 1133305 1148664 1123877 1137963 1104905 1124112 1143912 1156948
15869 1156948 1114884 1118586 1145316 1130727 1142149 1144622 1145734 1127440 1075879 1091876 1117145 1112525
15857 1112525 1111869 1115066 1087146 1083104 1087034 1089437 1128232 1107357 1101974 1108373 1160981 1134930 1123908
15844 1123908 1126412 1107076 1112352 1111386 1153449 1122348 1101053 1145271 1111464 1117228 1117138 1125832 1112352
15831 1112352 1092939 1101920 1088918 1118812 1100590 1086758 1129776 1122300 1129203 1126525 1123702 1109350
15819 1109350 1133571 1135397 1163881 1112022 1103181 1107711 1106620 1109195 1102922 1123571 1126239 1141935 1089822
15806 1089822 1115555 1085769 1061249 1071211 1121383 1121938 1112135 1103442 1121692 1115562 1074793 1107243
15794 1107243 1105943 1110722 1133480 1130676 1114076 1121808 1118113 1072505 1093018 1096677 1114188 1129987
15782 1129987 1141318 1088802 1075608 1087054 1080606 1071567 1108730 1109318 1105845 1128626 1124939 1118914 1105961
15769 1105961 1111621 1120996 1146245 1126662 1126745 1132277 1137829 1144199 1118774 1112965 1119860 1110744 1110865 1134268
15755 1134268 1131234 1126266 1138920 1103139 1126583 1158596 1161093 1119336 1089774 1085770 1101454 1132359
15743 1132359 1067806 1055407 1068706 1096277 1109477 1076051 1112208 1106213 1135722 1124875 1103634
15732 1103634 1121165 1133906 1092413 1087518 1093778 1113808 1140639 1163196 1146264 1135785 1146213 1142927
15720 1142927 1155839 1139658 1126126 1135933 1149822 1160744 1122229 1132754 1153424 1173478 1133901
15709 1133901 1109272 1099234 1111486 1130563 1126586 1126666 1154198 1159415 1148259 1137929 1113241 1131069
15697 1131069 1159248 1153624 1136931 1124445 1101610 1098586 1111912 1118814 1126984 1175683 1139029 1115012
15685 1115012 1111173 1104119 1127964 1154288 1131074 1115560 1142202 1161471 1165681 1160892 1158397 1128825
15673 1128825 1123237 1136626 1161312 1156283 1127042 1125656 1132042 1106783 1126122 1151090 1132522 1159903
15661 1159903 1154608 1146562 1154836 1160222 1171002 1147442 1146069 1159893 1133253 1181137 1150783 1130281
15649 1130281 1117258 1120472 1111193 1134469 1182067 1169785 1180929 1154611 1101877 1139413 1129563 1091931
15637 1091931 1086479 1089331 1105805 1155493 1149926 1170910 1177906 1138371 1145764 1153936 1128659 1155171
15625 1155171 1171571 1146048 1112917 1121922 1135851 1129269 1110291 1134248 1178766 1172502 1162570 1160471
15613 1160471 1180016 1176585 1133041 1101495 1133358 1113396 1128151 1163373 1150707 1143576 1162486 1135028
15601 1135028 1132333 1094138 1109701 1173992 1186825 1149847 1143089 1170258 1159939 1128101 1090185 1103642
15589 1103642 1126529 1157194 1167612 1155874 1136987 1120067 1120536 1162187 1156246 1132904 1105249 1129854
15577 1129854 1120642 1124258 1172521 1160004 1149281 1174912 1146837 1132425 1152043 1145540 1137091 1130432
15565 1130432 1154793 1177545 1158867 1181817 1155366 1150160 1166714 1167002 1194436 1185576 1172410 1150166
15553 1150166 1169459 1170385 1117543 1143857 1150690 1148754 1138554 1138253 1174985 1137958 1164910 1161938 1191348
$$ [...]
##END NTUPLES=NMR SPECTRUM
##END=
