##TITLE=1H_EC-3298
 CDCl3
 8 sc, 
 13.7.2023
##JCAMPDX= 6.0         $$ Bruker NMR JCAMP-DX V2.0
##DATA TYPE= NMR SPECTRUM
##DATA CLASS= NTUPLES
##ORIGIN= UXNMR, Bruker Analytische Messtechnik GmbH
##OWNER= root
$$ XWIN-NMR		Version 3.5
$$ Thu Jul 13 14:11:31 2023 Russian Standard Time (UT+4h)  she@DPX200
##.OBSERVE FREQUENCY= 200.13135
##.OBSERVE NUCLEUS= ^1H
##.ACQUISITION MODE= SIMULTANEOUS
##.ACQUISITION SCHEME= undefined
##.AVERAGES= 8
##.DIGITISER RES= 18
##SPECTROMETER/DATA SYSTEM= spect
##.PULSE SEQUENCE= zg30
##.SOLVENT NAME= CDCl3
##.SHIFT REFERENCE= (INTERNAL, CDCl3, 0, 15.7282)
##AUDIT TRAIL= $$ (NUMBER, WHEN, WHO, WHERE, WHAT)
$$ ##TITLE= Audit trail, XWIN-NMR		Version 3.5
$$ ##JCAMPDX= 5.01
$$ ##ORIGIN= Bruker BioSpin GmbH
$$ ##OWNER= she
$$ F:/spectra/data/she/nmr/H-F/1/pdata/1/auditp.txt
$$ ##AUDIT TRAIL=  $$ (NUMBER, WHEN, WHO, WHERE, WHAT)
(   1,<2023-07-13 14:10:17.64 +0400>,<she>,<DPX200>,
      <created by zg, POWCHK disabled, PULCHK disabled
       configuration hash MD5:
       00 E9 B6 7A A2 85 ED C7 34 08 36 98 17 FE 4E 26
       data hash MD5: 16K
       A0 A8 DE D6 17 C8 42 EE BF E9 12 2E 72 E1 5C 96>)
(   2,<2023-07-13 14:10:26.20 +0400>,<she>,<DPX200>,
      <Start of raw data processing
       efp BC_mod = 2 LB = 0.24 FT_mod = 6 PKNL = 1 PHC0 = -20991.09 PHC1 = 11.65272 SI = 16K 
       data hash MD5: 16K
       BC 0A 7B 71 C4 63 9D A7 2C 4F EE AD 3A 9C 44 F9>)
(   3,<2023-07-13 14:10:43.32 +0400>,<she>,<DPX200>,
      <pk PHC0 = -1.503201 PHC1 = 1.8 
       data hash MD5: 16K
       44 0F 98 2F 8D 4E FE 57 13 EF 3D 4C FA 10 ED F1>)
(   4,<2023-07-13 14:10:46.81 +0400>,<she>,<DPX200>,
      <abs ABSG = 5 
       data hash MD5: 16K
       C4 81 3B 12 06 D3 1D FE 15 EB 7F 92 71 4F FA F3>)
$$ ##END=
$$ 
$$ hash MD5
$$ 32 CE 93 15 B4 CA 33 98 76 D3 7D 58 31 28 2A 78
##$RELAX= 
##$RELAX= 
##$RELAX= 
##$RELAX= 
##$RELAX= 
##$RELAX= 
$$ Bruker specific parameters
$$ --------------------------
##$DU= <F:/spectra>
##$EXPNO= 1
##$NAME= <H-F>
##$PROCNO= 1
##$TYPE= <nmr>
##$USER= <she>
##$AMP= (0..31)
100 100 100 100 100 100 100 100 100 100 100 100 100 100 100 100 100 100 
100 100 100 100 100 100 100 100 100 100 100 100 100 100 
##$AQSEQ= 0
##$AQ_mod= 1
##$AUNM= <au_zg>
##$AUTOPOS= <>
##$BF1= 200.13
##$BF2= 200.13
##$BF3= 200.13
##$BF4= 200.13
##$BF5= 200.13
##$BF6= 200.13
##$BF7= 200.13
##$BF8= 200.13
##$BYTORDA= 1
##$CFDGTYP= 0
##$CFRGTYP= 5
##$CHEMSTR= <none>
##$CNST= (0..31)
1 1 145 1 1 1 1 1 1 1 1 1 1 1 1 1 1 1 1 1 1 1 1 1 1 1 1 1 1 1 1 1 
##$CPDPRG= <>
##$CPDPRG1= <>
##$CPDPRG2= <>
##$CPDPRG3= <>
##$CPDPRG4= <mlev>
##$CPDPRG5= <mlev>
##$CPDPRG6= <mlev>
##$CPDPRG7= <mlev>
##$CPDPRG8= <mlev>
##$CPDPRGB= <>
##$CPDPRGT= <>
##$D= (0..31)
0 1.2 0 0 0 0 0 0 0 0.06 0 0.03 0 0 0 0 0.0002 0 0 0 0 0 0 0 0 0 0 0 0 
0 0 0 
##$DATE= 1689243017
##$DBL= (0..7)
120 120 120 120 120 120 120 120 
##$DBP= (0..7)
150 150 150 150 150 150 150 150 
##$DBP07= 0
##$DBPNAM0= <>
##$DBPNAM1= <>
##$DBPNAM2= <>
##$DBPNAM3= <>
##$DBPNAM4= <>
$$ [...]
##$SUBNAM3= <"">
##$SUBNAM4= <"">
##$SUBNAM5= <"">
##$SUBNAM6= <"">
##$SUBNAM7= <"">
##$SUBNAM8= <"">
##$SUBNAM9= <"">
##$SW= 18.05172834244
##$SWIBOX= (0..15)
0 0 2 0 0 0 0 0 0 0 0 0 0 0 0 0 
##$SW_h= 3612.71676300578
##$TD= 16384
##$TD0= 1
##$TE= 0
##$TE2= 300
##$TE3= 300
##$TEG= 300
##$TL= (0..7)
0 120 120 120 120 120 120 120 
##$TP= (0..7)
150 150 150 150 150 150 150 150 
##$TP07= 0
##$TPNAME0= <>
##$TPNAME1= <>
##$TPNAME2= <>
##$TPNAME3= <>
##$TPNAME4= <>
##$TPNAME5= <>
##$TPNAME6= <>
##$TPNAME7= <>
##$TPOAL= (0..7)
0.5 0.5 0.5 0.5 0.5 0.5 0.5 0.5 
##$TPOFFS= (0..7)
0 0 0 0 0 0 0 0 
##$TUNHIN= 0
##$TUNHOUT= 0
##$TUNXOUT= 0
##$USERA1= <user>
##$USERA2= <user>
##$USERA3= <user>
##$USERA4= <user>
##$USERA5= <user>
##$V9= 5
##$VALIST= <valist>
##$VCLIST= <CCCCCCCCCCCCCCC>
##$VD= 0
##$VDLIST= <DDDDDDDDDDDDDDD>
##$VPLIST= <PPPPPPPPPPPPPPP>
##$VTLIST= <TTTTTTTTTTTTTTT>
##$WBST= 1024
##$WBSW= 4
##$XGAIN= (0..3)
0 0 0 0 
##$XL= 0
##$YL= 0
##$YMAX_a= 290141
##$YMIN_a= -353491
##$ZGOPTNS= <>
##$ZL1= 120
##$ZL2= 120
##$ZL3= 120
##$ZL4= 120
##$ABSF1= 15.7502
##$ABSF2= -2.301649
##$ABSG= 5
##$ABSL= 3
##$ALPHA= 0
##$AQORDER= 0
##$ASSFAC= 0
##$ASSFACI= 0
##$ASSFACX= 0
##$ASSWID= 0
##$AUNMP= <proc_1d>
##$AZFE= 0.1
##$AZFW= 0.1
##$BCFW= 0
##$BC_mod= 2
##$BYTORDP= 0
##$COROFFS= 0
##$CY= -3
##$DATMOD= 1
##$DC= 0
##$DFILT= <>
##$DTYPP= 0
##$F1P= 0
##$F2P= 0
##$FCOR= 1
##$FTSIZE= 16384
##$FT_mod= 6
##$GAMMA= 0
##$GB= 0
##$INTBC= 1
##$INTSCL= 3.70164e-10
##$ISEN= 128
##$LB= 0.24
##$LEV0= 0
##$LPBIN= 0
##$MAXI= 10000
##$MC2= 0
##$MEAN= 0
##$ME_mod= 0
##$MI= 1.114404
##$NCOEF= 0
##$NC_proc= -6
##$NLEV= 6
##$NOISF1= 3.799351
##$NOISF2= 2.8
##$NSP= 0
##$NTH_PI= 0
##$NZP= 0
##$OFFSET= 15.72816
##$PC= 1
##$PHC0= -20992.59
##$PHC1= 13.45272
##$PH_mod= 1
##$PKNL= yes
##$PPARMOD= 0
##$PSCAL= 0
##$PSIGN= 0
##$REVERSE= no
##$SF= 200.130008682775
##$SI= 16384
##$SIGF1= 3
##$SIGF2= 2
##$SINO= 5.538805
##$SIOLD= 16384
##$SREGLST= <1H.CDCl3>
##$SSB= 0
##$STSI= 16384
##$STSR= 0
##$SW_p= 3612.71676300578
##$SYMM= 0
##$S_DEV= 0
##$TDeff= 16384
##$TDoff= 0
##$TI= <>
##$TILT= no
##$TM1= 0
##$TM2= 0
##$TOPLEV= 0
##$USERP1= <user>
##$USERP2= <user>
##$USERP3= <user>
##$USERP4= <user>
##$USERP5= <user>
##$WDW= 1
##$XDIM= 16384
##$YMAX_p= 273767523
##$YMIN_p= -269565
$$ End of Bruker specific parameters
$$ ---------------------------------
##NTUPLES= NMR SPECTRUM
##VAR_NAME=  FREQUENCY,     SPECTRUM/REAL,   SPECTRUM/IMAG
##SYMBOL=    X,             R,               I
##VAR_TYPE=  INDEPENDENT,   DEPENDENT,       DEPENDENT
##VAR_FORM=  AFFN,          ASDF,            ASDF
##VAR_DIM=   16384,         16384,           16384
##UNITS=     HZ,            ARBITRARY UNITS, ARBITRARY UNITS
##FACTOR=    0.220516191357247, 1,           1
##FIRST=     3147.67677824765, 0,            0
##LAST=      -465.039984758128, 0,           0
##MIN=       -465.039984758128, -269565,     0
##MAX=       3147.67677824765, 273767523,    0
$$ Real data points
##PAGE= N=1
##DATA TABLE= (X++(R..R)), XYDATA
$$ [...]
7626F16628p3280o0752O6791l8646j0452R5707N1573J9118k6192j7060M2679L6040
7614G02154J945m6509j23641J21024M3572j0067J2528q8135M933l6125l066n1447
7602E27166o267O4315N564K7006K0745O6033M1817R2413p472k5614J5965j22605
7590F99066Q6307N1868l2993o2054K2626l2604l1370j9396Q4512p020L8652m1278
7578G56316O8858M6091N0891m6488k9096R751o0040P4394o5075J32259L5012q086
7566I64787K410m7912N7129M1984J08924o9764n5855Q4718K0841P9310j1805M3920
7554A218687K9441n2130L2751j762j9859J25045J93765q6359j14193J05458J230
7543A432074P908j0191k1464Q3769k0751k6192P889J06467M5685O8464o124m5173
$$ y = [616628, 543348, 482596, 549387, 510741, 500289, 595996, 647569, 666687, 640495, 623435, 666114, 702154, 704099, 657590, 533949, 654973, 698545, 688478, 701006, 612871, 617804, 581679, 578613, 527166, 520899, 585214, 590778, 617784, 638529, 704562, 746379, 838792, 831320, 805706, 821671, 699066, 785373, 837241, 804248, 742194, 764820, 732216, 700846, 681450, 765962, 758942, 797594, 756316, 825174, 871265, 922156, 875668, 846572, 856323, 796283, 870677, 805602, 937861, 972873, 964787, 967197, 919285, 976414, 1018398, 1127322, 1057558, 1001703, 1086421, 1107262, 1186572, 1174767, 1218687, 1248128, 1195998, 1228749, 1226987, 1207128, 1332173, 1525938, 1439579, 1325386, 1430844, 1432074, 1439982, 1429791, 1408327, 1492096, 1471345, 1445153, 1453042, 1559509, 1605194, 1673658, 1667534, 1622361]
7531A622361Q7397M3098k5775n4463Q0538M3154k8701P6472L883k7395J25461
7520A946030p2421J9264J06095P562J02995P7448O598N111P4692L6611K2369Q6555
7508B418909O8586O0775M9110L9894m49M3012N1407O7977J2474M3320N0035J59810
7496C064860J05498r8879Q8762J16918K891L9830L1705M3600m6187J61435J70619
7485C681052L0067m8225J12150J24403J8001L9769J55173J00231O0614J83228
7475D456463K11956P8029L0259M0795J08850J33554J20604P6959M7098N0279J37168
7464E492014J21245L3716K06393J19058J72351J84358K1471J80192J64653M1126
7454F736577J57695K10380Q5322J34030J09260J46789J98196J74770K21025J22171
$$ y = [1622361, 1709758, 1752856, 1727081, 1672618, 1753156, 1796310, 1767609, 1844081, 1847964, 1820569, 1946030, 1873609, 1892873, 1998968, 2006530, 2109525, 2186973, 2193571, 2198682, 2273374, 2309985, 2332354, 2418909, 2487495, 2548270, 2597380, 2637274, 2636825, 2679837, 2731244, 2799221, 2811695, 2855015, 2905050, 3064860, 3170358, 3071479, 3160241, 3277159, 3280050, 3319880, 3351585, 3395185, 3348998, 3510433, 3681052, 3711119, 3662894, 3775044, 3899447, 3917448, 3957217, 4112390, 4212621, 4273235, 4456463, 4668419, 4746448, 4776707, 4817502, 4926352, 5059906, 5180510, 5257469, 5304567, 5354846, 5492014, 5613259, 5646975, 5853368, 5972426, 6144777, 6329135, 6350606, 6530798, 6695451, 6736577, 6894272, 7104652, 7189974, 7324004, 7433264, 7580053, 7778249, 7953019, 8174044, 8296215]
7444H296215N1739K64510K49162J52286J39514Q2246K7699J53365J77491J51690
7434I745917K30402Q4146O015J35717J85454P9711J09481J8238L522K1986J18505
7423A0739094L7797N4454J26770K2795L498L6462l1641j17445j42801N9274k5686
7412A0762571k10j80397j41147r1803J2000j66882j98592n4638O3054k14443j30889
7401I658624j27398k12245j75804j79121j07356j30068j73773j53134j28088j89890
7391H081747k32052k02858l1607j73837j00722j52866k95781o8898j76660j47872
7381F498594p5307r3314j59422j89976j21607j98045j40836o0808J15j22589j77899
7370E158906j97865j03501r3517q6059j03904p3336j53468p5010j22986j08993
$$ y = [8296215, 8347954, 8612464, 8861626, 9013912, 9153426, 9235672, 9263371, 9416736, 9594227, 9745917, 9976319, 10060465, 10066480, 10202197, 10387651, 10467362, 10576843, 10595081, 10598603, 10620589, 10739094, 10776891, 10831345, 10958115, 10980910, 10984408, 11020870, 10989229, 10871784, 10728983, 10788257, 10762571, 10762361, 10581964, 10440817, 10349014, 10361014, 10194132, 9995540, 9940902, 10003956, 9789513, 9658624, 9531226, 9318981, 9143177, 8964056, 8856700, 8726632, 8552859, 8399725, 8271637, 8081747, 7849695, 7646837, 7615230, 7441393, 7340671, 7187805, 6892024, 6823126, 6646466, 6498594, 6423287, 6329973, 6170551, 5980575, 5858968, 5660923, 5520087, 5459279, 5459394, 5336805, 5158906, 4961041, 4857540, 4764023, 4677964, 4574060, 4500724, 4347256, 4272246, 4149260, 4040267]
7360D040267n9730q7580m4511o3839j73576O1027p7762j04539q9532l4786m8711
7349C316728l3283j7458j62799j63088j6289K9487n9313r2366j15323M5205j17324
7338B614177j2135m1850j32271L3694m8149l0973J045q1759l0605L9229j54658
7327B155745j16005J8905j6260j34610L3653q1303N6042j8235k4931k4650P755
7316A856106o2265K8890o5267n2431J6007l7778N8317j06818o8086j0612j9637
7305A536426p7104N040m274j791o8740k408n3241j0172m2542Q3114R63m0321r7489
7292A227461m3454q1901j7500j194l5207J23141l608P5547j06951o7777J51777
7281A220334r899j05305j37761Q3762N9773j33099p5603j3419r497O8979k524
$$ y = [4040267, 3980537, 3892957, 3848446, 3784607, 3611031, 3672058, 3594296, 3489757, 3400225, 3365439, 3316728, 3283445, 3265987, 3103188, 2940100, 2923811, 2953298, 2893985, 2801619, 2686296, 2731501, 2614177, 2602042, 2560192, 2427921, 2461615, 2413466, 2382493, 2383538, 2301779, 2271174, 2310403, 2155745, 2039740, 2058645, 2042385, 1907775, 1941428, 1860125, 1916167, 1897932, 1873001, 1848351, 1856106, 1793841, 1822731, 1757464, 1705033, 1721040, 1683262, 1741579, 1634761, 1566675, 1556063, 1536426, 1459322, 1464362, 1460088, 1458297, 1389557, 1387149, 1333908, 1323736, 1281194, 1364308, 1365271, 1324950, 1227461, 1184007, 1102106, 1084606, 1083412, 1048205, 1171346, 1167738, 1243285, 1136334, 1068557, 1220334, 1210435, 1105130, 967369, 1051131, 1110904, 977805, 902202, 888783, 879286, 948265, 945741]
7270I45741J8697r6400K9808j8047k0430N7209k0038o902k6004Q920j8092q3243
7258G71219J00104R031p1735j3064k6214N750q9559Q381O9174p4518j5570j0132
7246F62867O2547j3431R845m5287o5364L3405q3548P713J34830q674o1614J7574
7234F50863k2539M3884n9089J9457J15689K6628l6366J0272m5249n0640k5765
7223F27145j8673R911Q5542l7884R899p94l6168Q5035J6657l2835k8654j49404
7211E29777k8589k2132J10644n024j6282O2892j40040k0496L1602L3584p5376
7200D60560N5123n9248j7628J08305J5522L4359j9469m9440R785Q6392l9839k7182
7188E57240o1487m5309o4966L1872Q3580l5116j32481L8444L4665m7541J9888
$$ y = [945741, 964438, 868038, 897846, 879799, 859369, 916578, 896540, 889638, 863634, 872554, 854462, 771219, 871323, 880354, 808619, 795555, 769341, 775091, 685532, 693913, 763087, 688569, 672999, 662867, 725414, 711983, 721828, 676541, 611177, 644582, 561034, 568747, 703577, 694903, 633289, 650863, 628324, 672208, 613119, 632576, 748265, 774893, 738527, 748799, 703550, 652910, 627145, 608472, 618383, 703925, 666041, 675940, 675146, 638978, 724013, 740670, 707835, 679181, 529777, 501188, 479056, 589700, 584676, 568394, 631286, 491246, 470750, 502352, 535936, 460560, 515683, 456435, 438807, 547112, 562634, 596993, 577524, 528084, 537869, 624261, 584422, 557240, 495753, 450444, 385478, 417350, 500930, 465814, 333333, 371777, 406442, 358901, 378789]
7177C78789N2886m2571P51M3557m0988k8696O8318L692j0492J8279l9151N3302
7165D57676q4414J5747m3858j6082J5892n0250o470K7477J36011n5645j39684
7154B56400J959P361J0156J36269j6226o9504L458j06052k544m4731j1947M7513
7142B12112j2988P5129J1479j48025N4560P9374p9220J14340M3042J4965o0466
7131C04302m4930o7085O6502M4637l3499R3180m1828j02559N4406j6543m1305
7120B15278R671r5252K1372J7668k9271l4039j1242L5373O4709l0506J6363J21384
7108C01508p8192M9592N5039j17898J1351R31j6716r1885k4366L3214J24851p1477
7096A75952L6998K6469l3994o4467q6572P1550m39o1762J34209m3419K6037M7697
$$ y = [378789, 431675, 389104, 389855, 433412, 392424, 363728, 432046, 435738, 425246, 443525, 404374, 457676, 373262, 389009, 345151, 329069, 344961, 294711, 288241, 315718, 451729, 396084, 256400, 258359, 265720, 275876, 412145, 395919, 326415, 329873, 223821, 221277, 176546, 164599, 212112, 199124, 274253, 285732, 137707, 192267, 271641, 192421, 306761, 349803, 364768, 304302, 259372, 192287, 258789, 303426, 269927, 363107, 321279, 218720, 273126, 256583, 215278, 224949, 129697, 151069, 168737, 139466, 105427, 94185, 129558, 194267, 163761, 180124, 301508, 223316, 272908, 327947, 210049, 221400, 222331, 205615, 113730, 89364, 122578, 247429, 175952, 212950, 239419, 205425, 140958, 54386, 125936, 125497, 63735, 197944, 154525, 180562, 228259]
7084B28259L0869J4360r2176R02m6978M3446K9035j0619P156O504n4613R8528
7072B54673J2851r8890r7272N5881J12224m8672j1774j7922n6479l668J2003k3775
7060H9180N4613o9816J4046K3989j9504L7168l7246P5411M4565j17466L1485J2714
7048A39139j11421J15326N7132j43274L8912J29774n9226j33764M6560Q5123n8304
7037A05977o4836K7181N2228Q7464n20p5126k9343J8303r9627m8812N6717P4247
7025A03853J8770m2366O3677p8767L2236L7027J1409j294Q5857l7994j48992r7915
7013e4499Q5856P1135p369j8860n9086m2011j5277M4385N3558M0465p215j16181
7001b5099Q5314j6780j0876j0843L7171N0588j09102N1044o190k4424J9128k2052
$$ y = [228259, 259128, 273488, 181312, 182214, 135236, 178682, 207717, 197098, 204254, 210758, 156145, 254673, 267524, 168634, 71362, 127243, 239467, 190795, 179021, 161099, 104620, 100952, 112955, 89180, 143793, 73977, 88023, 112012, 92508, 129676, 92430, 167841, 212406, 94940, 126425, 139139, 27718, 143044, 200176, 56902, 95814, 225588, 166362, 32598, 79158, 164281, 105977, 41141, 68322, 120550, 208014, 207494, 132368, 103025, 121328, 21701, -27111, 29606, 103853, 122623, 80257, 143934, 65167, 97403, 134430, 145839, 144545, 230402, 192408, 43416, -54499, 31357, 102492, 95123, 76263, 17177, -24834, -40111, 4274, 57832, 98297, 91082, -25099, 60215, 43435, 32559, 21716, 58887, 109475, 373, 51417, 45227, 20803, 39931, 17879]
6989A7879q0629K2568L1533N6995k0845j16585j0479N0154N8588O8104m2105r410
6977B5768p7656N4914M6094L9592J1344q956o1775K7790K1660K683L9235j7636
6965A03057n9385O821Q6751q9527L6036n1117K0013m0650J5627p3212N9102J2908
6953B6424O3984l9955J61j05031l1486K9999K3513J3686k6279R8799l2903j9614
6941A298k0031N3901r378m4953r185l2980J7633N7330K2507J5591q2219q364o0018
6928i8868j8194J06003R9072l9761q8806j8993N9449O3272K5030p2068j6624r7158
6916i7646J10933j301O3708K9294q0720O057Q4392k4640l1413k6169o7000o4221
6904i8726r874O5922O4262o2283m4294R6604n80L4655N4625q5733J5742o0653
$$ y = [17879, -62750, -40182, -8649, 48346, 27501, -89084, -99563, -49409, 9179, 77283, 35178, 25768, -51888, 3026, 49120, 88712, 100056, 91100, 29325, 57115, 78775, 81458, 120693, 103057, 43672, 50493, 137244, 47717, 83753, 32636, 52649, 11999, 27626, -45586, 13516, 26424, 90408, 50453, 50614, -54417, -85903, -55904, -32391, -18705, -44984, 53815, 20912, 1298, -18733, 35168, 25790, -19163, -28348, -61328, -43695, 13635, 36142, 51733, -30486, -38850, -98868, -117062, -11059, 88013, 48252, -40554, -59547, -98, 63174, 88204, 16136, -488, -97646, 13287, 11986, 75694, 104988, 24268, 30325, 114717, 90077, 58664, 32495, -34505, -98726, -108600, -42678, 21584, -40699, -84993, 11611, 11031, 45686, 100311, 14578, 30320, -30333]
6892c0333K2066L7584l7401J10212m9160n7750j1900j806Q8086K5270n9357J7042
6880E2553j07380J3368R1455L9058j08124m0152M5742m4642j079O5756n9287k4355
6868g7087L2509J961R0262n1314q75N4765L7971q1472k8823J6523L2318m3448
6856a6710M870m6224o9062j1380L2946L0978Q5094O6016r0183l5986j5146N3387
6844a1400r4595k9267P0195J07553j855p2950L8344o51k4316M0096o9921J3765
6832c5002q9557K6852P3792j3431k1281N9913K9388j02271j04385K9963J46560
6821E41r223j39039n2065R8199J17367r9524j07113L8488Q4858k6049l1050J45912
6809B1302k5997P9059m4599o6002K5761m0182r42R8296L9898p9403j6879o2402
$$ y = [-30333, -8267, 29317, -8084, 102128, 52968, -4782, -16682, -18488, 69598, 94868, 35511, 52553, -54827, -41459, 49996, 89054, -19070, -59222, -13480, -58122, -59201, 6555, -52732, -77087, -44578, -42617, 47645, -3669, -4544, 50221, 88192, 6720, -22103, -5580, 26738, -16710, -11840, -58064, -127126, -138506, -105560, -74582, 10512, 76528, -13655, -49641, -64787, -11400, -105995, -135262, -65067, 42486, 40631, -32319, 6025, 5374, -18942, 21154, -48767, -35002, -124559, -97707, -23915, -37346, -58627, 1286, 30674, -71597, -175982, -146019, 541, -8682, -147721, -199786, -101587, 15780, -83744, -190857, -152369, -67511, -93560, -124610, 21302, -4695, 74364, 29765, -36237, -10476, -50658, -51600, 46696, 86594, 7191, -9688, -72090]
6797g2090J4369q714p1839N6476M4959o3140p9130K52825l467j15560j5282n5937
6785a16530P8221j5063L8116l5534m3557l4852J16200p539q6593m9005N0991M4620
6773f0525M7328p857L868r07J9698Q606J6704Q8530p7254p4377j7275M7194M1102
6760C4835j2855j69913j8908N1994p0949J22099j4433K4646J17745j2885L814
6749E5190j7507n4362O9423k175q9346K0319k2440L5983L6215o0897J4668L9215
6737B4286k3543j1712k8999L579l2132M0956o6465k1616M2540J4346K5822q891
6725d1829P4131o480n6091j7186K7197Q3856M249q9963m5171M3385M8760K9949
6713E4807o6113Q789J20446p634l8347l6633n2989j03903Q3880N1104m8868o1951
$$ y = [-72090, -57721, -66435, -138274, -81798, -36839, -99979, -179109, 73716, 70249, -45311, -60593, -116530, -38309, -53372, -15256, -50790, -94347, -129199, -12999, -20538, -107131, -156136, -105145, -60525, -13197, -21054, -17186, -18093, 1605, 10211, 26915, 115445, 38191, -36186, -53461, -6267, 34835, 21980, -147933, -166841, -114847, -185796, -63697, -78130, -53484, 64261, 51376, 55190, 37683, -16679, 52744, 50569, -38777, -18458, -40898, -4915, 31300, -29597, -14929, 24286, 743, -10969, -39968, -36389, -68521, -27565, -94030, -115646, -73106, -58760, -32938, -41829, 32302, 25822, -30269, -47455, -20258, 63598, 67847, -22116, -67287, -23902, 24858, 54807, -11306, -2517, 117929, 110295, 71948, 35315, -17674, -121577, -37697, 13407, -35461, -97412]
6701i7412m3391J05158K4361J3m4130O5781o6864p5013N3612n0098K1211J16155
6689I383O2328M915m7837r8930k8716m0994J5709J05625J26961l6126o6988N4817
6677F0147j49236K169O6700l9565K8718n2027o4835j4872O7823M6242m147L663
6665d9220J8K3313m0063j3889N0716K1248j24891L0152R7956P3256n5732r4466
6653h1602L3823M3601J7679O0790j47010j9811J32411M4266j8996p9204K8702
6642A4649K1910j07372j4936J30867L573r001Q5958q6854j29209J1416M4375K4737
6630i887k6866o9387Q9010J8812m2302o3905j9870L3346J787P6360q057p651m1096
6617f9706P1835n4108N3124r432o5442J48826r5185j13242J2955K4533M6000L0182
$$ y = [-97412, -140803, -35645, -11284, -11271, -55401, 10380, -56484, -131497, -77885, -127983, -106772, 9383, 71711, 76626, 28789, -70141, -98857, -139851, -124142, -18517, 108444, 72318, 5330, 60147, -89089, -86920, -20220, -59785, -31067, -83094, -147929, -162801, -94978, -48736, -52883, -49220, -49202, -25889, -65952, -79841, -29125, -7877, -132768, -102616, -4660, 68596, 12864, -81602, -47779, -4178, 13501, 74291, -72719, -92530, 39881, 84147, 65151, -14053, 14649, 36559, -70813, -85749, 45118, 48691, 39690, 125648, 38794, -90415, -78999, -34624, -9887, -36753, -106140, -17130, 1682, -40620, -104525, -124395, -91049, -89262, -12902, -20959, -28610, -69706, 2129, -51979, 1145, -8287, -73729, 75097, -20088, -133330, -120375, -95842, -49842, -19660]
6605a9660J01334O537o6099p5008N756p3858P0118n749l9031m3134O9385J63891
6593I4482k2100q6074j7352o862m2486M3947L5879N6476p181r2787N2127N8198
6581F6267l9845k8631p3307J08396J07200j36516P596J7549k2956J2130J2721
6570C0604m4188j0869o8892o6247J09002N5094K6166j24802m0904K4217R1711
6559a9108M4553j44766R3135J0413n5195J517P6450k3229l5355j8276m5802J12771
6547b892M0526M5235k0393j11078J54428n8987j32783J21058o4476L5757m8696
6536d2301J1482o286K1161j4347j5979R15M9800J4630l3068o2814k2489R771P7194
6523a2331P1338q2033k3687r3286N2148M1466P6522N0203n8390j36293o9526K6317
$$ y = [-19660, 81674, 88211, 22112, -52896, -47140, -120998, -50880, -56629, -95660, -138794, -69409, 94482, 72382, -13692, -31044, -37906, -80392, -36445, -566, 55910, 48729, -44058, 8069, 66267, 26422, -2209, -75516, 32880, 140080, 3564, 11160, 28709, 5753, 17883, 30604, -13584, -24453, -93345, -159592, -50590, 4504, 30670, -94132, -135036, -110819, -19108, 25445, -119321, -26186, -15773, -70968, -69451, 6999, -16230, -51585, -69861, -115663, -2892, 37634, 82869, 62476, -48602, 105826, 46839, -85944, 35114, -29362, 6395, -42301, -30819, -37105, -15944, -30291, -46270, -45355, 4445, 19075, -13993, -76807, -99296, -89525, -12331, 59007, -23026, -46713, -139999, -87851, -46385, 30137, 80340, 21950, -114343, -183869, -157552]
6511a57552P1431R4413l9362n9012M9705r217J9979j5634L6641Q015M9511M1931
6499I0849l4064m5156K444P721p2741l8570J1516k4850L4269K1901J9566K0713
6487f402l6987M6949n5285o0593k9199m98O520R2510L1346m0433L8801k1931p5596
6474a10798J04037k3244o5625N0405K2188p865M8530j05063m7422J670N9139M7973
6462b6075Q373k3051j9127N2875k600j4914j02450n9362M2299N2982k879L4074
6450e9855L525J07220O7313j19532K9649k4719n0552J5327P797l3031j4147P1875
6438H70L5239q5919m7350l5642R7905M3934m3343r6615m8067M5157L5389K0631
6426g7811M2498L2295p3706O6461R9720j04067l6758R1237J0578q3032o483P6320
$$ y = [-157552, -86121, 8292, -31070, -90082, -40377, -49594, -29615, -45249, -8608, -593, 48918, 90849, 56785, 11629, 14073, 21794, -50947, -89517, -78001, -102851, -68582, -46681, -27115, -6402, -43389, 3560, -51725, -112318, -141517, -142015, -135495, -42985, -11639, -52072, -13271, -35202, -110798, -6761, -30005, -95630, -45225, -23037, -30902, 17628, -87435, -134857, -133187, -74048, -26075, -17702, -40753, -59880, -7005, -9605, -24519, -126969, -186331, -144032, -91050, -93929, -59855, -56330, 50890, 118203, -1329, 28320, 3601, -46951, -31624, -23827, -56858, -71005, 870, 36109, -49810, -97160, -132802, -34897, 9037, -34306, -130921, -178988, -133831, -98442, -77811, -35313, -3018, -76724, -10263, 89457, -14610, -51368, 39869, 50447, -32585, -39068, 37252]
6414C7252l3235J0512Q395m2663j2196j6798l1061R9234O5422n2154L5034L8610
6402A06352p2913p7203n9138M2965Q0267j00458J02362Q9003r8371l9644O3282
6391C6504J1217r6262N9368p3780l778j1328Q3568Q5181m9201K6958k3307M407
6379D9547q8735q5284O6270o033j05935L3257N7452m9309J52804p0611O6444n331
6367A4536n0894n8399l4562J02496o0412Q3694l7284j854L6777M5288k3958m3712
6355b8284J65477j05995j18311O229j2500M8651J07947l8416j30156j0945Q0996
6344c5307Q9725J7m4321l7421L8292J01803j17051q031l7778m6815L8080j40062
6332a98869j1419J74598K0854k9245P2532q5634l7608J20447L7223O0719l9116
$$ y = [37252, 4017, 14529, 22924, -19739, -31935, -48733, -79794, 19440, 84862, 32708, 67742, 106352, 33439, -43764, -102902, -59937, 20330, -80128, 22234, 111237, 12866, -26778, 36504, 47721, -48541, 10827, -62953, -66731, -78059, 5509, 90690, 41489, 68447, 45140, 49547, -39188, -124472, -58202, -64235, -170170, -136913, -79461, -128770, 24034, -46577, 19867, 14536, -36358, -94757, -129319, -26823, -87235, -3541, -40825, -42679, -5902, 39386, 15428, -28284, 137193, 31198, -87113, -80884, -93384, -44733, 63214, 24798, -105358, -116303, -35307, 54418, 54435, 10114, -27307, 10985, 112788, -4263, -12294, -50072, -96887, -58807, -198869, -210288, -35690, -14836, -44081, 28451, -57183, -94791, 25656, 62879, 123598, 84482]
6321H4482o1687m8651m23J3128L7637n8942q6673M2849L3894J23527r1218j7594
6309b9671l1607J56833P3528j45045p4360k946k2979l6012L8828P4063k6269q3286
6297a08923n4794J16261o4213k8556J06006J86864p6432j47150L0993J5392l0227
6286e4779n7717o8216k2629J54304L7361K0624J00720m9126k0747K7789n6310
6275A1274k0319p8398J02756M8743r3284M4580m2281M7439L4141j4161m637k1186
6263A4667o323o2684j2134N9258k4964k6469M2666j0123M5580M4260P867k2312
6251D9289L0362k4198k9744J14782k9400m3630j538O1504J11296p1136j9377q609
6239A39601Q519q3382J24540m8547j05424Q0097J2454n3139P9519l3844n9226
$$ y = [84482, 22795, -25856, -26279, -13151, 24486, -34456, -121129, -78280, -44386, 79141, -12077, -29671, -61278, 95555, 169083, 24038, -50322, -53268, -76247, -112259, -73431, 632, -25637, -108923, -163717, -47456, -111669, -140225, -34219, 152645, 76213, -70937, -39944, -24552, -54779, -112496, -180712, -203341, -49037, -11676, 8948, 109668, 60542, 39795, 67584, 11274, -9045, -87443, 15313, 64056, -29228, 15352, -26929, 20510, 54651, 40490, 35853, 14667, 8344, -54340, -66474, -7216, -32180, -58649, -15983, -26106, 19474, 63734, 71601, 49289, 79651, 55453, 25709, 140491, 111091, 67461, 65923, 127427, 238723, 167587, 148210, 139601, 148120, 64738, 189278, 140731, 35307, 115404, 127858, 74719, 154238, 120394, 61168]
6228F1168o3231j8953P3563k5496n367k3225n3914J03882K1301L1182J3366o5362
6216D8914j1729j2767k6330P76O7983J02931n7976l7401Q3772p4582n9983L6017
6204E9625P1042l7869j35939l1843n6749P6210L1745p5622O4124p0962N3877m5224
6192i7585N6610M652q5865L8564L1330j357P6848Q833q0524n7334J7007j2279
6180a01100J05223O646l9776j946q755N8409K8678J6037J5o9543M3115o0986J4609
6167i374L5381p6908K7075M0503j17222K7255J0434K2863R5656N0486l5715k5451
6155D4983J8945l6710o6367k4004o1133P8398q399M5945p7566j5078R7419o506
6143a0073L3962j1119L8152p8359p4333o3560Q9949j3007O5862M7394M5749n5329
$$ y = [61168, -2063, -21016, 52547, 27051, 21684, -1541, -55455, 48427, 69728, 100910, 114276, 48914, 37185, 24418, -1912, -1136, 66847, 169778, 111802, 74401, 158173, 83591, 23608, 59625, 130667, 92798, -43141, -74984, -131733, -55523, -23778, -99400, -35276, -106238, -52361, -97585, -40975, -36323, -122188, -83624, -52294, -53651, 23197, 32030, -48494, -105828, -88821, -101100, 4123, 10769, -29007, -30953, -39708, 18701, 47379, 63416, 63431, -6112, 37003, -23983, -9374, 26007, -50901, -23826, 16677, -100545, -73290, -62856, -39993, 55663, 106149, 70434, 44983, 63928, 27218, -39149, -63153, -124286, -45888, -54287, -8342, -85908, -100986, -3567, -10073, 23889, 12770, 50922, -27437, -101770, -165330, -75381, -88388, -22526, 24868, 70617, 15288]
6131A5288o0020l8825K2495J8564N2242L5391K4442o730n4925M7974M6472r1893
6119A0475P9448L58j63689k9233J19599N004K2573m1946O7603o7523j08085K2881
6107h2535N6609m0368M548L0322R4191M6852m3928k09041L3027J54153j29489
6096h5659j8246N1611P9259P1111O1939j2903m3246J1426n7774q8454Q6411K4849
6084H0324p5587M224M8944n5480q068P9472o9016k00341P0299J90418M2397k3894
6072H3692j04150M279O2984l6682j8811l8739K2031R780q1931J91934R8720p3847
6060A19260L792m3936o3184L5253k6950l1552L3869J1308l5854j09863O4263M663
6048c8931l0264M5613o9164q3468M6342J22046O403r9835M3689L1893M1505K0640
$$ y = [15288, -44732, -83557, -61062, -42498, 9744, 45135, 69577, 62847, 7922, 55896, 102368, 10475, 89923, 90281, -73408, -102641, 16958, 21962, 44535, 2589, 70192, 2669, -105416, -82535, -25926, -66294, -61746, -31424, 62767, 109619, 65691, -143350, -110323, 43830, -85659, -103905, -52294, 26965, 98076, 160015, 147112, 103866, 115292, 57518, -30936, 55475, 80324, 4737, 8961, 57905, 2425, -5643, 73829, 4813, -195528, -125229, 65189, 107586, 83692, -20458, -16179, 46805, 10123, -8688, -47427, -25396, -15616, -97547, 94387, 193107, 119260, 123052, 79116, 15932, 51185, 24235, -7317, 26552, 37860, 2006, -107857, -43594, -38931, -69195, -23582, -92746, -176214, -129872, -7826, -1423, -101258, -57569, -25676, 15829, 36469]
6036C6469N8015m9261J21568r7822L1046L0502n7950m7193N0548K1346k7908k7735
6024D1625j12414Q5756K7419p2251P380L9342K7500m582M6076O6868j25339k0906
6012F474L6198j13890q544J15754R5011j29833l1665M6345Q9441k3617k2039P4882
6000A34517j06750N8323L7496l6090m9999l5096O975J2335P302m4066j2125N8343
5988C1165P5637q9698m3533N8901N3255l5936K2719L0530m0228k5426Q8899j6980
5976A09305J4188q7327l5452q698l5796L1901L1484K3497j6235J4419l1561M8891
5964E8616K1763M250j6886o0740q0114O1873J03243J4556p2624R0395J4681M1059
5952A80072o5156p1125m7935P7652j8812R143J1368l9006q6197N7109R0945O4842
$$ y = [36469, 94484, 45223, 166791, 68969, 100015, 130517, 72567, 25374, 75922, 97268, 69360, 41625, -70789, 14967, 42386, -29865, -22485, 16857, 44357, 39775, 85851, 152719, 27380, 6474, 42672, -71218, -79762, 35992, 131003, 1170, -30495, 15850, 105291, 81674, 59635, 134517, 27767, 86090, 123586, 87496, 37497, 2401, 9376, 21711, 29013, -15053, -27178, 31165, 106802, 17104, -26429, 32472, 85727, 49791, 72510, 103040, 62812, 37386, 126285, 109305, 123493, 36166, 714, -7984, -43780, -11879, 19605, 43102, 26867, 41286, 9725, 58616, 80379, 84629, 67743, 7003, -73111, -11238, 92005, 106561, 33937, 124332, 139013, 180072, 114916, 43791, -4144, 73508, 54696, 63839, 75207, 36201, -49996, 7113, 98058, 162900]
5940A62900m9181J3318m5951l8252k4231o967Q7948N3212j01423j6453L6163K0912
5928I1995P8268L8435n5417j14359k6762R2315J0460k9522M2849r0340L4608J7848
5916I0378N4796O3642j43123o7212J1708q276l7757K10516K7433o8452K2049m7583
5904A08119O5464M3085o9997m9464L3454j0904Q079J4944P169J41198l5526r033
5892B46588Q11j32252J6061l6877J65573j4046k275k3129p9340P2640j7579r3856
5880A02319Q3491P7371K1282n8551K6399q9184N7080J17314p693l7022j00423
5869A92383k0619Q6214p981j4441J036l9006j7204M4374m9894J10564L9402n0409
5857B74419j198j0164O8585K9345K0089M4743p5949j20405P0921m773P5384N7054
$$ y = [162900, 113719, 127037, 81086, 42834, 18603, 11636, 99584, 152796, 51373, 34920, 71083, 91995, 170263, 208698, 153281, 38922, 12160, 104475, 114935, 85413, 128262, 37922, 72530, 90378, 145174, 208816, 65693, -1519, 10189, 1913, -35844, 174672, 202105, 133653, 155702, 108119, 173583, 216668, 146671, 97207, 130661, 119757, 127836, 142780, 149949, 291147, 255621, 246588, 247399, 115147, 131208, 94331, 259904, 245858, 243583, 220454, 141114, 213754, 196175, 102319, 185810, 263181, 284463, 225912, 252311, 163127, 220207, 337521, 329828, 292806, 192383, 171764, 257978, 249997, 235556, 236592, 197586, 180382, 224756, 174862, 285426, 324828, 274419, 273221, 263057, 331642, 360987, 381076, 425819, 349870, 229465, 300386, 295613, 370997, 428051]
5845D28051k7240L7861j06505O2134k0119j2133M5856J02545j3705L054J2610
5834E12409k9191P1756K4146L1728Q5649J39430m4673R1870J09405R7064j5904
5823A073689K2055n2804J2740L3593j22224j42460n2589L0888Q0159J8427k1792
5812H79682k4420M3020J67956p240J1405J42310P2305Q2251J73659P3552J35448
5801A749928K43685K32241L07412L34941M16542J58677k14287l42412k81839k89272
5791B315616j97582j68042j62065j4398n2812k9475J50422J75561P8375m0472
5781B055128q0851K14061K51403P6365J46547L27703K98036L88382M66796N60997
5771D704567Q13778Q36567P12642K63780n39382q04944q14281p04826m82466n05363
$$ y = [428051, 400811, 438672, 332167, 394301, 374182, 362049, 407905, 510450, 496745, 499799, 512409, 483218, 554974, 579120, 610848, 696497, 835927, 791254, 883124, 992529, 1089593, 1073689, 1095744, 1042940, 1055680, 1089273, 967049, 824589, 772000, 802888, 883047, 901474, 879682, 855262, 898282, 1066238, 1058998, 1070403, 1212713, 1285018, 1367269, 1540928, 1614480, 1749928, 1993613, 2225854, 2533266, 2868207, 3284749, 3443426, 3229139, 2886727, 2604888, 2315616, 2118034, 1949992, 1787927, 1773529, 1720717, 1691242, 1841664, 2017225, 2095600, 2055128, 1974277, 2188338, 2439741, 2516106, 2662653, 2990356, 3288392, 3676774, 4143570, 4704567, 5518345, 6354912, 7067554, 7331334, 6791952, 5987008, 5172727, 4467901, 3985435, 3480072]
5761C480072k40699q1838j27366p5616j30491p1721P1592N0635K8875N0450J73503
5750C127396K04368L19158K95786L79973M56868O78755Q70218J128500J232100
5741H693122P43023L2204q81877j275960j147572r03095p32858m51785k32754
5732C842448m37785j41790k95675o1182o5321r7849J81742k9095j5404R324K07848
5721C097261J25609K15150L38724K36310N42401P58843Q67199Q93399M75880j30974
5711G419802q37706r59159p62086p67737l99104l36658l06974j47387j76750j42589
5701B583652k1632j17773r0485p184n8801J20105l1371Q5366J2577Q4282J19809
5690B678545J18514J48221K14842K99935L28027K3062l30345n00370l59438l45699
$$ y = [3480072, 3239373, 3157535, 3030169, 2954553, 2824062, 2752341, 2823933, 2874568, 2903443, 2953893, 3127396, 3331764, 3650922, 3946708, 4326681, 4783549, 5462304, 6332522, 7461022, 8693122, 9436145, 9468349, 8586472, 7310512, 6162940, 5259845, 4526987, 4075202, 3842448, 3404663, 3262873, 2967198, 2906016, 2840695, 2742846, 2924588, 2895493, 2880089, 2889413, 3097261, 3222870, 3438020, 3776744, 4013054, 4555455, 5314298, 6181497, 7074896, 7550776, 7419802, 6582096, 5622937, 4860851, 4093114, 3694010, 3357352, 3050378, 2902991, 2726241, 2583652, 2562020, 2444247, 2353762, 2346578, 2287777, 2407882, 2376511, 2461877, 2474454, 2558736, 2678545, 2797059, 2945280, 3160122, 3460057, 3788084, 3811146, 3480801, 2980431, 2620993, 2275294]
5680B275294k79760j43595l8951k34172k12753j4525o5067j15503j09493j3673
5670A047802L9987k7634j12777m6052Q4674j518J9906N3969K2062j5372M5656
5659A110703K592J6122K1249j26919k8570p5217r6808Q6369r0975j36557n9940
5648F22049p7989j112o624J17871m5815J34248M4796K2006j70401j14994L6126
5637E60161k9882O4115j497J9476j6335l8491n9417K5360R2592O474P9934k2509
5625F79981n3805j56616Q9453L5590o4560m1674n6456J3305M9383J2547p7667
5614D29481Q5810p567J14926m4671l5650O7258L03j2670O950m7663k0758R1673
5602F27422m8764p0723q464J2699L750k7209O7798J7400m1104o5322L2951R9891
$$ y = [2275294, 1995534, 1851939, 1812988, 1578816, 1366063, 1351538, 1286471, 1170968, 1061475, 1047802, 1087789, 1060155, 947378, 901326, 986000, 984482, 1004388, 1058357, 1080419, 1065047, 1110703, 1113295, 1129417, 1150666, 1023747, 995177, 919960, 823152, 909521, 818546, 681989, 622049, 544060, 542948, 536324, 654195, 608380, 742628, 787424, 809430, 639029, 524035, 560161, 530279, 594394, 592897, 612373, 596038, 557547, 498130, 523490, 616082, 622556, 702490, 679981, 626176, 469560, 559013, 594603, 530043, 488369, 431913, 445218, 494601, 507148, 429481, 515291, 507724, 622650, 577979, 542329, 609587, 609890, 597220, 604170, 556507, 535749, 627422, 578658, 507935, 499471, 512170, 515920, 488711, 556509, 573909, 532805, 467483, 500434, 600325]
5590F00325r4519K8756P9164N0086n6036p7408M6405N5212l304L4673M7378O9705
5578G80437p2725n6234M9797J0435J2885K399j41118O2400M2286J6116o93M201
5566G10186J10841Q2412r4646j15257L0188l8802M1901L9297R754O424J84598
5555I66896m4157j50179L7659J47299j0573j15702J2851M1885L7490N4573j3830
5544I64212K9044l1651K4953Q7147J1016j28603l4451N0213l5731L3236J15328
5533A084713N2902j6827n9449k7401J9040L0165O7609J3484n758K6631J96925
5522A382034m911q9848k1498o8536N2100O8794L0316J19118N1445j46139K2231
5511A395106P8840j0165k4176K1253J29622J7819L4907Q8653l9586q3075J16410
$$ y = [600325, 505806, 534562, 613726, 663812, 607776, 530368, 576773, 631985, 628681, 663354, 710732, 780437, 707712, 651478, 701275, 711710, 724595, 726994, 585876, 648276, 690562, 706678, 705985, 710186, 821027, 903439, 808793, 693536, 723724, 684922, 726823, 766120, 775874, 782298, 966896, 922739, 772560, 810219, 957518, 946945, 831243, 844094, 885979, 923469, 978042, 964212, 993256, 961605, 986558, 1073705, 1084721, 956118, 921667, 971880, 936149, 969385, 1084713, 1137615, 1120788, 1061339, 1033938, 1052978, 1083143, 1150752, 1164236, 1158478, 1185109, 1382034, 1377123, 1287275, 1265777, 1197241, 1249341, 1318135, 1348451, 1467569, 1519014, 1372875, 1395106, 1473946, 1463781, 1439605, 1460858, 1590480, 1608299, 1643206, 1731859, 1692273, 1609198, 1725608]
5500A725608M7985j5842L6494m3448L8059Q4537L5000M1089O0012J77964J44915
5489B332373p4837Q1658J09312N2796P6337J50848Q1569J0625O3376L140J06016
5478B993213J17190K217R1885J13287n5321P4588J53235J8480L219J24139J70306
5467C806438L0765Q7409Q2703J26158N5767J29041J06160J71980R5162N3870J60881
5456D906334J16593J18322J55430K17112Q6448R596J86716K32794J85843Q8850
5446F304038O1701K82893K92287K12649J67660K09493K23761J72360K62419K82941
5436H472202K83956L31967K94763L15403L18958M12078K60204L37113M96211M64163
5426A1987018K77038M29547M22487N57303O11120N67554O82472O92448Q93902
$$ y = [1725608, 1773593, 1757751, 1794245, 1750797, 1788856, 1873393, 1908393, 1949482, 2009494, 2187458, 2332373, 2257536, 2339194, 2448506, 2501302, 2577639, 2728487, 2810056, 2820681, 2884057, 2887197, 2993213, 3110403, 3112620, 3204505, 3317792, 3262471, 3337059, 3490294, 3508774, 3511993, 3636132, 3806438, 3837203, 3924612, 4007315, 4133473, 4189240, 4318281, 4424441, 4596421, 4691583, 4745453, 4906334, 5022927, 5141249, 5296679, 5513791, 5600239, 5609835, 5796551, 6029345, 6215188, 6304038, 6365739, 6648632, 6940919, 7153568, 7321228, 7530721, 7754482, 7926842, 8189261, 8472202, 8756158, 9088125, 9382888, 9698291, 10017249, 10429327, 10689531, 11026644, 11522855, 11987018, 12264056, 12693603, 13116090, 13673393, 14284513, 14852067, 15534539, 16226987, 17120889]
5417A7120889R29188J055325J232418J211523J328245J629824J849014K045413
5409B8401839K487473K976225L507574M162992M738041N567279O511069P029326
5401F5381818O922768O284289N335736M782737N016697O017565P114731O972914
5393A13829255M235666n99137m969075p171758o980042n715107m812077m987726
5385H2829999o070437p381085p943699p518852o602182n508262m622711l794277
5377C3388494l180391k637058k268500j942767j657623j573679j328779j152443
5369A7647254r50889r49450j034627p89691o49733n74627o52787n43152m73428
5360A1028870o37851m16853n80894n29756k54918k49792l75433m23663l27815
$$ y = [17120889, 18050077, 19105402, 20337820, 21549343, 22877588, 24507412, 26356426, 28401839, 30889312, 33865537, 37373111, 41536103, 46274144, 51841423, 58352492, 65381818, 72304586, 78588875, 83924611, 88707348, 93724045, 99741610, 106856341, 113829255, 118064921, 117465784, 112496709, 105324951, 98344909, 92629802, 87817725, 82829999, 76759562, 69378477, 61434778, 53915926, 47313744, 41805482, 37182771, 33388494, 30208103, 27571045, 25302545, 23359778, 21702155, 20128476, 18799697, 17647254, 16696365, 15746915, 14712288, 13922597, 13272864, 12698237, 12045450, 11502298, 11028870, 10391019, 9974166, 9393272, 8863516, 8608598, 8358806, 7983373, 7559710, 7231895]
5351G231895l16771l38208k84501j20108j86087k07364j50390j79841j74398k13614
5341E060613j10603j57766j2285j1865j85074j61689q4020q6038o6546j51893
5331D032834j34853q1537j69013l0838j26790o8074j33434q0397J3717j87795
5321C033820j49967R3943o7826j02181j10212j27640j16212m2201n7424j32887
5311B221213J5036j9598j58623q9258o4504J2962P803N753k0960n7787J9226j01357
5299A769906k9591j14672k2263L2821m5926L4516K4331r9863p1840N5829o1432
5288A471816l3150n4146J0814k1033J22223L2122q2624j43216p8233m5593P9424
5277A258404p7117o0850l269j4295K2353j12989P5887o944J8419p9343O5549N9016
$$ y = [7231895, 6915124, 6576916, 6292415, 6172307, 5986220, 5778856, 5628466, 5448625, 5274227, 5060613, 4950010, 4792244, 4779959, 4768094, 4583020, 4421331, 4337311, 4251273, 4184727, 4032834, 3897981, 3816444, 3647431, 3616593, 3489803, 3421729, 3288295, 3207898, 3221615, 3033820, 2883853, 2977796, 2909970, 2807789, 2697577, 2569937, 2453725, 2411524, 2354100, 2221213, 2236249, 2216651, 2058028, 1968770, 1904266, 1917228, 1925031, 1930784, 1909824, 1852037, 1871263, 1769906, 1740315, 1625643, 1603380, 1636201, 1590275, 1624791, 1649122, 1549259, 1477419, 1533248, 1471816, 1438666, 1384520, 1395334, 1374301, 1496524, 1528646, 1446022, 1302806, 1224573, 1178980, 1258404, 1181287, 1120437, 1117168, 1102873, 1125226, 1012237, 1088124, 1081180, 1099599, 1020256, 1085805, 1144821]
5265A144821q2367q1319J309l4654J1604m3551M2892Q400L7963j8635j01709K0309
5253I05063M0531k9659m5621k6653J912j082J8996M041k3462m8162N475M430o8818
5240G36991L8967O0105m2837n5704M1116k7904p221n85Q034k8083Q491m8739L1630
5227G14261q8193Q7781q8113J20430k0996n3514K1763o8720J6108o250J03140
5216G37697o6235K8743l5453l3570O5293j06131M376j7039J069N4236j15677J17492
5204F34801j6206J380L5014P610l8422L3773j46106L7250Q4641l0533j055J0686
5192F12833j22658P2088j43374k1154R0153L8484O1693Q774j38012q5765K8203
5181D01265n609N6135n4160N8239M4496K9632K3047j2151J625l6673q0411P1009
$$ y = [1144821, 1062454, 981135, 982444, 947790, 959394, 915843, 958735, 967135, 1005098, 986463, 884754, 905063, 945594, 915935, 870314, 843661, 845573, 844491, 863487, 867528, 844066, 795904, 801379, 805809, 736991, 775958, 836063, 793226, 737522, 778638, 750734, 743513, 742928, 750962, 722879, 731370, 682631, 714261, 626068, 713849, 625736, 746166, 725170, 671656, 693419, 624699, 640807, 634557, 737697, 671462, 700205, 664752, 631182, 696475, 590344, 594720, 577681, 578750, 632986, 517309, 634801, 618595, 619975, 654989, 662599, 624177, 657950, 511844, 549094, 633735, 603202, 602147, 612833, 490175, 562263, 418889, 397735, 487888, 526372, 588065, 596839, 458827, 373062, 401265, 395656, 451791, 397631, 455870, 500366, 529998, 553045, 540894, 542519, 505846, 425435, 496444]
5169D96444o0077J169k3158N1996L5949o225l7706J949J06098m0846m9059j4353
5157D62181K9507n3431n0970J19738p2846l6015Q1200J5550r452l6503p3969o0187
5145C14803j7710J24545Q0173J7114r9753L4029O8029j59293K3468J00490M1566
5134E27461Q4133J0160m9183m0603O4003p0482j44913Q8004k5333J5098Q5142
5123E43487K2318N1887R0012p244n9991J49079k1715r4969l9232q0135k8586J14011
5111F38922n6659j09375O0701K497l2366N3363k4339q9199M5610L3086J6091J58635
5099F96967r533q0329r3948N0545J06807O570P8729N1559l7479M0339R1404K9109
5087I30740k50J19246J039j91004R5445P0786p5065r4304J09183j35941n3265
$$ y = [496444, 436367, 437536, 414378, 466374, 502323, 496098, 458392, 460341, 566439, 525593, 476534, 462181, 491688, 438257, 387287, 507025, 434179, 398164, 479364, 494914, 485462, 448959, 374990, 314803, 297093, 421638, 501811, 518925, 419172, 453201, 521230, 361937, 385405, 485895, 527461, 611594, 621754, 572571, 531968, 595971, 525489, 380576, 468580, 443247, 458345, 543487, 565805, 617692, 707704, 700460, 640469, 789548, 767833, 672864, 633632, 553497, 524911, 638922, 582263, 472888, 533589, 536086, 503720, 557083, 532744, 443545, 489155, 522241, 538332, 696967, 687434, 607105, 513157, 563702, 670509, 677079, 755808, 807367, 769888, 810227, 901631, 930740, 930490, 1049736, 1050775, 859771, 955216, 1026002, 950937, 856633, 965816, 829875, 776610]
5076G76610o4540J0377k8086J7141p276o6366j25440R204j17934r0094R3870K2609
5064D30075O6459m9704L8581n2339o4402k1522j7120N4594O4009j14582n1005
5053B83044Q001J7517n3013J3006n4063j3857J07287j3506J239r423J3315m3494
5041B56053N0856M625j7678n311l4328j48N769O8944J5040J251n9375K9647L4124
5028C49469r8329p9329J3751m1358O9855J6029K5246k5163l7233O2492Q3378K7424
5016C66232o6166L121J18810m8704N1996p1002o3225k7315K6128R864K2127K4149
5004C46015R9668k6663j03733J9424j25869M0544o182n17p161k6896M2464p0776
4992A80318R346o139K3254J6843J735Q055r0180J38198O2422K0112M9594n6956
$$ y = [776610, 712070, 722447, 694361, 711502, 704226, 637860, 512420, 521624, 403690, 313596, 407466, 430075, 496534, 446830, 485411, 433072, 368670, 347148, 330028, 384622, 448631, 334049, 283044, 291045, 308562, 255549, 268555, 214492, 200635, 307922, 294416, 295655, 286232, 299547, 256053, 306909, 311534, 293856, 288545, 254217, 254069, 259838, 328782, 343822, 345073, 285698, 315345, 349469, 251140, 171811, 185562, 144204, 214059, 230088, 255334, 230171, 192938, 255430, 338808, 366232, 300066, 303187, 421997, 373293, 425289, 354287, 291062, 263747, 289875, 299739, 321866, 346015, 445683, 419020, 315287, 334711, 208842, 249386, 243204, 242687, 235526, 208630, 251094, 180318, 189664, 183525, 206779, 223622, 225357, 233412, 143232, 281430, 343852, 363964, 413558, 356602]
4980C56602K2715K9422l9163K7689N268l8095Q6025L4546m5321m7503l5582J1320
4968C67923n8803J08676j09329p3189J07154P006k1560O0362L6499L5799M5943
4957E06481N7731o6751Q2206k280j07407O6531P3848n6514L1671k2276j9690Q5873
4945F29423j47837Q72l4290m6516K3662M5296L8096j10786J1110L8787L3267J36896
4933F17980J09671o3163R860N5965L6784j7794J32009m913n324j02685j8407O5832
4921H15815l9213n007r8457K6590K1741j46044J3313q969J3932J4878j0098K4822
4909F23303j7182J30252q542j19374n2447J02396O417J07903r503Q5339J2490
4898H61052q8723n5094j6417k6236j23864o0653J02520P0625k1222j34232R4712
$$ y = [356602, 379317, 408739, 369576, 397265, 402533, 364438, 450463, 485009, 439688, 392185, 356603, 367923, 309120, 417796, 308467, 235278, 342432, 349438, 327878, 388240, 424739, 460538, 506481, 564212, 497461, 579667, 577387, 469980, 536511, 610359, 553845, 585516, 563240, 543550, 629423, 481586, 482458, 448168, 401652, 425314, 470610, 508706, 397920, 409030, 447817, 481084, 617980, 727651, 664488, 674348, 730313, 767097, 749303, 881312, 876399, 871075, 768390, 749983, 815815, 776602, 771595, 673138, 699728, 721469, 575425, 588738, 579769, 593701, 608579, 598481, 623303, 606121, 736373, 727831, 608457, 556010, 658406, 664823, 772726, 763223, 848562, 861052, 772329, 717235, 700818, 674582, 550718, 490065, 592585, 663210, 641988, 507756, 602468]
4887F02468O7525l6064N000P4552k8436p4078J8572j432M8076m8172k2672Q016
4875F13355n42m754l1445k4847l5099J8443P252J46494o4847N690N0804m2867
4863F37637k202j4995K618J8090q001P6652M6950P029M2629K1144p9026j08149
4851F40376P0264k5534N8274o7737J12931M1001k4728J2043M575O6939M2754N7634
4839I88792k013j7746O4479k0880m2046R4693M5334p3182j4331m0082p7626m1236
4827H64156J08015J08122Q3175R090k2072K916O4831q7321N6048J88804j2040
4816A363724q9574N3350K0737P1899j3896K0556O4785j5337R4833q9223M8502
4805A530356P9001m384P3629L4101l0071j20439Q8082M5326j23960J03349J66821
$$ y = [602468, 669993, 633929, 638929, 713481, 685045, 610967, 629539, 628107, 676183, 628011, 605339, 613355, 612813, 608059, 576614, 551767, 516668, 535111, 542363, 688857, 624010, 629700, 680504, 637637, 635435, 620440, 623058, 641148, 633147, 709799, 756749, 763778, 806407, 827551, 748525, 640376, 710640, 685106, 743380, 675643, 788574, 829575, 804847, 816890, 821465, 888404, 931158, 988792, 986779, 969033, 1033512, 1012632, 970586, 1065279, 1110613, 1037431, 1023100, 983018, 905392, 864156, 972171, 1080293, 1163468, 1172558, 1150486, 1153402, 1218233, 1130912, 1186960, 1375764, 1363724, 1274150, 1327500, 1348237, 1420136, 1406240, 1426796, 1491581, 1476244, 1571077, 1481854, 1530356, 1609357, 1604973, 1678602, 1712703, 1682632, 1562193, 1650275, 1695601, 1571641, 1674990, 1841811]
4794A841811J58052N9350M3593M0963J30495J44337M1147K15203K94956K73300
4784C243207L75987N58473N85972K50985j25255m83895l54441m42849m37295l42405
4774B828484j68617p9435m6071r7620j49096n9686n9512j19459O2916K2760k8990
4763B105674M8175J39425J3009r4503k1549l7255J8243O804O6N8759R5419K8665
4751B360932R3555o8393l9985Q5168k4488J71039N4803m1569J18555J17357J22749
4740B949723J01564K8850R2208O2314J24856O2034R0264K80321K56343K35721
4730D284198K12098K56332R3585R1525J3969m4404K68013N39183M70495L13627
4720F498621M1285j6535k09865l65105n59912l60899j08155k01375j70225n9591
$$ y = [1841811, 1999863, 2059213, 2102806, 2143769, 2274264, 2418601, 2459748, 2674951, 2969907, 3243207, 3619194, 4177667, 4763639, 5014624, 4889369, 4405474, 4051033, 3608184, 3170889, 2828484, 2659867, 2580432, 2534361, 2436741, 2287645, 2227959, 2168447, 2048988, 2111904, 2134664, 2105674, 2153849, 2293274, 2306283, 2211780, 2190231, 2152976, 2171219, 2178023, 2178089, 2236848, 2332267, 2360932, 2454487, 2386094, 2346109, 2431277, 2406789, 2577828, 2632631, 2591062, 2709617, 2826974, 2949723, 3051287, 3080137, 3172345, 3234659, 3359515, 3421549, 3511813, 3792134, 4048477, 4284198, 4496296, 4752628, 4846213, 4937738, 4951707, 4907303, 5175316, 5714499, 6184994, 6498621, 6539906, 6523371, 6313506, 5948401, 5388489, 5027590, 4919435, 4718060, 4547835, 4488244]
4710D488244O0245m4533k076J1526j18923O7816M4431J54100Q2094Q6202N701
4699D834827K3887K69202O1228N8494J33853P2761J05659Q9045J20321J25027
4689E894304J85910J98057K07734J12420P0458J88489J92983J98713J48151J14509
4679G511728J73154J55442J92440K36827L21261L11460L38147K66447M06870M42417
4669A0356193L77512M07305M54203N97616P29829P26590P90530R67041J004496
4660A6411315J123954J336646J627832J680833J787886J672634J223904P94310
4652B7659314N84755M29381M46071P58300N52855j5355l36311o96659n03674m84972
4642B8393705j46283r959L56469P96192Q52155J289773J897487K207145K408310
$$ y = [4488244, 4548489, 4503956, 4501880, 4513406, 4394483, 4462299, 4506730, 4660830, 4742924, 4829126, 4834827, 4858714, 5127916, 5189144, 5247638, 5381491, 5454252, 5559911, 5648956, 5769277, 5894304, 6080214, 6278271, 6486005, 6598425, 6668883, 6857372, 7050355, 7249068, 7397219, 7511728, 7684882, 7840324, 8032764, 8269591, 8590852, 8902312, 9240459, 9506906, 9913776, 10356193, 10733705, 11141010, 11595213, 12192829, 12922658, 13649248, 14439778, 15406819, 16411315, 17535269, 18871915, 20499747, 22180580, 23968466, 25641100, 26865004, 27659314, 28244069, 28673450, 29119521, 29877821, 30430676, 30415321, 30079010, 29382351, 28878677, 28393705, 28247422, 28237463, 28593932, 29390124, 30242279, 31532052, 33429539, 35636684, 38044994]
4633C8044994K734747K988424K921555K595819K645775K849003L306035L978190
4625F2064542M039713L784084K676723M5388l229211n690870o319308n803052
4617E1568009m726579l389142k407370j786039j147036n71135r9250L21964P72291
4608C8535713J384993K018805K710464L328512L926628M314295L906255K537533
4600F2663198J076548k7172j414970k748848l986025m939600n113401m718250
4592D0791480m010870l281442k706479k280206j928677j655861j427876j262523
4584B2237546q97224q14039q12933m19664n25066n02806l33924m65136k01520
4575A7265234j29710k17696p0745k6254r6957k2694j7330j7919J56582J47831
$$ y = [38044994, 40779741, 43768165, 46689720, 49285539, 51931314, 54780317, 58086352, 62064542, 66104255, 69888339, 72565062, 72610450, 69381239, 63690369, 57371061, 51568009, 46841430, 43452288, 41044918, 39258879, 38111843, 37540708, 37441458, 37763422, 38535713, 39920706, 41939511, 44649975, 47978487, 51905115, 56219410, 60125665, 62663198, 63739746, 63712574, 62297604, 59548756, 55562731, 50623131, 45509730, 40791480, 36780610, 33499168, 30792689, 28512483, 26583806, 24927945, 23500069, 22237546, 21340322, 20526283, 19713350, 19293686, 18768620, 18265814, 17931890, 17466754, 17265234, 17135524, 16917828, 16847083, 16820829, 16723872, 16701178, 16683848, 16665929, 16822511, 16970342]
4565A6970342J36617J71298J28869J49039L40994M29649N03673N93701O32839
4556B0057021P13914R01546J086530J115326J219175J580680J726371K016933
4548C0417496K248371K328733K355454K308018K494236K529569K438945K230799
4540D9351621J967134J705282J004014N29382J48258j23386o16713j067558j311071
4531E1586963j184660j118360j101893q22740n88979j22649J88861N89214J009831
4522D8435588J155050J180921J180656J186767J672445J897799J963616J875038
4514F0547880J119386K95210m23519j145200j447678j290407j368761j511214
4506E4775697j686883k096339k355098k383956k263850k034096j616545j374334
$$ y = [16970342, 17106959, 17278257, 17407126, 17556165, 17897159, 18326808, 18830481, 19424182, 20057021, 20770935, 21672481, 22759011, 23874337, 25093512, 26674192, 28400563, 30417496, 32665867, 34994600, 37350054, 39658072, 42152308, 44681877, 47120822, 49351621, 51318755, 53024037, 54028051, 54557433, 54705691, 54582305, 53965592, 52898034, 51586963, 50402303, 49283943, 48182050, 47359310, 46770331, 46647682, 46836543, 47425757, 48435588, 49590638, 50771559, 51952215, 53138982, 54811427, 56709226, 58672842, 60547880, 61667266, 61962476, 61538957, 60393757, 58946079, 57655672, 56286911, 54775697, 53088814, 50992475, 48637377, 46253421, 43989571, 41955475, 40338930, 38964596]
4498C8964596j216559j016101q95623p96414m38968k99168r8494L8843m1429j83135
4488C4017548l72695l57050m19148m26741j75346k31576m10829o55763p36908
4479C0231492r66620r69547p96259o85207o25077n73791n00834n15861m01152
4470B4197144k52300j10597j78953j10219J31514K62895J17319K83182J84888
4461B4524873L23569M25474L54261N82424N59170N69689Q78764Q97166R12722
4452C0028112J006336J180233J171678J394355J556431J858613K405674K769186
4444D3370618L072425L657033M222865M600460M916845N637491O804342Q348099
4436H4630178J0452448J3448881J7338100K2530719K8998336L5206594L6775539
$$ y = [38964596, 37748037, 36731936, 35836313, 35039899, 34600931, 34301763, 34203269, 34242112, 34200683, 34017548, 33644853, 33287803, 32868655, 32441914, 32266568, 32034992, 31624163, 30968400, 30231492, 29264872, 28295325, 27499066, 26813859, 26188782, 25614991, 25114157, 24598296, 24197144, 23944844, 23834247, 23655294, 23545075, 23676589, 23939484, 24056803, 24339985, 24524873, 24848442, 25273916, 25628177, 26210601, 26769771, 27339460, 28218224, 29115390, 30028112, 31034448, 32214681, 33386359, 34780714, 36337145, 38195758, 40601432, 43370618, 46443043, 50100076, 54322941, 58923401, 63840246, 69477737, 76282079, 84630178, 95082626, 108531507, 125869607, 148400326, 177398662, 212605256, 249380795]
4429B49380795K4386728l655475k8447629l7468351l5186715k8358286k2007649
4422A18643418j6959695j3302708j0583358q485426o716378n712711m766735m131409
4414D7984998l819769l261563k863554k597263k153292j926521j860236j599663
4406B7903137j317541j297647j185697r65333j004238r10253q75140q61197p87599
4397A8698492q76858p77735q73947p03777p57447n58624o02669m65098m64494
4388A2617843m80479m76855l42733m07126l52040l63327l80325k10522k34483
4379I369953k45601j89306l5272j45631j42217k87539k44377j34413P378k08179
4369G744796j70559j87557k11913j11287j29454k34174j55639k26406j57081l7686
$$ y = [249380795, 273767523, 270112048, 241664419, 204196068, 169009353, 140651067, 118643418, 101683723, 88381015, 77797657, 69312231, 62595853, 56883142, 52116407, 47984998, 44165229, 40903666, 38040112, 35442849, 33289557, 31363036, 29502800, 27903137, 26585596, 25287949, 24102252, 23136919, 22132681, 21222428, 20347288, 19486091, 18698492, 17821634, 17043899, 16169952, 15466175, 14708728, 14150104, 13547435, 13082337, 12617843, 12137364, 11660509, 11317776, 10910650, 10558610, 10195283, 9814958, 9604436, 9369953, 9124352, 8935046, 8899774, 8754143, 8611926, 8324387, 8080010, 7945597, 7952975, 7744796, 7574237, 7386680, 7174767, 7063480, 6934026, 6699852, 6544213, 6317807, 6160726, 6123040]
4359F123040k8211j65816j45987N140o1670j05376j28382q1470j20055j64554
4349E126659j39131K45j31362r8040Q0873m0560k18114j07243l0533p7886L4867
4338D399775M1242L914j64310m4422k2903n6581k8708p3648j05917K8139P0969
4327D047550j42973r067L6089j37918l3228n4382k5741m9324r3133k3248K014
4316C516639Q1397l7528k0075j16978n3624j6092k6163n0188q3714j35751q5367
4305B972556m279M3156K3158R581o3212k4770k0782J4558l5260j36311N5033L7877
4293B871305P6897j83431n2454M3477N0996k2832j35329N9554n7277J5473N5354
4282B721733r3419l6539L9001l0629n4389p493M9753m6358o413L7281Q4344L1163
$$ y = [6123040, 6094829, 5929013, 5783026, 5788166, 5726496, 5621120, 5492738, 5411268, 5291213, 5126659, 4987528, 4987773, 4856411, 4758371, 4839244, 4798684, 4580570, 4473327, 4442794, 4364908, 4399775, 4441017, 4444931, 4280621, 4236199, 4213296, 4156715, 4128007, 4054359, 3948442, 3976581, 4047550, 3904577, 3895510, 3931599, 3793681, 3760453, 3706071, 3680330, 3631006, 3537873, 3514625, 3516639, 3598036, 3560508, 3540433, 3423455, 3369831, 3353739, 3327576, 3277388, 3193674, 3057923, 2972556, 2968277, 3011433, 3034591, 3044172, 2980960, 2956190, 2935408, 2949966, 2914706, 2778395, 2833428, 2871305, 2948202, 2764771, 2712317, 2755794, 2806790, 2783958, 2648629, 2708183, 2650906, 2666379, 2721733, 2628314, 2591775, 2630776, 2600147, 2545758, 2538265, 2588018, 2541660, 2535247, 2572528, 2656872, 2688035]
4270B688035j23985q2329J08482K6907R179L6851l784O163K7880R3326L3108n4503
4258B765330l351L5777N6093J76154O3406N3525L6328J06038j0220l6418J12309
4247C354971L6226j20626J21707L6136N5055Q0369J39271R305j33567Q0250O3342
4236C722439r0572n3778n5008j1722j7611l2682l8251j48562q5155q2401J914
4225C108611k3734P762p0009m0047k4253l3983Q277p6258j1515l7535K4678m4971
4213B787023l4015p5734K9569L0335n7517M0046k0629M0624j50008P6169N7079
4202B722942L080L2014L8917N2054m2510O7230J1726r9715N8124K1536L8128j1448
4190B892078p6148Q0757J24658L6482r4634N1301N2652P6594m4609r0289J03879
$$ y = [2688035, 2564050, 2481721, 2590203, 2617110, 2626289, 2663140, 2659356, 2665519, 2693399, 2786725, 2819833, 2765330, 2761979, 2797756, 2853849, 3030003, 3093409, 3146934, 3183262, 3289300, 3279080, 3242662, 3354971, 3391197, 3270571, 3392278, 3428414, 3483469, 3563838, 3703109, 3712414, 3578847, 3659097, 3722439, 3631867, 3578089, 3523081, 3511359, 3493748, 3461066, 3422815, 3274253, 3189098, 3106697, 3108611, 3084877, 3092639, 3022630, 2982583, 2958330, 2924347, 2932624, 2856366, 2844851, 2807316, 2831994, 2787023, 2753008, 2677274, 2706843, 2737178, 2679661, 2719707, 2699078, 2739702, 2589694, 2665863, 2722942, 2726022, 2758036, 2796953, 2849007, 2806497, 2873727, 2885453, 2785738, 2843862, 2865398, 2903526, 2892078, 2815930, 2896687, 3021345, 3057827, 2963193, 3014494, 3067146, 3143740, 3099131, 3008842, 3112721]
4179C112721J09697n454r871j03662J5402J01065k8974K5985J20957N1634l8118
4168C351382M9728Q3036j09285L9928J37429L4657O4586O9803L8321q1266l570
4157C674749J4622M4524Q1319K01090O9826K6184J05345q3539K8966Q3402p428
4146D239060J33221J27417L4227M1P6198J53665J67746M5942J80367O5162J67774
4135E390820J42990Q0850J07765J00736K18771J32142K23660K59144K28697K35309
4125G120884K66432J18608j74724n087N8246r4657l3361O6831M6274J45312J66259
4114G681017M1248Q8748J85850O3931O1184J53058J74816J74678J74906J29722
4104H929158J35520J97723L41919K00856J14407L57443L33960J32437J87278L19771
$$ y = [3112721, 3222418, 3216964, 3207093, 3103431, 3118833, 3219898, 3190924, 3216909, 3337866, 3389500, 3351382, 3401110, 3484146, 3374861, 3414789, 3552218, 3586875, 3651461, 3721264, 3759585, 3678319, 3674749, 3689371, 3733895, 3815214, 4016304, 4086130, 4112314, 4217659, 4134120, 4163086, 4246488, 4239060, 4372281, 4499698, 4533925, 4533966, 4610164, 4763829, 4931575, 4977517, 5157884, 5223046, 5390820, 5533810, 5614660, 5722425, 5823161, 6041932, 6174074, 6397734, 6656878, 6885575, 7120884, 7387316, 7505924, 7331200, 7326113, 7384359, 7289702, 7256341, 7323172, 7369446, 7514758, 7681017, 7722265, 7811013, 7996863, 8060794, 8121978, 8275036, 8449852, 8624530, 8799436, 8929158, 9064678, 9262401, 9604320, 9805176, 9919583, 10277026, 10610986, 10743423, 10930701, 11250472]
4094A1250472K51820K77155L80304M06789L46852L94970M76563M15584M13627
4085A4614136N33721P40950N75432N95226O58055O82285Q09121Q18005R48438
4076B0975369R14184R08787J054950R85407J206431J392287J317691J390574J297687
4067C1443367J483495J453413J487364J498689J686621J578072J715798J661591
4059D4008410J784960J955702J953173K090885K020875J967300K019395J869548
4051E9670248J762025J748230J457422J374694J432264J354027J317759J430480
4043G1547149J466083J361902J307287J131524R95803Q36989N51646K09332o131
4034G9401584l12078l69075l93531m75360n31431m65994m60448m98899o54112
$$ y = [11250472, 11502292, 11779447, 12159751, 12566540, 12913392, 13308362, 13784925, 14200509, 14614136, 15147857, 15888807, 16464239, 17059465, 17717520, 18399805, 19208926, 20026931, 20975369, 21889553, 22798340, 23853290, 24838697, 26045128, 27437415, 28755106, 30145680, 31443367, 32926862, 34380275, 35867639, 37366328, 39052949, 40631021, 42346819, 44008410, 45793370, 47749072, 49702245, 51793130, 53814005, 55781305, 57800700, 59670248, 61432273, 63180503, 64637925, 66012619, 67444883, 68798910, 70116669, 71547149, 73013232, 74375134, 75682421, 76813945, 77809748, 78646737, 79198383, 79407715, 79401584, 79089506, 78720431, 78326900, 77851540, 77320109, 76854115, 76393667, 75894768, 75240656]
4025G5240656p48894q44307j029320j303745j440825j585342j762546j638020
4017F4887657j509725j551505j418729j338922j478398j381117j329176j229772
4009E3650313j163843j236658j279771j271724j169823j085547j017904r18045
4001D4506998r51562p53566o79441m52200l38363k74413j44275j29028j42699
3992D0641451N4811J02230J41895L55158L63799N15215N18085Q05100P74914R56458
3982D5229116J178590J219739J491708J574382K038760K301227K724192L120011
3974F0877725L539690M222018M779067N405592O421152P419684Q601481J0207909
3966A11474318J2206440J4498450J6837792J8700033J9664131J8457988J5279392
$$ y = [75240656, 74491762, 73647455, 72618135, 71314390, 69873565, 68288223, 66525677, 64887657, 63377932, 61826427, 60407698, 59068776, 57590378, 56209261, 54880085, 53650313, 52486470, 51249812, 49970041, 48698317, 47528494, 46442947, 45425043, 44506998, 43555436, 42801870, 42122429, 41670229, 41331866, 41057453, 40913178, 40784150, 40641451, 40696262, 40798492, 40940387, 41295545, 41659344, 42174559, 42692644, 43497744, 44272658, 45229116, 46407706, 47627445, 49119153, 50693535, 52732295, 55033522, 57757714, 60877725, 64417415, 68639433, 73418500, 78824092, 85245244, 92664928, 101266409, 111474318, 123680758, 138179208, 155017000, 173717033, 193381164, 211839152, 227118544]
3959B27118544J0292008M860130k74927l806749n951807o912517o518729n425094
3951B13380859l944355k409958j194014m35973n13664j314568k808169n308708
3943A95451450q510172j1553528j3781022j5095197j4994647j3880614j2324639
3936A05311631j0623799q883798p680919o519754n591686m847630m251395l762127
3928E3150523l307855l040344k636940k354954k161039j899331j830693j623252
3920C4296115j400716j259729j217788j088611j105023r90339q63160q87413r23761
3911B4559575q08003o56458p20810o14071o49207o59913m65332n27376l92009
3902A9066396n17739m35250l30351l33840l67296k21915l40446n16351l49389
$$ y = [227118544, 237410552, 242270682, 241995755, 238189006, 232237199, 225324682, 218805953, 213380859, 209436504, 207026546, 205832532, 205396559, 204882895, 203568327, 200760158, 195451450, 186941278, 175387750, 161606728, 146511531, 131516884, 117636270, 105311631, 94687832, 85804034, 78123115, 71603361, 66011675, 61164045, 56912650, 53150523, 49842668, 46802324, 44165384, 41810430, 39649391, 37750060, 35919367, 34296115, 32895399, 31635670, 30417882, 29329271, 28224248, 27233909, 26370749, 25483336, 24559575, 23751572, 23095114, 22374304, 21760233, 21111026, 20451113, 19985781, 19458405, 19066396, 18548657, 18113407, 17783056, 17449216, 17081920, 16860005, 16519559, 16003208, 15653819]
3893A5653819k24003k33417l58873k31105l43149j98748j80874k74917l24004
3884A3284729k89700j96836k21468l62006k51443k67463k39307j33576j88708
3875A1134222k45826k81428j78022j80216k21267j99645j75449r2341j74668k09427
3865I175933j15557j14543l3127j14058j78889j7643m8384k20821k21082j00157
3855H011672o6359q4400p0316r5487j12350q314k7930j33443J813O43j11469j48620
3843G155440k1757q6357p1365k4506m8504o2065o9130j58705j68588N7752n1341
3832F450874m5869l0665q0889K9253j4610j20026o9887J4601j03873r262l7088
3821E982559r1762j53683n0235J1816J6961m4319M7566O5455j74242j0588J6481
$$ y = [15653819, 15429816, 15196399, 14837526, 14606421, 14263272, 14064524, 13883650, 13608733, 13284729, 12995029, 12798193, 12576725, 12214719, 11963276, 11695813, 11456506, 11322930, 11134222, 10888396, 10606968, 10428946, 10248730, 10027463, 9827818, 9652369, 9560028, 9385360, 9175933, 9060376, 8945833, 8912706, 8798648, 8619759, 8602116, 8553732, 8332911, 8111829, 8011672, 7945313, 7860913, 7790597, 7695110, 7582760, 7574446, 7546516, 7413073, 7414886, 7415529, 7304060, 7155440, 7133683, 7047326, 6975961, 6951455, 6902951, 6840886, 6771756, 6613051, 6444463, 6502215, 6450874, 6405005, 6374340, 6293451, 6322704, 6308094, 6188068, 6118181, 6132782, 6028909, 6019647, 5982559, 5890797, 5737114, 5686879, 5698695, 5715656, 5671337, 5718903, 5784358, 5610116, 5599528, 5616009]
3810E616009j17777l7520J36803j06001p098j9404r4608J8293n406q895j3310
3799E361086p2915l4336O4926k4265O1020m8089m0669Q3596N3414K378j01547
3788E304599J4826M678n639j2993o7031L5343n8090P5070K2932k1937M9370K3691
3776E364819K4367J9516O6473Q0696M5261O7722N787K6890k2822M0834k5777L7172
3764E730938O7305N983M4373J53478O8748j3116J8202J29901J58754M4098J18637
3753F527301M2222O8697O1621J55047K05232Q5736M5904K7900J10636L2980J95408
3742G558684K33808P7965R6919J02603J96334J33228K21201J20372J45763P8260
3732H965137J46083K88349K05115J27457J54114J10249J98968K55812K36882K26644
$$ y = [5616009, 5498232, 5460712, 5597515, 5491514, 5484416, 5465012, 5370404, 5388697, 5383291, 5374396, 5361086, 5288171, 5253835, 5318761, 5294496, 5355516, 5307427, 5266758, 5350354, 5403768, 5406146, 5304599, 5319425, 5324103, 5318464, 5305471, 5238440, 5273783, 5215693, 5290763, 5313695, 5291758, 5341128, 5364819, 5389186, 5408702, 5475175, 5555871, 5601132, 5668854, 5674641, 5701531, 5678709, 5719543, 5693766, 5730938, 5798243, 5804226, 5848599, 6002077, 6070825, 6057709, 6075911, 6205812, 6364566, 6408664, 6527301, 6569523, 6638220, 6699841, 6854888, 7060120, 7145856, 7191760, 7219660, 7330296, 7363276, 7558684, 7792492, 7870457, 7967376, 8069979, 8266313, 8399541, 8620742, 8741114, 8886877, 8965137, 9111220, 9399569, 9604684, 9732141, 9886255, 9996504, 10195472, 10451284, 10688166, 10914810]
3722A0914810J53198L32978K88881J29242K99037K39179K31152K20431L82690
3713A3191598K74703O6564L98241K91949L23064M22286K86856M67313L17289K42721
3703A6282584L20195M48686L55206L34051M82743N46832M50067M87233N43488
3694B0251085O20195N64341N11988N70918N94108P17862P39023P90000P74823
3685B6134343R25154J105738J051856J156408J120819J260906J451527J748309
3677C5955060K012008K132144K443907K648173K870499L418571L857978M561829
3669E9900169N092464N863048O991373Q158084R487187J0715207J1533532J1207065
3661A28948129R530239O712036L675984J262143N35366J036425K241729L935971
$$ y = [10914810, 11068008, 11400986, 11689867, 11819109, 12118146, 12357325, 12588477, 12808908, 13191598, 13466301, 13532865, 13931106, 14223055, 14546119, 14968405, 15255261, 15722574, 16039863, 16282584, 16602779, 17051465, 17406671, 17740722, 18223465, 18770297, 19220364, 19707597, 20251085, 20871280, 21435621, 21947609, 22518527, 23112635, 23830497, 24569520, 25359520, 26134343, 27059497, 28165235, 29217091, 30373499, 31494318, 32755224, 34206751, 35955060, 37967068, 40099212, 42543119, 45191292, 48061791, 51480362, 55338340, 59900169, 64992633, 70855681, 77847054, 86005138, 95492325, 106207532, 117741064, 128948129, 138478368, 145190404, 148866388, 150128531, 150663897, 151700322, 153942051, 157878022]
3653A57878022O037777P926578R389151J0197175R838026Q045074M908712R64933
3645B15185448l120779o420353r001368j0383279j0555081r866214q357870o579186
3637A50901318m967410l782121k844816k387484k714092l990910n928059q109138
3629A16177288r593629j0323436j0074234r098508p800195o541000n398127m699456
3621E2648703m019401l552385l186967k794336k273456k173354j994379j738311
3613C0916114j648115j462608j281311j184445j161250j110764q53605q98411
3605B1315605q34178o81320p34389o59723o49304o31867n07851n97909m99275
3596A5519789n13450l33705m60903m89078k76470l69225l01914m65022l75909
$$ y = [157878022, 163915799, 171842377, 181231528, 191428703, 201266729, 209311803, 214220515, 215185448, 212064669, 205644316, 196642948, 186259669, 175704588, 165838374, 157480504, 150901318, 145933908, 142151787, 139306971, 136919487, 134205395, 130214485, 124286426, 116177288, 106583659, 96260223, 86185989, 77087481, 69287286, 62746286, 57348159, 52648703, 48629302, 45076917, 41889950, 39095614, 36822158, 34648804, 32654425, 30916114, 29267999, 27805391, 26524080, 25339635, 24178385, 23067621, 22214016, 21315605, 20481427, 19800107, 19065718, 18405995, 17756691, 17124824, 16616973, 16019064, 15519789, 15006339, 14672634, 14211731, 13722653, 13446183, 13076958, 12775044, 12310022, 11934113]
3587A1934113j85927k83055l44203k94429l78269k16793l31787k03805j87575
3578I508270k71970k28490j46025k71235j77511k74060j84314j25651k97336k24846
3568G306832j93051j75689j49604j60042r0982k72312j34741o6492q6633n9546
3558E917740j95264m7669j70371p6236M210p4039j20929p6368q4352m8267o4573
3547D963882q9699q5881j63107o8877m243K6897n9123j73356r9655M655q2286
3536D169207j26598q0012j25763n1690K4582q4185j72723p209r5669k13427l2641
3525C203872j19409M0223J3396j00077l6722K6165r1018j06454l2392p3034m8742
3514B675808J8123J4918l4392l0625j00096J3265l7587j30992R3444Q3141j08457
$$ y = [11934113, 11748186, 11465131, 11120928, 10826499, 10448230, 10231437, 9899650, 9695845, 9508270, 9236300, 9007810, 8861785, 8590550, 8413039, 8138979, 7954665, 7829014, 7531678, 7306832, 7113781, 6938092, 6788488, 6628446, 6537464, 6265152, 6130411, 6063919, 5977286, 5917740, 5722476, 5674807, 5504436, 5428200, 5432410, 5358371, 5237442, 5161074, 5076722, 5028455, 4963882, 4874183, 4788302, 4625195, 4556318, 4552075, 4578972, 4519849, 4346493, 4246838, 4251493, 4169207, 4042609, 3962597, 3836834, 3785144, 3809726, 3725541, 3552818, 3545609, 3449940, 3236513, 3203872, 3084463, 3124686, 3138082, 3038005, 3001283, 3027448, 2936430, 2829976, 2797584, 2724550, 2675808, 2693931, 2708849, 2674457, 2643832, 2543736, 2557001, 2519414, 2388422, 2481866, 2565007, 2456550]
3503B456550p7959p4111n3290M6815L7983o7598J14145o0111l1463R656j83593
3492B117024j3568k1011P7564M7779j8174q8242J0157Q6858Q3238l2609l426j5899
3480B229691j58041j4810j45025n8319R9122j20758j2092q6340l6946J9179o1101
3469A654560o701l3160N1514M3886p6741q3300J1913L8857j182L1339J00714R034
3457A740733p1074K3815P7345j6667q28r3020j26374K5149P887k3253k0395o3883
3445A459435p7063K2828K190n7213l8776j7623M3327k1539k2563M6218m9694P6219
3433A365746k3299n0716o5220K2299p386l8916j5469Q5228Q1780j17676k5067
3422A211304m3120l342J17007l1222j08191j8293l9181Q422M1448M4304j7992
$$ y = [2456550, 2378591, 2304480, 2251190, 2298005, 2335988, 2268390, 2382535, 2322424, 2290961, 2300617, 2117024, 2103456, 2082445, 2160009, 2207788, 2189614, 2101372, 2111529, 2198387, 2281625, 2249016, 2245590, 2229691, 2071650, 2056840, 1911815, 1853496, 1952618, 1831860, 1819768, 1733428, 1696482, 1715661, 1654560, 1647859, 1614699, 1666213, 1710099, 1633358, 1550058, 1561971, 1600828, 1599646, 1630985, 1731699, 1740733, 1669659, 1693474, 1770819, 1754152, 1753324, 1660304, 1533930, 1559079, 1566966, 1543713, 1523318, 1459435, 1382372, 1405200, 1407390, 1350177, 1311401, 1293778, 1337105, 1315566, 1293003, 1339221, 1289527, 1365746, 1342447, 1291731, 1226511, 1248810, 1241424, 1202508, 1187039, 1272267, 1354047, 1236371, 1211304, 1168184, 1164842, 1281849, 1250627, 1142436, 1124143, 1084962, 1093384, 1134832, 1179136, 1161144]
3411A161144k6684K0291o9217l4610O5224K0853M4978K4852k198j3013j2357j06885
3399A072378j0226J2099N7127l4090J29081J3841O6791j7739j70045M2956O8039
3388A230212r468l0274m8178J15407K2363J0771N9667m7089N9104Q2372O464Q8772
3376A540123K9065Q0963J22430p1646l5086M8283Q0864n4815r119l253N0452m447
3364A773814K4188m4822J20657J39457j34471J21920j2176r0145R8268L2083j2964
3353B015809k282q2575P6587p6293j38760q340k931J6328L3358j53294L5352l0962
3341A681997J12864m2226j40309j01273k8773M2046n0371j3488K5179K0935j03246
3330A403335p588l734j1036M9496M2335k7960j1098K7482J4475r1918J39357R7860
$$ y = [1161144, 1134460, 1154751, 1085534, 1050924, 1116148, 1137001, 1181979, 1206831, 1204633, 1191620, 1179263, 1072378, 1062152, 1074251, 1131378, 1097288, 1226369, 1240210, 1307001, 1289262, 1119217, 1162173, 1230212, 1220744, 1190470, 1142292, 1257699, 1280062, 1290833, 1350500, 1303411, 1362515, 1444887, 1451351, 1540123, 1569188, 1650151, 1772581, 1700935, 1665849, 1714132, 1794996, 1740181, 1731062, 1727809, 1778261, 1773814, 1798002, 1753180, 1873837, 2013294, 1878823, 2000743, 1988567, 1898422, 1996690, 2028773, 2015809, 2013527, 1930952, 2007539, 1931246, 1792486, 1784146, 1781215, 1797543, 1830901, 1677607, 1712959, 1681997, 1794861, 1752635, 1612326, 1511053, 1482280, 1524326, 1473955, 1460467, 1485646, 1506581, 1403335, 1395747, 1392013, 1380977, 1430473, 1472808, 1444848, 1433750, 1461232, 1475707, 1383789, 1523146, 1621006]
3318A621006r6388q5921J10002J7504P6617L4831k7875p7867l5361R454k9698
3307A516304q3292N5855Q4120J09743k5734J4639O3907k0815m044L4020O2381
3296A807084O4994M6310N260L4470J15104O3375j17443J649J36774J33495O9912
3285B360984Q7690N1555p4580M2451L5536L1724r7098N9765Q9928O1828j981N1602
3273B699404R470J03637L886J21044Q4798J25888N4061j3175J21451J76577J97534
3262C684575J23348J51325J05716J36403J23283O4634N4506J22788K41904J10277
3252D918759N7027J60924J53642J55306J58126K89296L7819N8585J82668M5239
3242F217391j3428R2245J81042J27680Q3198J63177K26919J15933P9418J45433
$$ y = [1621006, 1524618, 1438697, 1548699, 1566203, 1642820, 1677651, 1649776, 1571909, 1536548, 1546002, 1516304, 1433012, 1488867, 1572987, 1682730, 1656996, 1671635, 1735542, 1714727, 1710683, 1744703, 1807084, 1872078, 1918388, 1923648, 1958118, 2073222, 2136597, 2019154, 2020803, 2157577, 2291072, 2360984, 2448674, 2500229, 2425649, 2468100, 2503636, 2535360, 2438262, 2498027, 2587955, 2649783, 2647802, 2699404, 2708874, 2812511, 2816397, 2937441, 3022239, 3148127, 3202188, 3189013, 3310464, 3487041, 3684575, 3807923, 3959248, 4064964, 4201367, 4324650, 4389284, 4443790, 4566578, 4808482, 4918759, 4975786, 5136710, 5290352, 5445658, 5603784, 5893080, 5930899, 5989484, 6172152, 6217391, 6203963, 6296208, 6477250, 6604930, 6688128, 6851305, 7078224, 7194157, 7273575, 7419008]
3232G419008J87522J54592K97648L04534K88086L33398L36312K09056M34466M53216
3222A0417838K73568L61994M80414O46280O23916Q36256R26103J122194J277491
3213A6966054J392272J583006J781065J912155K278719K754041L803712M888235
3205C7359259P067443R895333J4190079J9239747J7500885j234955j6887616j7755011
3197F9375164j4393160r441337o564004m535084l321208k357707j750737j162555
3189B5849372r66172o08225j84963J23356M32351P82428R95873J441784J808452
3180B9674256K376021L238143M730744O990205J0050864J4605560J9043244J3914222
3172A04623259o438563j8235896j7361395j3409078r039078o442707m636685l613957
$$ y = [7419008, 7606530, 7761122, 8058770, 8363304, 8651390, 8984788, 9321100, 9530156, 9964622, 10417838, 10691406, 11053400, 11533814, 12180094, 12804010, 13640266, 14566369, 15688563, 16966054, 18358326, 19941332, 21722397, 23634552, 25913271, 28667312, 32471024, 37359259, 44426702, 54322035, 68512114, 87751861, 105252746, 104017791, 87130175, 69375164, 54982004, 45540667, 38976663, 34441579, 31120371, 28762664, 27011927, 25849372, 24883200, 24274975, 24090012, 24213368, 24645719, 25428147, 26424020, 27865804, 29674256, 32050277, 35288420, 40019164, 47009369, 57060233, 71665793, 90709037, 104623259, 98184696, 79948800, 62587405, 49178327, 40139249, 33696542, 29059857, 25445900]
3164B5445900k795975k235698j711495j614264j451592j293338r60255j013995
3156A2369288p70505p08783m52802n90575m18335m17124m53322l90692l52405
3147G814745k12589k08820k39119l25436j92554k65294k81480j68668l29986l94241
3137E196558j98392j32189j42982j60942j97431l9016j73661k22429k86582l3395
3127C609539o2848j34864p3529r650m3360p0861N961p8328l9580k37829j23119
3116B741532O1234j15171q6363p9786j0668j26486j0558k5235j65664r0382n2066
3105B040387j8973l156r0985J0947l5110J5362k7846n6967j10753l0997L7987
3094A729896j1246q4874P717k2798j16044j5767m5073q0404M3770j49311N4935
$$ y = [25445900, 22649925, 20414227, 18702732, 17088468, 15636876, 14343538, 13383283, 12369288, 11598783, 10890000, 10437198, 9846623, 9428288, 9011164, 8557842, 8167150, 7814745, 7602156, 7393336, 7154217, 6828781, 6636227, 6370933, 6089453, 5920785, 5590799, 5196558, 4998166, 4865977, 4722995, 4562053, 4364622, 4325606, 4151945, 3929516, 3642934, 3609539, 3546691, 3411827, 3338298, 3328648, 3285288, 3214427, 3220388, 3142060, 3102480, 2864651, 2741532, 2802766, 2687595, 2601232, 2521446, 2510778, 2384292, 2373734, 2348499, 2182835, 2092453, 2040387, 2021414, 2018258, 1927273, 1938220, 1903110, 1918472, 1890626, 1833659, 1722906, 1691909, 1729896, 1718650, 1633776, 1641493, 1618695, 1502651, 1486884, 1441811, 1361407, 1405177, 1255866, 1310801]
3083A310801Q7163j866l8078Q071k0928n8832n1630p4806K0456o1112N1893O240
3071A177372P118p0458n3703n9494M7093q5876M0279r409J2944k4858r7406K2009
3059I05611k7925m6470j5340L35p0420P8938n659j52970J1075M5537K15759k1745
3047I16726l7986p1816p8737k8121O0532p2415K8792O5136k6684j9088j37187
3036E99152K1594M8352O2488m315q1894j30382K6191M100O0181n3481l5914Q4204
3024F00276l1128J25380j02783j501l8911J0733Q2499n1105q5687r608l5637M7633
3012E10161Q016N7929j1796J04940n890j03896m5776j8656Q841M0061J47200l2443
3000F58691j12470p7787n118M4744P2007m7822m3404m0657J21473l2618l3317
$$ y = [1310801, 1397964, 1396098, 1358020, 1366091, 1345163, 1286331, 1234701, 1159895, 1180351, 1119239, 1171132, 1177372, 1184490, 1114032, 1060329, 1000835, 1047928, 962052, 1002331, 992922, 1005866, 981008, 883602, 905611, 877686, 831216, 815876, 816211, 745791, 824729, 819070, 666100, 677175, 722712, 938471, 916726, 878740, 806924, 728187, 700066, 760598, 688183, 716975, 782111, 755427, 736339, 599152, 620746, 669098, 731586, 727271, 645377, 514995, 541186, 545286, 605467, 551986, 516072, 600276, 569148, 694528, 591745, 590244, 551333, 562066, 644565, 593460, 507773, 498165, 462528, 510161, 518177, 576106, 564310, 669250, 663360, 559464, 513688, 495032, 503873, 543934, 691134, 658691, 546221, 468434, 463316, 508060, 580067, 532245, 488841, 448184, 569657, 537039, 503722]
2989E03722P889P3506K8625o0619n7562j01398l2001J73158m7790q3420L5518
2978D39628k5164p3876j8928M0081l4052P4895p0272R117R3340n5175k639o5J7956
2965C94846k8598n837P1088P7034r3033o8645l3257N330O1879k2474k8692J14113
2953D43754Q578l5064j6364M4082q0579l0895p031o4082J69058M6275n8857K9386
2941D48261o2709o2652Q7435j6154l3868j7004K4415M9958N7533J04680p855m3204
2929E28836J4909j2569q2789O094O5380q6779K7866M810J05330M9034O533J2559
2917F39214O5291k2595k932j1751j9133j0709j09089K7094j05521j7789Q0275
2906E12355l387O2412j26894l0576R097J2342Q7649k3486o5706k8842J10664j23496
$$ y = [503722, 511611, 585117, 613742, 553123, 495561, 394163, 362162, 535320, 487530, 404110, 439628, 414464, 340588, 321660, 361741, 327689, 402584, 332312, 341429, 434769, 379594, 376955, 376890, 394846, 366248, 360411, 431499, 508533, 415500, 346855, 313598, 318928, 380807, 358333, 329641, 443754, 452332, 417268, 400904, 444986, 364407, 333512, 326481, 262399, 431457, 477732, 418875, 448261, 385552, 322900, 410335, 394181, 360313, 343309, 367724, 417682, 475215, 579895, 572040, 528836, 543745, 531176, 448387, 454481, 519861, 433082, 460948, 465758, 571088, 620122, 626655, 639214, 704505, 681910, 678978, 667227, 648094, 637385, 528296, 555390, 449869, 432080, 512355, 508968, 571380, 444486, 413910, 423007, 435349, 522998, 499512, 433806, 404964, 515628, 392132]
2894C92132j8842J28343P1418M008l9956R7832R8423K7405j32483m0343k8175
2883E59762r6697j5210m4306M7144j25191p424P1637j6303j12057P6520J27768
2872D65643l1372l9030L2591r7334J2267M7755n5160o8154K1193M147n7084K0861
2860B56323m8196J3696L967J7252l2871k7648Q581J5589O0514k4686p2047l1838
2848A38636J2323o4364k187Q4595L222O57k1730j13977Q1756O5682M7029o9121
2836A62521l3436O5727q8275j19592J0955j0240O7539R3640j4024l0125M6154
2825A50844J18259j18354n532k9327o105j9786j2478n5987j5631Q855J7551k3787
2813H522K3579J94049o735l3375O364j25767L2029l0115j4070j90J09113j42178
$$ y = [392132, 373290, 501633, 573051, 577059, 537103, 634935, 733358, 760763, 628280, 587937, 559762, 463065, 447855, 403549, 450693, 325502, 318078, 389715, 373412, 261355, 337875, 465643, 434271, 395241, 427832, 330498, 342765, 390520, 335360, 267206, 288399, 292546, 235462, 256323, 208127, 221823, 225790, 243042, 210171, 182523, 191104, 206693, 267207, 242521, 170474, 138636, 150959, 86595, 84408, 169003, 172225, 172882, 151152, 37175, 118931, 184613, 231642, 162521, 129085, 194812, 106537, -13055, -2100, -12340, 55199, 148839, 134815, 104690, 150844, 269103, 150749, 145217, 115890, 109785, 89999, 77521, 21534, 5903, 14758, 32309, 8522, 32101, 226150, 219415, 186040, 192404, 66637, 98666, 68551, 54481, 54291, 163404, 21226]
2801B1226l2769J02427K9035n3369J25691j04212q0264O8525M2748M357j2602
2790A10793q0029K6651O3344o2799J10265k2683o9323R127N2614M622l5439L6344
2778A43487N5990L1891q0048o8851l2334R486N1444r5820M7319m2264M9679J04801
2766A74780j5394j1621k5332k8590Q0467j11816L2257J7456o2848o5294O2225
2755D6290K9218l909k1350J2810J0874n3469m1616O4336J0397J34720r0406j23155
2743b5260J2233n0551J2954P0892L1616k4955L8313P0074o566n8230J3121j2772
2731G0869J3509p6359j3089K3816O948K252N4286o2419j4462j5117P8095l2636
2719C5693m856k4087N3472J1252r6568q3493O753O2941p3079N0809Q3101K2931
$$ y = [21226, -11543, 90884, 119919, 66550, 192241, 88029, 7765, 76290, 119038, 123395, 110793, 30764, 57415, 120759, 57960, 168225, 145542, 76219, 85346, 137960, 142582, 107143, 143487, 199477, 231368, 151320, 82469, 50135, 59621, 111065, 15245, 62564, 20300, 69979, 174780, 159386, 147765, 122433, 93843, 174310, 62494, 94751, 112207, 49359, -15935, 46290, 75508, 71599, 50249, 63059, 73933, 20464, -21152, 43184, 53581, 188301, 97895, -25260, -13027, -63578, -50624, 20268, 51884, 26929, 65242, 135316, 128750, 70520, 83641, 70869, 84378, 8019, -5070, 18746, 25694, 27946, 82232, 19813, 5351, -9766, 68329, 35693, 30837, 6750, 60222, 71474, -25094, -108587, -101834, -38893, -111972, -61163, 21938, 44869]
2707D4869M3776k5269p6176N530K2488Q149j32869J54729P4595O3887q2940l5437
2695F5332O0713O5912r0264k5178m9677K9797L8260N4514K4549j32320P4540p6469
2683C9709P79p2083O2546L5474k9939J04418l7601q5463p450m97L7666r9086L0567
2670b0960Q5506M366m732m7458Q3753J10207p7507j2502L782m7820r2664l6629
2658e2658m437J5664Q0515n280m9828L3986L0205q3678l519J14433Q5541r8072
2646F2872K3242k5706k1598N0734o4870l9166K8373L4243o4906Q0778j2742R01
2634E2155L2922j02429K5140j3872L4485M3314p1135N4058J7677p0457n5703L0377
2622b3468m2132k8332N9777J14554L4403n8904J9613o3818m8114K4376O6090k2688
$$ y = [44869, 88645, 63376, -12800, -7270, 15218, 23367, -109502, 45227, 119822, 183709, 100769, 65332, 126045, 191957, 101693, 76515, 26838, 56635, 94895, 149409, 173958, 41638, 116178, 39709, 40488, -31595, 30951, 66425, 36486, 140904, 103303, 17840, 10390, 9893, 47559, -51527, -20960, 64546, 68912, 64180, 16722, 100475, 210682, 133175, 120673, 124455, 76635, -16029, -52658, -57095, -41431, 39084, 33804, -16024, 17962, 48167, -35511, -39030, 75403, 160944, 62872, 86114, 60408, 38810, 89544, 24674, -14492, 13881, 48124, -16782, 63996, 51254, 52155, 85077, -17352, 7788, -6084, 28401, 71715, 580, 54638, 72315, 1858, -53845, -23468, -65600, -93932, -34155, 80399, 114802, 55898, 75511, 11693, -36421, -12045, 54045, 31357]
2610C1357p1345k7688q4385P1452Q7548o5197J4218O7808j8075M4315K8492l3472
2598D5028n0990R306o0239O9112L9769n606J00279p2957q6365L1144R2063L1764
2586A42308M4003m7077p7701L8173k2886J1462m071o22k6690p0890m2707K7713
2574b8985k9676J15693J06277p6388l5890O422j64139k5642P9812l6511N0261
2563c8766R4571K3310p2387l2483R0182l9410j00222m858O3525K4118m5994P5084
2551C6670n4870p443N601m4483R925k9236J23489R7640o5600J955m6583r5952
2539f8887l1568J68124J9958n374J01550j32555n9101P6547J4856K1137l4399
2528G0288n3129j5832N6056J3891L0047j67435K6286R8553L555p0266N1592L7711
$$ y = [31357, -39988, -67676, -152061, -80609, 6939, -58258, -44040, 23768, 5693, 50008, 78500, 45028, -5962, 3344, -56895, 12217, 51986, 46380, 146659, 73702, -12663, 18481, 110544, 142308, 186311, 139234, 61533, 99706, 76820, 88282, 84211, 83589, 56899, -13991, -56698, -28985, -58661, 57032, 163309, 86921, 51031, 57453, -106686, -132328, -52516, -89027, -38766, 55805, 79115, 6728, -25755, 64427, 25017, -75205, -80063, -16538, 7580, -38414, 36670, -18200, -25643, -20042, -64525, -54600, -83836, 39653, 137293, 71693, 73648, 27065, -68887, -100455, 67669, 87627, 82253, 183803, 51248, -7853, 68694, 83550, 104687, 70288, 17159, 1327, 57383, 71274, 101321, -66114, -39828, 58725, 62280, -7986, 43606, 81317]
2516H1317K7710J15N737p7649n768N278j09880o5829J06967Q7331L997m12k273
2503E6641r6492j08911J35317L9536N243k7682p1451p618K7310j02J12162m6416
2491A7537r7724J57514M1541j7442n8602l2440m7648N3000P0536R3242r6076n3390
2479C0048j3799L5569K5061o1417k3763O8231J0887j952k0617o1596N4115L0959
2467G1726J4885j32930L9602k6840j4912J6680J4240k2751N1574o5156N00j0107
2455f3489L7482M6798M1142p1866J5999J9995J5831J0916N3339K9896n5975k9275
2443E0793n4077r2846l7203l069R6319k5149R3449P5150j28021K5087k0326j11827
2431a31720k0808J87J50088O8082n2523q0052p2680J80404r191O447l3352j15497
$$ y = [81317, 109027, 109142, 114879, 37230, 31462, 36740, -73140, -138969, -32002, 55329, 59326, 58914, 56641, -39851, -148762, -13445, 26091, 31334, 3652, -67799, -75417, -48107, -48209, 63953, 17537, -80187, 77327, 118868, 101426, 42824, 10384, -37264, 15736, 86272, 179514, 83438, 30048, 16249, 51818, 76879, 15462, -8301, 59930, 70817, 68865, 48248, -13348, 40767, 71726, 86611, -46319, -6717, -33557, -48469, -31789, -17549, -40300, 11274, -53882, -53382, -63489, -26007, 20791, 61933, -9933, 6066, 26061, 41892, 52808, 106147, 136043, 80068, 50793, -3284, -96130, -133333, -136402, -40083, -65232, 28217, 103367, -24654, 433, -19893, -131720, -152528, -152341, -2253, 65829, 13306, -66746, -139426, 40978, 31787, 38234, 4882, -110615]
2419a10615M8585l2126m4200m1765Q4806M1753O0619m8686L844N5308L3460j7693
2407C3290M0028p9928l5895k4537P9918K6351M7020M4593l5029J6536O0540m0733
2395A32154j45124k204m3667R3832r666K6375M7255K2937O5028P7367o6052O4288
2383B62523N0199N0018j67626j10988m5835J18153R0610N7684L1614j20126J2750
2372B28976p4378o9349M573R80r193L2805O5368N8806j43374J08793n0328j55020
2360a341R6567p6297j6478r170M9030q9635L6091J5891L3183o2593O4904K7272
2348F7424r376l2565N9463K5018Q0585j14950j08049n6326J8542R9326m1017Q999
2336b926n0301O036N3131L4857Q0278l8944L8767J0350J6620j0858j89507O3530
$$ y = [-110615, -62030, -94156, -138356, -180121, -95315, -53562, 7057, -41629, -37785, 17523, 50983, 33290, 73318, -6610, -42505, -67042, 12876, 39227, 86247, 130840, 95811, 112347, 172887, 132154, -12970, -15174, -58841, 34991, 25325, 51700, 98955, 121892, 186920, 264287, 198235, 262523, 312722, 362740, 195114, 84126, 38291, 156444, 247054, 304738, 336352, 216226, 228976, 154598, 85249, 89822, 90802, 81609, 114414, 179782, 238588, 95214, 204007, 153679, -1341, 95226, 18929, 2451, -6719, 42311, -47324, -11233, 4658, 37841, -24752, 40152, 67424, 58048, 25483, 84946, 109964, 190549, 75599, -32450, -88776, -70234, 29092, -11925, -2926, -53227, -47191, 5940, 40797, 121075, 82131, 120898, 131248, 147868, 137010, -52497, 11033]
2324A1033K6724O510K0405N3050j9094o017l3425K1106l769o5265K3651J3141
2312D8050M9857J3469r828o0125j08129l1763L8722Q9542O4468q324k3079K3584
2300H6444m1742J37365K5407r1028m1243j0904p5881l5121Q0396J16468n7648
2289I2513l4024J47382O4781j14337N421k0228m6472q2259K7078J22563l2330
2278A30088L9615l8662j56805j0414M3392R8256P0841n2029K5596m2280k4484
2267H3114j507m1029J8753Q1259j7161j12848l4718L0103L5212K6417j5068k0200
2255C2327K944K1876m007l5577L7275N9474j20565K3044J31038o2602Q4980M8420
2243B18627r0259j5016m5640m9155M4760o493P5497n3068K5160Q2506N2452J173
$$ y = [11033, 37757, 44267, 64672, 117722, 98628, 92611, 59186, 80292, 76523, 11258, 34909, 48050, 97907, 111376, 101548, 41423, -66706, -98469, -59747, 29795, 94263, 85939, 62860, 86444, 44702, 182067, 207474, 116446, 75203, 64299, -11582, -46703, 33693, 150161, 92513, 58489, 205871, 270652, 156315, 161736, 141508, 95036, 12777, 39855, 162418, 130088, 169703, 131041, -25764, -36178, 7214, 105470, 176311, 124282, 149878, 107598, 83114, 81607, 40578, 59331, 140590, 123429, 10581, -24137, 5966, 41178, 67595, 52527, 32327, 35271, 57147, 53140, 17563, 54838, 114312, -6253, 16791, 147829, 85227, 170207, 218627, 128368, 113352, 67712, 18557, 63317, 56824, 132321, 79253, 104413, 186919, 239371, 240544]
2231B40544m0319k59q3160l7587J2732J21857K21289j59753j34539K7522J867
2220A70194J03082j6063l9131O9341R008q8024K4807O14m7668K4936M8308m4642
2208B14762O4999J6366j1428O1335L6158J0163M2294q2128J5601R7327M727L3640
2196E03816k6573O7426l5716o2971Q9902j3342J8795M6735l7344n343p5749L066
2184D72702O0106P2098j99957L9210R4657k5223R2869J31219m1790l4833R031
2173F70089K0053p02m185J29825j2719K8312M5761j9559L0094P4471j7541J59139
2161A103038O2934K2077r4843J15022K4101o3373J35125R7861m2301K1934J03459
2150A485034J20271n1140j9916J8663M3046J02535J00260L4048J32406r159K3187
$$ y = [240544, 200225, 199966, 116806, 79219, 91951, 213808, 435097, 275344, 140805, 168327, 170194, 273276, 257213, 218082, 287423, 296431, 208407, 233214, 233828, 186160, 211096, 259404, 214762, 279761, 296127, 284699, 346034, 382192, 392355, 434649, 352521, 368122, 465449, 470176, 503816, 477243, 544669, 508953, 445982, 535884, 522542, 541337, 588072, 550728, 545385, 469636, 472702, 532808, 604906, 404949, 444159, 538816, 513593, 606462, 737681, 695891, 661058, 670089, 690142, 689440, 685255, 815080, 802361, 830673, 876434, 856875, 886969, 961440, 943899, 1103038, 1165972, 1188049, 1093206, 1208228, 1232329, 1168956, 1304081, 1401942, 1359641, 1381575, 1485034, 1605305, 1554165, 1534249, 1552912, 1595958, 1698493, 1798753, 1832801, 1965207, 1956048, 1979235]
2139A979235K4273P1168J49132J92365Q5559J62968L5777J17576K00426J18830
2129C137309J51596K74242L87541M12835L68388M45325L76688K96485L00350L25041
2119F475800O06621P90649R24888J251858J769246K191331L171834M557333O463178
2110B8202738Q351114M400934m886951p719347o659951m663543k987902k355671
2102A1681421j759076j318704r66850q99612p68999l43590l08309k12545j26383
2093D977353l92988n00081l34269k49016j76759k28452l35448j44951j59291j38332
2083B317766p0671l8693j22442l7203j40332q1754j26053n3012n5874k3737l5284
2072A532711j38607k9909j23902m0708L5507p2580j72951p1739r742O2980J120
$$ y = [1979235, 2003508, 2074676, 2223808, 2416173, 2501732, 2664700, 2700477, 2818053, 3018479, 3137309, 3288905, 3563147, 3950688, 4363523, 4731911, 5177236, 5553924, 5850409, 6150759, 6475800, 7082421, 7873070, 8797958, 10049816, 11819062, 14010393, 17182227, 21739560, 28202738, 36553852, 40954786, 36067835, 28348488, 21688537, 17024994, 14037092, 11681421, 9922345, 8603641, 7636791, 6737179, 5968180, 5624590, 5316281, 5103736, 4977353, 4584365, 4084284, 3750015, 3500999, 3324240, 3095788, 2760340, 2615389, 2456098, 2317766, 2247095, 2208402, 2085960, 2048757, 1908425, 1826671, 1700618, 1647606, 1591732, 1567995, 1532711, 1394104, 1364195, 1240293, 1199585, 1235092, 1162512, 989561, 917822, 908080, 971060, 972180]
2061I72180j02689K9396m0125o9896m6863p56m9497J03038j1736o9517l3708O4170
2049G43997o8028j08871K8941P4520q4330L4689j3986J7253r9044k6196M011K6763
2037E29719n5550K0195L1784j47579k9163j7900M3636K2545l4895L9814o6577
2026C36029n5758j09724L7036P5011O8446q404m8988J5220p214K9926r3489l5257
2014B02834j8163K7746J5115q481k6933N2778k360l3848j2888J55414M7299l9306
2002C59207r9258j30049K424k5641j9132J21510n9098r303m2706l228N4493N3606
1990B02825m2748m2343N0290O4799j06386N8490M1918L899J9101m5854j8000j47455
1978C8536J06172J09081m2309l5912j24448k9061P4186k181N5875j6286n863J23794
$$ y = [972180, 869491, 898887, 858762, 788866, 742003, 741247, 691750, 794788, 783052, 713535, 679827, 743997, 675969, 567098, 596039, 670559, 586229, 620918, 606932, 624185, 525141, 498945, 502956, 529719, 474169, 494364, 526148, 378569, 349406, 331506, 375142, 397687, 362792, 402606, 336029, 280271, 170547, 207583, 282594, 351040, 342636, 293648, 308868, 301654, 331580, 238091, 202834, 184671, 212417, 227532, 219051, 192118, 244896, 242536, 208688, 195800, 351214, 398513, 359207, 259949, 129900, 132324, 106683, 87551, 209061, 149963, 140660, 97954, 94726, 149219, 202825, 160077, 117734, 168024, 232823, 126437, 184927, 226845, 230744, 249845, 203991, 185991, 38536, 144708, 253789, 211480, 175568, 51120, 22059, 96245, 94064, 149939, 133653, 127790, 251584]
1966B51584o6932J7803j57539o1605J05714K067n9227J2377J9125N6192N8287
1955A77846m4310M6984L0903j1875j1626l2495r7458Q5037L6413q6265j6631p712
1943F8811K9180N3767M856j5074O0216r6098K3590n0979R128l3140o0984n2077
1931e8804Q3972J6351l5425L9735J9668l3213l1988R8097k9909n3627L8204O6884
1919A19945n4558l2504j4662K3721m0985O9272q1176M2825J784L7478k2731J11641
1907A60050j79666N2300J02684n2046N9690M2657j07364p8481J3470Q952Q095
1896C0341l8758M2289J5232q3381J37076J12338k04784n7215l685N5794j5173
1885i926l83M2012l4352J08191J6140j20443m6561P5817L1734o568K8246P0309
$$ y = [251584, 184652, 202455, 44916, -16689, 89025, 91092, 31865, 44242, 63367, 119559, 177846, 133536, 180520, 211423, 199548, 187922, 155427, 57969, 143006, 179419, 93154, 76523, 68811, 97991, 151758, 156614, 141540, 201756, 105658, 129248, 78269, 87397, 54257, -6727, -58804, 25168, 41519, 6094, 45829, 65497, 32284, 296, 98393, 68484, 14857, 53061, 119945, 65387, 32883, 18221, 41942, 957, 70229, -10947, 31878, 33662, 71140, 48409, 160050, -19616, 32684, 135368, 83322, 143012, 185669, 78305, -176, 13294, 22246, 30341, -8417, 33872, 49104, -34277, 102799, 215137, 10353, -46862, -50547, 5247, -9926, -10309, 31703, -2649, 105542, 121682, 1239, -45322, 30495, 62229, 55661, 83907, 154216]
1873A54216n3855p9851J01119L1325p5173j3973k2013n3488j862K3808N7946O5403
1861A33602j7545p8784M0716m4028l2396R86L2395P6723l409o0537O3671J7546
1849A28940r5137J0489o175Q2294L1475k0476m5372L9557L7405l6448J1112O0793
1837A98457m932q2822J2967n2135l111n5463J7482L9079K1036j3940J38580o0847
1825A54351k9574r2461n2889P4648l9746Q9592j14j46213p2288P9654J29650M4135
1813A38745N2071o3123j45828M1731J02633k7243j23106J5650P579L2559R6131
1802A27799m3156p2498l7888m1088j8776M779N0013K1553n0530M5307K9420n0314
1790c5379k3075n6933Q9418P3690m7746R375M9435P567p3087l5670p830R0057
$$ y = [154216, 100361, 20510, 121629, 152954, 77781, 63808, 41795, -11693, -13555, 10253, 68199, 133602, 116057, 37273, 77989, 33961, 1565, 2551, 34946, 111669, 108260, 47723, 111394, 128940, 33803, 44292, 38117, 120411, 151886, 131410, 86038, 125595, 163000, 126552, 137664, 198457, 193525, 110703, 123670, 71535, 68424, 12961, 30443, 69522, 90558, 76618, 215198, 154351, 124777, 32316, -20573, 54075, 14329, 103921, 103807, -42406, -114694, -35040, 94610, 138745, 190816, 127693, -18135, 23596, 126229, 98986, -24120, -8470, -891, 31668, 127799, 84643, 12145, -25743, -66831, -85607, -80828, -30815, -9262, -59792, -14485, 14935, -35379, -58454, -115387, -25969, 47721, -25, 9350, 58785, 66352, -6735, -42405, -50235, 39822]
1778C9822K4321k8253j1915M4919k9873m2320M8726L4177n1500J3194m6415j07997
1766a13114R588J03341R939K8461k8782m2563N2836P7101K0112o5698j19212J13465
1754D5474K3965j13429K6380k5445l4689M4176k5747N3585o8284q952K07419M910
1742A29363m3139o4840M7670P003j8299l5307N8811l2784k5270j1442k4291q407
1730b0932Q8135o254J524l9754k0613l3287k6414R3446l8137q444K4474P3554
1718H7298O8190j67660j2085l2621K8031N9460j7617L6809j4479j09936K8596
1707d6014J8806K0143l5294j1484K5765j6053J02239k9034p3143M873J0151M6158
1695A7113m9338L8960L0395J8411m3072m0035N6163m2738P391J67863m7572n3983
$$ y = [39822, 64143, 35890, 23975, 68894, 39021, -3299, 45427, 79604, 28104, 41298, -5117, -113114, -103526, -185, 9754, 38215, 9433, -33130, 19706, 96807, 116919, 51221, -67991, 45474, 69439, -43990, -17610, -43055, -77744, -33568, -59315, -5730, -74014, -82966, 124453, 129363, 86224, 21384, 69054, 76057, 57758, 22451, 81262, 48478, 23208, 11766, -12525, -20932, 67203, 60949, 62473, 22719, 2106, -31181, -57595, 35851, -2286, -10730, 13744, 87298, 155488, -12172, -24257, -56878, -28847, 30613, 12996, 49805, 35326, -74610, -46014, -27208, -7065, -42359, -53843, -28078, -44131, 58108, 29074, -44069, -39196, -29045, 17113, -32225, 6735, 37130, 55541, 12469, -27566, 28597, -14141, -6750, 161113, 113541, 59558]
1683E9558o4984j17646k624K09075M5913p2999N1432m6253O036l4273m8761l7908
1671e3434O489m664O2803k4762M5109r2477N8443m7077L1624j4845l1077k2021
1659h5889n5231L5063J67703l1399m028N1289K3124L3830j20486o6869K2369J35882
1647A05358o7611j58830N9380L6781J2563J9230l1693L3629n705r750j3594J46614
1635A26372k2011j24164Q73P0099Q449n8331K6474q0866r0668O8750M4022O7947
1623C6946L2606j01515o8918Q6170O3503j14220j6215J14569K9194L5474j20976
1612b3382n9414k9574J07276L2383J2125j7016o9692O704k8428R713K111J18115
1600F0921j0598p3646L3588K7693J7531K7489q3770K8477L1543p6356l2918J05532
$$ y = [59558, -5426, -123072, -125696, 83379, 129292, 56293, 107725, 61472, 67508, 33235, -15526, -53434, -46945, -51609, 11194, -13568, 31541, -60936, -2493, -49570, -17946, -32791, -63868, -85889, -141120, -106057, 61646, 30247, 26219, 77508, 100632, 134462, 13976, -52893, -30524, 105358, 37747, -121083, -61703, -24922, -12359, 6871, -24822, 8807, 3102, -6648, -20242, 126372, 104361, -19803, -18930, 51169, 59618, 1287, 27761, -53105, -143773, -75023, -31001, 36946, 69552, -31963, -100881, -14711, 48792, -65428, -81643, 32926, 62120, 97594, -23382, -82796, -112370, -5094, 27289, 39414, 22398, -47294, -40590, -69018, -59305, -57194, 60921, 50323, -23323, 10265, 37958, 55489, 82978, -792, 27685, 59228, -17128, -50046, 55486]
1588E5486k6289o0492L5262n5984Q4017L1662P0588j261q9967K9313O1447o5359
1576F8423l5198j24472R9935m8777r1705P4966L3771J07720o8509q5746K5192
1565d4400O5767o8350m13r6350j3545Q2650k1525j39318M3629K0781O3269J2724
1553i5081L6546L5064p3763L6210m9533j1576P8991n1811Q9359K2920m4449J64558
1541A37435L3814j67926Q768j23174O078J2230k6059O3527N3773j29281k5799
1530a56614J03021M9049Q4471L2437j07377l9834K2649K9965N5518n1907p002
1519A4376m8766R1382m72L5414o9333m9313l0688K4548k8666l0139K5148n26k0741
1506h7776K6177N1937j2386J6215N618m303L8324p8325p053K0453K6237n1633
$$ y = [55486, 29197, -31295, 3967, -52017, 32000, 63662, 134250, 132989, 43022, 72335, 133782, 68423, 33225, -91247, 8688, -40089, -131794, -56828, -23057, 84663, 16154, -69592, -44400, 21367, -46983, -47396, -143746, -157291, -74641, -96166, -235484, -191855, -171074, -107805, -95081, -58535, -23471, -97234, -61024, -110557, -122133, -43142, -94953, -5594, 17326, -27123, 137435, 171249, 3323, 12091, -111083, -105005, -92775, -118834, -55307, -1534, -130815, -156614, -53593, -4544, 79927, 112364, 4987, -34847, -12198, 17767, 73285, 21378, 14376, -34390, 56992, 56520, 91934, 22601, -26712, -57400, -32852, -61518, -91657, -66509, -67035, -87776, -61599, -9662, -22048, -5833, -215, -4518, 33806, -44519, -51572, -31119, -4882, -56515]
1494e6515M4304q722M9335M3353j04231n7759N8318l7475m6844P5536j8127J8653
1482d0174K888p3031l9120k8184M4215J43189m1569k5055J09010p8536N765J0351
1470a0251l2606M6462j05845K2983J8130N5144l6379L3148L2992m3786K1735L867
1458E594N3312N0422j21883o5262J27702P6862q6362j02222L7612j9227O1387
1447A7935m4831j2684J5393m7087K4650q1749k6396N7955j2309M4277M3285N0804
1435B9243m3803J4358l1491J6302J10042j06284N1303P3927j6721o2257J7536
1424E2155k3018j01425j05446J60529K0750K876J221q0236P3205l14p6172k0612
1412i6487O8544J25922K0445q4722j35496l0980J01344m7361K9948J21385m9309
$$ y = [-56515, -12211, -20933, 28402, 71755, -32476, -90235, -31917, -69392, -116236, -40700, -58827, -40174, -37286, -110317, -149437, -177621, -133406, 9783, -31786, -56841, 52169, -26367, -20602, -10251, -42857, 3605, -102240, -79257, -61127, -5983, -42362, -9214, 23778, -20008, 1727, 5594, 58906, 109328, -12555, -77817, 49885, 126747, 40385, -61837, -24225, -43452, 17935, -26896, -39580, -24187, -71274, -46624, -128373, -154769, -96814, -109123, -64846, -21561, 29243, -14560, -202, -31693, -15391, 94651, -11633, 39670, 113597, 96876, 34619, 52155, 29137, -72288, -177734, -17205, 3545, 6421, 7642, -72594, 611, 297, -75875, -96487, -27943, 97979, 118424, 33702, -101794, -132774, -31430, -78791, -48843, 72542, 23233]
1401B3233j11604l7282j1081M2434l9628N4394j0854J4486J33818m0762r8602
1390h1448L429o061Q442O700R0114K0691l2440Q369j2479O9621l4384p3307L7075
1377D322p661n2692L396j8617R8438r4751k8153M6349m8576N469J09715L5152
1365E2391j15499k6994N2501r274O9525N9054J2660m3704m3649L4425q0113Q0157
1353D1480J21393n1363j03203n8335l0729J44053K4170o6108r0343L7381J03104
1342G1500o4420p1184K1600M5633n3796J2136o4956j3583J5254P3503M2307n1096
1330c7102J19955o7367K7517k3186K5084M1782m8602o0714L4929K4426j12647
1319g5925n4365J04177J1636n6555k4031j4370N0405M0674k1136k5003r927r0361
$$ y = [23233, -88371, -125653, -136734, -94300, -133928, -79534, -90388, -75902, 57916, 17154, -81448, -78019, -84080, -75638, -68938, 21176, 41867, 9427, 17796, 5317, 74938, 40554, -32753, 4322, -3339, -56031, -52635, -71252, 27186, -67565, -95718, -49369, -97945, -92476, 17239, 52391, -63108, -90102, -37601, -46875, 22650, 81704, 94364, 50660, 7011, 41436, -38677, 41480, 162873, 111510, 8307, -50028, -80757, 63296, 87466, 21358, -68985, -31604, 71500, 7080, -64104, -42504, 3129, -50667, -38531, -103487, -117070, -101816, -28313, 13994, -37102, 82853, 15486, 43003, 19817, 44901, 86683, 38081, -22633, 12296, 36722, -75925, -130290, -26113, -14477, -71032, -95063, -109433, -59028, -18354, -39490, -64493, -74420, -164781]
1307a64781m3860L2322Q9276J4467l2223J03545o1734j17695J30256J7516L4476
1296A565o1845j478J2083j4790K2471P5553r8910M8306l3179r948R1761k2385
$$ y = [-164781, -208641, -176319, -87043, -72576, -104799, -1254, -62988, -180683, -50427, -32911, 1565, -60280, -61758, -49675, -64465, -41994, 33559, -65351, -17045, -50224, -60172, 31589, 9204]
$$ [...]
##END NTUPLES=NMR SPECTRUM
##END=
