##TITLE=1H_EC-3298(2)
 CDCl3
 8 sc, 
 14.7.2023
##JCAMPDX= 6.0         $$ Bruker NMR JCAMP-DX V2.0
##DATA TYPE= NMR SPECTRUM
##DATA CLASS= NTUPLES
##ORIGIN= UXNMR, Bruker Analytische Messtechnik GmbH
##OWNER= root
$$ XWIN-NMR		Version 3.5
$$ Fri Jul 14 13:59:45 2023 Russian Standard Time (UT+4h)  she@DPX200
##.OBSERVE FREQUENCY= 200.13135
##.OBSERVE NUCLEUS= ^1H
##.ACQUISITION MODE= SIMULTANEOUS
##.ACQUISITION SCHEME= undefined
##.AVERAGES= 8
##.DIGITISER RES= 18
##SPECTROMETER/DATA SYSTEM= spect
##.PULSE SEQUENCE= zg30
##.SOLVENT NAME= D2O
##.SHIFT REFERENCE= (INTERNAL, D2O, 0, 15.7248)
##AUDIT TRAIL= $$ (NUMBER, WHEN, WHO, WHERE, WHAT)
$$ ##TITLE= Audit trail, XWIN-NMR		Version 3.5
$$ ##JCAMPDX= 5.01
$$ ##ORIGIN= Bruker BioSpin GmbH
$$ ##OWNER= she
$$ F:/spectra/data/she/nmr/H-F/1/pdata/1/auditp.txt
$$ ##AUDIT TRAIL=  $$ (NUMBER, WHEN, WHO, WHERE, WHAT)
(   1,<2023-07-14 13:57:49.81 +0400>,<she>,<DPX200>,
      <created by zg, POWCHK disabled, PULCHK disabled
       configuration hash MD5:
       00 E9 B6 7A A2 85 ED C7 34 08 36 98 17 FE 4E 26
       data hash MD5: 16K
       A6 F1 9E B8 B9 55 43 F8 01 7A 84 AA 45 E0 4D A1>)
(   2,<2023-07-14 13:57:52.48 +0400>,<she>,<DPX200>,
      <Start of raw data processing
       efp BC_mod = 2 LB = 0.24 FT_mod = 6 PKNL = 1 PHC0 = -20993.95 PHC1 = 10.05272 SI = 16K 
       data hash MD5: 16K
       CD B0 E8 D9 99 EA EF F0 BC 55 B9 37 7A 56 C5 4F>)
(   3,<2023-07-14 13:58:10.31 +0400>,<she>,<DPX200>,
      <pk PHC0 = 3.640993 PHC1 = -0.6000001 
       data hash MD5: 16K
       E6 A9 70 3D 63 F4 5C FE DB 68 BA AE E3 CD 90 57>)
(   4,<2023-07-14 13:58:14.60 +0400>,<she>,<DPX200>,
      <abs ABSG = 5 
       data hash MD5: 16K
       DB A7 46 FF A6 87 A9 15 9B 5E D5 32 97 1A 0F 1B>)
$$ ##END=
$$ 
$$ hash MD5
$$ AC 4F BE ED AA FB A9 53 B3 98 0F F1 6B 98 3D D2
##$RELAX= 
##$RELAX= 
##$RELAX= 
##$RELAX= 
##$RELAX= 
##$RELAX= 
$$ Bruker specific parameters
$$ --------------------------
##$DU= <F:/spectra>
##$EXPNO= 1
##$NAME= <H-F>
##$PROCNO= 1
##$TYPE= <nmr>
##$USER= <she>
##$AMP= (0..31)
100 100 100 100 100 100 100 100 100 100 100 100 100 100 100 100 100 100 
100 100 100 100 100 100 100 100 100 100 100 100 100 100 
##$AQSEQ= 0
##$AQ_mod= 1
##$AUNM= <au_zg>
##$AUTOPOS= <>
##$BF1= 200.13
##$BF2= 200.13
##$BF3= 200.13
##$BF4= 200.13
##$BF5= 200.13
##$BF6= 200.13
##$BF7= 200.13
##$BF8= 200.13
##$BYTORDA= 1
##$CFDGTYP= 0
##$CFRGTYP= 5
##$CHEMSTR= <none>
##$CNST= (0..31)
1 1 145 1 1 1 1 1 1 1 1 1 1 1 1 1 1 1 1 1 1 1 1 1 1 1 1 1 1 1 1 1 
##$CPDPRG= <>
##$CPDPRG1= <>
##$CPDPRG2= <>
##$CPDPRG3= <>
##$CPDPRG4= <mlev>
##$CPDPRG5= <mlev>
##$CPDPRG6= <mlev>
##$CPDPRG7= <mlev>
##$CPDPRG8= <mlev>
##$CPDPRGB= <>
##$CPDPRGT= <>
##$D= (0..31)
0 1.2 0 0 0 0 0 0 0 0.06 0 0.03 0 0 0 0 0.0002 0 0 0 0 0 0 0 0 0 0 0 0 
0 0 0 
##$DATE= 1689328669
##$DBL= (0..7)
120 120 120 120 120 120 120 120 
##$DBP= (0..7)
150 150 150 150 150 150 150 150 
##$DBP07= 0
##$DBPNAM0= <>
##$DBPNAM1= <>
##$DBPNAM2= <>
##$DBPNAM3= <>
##$DBPNAM4= <>
$$ [...]
##$SUBNAM3= <"">
##$SUBNAM4= <"">
##$SUBNAM5= <"">
##$SUBNAM6= <"">
##$SUBNAM7= <"">
##$SUBNAM8= <"">
##$SUBNAM9= <"">
##$SW= 18.05172834244
##$SWIBOX= (0..15)
0 0 2 0 0 0 0 0 0 0 0 0 0 0 0 0 
##$SW_h= 3612.71676300578
##$TD= 16384
##$TD0= 1
##$TE= 0
##$TE2= 300
##$TE3= 300
##$TEG= 300
##$TL= (0..7)
0 120 120 120 120 120 120 120 
##$TP= (0..7)
150 150 150 150 150 150 150 150 
##$TP07= 0
##$TPNAME0= <>
##$TPNAME1= <>
##$TPNAME2= <>
##$TPNAME3= <>
##$TPNAME4= <>
##$TPNAME5= <>
##$TPNAME6= <>
##$TPNAME7= <>
##$TPOAL= (0..7)
0.5 0.5 0.5 0.5 0.5 0.5 0.5 0.5 
##$TPOFFS= (0..7)
0 0 0 0 0 0 0 0 
##$TUNHIN= 0
##$TUNHOUT= 0
##$TUNXOUT= 0
##$USERA1= <user>
##$USERA2= <user>
##$USERA3= <user>
##$USERA4= <user>
##$USERA5= <user>
##$V9= 5
##$VALIST= <valist>
##$VCLIST= <CCCCCCCCCCCCCCC>
##$VD= 0
##$VDLIST= <DDDDDDDDDDDDDDD>
##$VPLIST= <PPPPPPPPPPPPPPP>
##$VTLIST= <TTTTTTTTTTTTTTT>
##$WBST= 1024
##$WBSW= 4
##$XGAIN= (0..3)
0 0 0 0 
##$XL= 0
##$YL= 0
##$YMAX_a= 686638
##$YMIN_a= -843462
##$ZGOPTNS= <>
##$ZL1= 120
##$ZL2= 120
##$ZL3= 120
##$ZL4= 120
##$ABSF1= 15.76562
##$ABSF2= -2.286229
##$ABSG= 5
##$ABSL= 3
##$ALPHA= 0
##$AQORDER= 0
##$ASSFAC= 0
##$ASSFACI= 0
##$ASSFACX= 0
##$ASSWID= 0
##$AUNMP= <proc_1d>
##$AZFE= 0.1
##$AZFW= 0.1
##$BCFW= 0
##$BC_mod= 2
##$BYTORDP= 0
##$COROFFS= 0
##$CY= -3
##$DATMOD= 1
##$DC= 0
##$DFILT= <>
##$DTYPP= 0
##$F1P= 0
##$F2P= 0
##$FCOR= 1
##$FTSIZE= 16384
##$FT_mod= 6
##$GAMMA= 0
##$GB= 0
##$INTBC= 1
##$INTSCL= 3.70164e-10
##$ISEN= 128
##$LB= 0.24
##$LEV0= 0
##$LPBIN= 0
##$MAXI= 10000
##$MC2= 0
##$MEAN= 0
##$ME_mod= 0
##$MI= 1.114404
##$NCOEF= 0
##$NC_proc= -5
##$NLEV= 6
##$NOISF1= 3.799351
##$NOISF2= 2.8
##$NSP= 0
##$NTH_PI= 0
##$NZP= 0
##$OFFSET= 15.72485
##$PC= 1
##$PHC0= -20990.31
##$PHC1= 9.45272
##$PH_mod= 1
##$PKNL= yes
##$PPARMOD= 0
##$PSCAL= 0
##$PSIGN= 0
##$REVERSE= no
##$SF= 200.130009343536
##$SI= 16384
##$SIGF1= 3
##$SIGF2= 2
##$SINO= 5.538805
##$SIOLD= 16384
##$SREGLST= <1H.CDCl3>
##$SSB= 0
##$STSI= 16384
##$STSR= 0
##$SW_p= 3612.71676300578
##$SYMM= 0
##$S_DEV= 0
##$TDeff= 16384
##$TDoff= 0
##$TI= <>
##$TILT= no
##$TM1= 0
##$TM2= 0
##$TOPLEV= 0
##$USERP1= <user>
##$USERP2= <user>
##$USERP3= <user>
##$USERP4= <user>
##$USERP5= <user>
##$WDW= 1
##$XDIM= 16384
##$YMAX_p= 294347820
##$YMIN_p= -198268
$$ End of Bruker specific parameters
$$ ---------------------------------
##NTUPLES= NMR SPECTRUM
##VAR_NAME=  FREQUENCY,     SPECTRUM/REAL,   SPECTRUM/IMAG
##SYMBOL=    X,             R,               I
##VAR_TYPE=  INDEPENDENT,   DEPENDENT,       DEPENDENT
##VAR_FORM=  AFFN,          ASDF,            ASDF
##VAR_DIM=   16384,         16384,           16384
##UNITS=     HZ,            ARBITRARY UNITS, ARBITRARY UNITS
##FACTOR=    0.220516191357247, 1,           1
##FIRST=     3147.01431757237, 0,            0
##LAST=      -465.702445433414, 0,           0
##MIN=       -465.702445433414, -198268,     0
##MAX=       3147.01431757237, 294347820,    0
$$ Real data points
##PAGE= N=1
##DATA TABLE= (X++(R..R)), XYDATA
$$ [...]
7092b1325o326k085K9150k8512l4768J3263P2068Q17j4706n532j9163L980M1236
7079B8097j6660j4646j222K3393k8527q431J9590K8340K2223k1328j7657M397
7067A7569K064l1287j5139P476M5997K5372O119k7998k4561M515O1054J9595k7426
7054F3350o2259j3600M0781m2406L9491M6579L6463J1159j9447n6017K2562J1953
7042G8609j5131m9871m591L2725K4120m3723p661L2305q647l6509M0111m936l1717
7029E084n945J6862N0998k3577M3862J1677k9896m23K0120j7339K1047o6153m3594
7016a7277n289N3269O5072k2948J3914J2032n2692M1850l5699k799M0617j1447
7004G8603o871j2017K5308L2059m1097p376N5617O67J3135J7547O612K3516L48
$$ y = [-21325, -27651, -29736, -586, -29098, -63866, -50603, 21465, 22282, 7576, 2044, -17119, -13139, 28097, 11437, -3209, -4431, 18962, -9565, -17996, 1594, 29934, 52157, 30829, 13172, 17569, 19633, -11654, -26793, -19317, 26680, 52052, 58171, 30173, 5612, 10127, 71181, 90776, 63350, 1091, -12509, 28272, -14134, 25357, 71936, 108399, 119558, 100111, 44094, 66656, 78609, 63478, 13607, 9016, 41741, 65861, 22138, 14477, 46782, 38135, 1626, 41737, 36801, 5084, -861, 16001, 66999, 43422, 87284, 98961, 69065, 68642, 88762, 71423, 92470, 26317, -17277, -22566, 30703, 95775, 72827, 86741, 98773, 46081, 87931, 52232, 49433, 90050, 78603, 71732, 59715, 85023, 117082, 75985, 68609, 124226, 124893, 138028, 155575, 162187, 185703, 186051]
6991A86051K7556k5093J2272M0287O002Q390K0316j5934m3631j4099l0913L0910
6979B02114K6248k08l2340M373J0244p160l8734k2612m1829J6806j8068k8329
6967G0505P2320L9735j4720n91K2090l3194P913L6560k1882m9951K418O922r592
6954A28533j1063K0979L0576P406K2180M8899j0739M7551o770R636K2016O8182
6942C77386M3914N3780J7935M1233L6461R658J10591J17697J43171J93528J31820
6931A277174J09536p1416k07089j91102k11355j13654j00199l8995o0930j6539
6921C75431J3835j5554m2986j197l1821J9590J6466k3734k0243R029M1192L376
6909C43384K3220N716l3552L8551J8783j0738O324L4621l167L5808M5812L4187
$$ y = [186051, 213607, 188514, 200786, 241073, 247075, 255465, 275781, 259847, 216216, 202117, 171204, 202114, 228362, 228154, 195814, 200187, 210431, 203271, 164537, 141925, 100096, 116902, 98834, 70505, 142825, 182560, 167840, 167249, 189339, 156145, 164058, 200618, 178736, 128785, 131203, 138125, 128533, 117470, 138449, 169025, 176431, 198611, 247510, 236771, 284322, 277552, 287188, 309204, 377386, 421300, 475080, 493015, 534248, 570709, 580367, 690958, 808655, 951826, 1145354, 1277174, 1386710, 1315294, 1108205, 917103, 705748, 592094, 491895, 452900, 391970, 375431, 389266, 373712, 330726, 329529, 297708, 317298, 333764, 310030, 289787, 298816, 340008, 343384, 366604, 372320, 338768, 377319, 396102, 385364, 391688, 426309, 423142, 458950, 504762, 538949]
6897E38949j2635M4038K315O902O9622m4587j7389L3654j8915p3007N2425K8145
6885F09517k4624o232L6237j6229r765J9600o134K9692J1823j962M0204j9188
6873F62939K0399N666N6747L1528k0593L9851Q7791O3849M6486P5106L6233J17779
6861A223781P5132O3692J00305Q1149J67068J71061J58036K75924K47481L00740
6851B864369K46760K49124K20361P1741p1350j79826k25335l12826l54868k73783
6841B234367j90568j77970j76829j46408j51205q2529r0240J7544n9475n920Q507
6830A179274m8993l608P9361P0661M2159O0336L8948J00902L9987O3684R5443
6819A718154K5680m1803k2382j10412j49512j45486j84784j45006m7786j06038
$$ y = [538949, 526314, 570352, 572667, 579569, 649191, 604604, 587215, 620869, 601954, 528947, 581372, 609517, 584893, 578661, 614898, 598669, 588904, 608504, 602370, 632062, 643885, 641923, 682127, 662939, 683338, 689004, 745751, 777279, 756686, 796537, 884328, 948177, 994663, 1069769, 1106002, 1223781, 1298913, 1362605, 1462910, 1544059, 1711127, 1882188, 2040224, 2316148, 2563629, 2864369, 3111129, 3360253, 3580614, 3652355, 3581005, 3401179, 3175844, 2863018, 2508150, 2234367, 2043799, 1865829, 1689000, 1542592, 1391387, 1308858, 1218618, 1236162, 1176687, 1170767, 1179274, 1130281, 1126673, 1206034, 1276695, 1318854, 1379190, 1418138, 1519040, 1559027, 1622711, 1718154, 1743834, 1702031, 1679649, 1569237, 1419725, 1274239, 1089455, 944449, 896663, 790625]
6809G90625m1142p6667p7279L185o4687p7516o599J4384m1123o3469m4163k2221
6797B93328l7401j5350j6767K2563J1132m0935O7958J3445m3504n3701l9076o998
6785A54694k171J3485M7749m806l1490m2510J7448K1417j9815K4599k3674m553
6773A50373J9761K1274l4999K3896m3793k3473k4559J1784k19J6515k6191N26
6761I0895L6855m5420j1474k3641K2140K2952N784o2630o20O981J7499j4336k0065
6748B4920k7270P5860l6842l0675P564K4028j6273q415k5487K3185J2294l4726
6736a1837o145o121O989J3492K9152k308N287j4175K3318p054J0129j6808J0362
6723C4281J7305m6095J3642p3284L7332L3123q768J9878n8283K1975Q38Q855P766
$$ y = [790625, 749483, 672816, 595537, 598722, 534035, 456519, 449920, 464304, 423181, 359712, 315549, 293328, 255927, 240577, 223810, 246373, 257505, 216570, 284528, 297973, 254469, 200768, 161692, 154694, 152523, 166008, 213757, 208951, 177461, 134951, 152399, 173816, 154001, 178600, 154926, 150373, 170134, 191408, 156409, 180305, 136512, 113039, 88480, 100264, 100045, 116560, 90369, 90895, 127750, 82330, 70856, 47215, 69355, 92307, 98091, 35461, 34841, 41822, 59321, 44985, 24920, -2350, 73510, 36668, 5993, 13557, 37585, 21312, 12897, -12590, 10595, 22889, -11837, -17982, -24103, -17114, -3622, 25530, 23222, 28509, 14334, 37652, 30598, 40727, 23919, 34281, 51586, 5491, 19133, -54151, -16819, 16304, 7536, 27414, -30869, -8894, -8056, 799, 8565]
6710H565r0727J0992N8093k0157l0234L7478L253l767p141l2298J5420L7313m2989
6697e6199K2413J2884j5636K280K0j7729J8226L3928O424k490k8899l3274l917
6684f1969M9016l9713N5283M4699k8634j9480J6294p9009J1178O810M314K1656
6672a9555j6433k8463q942K4434K1141j2755k9587Q615M2926m4472L1001j8026
6660e0116k2689M0350k3586l2250Q4229M5305l998k2120L1831m645n7512Q381
6648f820m0373J7908N002k3235N1674l9727J1585K5969R94j914j0022J9003l0905
6635b0861l991k7545k2599M1624M6392L612j7566M2392k6948j3157m0818K3403
6623a6062M8691M4628k9961m7002o656J9942R554k88L35l9698k3083M940j3051
$$ y = [8565, -82162, -71170, -13077, -33234, -63468, -25990, -22737, -26504, -33645, -65943, -50523, -13210, -56199, -33786, -20902, -36538, -34258, -34238, -51967, -33741, 187, 6611, 4121, -24778, -58052, -61969, -12953, -52666, 2617, 47316, 18682, -798, 15496, -63513, -52335, -45525, -41211, -19555, -35988, -64451, -73393, -48959, -27818, -40573, -70160, -61545, -18619, -63091, -32090, -50116, -72805, -32455, -56041, -88291, -4062, 41243, 37245, 15125, 46956, 42311, -15201, -6820, -47193, -29285, -24283, -47518, 4156, -35571, -23986, 1983, 2977, 1063, -8959, 10044, -20861, -24852, -52397, -74996, -33372, 13020, 16632, -934, 41458, 14510, 1353, -39465, -16062, 32629, 77257, 47296, 294, -6362, 13580, 23134, 22846, 23181, -16517, -39600, -34660, -47711]
6610d7711m1605R626K3783J9995J6184M613l8463L7045J2870l7277j9266K9215
6598c0991J6633K4924J7046L5836q494K9301k8656p7470r463Q285q516M923P30
6585b5912l7129L3433M5512j5050l715l9471Q527L9622M2710q9358L4717k440
6573h554J0739j6550O146M3070k5006K5789L6867R928l0982j0295k487N5027j8568
6560G5124m3079R359J4926L7448k174l0030j2203M0256J6842k2473l8360K2427
6548F8063M7442L9321K0901M2272J6309n0733Q25K4970l3540J8283J4007k5742
6536A82378k2371l4079n3909k6763j175O728j3807L4665j3198M5551K1350n8869
6524F6501k8510r239j2912l5003R6547m0046k9040l560r482K3767n944K8679J7031
$$ y = [-47711, -89316, -79690, -55907, -35912, -19728, -15115, -53578, -16533, -3663, -40940, -60206, -30991, -14358, 10566, 27612, 63448, 54954, 84255, 55599, -21871, -31334, -23049, -31565, -26642, -25912, -63041, -29608, 15904, 854, -2861, -42332, -33805, 5817, 48527, -40831, -6114, -8554, 2185, -14365, -8219, 34851, 9845, 35634, 72501, 82429, 51447, 41152, 38665, 93692, 75124, 32045, 41404, 56330, 93778, 91604, 61574, 49371, 89627, 106469, 83996, 45636, 68063, 115505, 154826, 175727, 217999, 234308, 183575, 184400, 209370, 175830, 194113, 208120, 182378, 160007, 125928, 72019, 45256, 44081, 50809, 37002, 71667, 58469, 104020, 125370, 66501, 37991, 28752, 15840, -19163, 77384, 37338, 8298, 4738, -4744, 19023, 13079, 41758, 58789]
6511E8789p6792n6365L8341L7502K3339o2002l611L1199M9743R440m8577K5881
6499B6887r366K8381p1452k6060N1375K248n6898L5927j4437j888K3624m8803
6487f0462J6146N4242q509Q229k9931L2232K8780L5040m9401n2676O1987k1584
6475A4093q011p471O207K979j352L7367J2241k8117k7445J6071L574J8116j1434
6462B6818N823L4825k9123k0673j1014J6539j930j4921j4052K2705K6760J5625
6450E7382j3078j9461N6153K1137K8586p847k0555P425j9925k8410N9408o342
6438A14473j7145L5234n491j1138k0967J6904k6998L1716j3070L2135k4411J2992
6426A24234L1108L9073M086K150k1844J0131Q6109l3038j5460P495O2653K0408
$$ y = [58789, -18003, -74368, -36027, 1475, 24814, -37188, -40799, -9600, 40143, 49583, 1006, 26887, 17521, 45902, -25550, -51610, -235, 2013, -54885, -18958, -33395, -35283, -11659, -60462, -44316, 9926, 1417, 9646, -20285, 11947, 40727, 75767, 26366, -26310, 35677, 14093, 6082, -1389, 4818, 7797, 6445, 43812, 56053, 27936, 491, 16562, 20136, 38252, 26818, 32641, 67466, 38343, 17670, 6656, 23195, 21265, 6344, -7708, 14997, 41757, 57382, 44304, 24843, 80996, 102133, 130719, 122872, 102317, 109742, 89817, 61407, 120815, 114473, 97328, 132562, 127071, 115933, 94966, 111870, 84872, 116588, 103518, 135653, 111242, 124234, 155342, 194415, 198501, 200651, 178807, 188938, 275047, 242009, 226549, 234044, 296697, 317105]
6414C17105m8557O710O3699k2609L4873o8658K1164N8611j2921K6773k317O0148
6402D34021R1467O5953l8986M3294K8668K668R8662K9639J8761Q3070R8423O5552
6390A021192J45762J54154J52424K05728K49588K43502R3899k6935q9154j02197
6380B047963k29491k70848k63269r8397p6024r7360r8615j28504o4912L599k8158
6369F95984j6288L0362K9997m1585l6731M7116K3915M1243k0206J9115j9177L1440
6357G85185K1060K6039R53R402n3827pJ09253K2141J5717n7369k3227K2535J3621
6344H91476q026k410j2797l3499J1520K1315k714O6576P941j4337N8628M1596
6332A025269J1784N186J7419N3919N5710K6148J2574L9710J09182J48358Q0944
$$ y = [317105, 268548, 275258, 338957, 316348, 351221, 282563, 303727, 362338, 349417, 376190, 373873, 434021, 525488, 591441, 552455, 595749, 624417, 627085, 725747, 755386, 774147, 857217, 955640, 1021192, 1166954, 1321108, 1473532, 1679260, 1928848, 2172350, 2266249, 2239314, 2150160, 2047963, 1818472, 1547624, 1284355, 1185958, 1109934, 1012574, 913959, 785455, 720543, 724142, 695984, 679696, 710058, 740055, 698470, 661739, 708855, 732770, 774013, 753807, 772922, 753745, 785185, 806245, 832284, 833237, 842639, 788812, 788805, 898058, 920199, 935916, 878547, 855320, 877855, 891476, 883450, 881040, 868243, 834744, 846264, 867579, 864865, 931441, 939382, 925045, 983673, 1025269, 1037053, 1042239, 1059658, 1113577, 1169287, 1195435, 1208009, 1247719, 1356901, 1505259, 1586203]
6321A586203J00672J11811J34347J39273J67038J70372R9963Q9725m7134k5300
6311B526970j1909j19806l1414j27863j10019r8338j21917m8448j37075j57389
6301A562792r9805j02066J431J1194p5540m103p70j2585j7277m0844L5258K4605
6289A282290M1194l558K8269L3130M8476P7646R148J36270R5736J07800R5167
6278A951568J29411K26104J71983K35562K60335K64275L53264L19734J73208p1835
6268D013609k74852m35801m03918l50339k78059j93065k42392j53542j01616j31688
6258A448337r4828n7566q2876o4517l3556L1582l4858L109L6203L5995k8170M3851
6246A202706M8246L6713P5124P5089Q2628J17723J40629J10982K33006K02951
$$ y = [1586203, 1686875, 1798686, 1933033, 2072306, 2239344, 2409716, 2509679, 2599404, 2552270, 2526970, 2515061, 2395255, 2363841, 2235978, 2125959, 2027621, 1905704, 1857256, 1720181, 1562792, 1462987, 1360921, 1362352, 1373546, 1298006, 1293903, 1293133, 1280548, 1263271, 1222427, 1257685, 1282290, 1323484, 1319926, 1348195, 1381325, 1429801, 1507447, 1516595, 1652865, 1748601, 1856401, 1951568, 2080979, 2307083, 2479066, 2714628, 2974963, 3239238, 3592502, 3912236, 4085444, 4013609, 3738757, 3302956, 2899038, 2548699, 2270640, 2077575, 1835183, 1681641, 1580025, 1448337, 1353509, 1295943, 1213067, 1148550, 1114994, 1146576, 1111718, 1114827, 1151030, 1187025, 1158855, 1202706, 1250952, 1287665, 1362789, 1437878, 1520506, 1638229, 1778858, 1889840, 2122846, 2325797]
6236B325797K77668J68485n8409k18084k80031l29244k54563j64183j31082j57941
6226A178413j45801j19405p0454l0062p9725o8552J658K906q814j4794l4384l3039
6214E77947l7847p1869L0900p685R507n5r6709M1714j6231o9626M9673k4473j2095
6201C73151R441k6788K3593K4122j2279m3089K2261l3306J378J6569l3922R625
6189C30756O3469L7287l4375K4792J9559k5510j5469N6978p853p6844P866N206
6177C85862n1811J1145m2803k7942J224J010l3958n5085Q784L5228l9183n687
6165A86784L6847l0231K8163p0311l6587j1566M2893R600J0537J7540j2326l1887
6153A39456J7154r417K3730j1017m6296M6632m7715k7899K2869k6807K2145k1374
$$ y = [2325797, 2603465, 2771950, 2713541, 2495457, 2215426, 1886182, 1631619, 1467436, 1336354, 1178413, 1032612, 913207, 842753, 812691, 732966, 664414, 666072, 668978, 660164, 645370, 610986, 577947, 540100, 468231, 499131, 491446, 500953, 500898, 404189, 445903, 429672, 360046, 409719, 385246, 373151, 382592, 355804, 379397, 403519, 391240, 348151, 370412, 337106, 338484, 355053, 321131, 330756, 394225, 431512, 397137, 421929, 441488, 415978, 400509, 457487, 449634, 372790, 380656, 385862, 334051, 345196, 302393, 274451, 275675, 276685, 242727, 187642, 196426, 231654, 192471, 186784, 223631, 193400, 221563, 151252, 114665, 103099, 145992, 155592, 166129, 183669, 171343, 139456, 156610, 147193, 170923, 159906, 113610, 160242, 112527, 84628, 107497, 80690, 102835, 81461]
6141H1461l1905K5029m0564N8202K7941m1457j2496m111M5241J6909j161k1249
6129A01840O420J9639q977l635M781k4654m1917M4M2453L6496p6822j9253K9433
6116F5848l1936J8829M6173m6630j8991o29J1096k7319J1334o485J3980j9702
6104A5568k1527L5533K236k6896K4248k1285J2792L4578m121k27n7134j7041k1069
6091d4345k9J2497K0597L7974L7495l8164r959J1702M9485L4390o9167j3191l1949
6078b664Q098L8702m3488k095p7782N9293M2873k3899o313O9167r727q957P619
6065E0827j0765l1126j3631J3585r894l3887k1202J6721L7936J8435j2415J3284
6053A7868k8616K6881M025K0017K9505l6869K899J8498J9835k5603L950q543n7463
$$ y = [81461, 49556, 74585, 34021, 92223, 120164, 78707, 66211, 62100, 107341, 124250, 123089, 101840, 108260, 127899, 118922, 115287, 120068, 95414, 53497, 53541, 95994, 132490, 55668, 36415, 65848, 33912, 52741, 98914, 52284, 33293, 32664, 43760, 16441, 27775, 21290, 35270, 15568, -5959, 29574, 31810, 4914, 29162, 7877, 20669, 55247, 51126, 50899, -6235, -23276, -44345, -44374, -31877, -11280, 26694, 64189, 26025, 16066, 27768, 77253, 111643, 42476, 29285, -2664, 5434, 44136, 648, -1447, -79229, -19936, 22937, -962, -7275, 61892, 52165, 43208, 50827, 40062, 8936, -4695, 8890, -1004, -34891, -56093, -39372, -1436, 16999, 4584, 17868, -10748, 16133, 20158, 40175, 69680, 32811, 35710, 54208, 74043, 48440, 52390, 43847, -13616]
6040a3616j6397O7951j8357j239N8880j3898Q770m5297J9575L2962m3119j2940
6028B3275L9356P3j3056k780m1879M4424K5868O460l799m7287j6583M121N4205
6015G2398J3808j6420m0579J5637Q159m9200M1316K5840k7306j7768K6493l8099
6003A4279l3996L8892j4532K5700J9637n1430n268L9047K3868J508K6648K9346
5991A13699m6992k238K9830n909L6495J2145n0469r098m0722J5935k7127M9878
5979G5427J1926r494J1117j3175m6561j9404J1355K8248o152K7352n439L5474
5967A00674j4126j4030J3716K9628m5639q746l068m4604J8028J3028m235M2216
5955H2842K281l7018K193K5601j1959m9577K5708k6125K4896k7843L8472N2902
$$ y = [-13616, -30013, 37938, 19581, 18342, 77222, 63324, 72094, 26797, 46372, 79334, 36215, 23275, 62631, 62704, 49648, 46868, 4989, 49413, 75281, 81741, 77942, 30655, 14072, 18193, 72398, 86206, 69786, 29207, 44844, 53003, 3803, 45119, 70959, 43653, 25885, 52378, 14279, -19717, 19175, 4643, 30343, 49980, -1450, -6718, 32329, 56197, 57705, 84353, 113699, 66707, 64469, 94299, 88390, 124885, 137030, 86561, 77463, 36741, 52676, 25549, 75427, 87353, 77859, 88976, 75801, 29240, 9836, 21191, 49439, 43287, 70639, 65200, 100674, 86548, 72518, 86234, 115862, 70223, 61477, 58409, 13805, 31833, 44861, 40626, 82842, 85123, 48105, 50298, 75899, 63940, 14363, 40071, 13946, 38842, 10999, 49471, 102373]
5943A02373k664l3783o218k8698k4747J6511O8423j5027o0908k9372o818J6140
5931d788L6176M2471R724M9064k6349K918n6760P179Q389j9102J3397J5745n486
5918G2578k5521K2335k6889J0546J8908J533K0661L5054l1139m2297O957J1382
5906G4108k1240J8264K0739L8592j4259n765j3819J1526l038n1187L2105Q255
5894I4281j8005n263r08J0608J8824j1801l4842K5140M036J2140j3326N2189J6766
5881A49839P682n8101j261K1803j4223L2505k0788j8760k8680j5387O1836J029
5869A17494M3206l701K848j4038j1131K9283J3754M661l8025l450K0439M9704
5857B11044l9938m777L990k1123n6963P500N0069P4087j0939m002K7588j2789
$$ y = [102373, 99709, 65926, 59708, 31010, 6263, 22774, 91197, 76170, 15262, -14110, -20928, -4788, 31388, 73859, 83583, 132647, 106298, 109216, 52456, 59635, 68024, 48922, 62319, 78064, 72578, 47057, 69392, 42503, 53049, 71957, 73490, 94151, 129205, 98066, 55769, 62726, 74108, 52868, 71132, 91871, 130463, 116204, 110439, 96620, 108146, 105108, 53921, 86026, 94281, 76276, 71013, 70105, 80713, 99537, 87736, 52894, 78034, 82070, 94210, 80884, 133073, 149839, 157521, 99420, 98159, 119962, 105739, 138244, 117456, 98696, 70016, 54629, 116465, 117494, 160700, 156999, 159847, 145809, 134678, 163961, 177715, 182376, 144351, 140901, 161340, 211044, 171106, 166329, 170319, 149196, 92233, 99733, 149802, 223889, 212950, 208948, 236536, 223747]
5845B23747K7112p064K747n7207J5503o579J1908O2339J5816o9018J0621M3288
5833B73213L7723k102j8352m2153M3622L1585q765p53r84L8846k4312J0019K4916
5820C62503J5556K1586N0517J4825p671m123M3278r87J5936l90L5997K8185M3717
5807F18929l084o439n786j0874K5592J2680K7374j2236K2454P9404K8171L8123
5795H14308R341O6021P0104J0861N3894O4525l1167J5927L3580K5128J5376N9082
5783A206980Q7429J34697J77540M5739M6499m8843r4565l7607o3686j5555n4368
5772A384260j4649N1405L9004n410P0295Q2887J63556J39878O9633L8582k7049
5761A992392j009j0548j4225K8742P5521J28130J70044K20286K58474K63075J4713
$$ y = [223747, 250859, 243795, 246542, 189335, 204838, 198259, 210167, 272506, 288322, 219304, 229925, 273213, 310936, 308834, 290482, 248329, 291951, 323536, 314771, 314018, 313034, 351880, 327568, 337587, 362503, 378059, 399645, 450162, 464987, 457316, 453193, 496471, 495484, 511420, 511030, 547027, 575212, 618929, 615845, 609406, 603620, 592746, 618338, 631018, 658392, 646156, 668610, 748014, 776185, 814308, 823649, 889670, 959774, 970635, 1024529, 1089054, 1057887, 1073814, 1107394, 1132522, 1147898, 1206980, 1294409, 1429106, 1606646, 1652385, 1698884, 1650041, 1555476, 1517869, 1454183, 1438628, 1384260, 1369611, 1421016, 1460020, 1454610, 1524905, 1607792, 1771348, 1911226, 1980859, 2019441, 1992392, 1991383, 1980835, 1966610, 1995352, 2070873, 2199003, 2369047, 2589333, 2847807, 3110882, 3125595]
5750C125595j56289k52859l02876j87334j36310j31844o4482L1259O3632Q3053
5740B071545J7299J18932J93136J85736K00846Q7809M680n9830J6044K6109P5066
5729B937372P7508J43809K64289L51787K81666K89031J24540l39787m82810m18767
5719C228638l71409k56094j46737n4065n4136n2307L7014N1744P3373J01964J48053
5708B706038J21041J44442J0485M3239r679n7799j9119L7515L8761J56958J67707
5697C339589K14148J86709n3230l12169l83121l47470k12840j88322q1801n7576
5687B103917r2200o8054k2081q458Q599k0189K7039j5295O2510j9494m4075l3393
5675A878826q0744O308m1519m602k0444R1734N2703l0606p0699j41589j69781
$$ y = [3125595, 2969306, 2716447, 2413571, 2226237, 2089927, 1958083, 1893601, 1924860, 1988492, 2071545, 2088844, 2207776, 2400912, 2586648, 2787494, 2875303, 2879983, 2820153, 2836197, 2862306, 2937372, 3014880, 3158689, 3422978, 3774765, 4056431, 4345462, 4470002, 4130215, 3647405, 3228638, 2857229, 2601135, 2454398, 2400333, 2346197, 2293890, 2330904, 2382648, 2456021, 2557985, 2706038, 2827079, 2971521, 2982006, 3025245, 3015566, 2957767, 2938648, 2976163, 3014924, 3171882, 3339589, 3553737, 3740446, 3687216, 3375047, 2991926, 2644456, 2431616, 2243294, 2161493, 2103917, 2011717, 1943663, 1921582, 1913124, 1921723, 1901534, 1928573, 1913278, 1975788, 1956294, 1912219, 1878826, 1798082, 1804390, 1762871, 1758269, 1737825, 1829559, 1882262, 1851656, 1780957, 1639368, 1469587]
5664A469587j52727j05035q0944m3457o6474l9629k1687m9654k8264J0107L558
5653H95381J2051O39j5285M6687j2633J3148J3441J8890M262j5117o9520m8105
5641H43839l0604J2121M95j7872o1314l8163j1954k2669o448m9680k8849M4655
5629F33557K4018J9713j5466k7672j163O5234L802k3198L8965p1006R996Q5739
5617G42519k5931m6276P3664L3456j0791M7842j785K2865j7029j00359K1417J9469
5605G59061j0857J92N6133O976J1437j2817l4040P569J3190l479l6224j8228N6385
5592G95298O1621K7321K9469O845K6426k6307m2368k9287J3536N2785N7156J6823
5580I89318L4267j2235k9012j587j0375M725N1520O1922P1019L5944K5985m616
$$ y = [1469587, 1316860, 1211825, 1130881, 1087424, 1020950, 981321, 959634, 909980, 881716, 891823, 895381, 907432, 908071, 892786, 939473, 926840, 939988, 953429, 972319, 976581, 961464, 891944, 843839, 813235, 825356, 825851, 807979, 746665, 708502, 696548, 673879, 667431, 617751, 588902, 633557, 657575, 677288, 661822, 634150, 632987, 698221, 702023, 678825, 717790, 646784, 656780, 742519, 716588, 670312, 743976, 777432, 766641, 814483, 812698, 835563, 818534, 718175, 739592, 759061, 748204, 748396, 804529, 811505, 822942, 810125, 776085, 783654, 796844, 793365, 757141, 738913, 795298, 856919, 884240, 913709, 920554, 946980, 920673, 878305, 849018, 862554, 915339, 972495, 989318, 1023585, 1011350, 982338, 980751, 970376, 975101, 1026621, 1088543, 1159562, 1195506, 1221491, 1216875]
5568A216875L3409L7125k1645l7930M0436j3622K1687K6842J0032l6471l0356
5557A246382N31o398N1910M1800R41K6986Q6707j5332J1118P1778O5123K8696
5545A610242P5329Q0195P3079N0382l2174j5459n1496j04612m3278o4749l8081
5534A539378R283k0021j7126L0524L9353j1850q711N283J9298L4493M4319P9179
5522A743402J16874O7106Q5854L3599P2731J14014J18729J05612L2069K3240l8928
5511B474302o3345q3174p4396J2782j6645o5529K5774K8474j2821O2459M2848
5500B330729J2112j157N7587P6204K8403Q8472P6568K1031J32904J40528M6829
5489C010210J14488N7971J06144Q6327J09323l3744q5811N008n242K9534R1914
$$ y = [1216875, 1250284, 1287409, 1265764, 1227834, 1268270, 1254648, 1276335, 1303177, 1313209, 1276738, 1246382, 1246913, 1240515, 1292425, 1334225, 1335166, 1362152, 1448859, 1433527, 1444645, 1516423, 1581546, 1610242, 1685571, 1765766, 1838845, 1889227, 1857053, 1841594, 1790098, 1685486, 1642208, 1577459, 1539378, 1548661, 1528640, 1511514, 1542038, 1581391, 1569541, 1560830, 1566113, 1585411, 1619904, 1664223, 1743402, 1860276, 1927382, 2013236, 2046835, 2119566, 2233580, 2352309, 2457921, 2489990, 2513230, 2474302, 2410957, 2327783, 2253387, 2266169, 2249524, 2183995, 2209769, 2238243, 2225422, 2287881, 2330729, 2342841, 2341684, 2399271, 2475475, 2503878, 2592350, 2668918, 2689949, 2822853, 2963381, 3010210, 3124698, 3182669, 3288813, 3375140, 3484463, 3450719, 3364908, 3369916, 3364674, 3394208, 3486122]
5478C486122M3673R6369P6907K6840J26645O3868P3968J48453J03054O5019R8299
5467D409217J52848J27866J66849K01528K09871J43073R8810Q9745O9395J02231
5457E771433J40039P2285J14834J10817Q9586J50470J99095J83294K04991K24924
5447G261768J88196K75243K70613J96945K76603K69651L04331L18380K92845L97763
5437A0052338M13250M23424M02181M19215M09853M47220L60668K37959N3368l6104
5427A3183372J5604J00153J67651J63821J19710K50264K75869K53519L00229L80164
5417A5210356M48151M53040N71413N86257O31579O60917P37987Q59173R27444
5408B1086317J055425J126086J276753J371370J547114J766048K009044K299296
$$ y = [3486122, 3529795, 3626164, 3703071, 3729911, 3856556, 3920424, 3994392, 4142845, 4245899, 4310918, 4409217, 4562065, 4689931, 4856780, 5058308, 5268179, 5411252, 5510062, 5599807, 5669202, 5771433, 5911472, 5983757, 6098591, 6209408, 6298994, 6449464, 6648559, 6831853, 7036844, 7261768, 7449964, 7725207, 7995820, 8192765, 8469368, 8739019, 9043350, 9361730, 9654575, 10052338, 10465588, 10889012, 11291193, 11710408, 12120261, 12567481, 12928149, 13166108, 13219476, 13183372, 13198976, 13299129, 13466780, 13630601, 13750311, 14000575, 14276444, 14529963, 14830192, 15210356, 15658507, 16111547, 16682960, 17269217, 17900796, 18561713, 19299700, 20158873, 21086317, 22141742, 23267828, 24544581, 25915951, 27463065, 29229113, 31238157, 33537453]
5400C3537453K528746K796133L144773L422659L793949M265212M732587N133715
5392F3355227N384017N461268N202296M884351M569526M296205M086730L617713
5384A00857333K565603M74669k168603m404880n782930o059055o022769n762380
5376G3696988n900083o160944o175439o033471n477819m914444m112560l455607
5368C1466621k867861k363812k043622j758258j545996j337442j076076j019790
5360A7453764q87129q41876p21976n74307n97317n34639n42852m73483l97145
5351A1883040l65790l41161k65126k77217l40570l51212l90874m61392l92037
5342H697661l17624l68383l78556l11549k79255k31587k27620k24711k58554j84631
$$ y = [33537453, 36066199, 38862332, 42007105, 45429764, 49223713, 53488925, 58221512, 63355227, 68739244, 74200512, 79402808, 84287159, 88856685, 93152890, 97239620, 100857333, 103422936, 103897605, 101729002, 97324122, 91541192, 85482137, 79459368, 73696988, 67796905, 61635961, 55460522, 49427051, 43949232, 39034788, 34922228, 31466621, 28598760, 26234948, 24191326, 22433068, 20887072, 19549630, 18473554, 17453764, 16566635, 15724759, 15002783, 14428476, 13831159, 13296520, 12753668, 12280185, 11883040, 11517250, 11176089, 10910963, 10633746, 10293176, 9941964, 9551090, 9089698, 8697661, 8380037, 8011654, 7633098, 7321549, 7042294, 6810707, 6583087, 6358376, 6099822, 5915191]
5332E915191j36297j81884j97287j33307p7345j36025j55094j28229j34732q9929
5322D545062l7473k5205n7131o2374j4616R008L274l7668j39172m9454p8385j31654
5310C924212l1863q1276j15156q4347p4247q5331p9837q7162q9781j45205p3910
5299B976097o2119m8087r8971j12297j31157q9722o0523r1835k1708o3248q5846
5288B110584J1367K4555n0974j8506L9134q1198m5387m85M1096N315n0490K6092
5276B011103K4872m3065j614o347l2265k8058j05913j3445l8912q6190K2444p0598
5264A632012n7757K546k6716k1017o1839k8740l4725L7298L2331j8117L4103J7255
5252A506634p0229J4658j5552N645Q408k0022q0690L6162j46k6974j9527o9652
$$ y = [5915191, 5778894, 5597010, 5399723, 5266416, 5189071, 5053046, 4897952, 4769723, 4634991, 4545062, 4507589, 4482384, 4425253, 4362879, 4348263, 4357271, 4360545, 4322877, 4183705, 4134251, 4055866, 3924212, 3892349, 3811073, 3695917, 3611570, 3537323, 3451992, 3372155, 3284993, 3195212, 3050007, 2976097, 2913978, 2865891, 2766920, 2654623, 2523466, 2433744, 2373221, 2281386, 2259678, 2196430, 2110584, 2121951, 2146506, 2095532, 2077026, 2116160, 2034962, 1989575, 1989090, 2030186, 2035501, 1985011, 2011103, 2035975, 1992910, 1991296, 1984949, 1952684, 1924626, 1818713, 1805268, 1766356, 1680166, 1702610, 1632012, 1574255, 1576801, 1550085, 1529068, 1467229, 1438489, 1403764, 1441062, 1473393, 1455276, 1489379, 1506634, 1436405, 1451063, 1435511, 1441156, 1449564, 1429542, 1348852, 1385014, 1384868, 1357894, 1338367, 1268715]
5240A268715j0881n227N5493m8721K2311k6195j12271o701L9892j3615L8747L554
5228A205101n7928k5549N465o3589m5316O4432J295m6159M013J8299N438k3373
5216A042129k763J9495l875P9401K5548l7549L0968M1212n0675J2394j0115L6092
5204A182262J0296k2846r281k931J9259L5805J1255l7911l285O3899j8901J0221
5192A237842N6843R328r610k7135M2180N8637L8074k8830N9088P7138p925l3661
5180A471969Q7786Q7412P6893j3892K4344K0348J0408M469k6855j1939m6264l5718
5168A648961j6976L2968J0554p981r723k0914M0984j4419j3041m3167l5822j023
5156A570401j2084k2649n8518n398K7459J6416L0957K7750Q533L4896j0245Q9285
$$ y = [1268715, 1257834, 1252607, 1308100, 1259379, 1281690, 1255495, 1143224, 1136523, 1176415, 1162800, 1201547, 1205101, 1147173, 1121624, 1127089, 1063500, 1018184, 1082616, 1083911, 1037752, 1041765, 1060064, 1065502, 1042129, 1039366, 1058861, 1054986, 1134387, 1159935, 1122386, 1153354, 1194566, 1143891, 1156285, 1146170, 1182262, 1192558, 1169712, 1160431, 1157500, 1176759, 1212564, 1223819, 1185908, 1182623, 1246522, 1227621, 1237842, 1294685, 1304013, 1294403, 1267268, 1309448, 1368085, 1406159, 1377329, 1436417, 1513555, 1505630, 1471969, 1559755, 1647167, 1724060, 1710168, 1734512, 1754860, 1765268, 1769737, 1742882, 1730943, 1684679, 1648961, 1631985, 1664953, 1675507, 1667526, 1657803, 1636889, 1677873, 1663454, 1650413, 1607246, 1571424, 1570401, 1558317, 1535668, 1477150, 1471752, 1499211, 1515627, 1546584, 1574334, 1582867, 1617763, 1607518, 1696803]
5144A696803K4791k1792M3274O239L1206O9755m872L0857J19429L6188K8508k5734
5132B034652o5065n5503n8496n4611j14611j07779q8348q3273l5826j0868j2783
5121A347489l3907k4120L8459L0978o32k4872J763K886O5926P121J9833M4377
5109A475301M3066M6350N2400N7475m4664n9830k619l8234p5171o1101o7868l0100
5097A295005q194M9388l6278L4054L1139l1403K1409R791K5253P666k7369M6791
5085A417252O8740k064k1438K941Q0608N3144r365J2274K9588L6191k7200q057
5073A632614K8448l1369n3102P242l547p7467k8927q0389m8633k3254J0532l371
5061A328777m2417l2763m2736n3916O968R007l6334K0240k6259n0124j7106K7206
$$ y = [1696803, 1721594, 1699802, 1743076, 1749315, 1780521, 1850276, 1845404, 1876261, 1995690, 2031878, 2060386, 2034652, 1969587, 1914084, 1855588, 1800977, 1686366, 1578587, 1490239, 1406966, 1371140, 1360272, 1347489, 1313582, 1289462, 1327921, 1358899, 1358267, 1333395, 1335158, 1338044, 1403970, 1411091, 1430924, 1475301, 1518367, 1564717, 1617117, 1674592, 1629928, 1570098, 1567479, 1529245, 1454074, 1392973, 1325105, 1295005, 1286811, 1336199, 1299921, 1333975, 1365114, 1333711, 1355120, 1364911, 1390164, 1397830, 1370461, 1417252, 1485992, 1483928, 1462490, 1465431, 1546039, 1599183, 1589818, 1602092, 1631680, 1667871, 1640671, 1632614, 1661062, 1629693, 1576591, 1583833, 1580286, 1502819, 1473892, 1393503, 1344870, 1321616, 1332148, 1328777, 1286360, 1253597, 1210861, 1156945, 1163913, 1172920, 1136586, 1156826, 1130567, 1080443, 1063337, 1090543]
5049A090543j700L2548K0010k5539m7523j2541J3293J5759L9849n89Q2089p009
5037A199190K9291K6119O515M9268O8374P3466K0450J07592Q4806k714l7186n1632
5025A573539j35468r6511n3932n6388m237m9349J632r700j5933K014n0820n9386
5013A045461l5812j9938p9216P0731N2123j9578k6713j8424P148K0512J7636j7220
5001I96710J8648n1602L025J7587P143M4409K623J5190k3022M3778j7069L0959
4989A088379J2504L0824N1145L2603o7873J7916k4118M677O3321m5508P216l9915
4977A131171J2595k9251j3527N0841n611M3925n8277o5621P1687O2912J9398M1204
4965A261446M8349k2520N0389K9502M8186N8863N8749J2791J5066M4043L062l5413
$$ y = [1090543, 1088843, 1121391, 1141401, 1115862, 1068339, 1055798, 1069091, 1084850, 1124699, 1124110, 1206199, 1199190, 1228481, 1254600, 1261115, 1310383, 1378757, 1452223, 1472673, 1580265, 1665071, 1662357, 1625171, 1573539, 1438071, 1341560, 1287628, 1231240, 1227003, 1177654, 1179286, 1169586, 1153653, 1155667, 1104847, 1045461, 1009649, 989711, 910495, 981226, 1033349, 1013771, 987058, 968634, 975782, 996294, 1013930, 996710, 1015358, 963756, 966781, 984368, 991511, 1035920, 1038543, 1053733, 1030711, 1074489, 1057420, 1088379, 1100883, 1131707, 1182852, 1215455, 1147582, 1165498, 1141380, 1146057, 1209378, 1163870, 1171086, 1131171, 1143766, 1114515, 1100988, 1151829, 1146218, 1190143, 1131866, 1066245, 1137932, 1200844, 1220242, 1261446, 1309795, 1287275, 1337664, 1367166, 1415352, 1474215, 1532964, 1545755, 1560821, 1604864, 1607926, 1572513]
4953A572513j7735L2453q2424J4138R254p4316K0732r685o0205n2739K2418O67
4941A375071N9441K1233n6938K4134P5197R660L1898K5353N2310K4330M579L9197
4929A685465j398J5947K5494j0539j9968p8457k8801K03J2758m7360L6289l3735
4917A555898K1089R989k335J2161J6872m619J6806L077L824k1863n0835N4152
4905A614216L4183J7234J8310M2125K4108K8262K2993j6855m312n7443l0295K9061
4893A721587l1620o6825l560O7035M0697N5205o1293n4922R1398N2607N0221Q8684
4881A949214o58m501K4893R8207M3064L9152M2564j8440R7549P0576l6126J3734
4869B319228O1972K6366M2208K6568Q22r825j01645o0408k5929R089m1417j311
$$ y = [1572513, 1554778, 1587231, 1504807, 1518945, 1528199, 1453883, 1474615, 1464930, 1404725, 1351986, 1374404, 1375071, 1434512, 1455745, 1398807, 1422941, 1498138, 1507798, 1539696, 1565049, 1617359, 1641689, 1646268, 1685465, 1684067, 1700014, 1725508, 1714969, 1695001, 1616544, 1587743, 1587946, 1600704, 1553344, 1589633, 1555898, 1576987, 1586976, 1584641, 1596802, 1613674, 1609055, 1625861, 1628938, 1632762, 1610899, 1560064, 1614216, 1648399, 1665633, 1683943, 1726068, 1750176, 1778438, 1801431, 1784576, 1780264, 1722821, 1692526, 1721587, 1689967, 1623142, 1619582, 1686617, 1727314, 1782519, 1721226, 1666304, 1757702, 1810309, 1860530, 1949214, 1948556, 1944055, 1968948, 2067155, 2110219, 2149371, 2191935, 2173495, 2271044, 2341620, 2305494, 2319228, 2381200, 2407566, 2449774, 2476342, 2477164, 2467339, 2365694, 2305286, 2279357, 2288446, 2247029, 2245718]
4857B245718n4988L7049l434n748K1747M9031N1537k688L7614Q4561O3439Q4700
4845B608538K5871P6954J16155J25962J52625J43764J9263q1269r7522l1713j15412
4834B943216j23667n8959o2172p7686m4276r505J037k6187m6302M2601K0365K1826
4822B580291L4311N5250P2354N2427O1396O8753P465O7690N0347J10775Q0299
4811C241358J01095L1800J9968L0557p823P0689L1953Q1588J15609Q2986M0644
4800C840424K6388n1984R055k2325k091n3821J8594J02076q114L5725j006j4605
4788C878316J0193L0694j6343L541J4988M3625N9918J08576J6634J72232J57087
4777D479461J04373J42649J74345K25635K57006K05623K24165L12614L86705K46792
$$ y = [2245718, 2190730, 2227779, 2224345, 2218597, 2240344, 2289375, 2340912, 2338224, 2375838, 2460399, 2523838, 2608538, 2634409, 2711363, 2827518, 2953480, 3106105, 3249869, 3269132, 3187863, 3090341, 3058628, 2943216, 2819549, 2760590, 2698418, 2620732, 2576456, 2566951, 2567988, 2541801, 2495499, 2538100, 2558465, 2580291, 2614602, 2669852, 2742206, 2794633, 2856029, 2924782, 2932247, 2999937, 3050284, 3161059, 3241358, 3342453, 3374253, 3394221, 3424778, 3416955, 3487644, 3519597, 3601185, 3716794, 3799780, 3840424, 3866812, 3814828, 3823883, 3801558, 3799467, 3745646, 3764240, 3866316, 3858202, 3893927, 3892921, 3878316, 3888509, 3919203, 3902860, 3906401, 3921389, 3965014, 4024932, 4133508, 4150142, 4322374, 4479461, 4583834, 4726483, 4900828, 5126463, 5383469, 5589092, 5813257, 6125871, 6512576, 6759368]
4767F759368M03313K89943P8076j25084k87018k65910l44247l36634l05082k34106
4757E632619k41679k00695k51835l4886m9524m4674k3813m4256j350J8832K5167
4746D783906L303N7250L3108N8757R1584P4559R4807N2219O0837O8864K4980J8910
4734E423084L5340J5736L5274K159K6513J09752Q8986J11684R8880N7399J72159
4723F176966J46654J50516J31485J47356R1553j6060l0106J05267J76339J44257
4713G224227K59602L33502L02929k2993J259k6079k60383l65013j64629j06718
4703G175704r7385j15909j0820L5947K3046L274N0256J03123J05786R8402J31877
4692G503301J45636J06358M4971J19820J56123J50901J89009J49154J94602J77901
$$ y = [6759368, 7162681, 7452624, 7530700, 7405616, 7118598, 6852688, 6508441, 6171807, 5866725, 5632619, 5390940, 5190245, 4938410, 4903524, 4854000, 4809326, 4785513, 4741257, 4739907, 4758739, 4783906, 4787209, 4844459, 4877567, 4936324, 5027908, 5102467, 5197274, 5249493, 5310330, 5379194, 5404174, 5423084, 5458424, 5474160, 5509434, 5511593, 5538106, 5647858, 5736844, 5848528, 5947408, 6004807, 6176966, 6323620, 6474136, 6605621, 6752977, 6844530, 6828470, 6798364, 6903631, 7079970, 7224227, 7483829, 7817331, 8120260, 8097267, 8098526, 8072447, 7812064, 7447051, 7282422, 7175704, 7078319, 6962410, 6951590, 6987537, 7010583, 7013857, 7064113, 7167236, 7273022, 7371424, 7503301, 7648937, 7755295, 7800266, 7920086, 8076209, 8227110, 8416119, 8565273, 8759875, 8937776]
4682H937776J73085J04894J64987P5058R7801J68941J45546J13997J28635J09934
4672A0220654J38434J22425J66636J49088J99304J58677J62808K11299K26177
4663A1755502K48156K37276J72292K84008L44709L64166L88805L69013M38507
4654A4602434M75084N17707N28980N72669O63371P66677Q33022Q14726R40286
4645B0714956J041336J012989Q60346O92500N97311P01914R21819J027737R61516
4636B8532424O74650L64982K61099K67562M76487Q02596J050679J198873J335983
4627C4965335J356228J157811Q70015M83260K49593r0010k92887m70422n52979
4618C7675944m49444l19326j25303J00435L35895N37086P84468J045146J224236
$$ y = [8937776, 9110861, 9215755, 9380742, 9455800, 9553601, 9722542, 9868088, 9982085, 10110720, 10220654, 10359088, 10481513, 10648149, 10797237, 10996541, 11155218, 11318026, 11529325, 11755502, 12003658, 12240934, 12413226, 12697234, 13041943, 13406109, 13794914, 14163927, 14602434, 15077518, 15595225, 16124205, 16696874, 17360245, 18126922, 18959944, 19774670, 20714956, 21756292, 22769281, 23629627, 24322127, 24919438, 25621352, 26543171, 27570908, 28532424, 29207074, 29572056, 29833155, 30100717, 30577204, 31379800, 32430479, 33629352, 34965335, 36321563, 37479374, 38349389, 38832649, 39082242, 38992232, 38699345, 38228923, 37675944, 37226500, 36907174, 36781871, 36882306, 37218201, 37755287, 38539755, 39584901, 40809137]
4609D0809137J517272J700303K029852K322393K610623K886733L117571L298270
4601F0292154L348358L236779K842110K267892J197364m50961k490787m041372
4593F6201537m789096m819520m324507l614067k846681k211161j658938j169694
4585D0767873p91722l37929k5477L58061O89558J060748J402182J714708K075755
4576D6913757K176669K083717J625657Q26541k70143j319577k313624l090011
4568D6632986l362310l435844l274851k946658k624633k288452j975777j636730
4560B5087731j397609j196419j017699q84446p92597o60363n45228n37119m40977
4551A7615274l52418l93883l21856k82884k64811k17445l10301k84559k49694
$$ y = [40809137, 42326409, 44026712, 46056564, 48378957, 50989580, 53876313, 56993884, 60292154, 63640512, 66877291, 69719401, 71987293, 73184657, 72733696, 70242909, 66201537, 61412441, 56592921, 52268414, 48654347, 45807666, 43596505, 41937567, 40767873, 39976151, 39638222, 39612745, 39970806, 40660364, 41721112, 43123294, 44838002, 46913757, 49090426, 51174143, 52799800, 53626341, 53356198, 52036621, 49722997, 46632986, 43270676, 39834832, 36559981, 33613323, 30988690, 28700238, 26724461, 25087731, 23690122, 22493703, 21476004, 20591558, 19798961, 19138598, 18593370, 18056251, 17615274, 17262856, 16868973, 16547117, 16264233, 15999422, 15781977, 15471676, 15187117, 14937423]
4542A4937423j65961j67689k50582j56742j48014j55531q7232j07895j39236r5521
4532A3463020J625l7161r9837j6764M624k7440l4384J6121J28320J18980J09689
4521A3626793J62155J75984J33371J50105J74849J93704J60911J55203K12927
4512A5146002J56502J23492J12831J25362J20995J70080J89893K30007J68554
4503A6543718K18166K04941K09106K22772L17440K84944L14375L35604L38001
4494A8989067L44796L72561M10997M22830L80112L90254M49042M76434N15275
4485B2751368N13676O05617O23944N90686O77912P56132Q09328Q91278R42487
4476B9162428J031881J088920J182497J257217J420175J618509J804547J959377
$$ y = [14937423, 14771462, 14603773, 14353191, 14196449, 14048435, 13892904, 13805672, 13697777, 13558541, 13463020, 13464645, 13427484, 13327647, 13310883, 13315507, 13288067, 13253683, 13269804, 13398124, 13517104, 13626793, 13788948, 13964932, 14098303, 14248408, 14423257, 14616961, 14777872, 14933075, 15146002, 15302504, 15425996, 15538827, 15664189, 15785184, 15955264, 16145157, 16375164, 16543718, 16761884, 16966825, 17175931, 17398703, 17716143, 18001087, 18315462, 18651066, 18989067, 19333863, 19706424, 20117421, 20540251, 20920363, 21310617, 21759659, 22236093, 22751368, 23265044, 23870661, 24494605, 25085291, 25763203, 26519335, 27328663, 28219941, 29162428, 30194309, 31283229, 32465726, 33722943, 35143118, 36761627, 38566174, 40525551]
4468D0525551K075895K101057K157189K261283K150887K149799K098695J864297
4460E7384653J698216J395658J103232P88371N52018L80796L12739J51380J23195
4451F3890258K76475K87636M09325O55650R80853J400400J829168K215337K589420
4442G4534522L017354L367025L795535M189265M497592M722050M730987M334992
4434A07189322M037174L998662M093450M293547M666179N293830O449921Q017046
4426A48039131J0068552J2600525J5355600J7481960J8625973J8338499J3812469
4419B54322709R86892j5741145k6182294k8278542k5658357k1295942j6979363
4412A21173958j3419283j0633705q576978o945202n707651m743018l998428l382613
$$ y = [40525551, 42601446, 44702503, 46859692, 49120975, 51271862, 53421661, 55520356, 57384653, 59082869, 60478527, 61581759, 62370130, 62922148, 63302944, 63615683, 63767063, 63890258, 64166733, 64454369, 64863694, 65519344, 66500197, 67900597, 69729765, 71945102, 74534522, 77551876, 80918901, 84714436, 88903701, 93401293, 98123343, 102854330, 107189322, 111226496, 115225158, 119318608, 123612155, 128278334, 133572164, 140022085, 148039131, 158107683, 170708208, 186063808, 203545768, 222171741, 240510240, 254322709, 255309601, 239568456, 213386162, 185107620, 159449263, 138153321, 121173958, 107754675, 97120970, 88543992, 81598790, 75891139, 71148121, 67149693, 63767080]
4404F3767080k954846k654844k503411k291854k114685k003089j919604j857386
4396D5467361j725980j667228j468522j236104j111710j011532r24448q82142
4388C5439695j043951j201478j296738j334493j378179j367120j253110j186455
4380B5378171j149072j142333j052078r16892r38970q66182p63775o54295n97318
4371A7297256n68052n23562m89711n27932m65653n08251m49593m33239m25816
4362A2905447m33902l65295k51133l22529k91676l05463k18225k05934j76906
4353A0334384j64854j77161j72329j49463j75203j49282j11933n2161r3793j11242
4343H976963j12608j46054j33372l1282j8243p1408j25601q5990j2395n4553p6340
$$ y = [63767080, 60812234, 58157390, 55653979, 53362125, 51247440, 49244351, 47324747, 45467361, 43741381, 42074153, 40605631, 39369527, 38257817, 37246285, 36321837, 35439695, 34395744, 33194266, 31897528, 30563035, 29184856, 27817736, 26564626, 25378171, 24229099, 23086766, 22034688, 21117796, 20178826, 19312644, 18548869, 17894574, 17297256, 16729204, 16205642, 15715931, 15187999, 14722346, 14214095, 13764502, 13331263, 12905447, 12471545, 12106250, 11855117, 11532588, 11240912, 10935449, 10717224, 10511290, 10334384, 10169530, 9992369, 9820040, 9670577, 9495374, 9346092, 9234159, 9181998, 9088205, 8976963, 8864355, 8718301, 8584929, 8553647, 8535404, 8463996, 8338395, 8252405, 8240010, 8185457, 8109117]
4332H109117p8638m9027q6646q8078n1785n8098r0468q9384j2782l225L640n5806
4320G448820j01983q0985p7626n2628J739m5014q879p090n0551o0324n8894n7109
4308F849476o9593m2468J9843J13032N3040P3357J50613K28329K64100L06395
4298G946124K92136K90529J74002N6310j01567k72166l39622k99342l05044k81795
4288G159565k66571k40248k40213j74130j55117j09026o9068k2879r0277j34913
4278E657123k3169l9949p8257o6398o2368o2160k6080k9561J3019k2459j27692
4267E132049p2274j27828r9684p8688r8729k8482M1974N2667N089L4195L7796
4256D798085J5047K1097K1043Q4470O1893J2868N2265J68M4640L4817R019n2505
$$ y = [8109117, 8030479, 7981452, 7894806, 7806728, 7754943, 7696845, 7606377, 7516993, 7504211, 7500986, 7504626, 7448820, 7346837, 7265852, 7188226, 7135598, 7137337, 7092323, 7083444, 7076354, 7025803, 6965479, 6906585, 6849476, 6779883, 6737415, 6757258, 6870290, 6923330, 6996687, 7147300, 7375629, 7639729, 7946124, 8238260, 8528789, 8702791, 8759101, 8657534, 8385368, 8045746, 7746404, 7441360, 7159565, 6892994, 6652746, 6412533, 6238403, 6083286, 5974260, 5905192, 5882313, 5792036, 5657123, 5633954, 5594005, 5515748, 5449350, 5386982, 5324822, 5298742, 5269181, 5282200, 5259741, 5132049, 5059775, 4931947, 4832263, 4753575, 4654846, 4626364, 4668338, 4721005, 4726094, 4760289, 4798085, 4813132, 4834229, 4855272, 4939742, 5001635, 5014503, 5066768, 5066936, 5111576, 5146393, 5155412, 5102907]
4244E102907o793n514K7154K4390j994o019L0989M2959N9545R5594L7940N229
4232E406387K724m3638q5602j5716p3628q7282m8344o9489j12945o0257K962n8215
4220D756957j9368j9673n3341j7330r5546n8973l0297j5462L18p5576l0459k1593
4208D319657l491n3222o120k0053k168l1060J4434L8768L8008l4614k1357k2191
4196D216591K1582O472J00055R2963j6231J418P5311Q2749L2975R1798J9556K6106
4184D751345N4701M1862L8621Q9778R4987Q0590J5769m2756J1246Q783q671J8793
4172E155048j5200O665J1954K8119N6312N0302r421P3909M2633p268K5445L2712
4160E451210Q027O0577L9259P0901J46952J09745P2509J12977J24878Q2279J10825
$$ y = [5102907, 5096114, 5090600, 5117754, 5142144, 5140150, 5134131, 5165120, 5208079, 5267624, 5363218, 5401158, 5406387, 5409111, 5365473, 5279871, 5264155, 5190527, 5103245, 5054901, 4985412, 4872467, 4812210, 4815172, 4756957, 4737589, 4717916, 4664575, 4647245, 4551699, 4492726, 4462429, 4446967, 4447285, 4371709, 4341250, 4319657, 4316166, 4262944, 4256824, 4236771, 4234603, 4203543, 4217977, 4256745, 4294753, 4260139, 4238782, 4216591, 4238173, 4244645, 4344700, 4437663, 4421432, 4422850, 4498161, 4580910, 4613885, 4705683, 4725239, 4751345, 4806046, 4847908, 4886529, 4976307, 5071294, 5151884, 5167653, 5124897, 5136143, 5144926, 5136255, 5155048, 5139848, 5146513, 5158467, 5186586, 5242898, 5293200, 5283779, 5357688, 5400321, 5393053, 5418498, 5451210, 5459237, 5519814, 5559073, 5629974, 5776926, 5886671, 5959180, 6072157, 6197035, 6279314, 6390139]
4149F390139J08101O4288J12739Q0377J30553J15355N2706J38910J01861J02607
4139G397636J21000O7567Q3304Q1811p822L0948k7451K7269R5659N2495O3412
4128G985828Q4354J47639J03209J05106J85088J59324J41515J83571K18962K14762
4118I529358J77632K22268K52109J52397J11277M1232L6205K4998n0348P5692
4108A0572820M6606K2860Q4769Q3900J02604J37705R3899R3901J51604J52993
4098A1543661J32354K09823K16478J94492K16563K45084K83934L10885L16547
4089A3669821L24984L32472L76278L99024M39808M52074M78168N77942N50244
4080A7600815N90467O26759O46616P27576P77547P89899Q52291R15446Q94157
$$ y = [6390139, 6498240, 6562528, 6675267, 6755644, 6886197, 7001552, 7054258, 7193168, 7295029, 7397636, 7518636, 7586203, 7669507, 7751318, 7743496, 7774444, 7746993, 7774262, 7869921, 7922416, 7985828, 8070182, 8217821, 8321030, 8426136, 8611224, 8770548, 8912063, 9095634, 9314596, 9529358, 9706990, 9929258, 10181367, 10333764, 10445041, 10486273, 10522478, 10547476, 10497128, 10572820, 10619426, 10642286, 10727055, 10810955, 10913559, 11051264, 11145163, 11239064, 11390668, 11543661, 11676015, 11885838, 12102316, 12296808, 12513371, 12758455, 13042389, 13353274, 13669821, 13994805, 14327277, 14703555, 15102579, 15542387, 15994461, 16472629, 17050571, 17600815, 18191282, 18818041, 19464657, 20192233, 20969780, 21759679, 22611970, 23527416, 24421573]
4071B4421573J022462J056980J089459J095732J233533J317177J397443J546503
4063C4180862J544944J615031J627649J774391J861725J876644J912997J981887
4055D8376130J974422K062487K150159K209484K261857K350660K362145K379758
4047F6127102K449796K354800K287402K219577K100913J936233J846390J769781
4039H3091994J665864J608590J663634J674485J649884J655151J599561J399003
4031I6008166J263203J070603P33499M73379K17050K5507p1473j05798j19177
4022I9494959J6769Q9672J59388J79497P4983k35849p78779j341130j894108k257669
4012I3507733k396944k416087k332960k078104j914109j829191j602389j548353
$$ y = [24421573, 25444035, 26501015, 27590474, 28686206, 29919739, 31236916, 32634359, 34180862, 35725806, 37340837, 38968486, 40742877, 42604602, 44481246, 46394243, 48376130, 50350552, 52413039, 54563198, 56772682, 59034539, 61385199, 63747344, 66127102, 68576898, 70931698, 73219100, 75438677, 77539590, 79475823, 81322213, 83091994, 84757858, 86366448, 88030082, 89704567, 91354451, 93009602, 94609163, 96008166, 97271369, 98341972, 99075471, 99548850, 99765900, 99791407, 99719934, 99614136, 99494959, 99511728, 99601400, 99760788, 99940285, 100015268, 99779419, 99000640, 97659510, 95765402, 93507733, 91110789, 88694702, 86361742, 84283638, 82369529, 80540338, 78937949, 77389596]
4004G7389596j427593j293428j303179j216458j156003j101055j071955j029977
3996F7789948j015649r29434p77727p70182n53915m10360k80749j12978p418J09725
3986F3041261K27020L37529M75921O60873P84414J019466J275690J488774J791335
3977G1102283K133617K545651K970699L437361M013573M604048N269779N902565
3969A01979576O772576P798808Q934637J0383705J1989857J4045773J6344395
3962A78249327J8501601K0282603K1111787K0189603J7105451J2177169O238065
3955B93855606M92214m119647p152725q448612q301023p208749n410039l604421
3947B50102604k032959q04446m75691r65550k504826n020479q268794j1775494
$$ y = [77389596, 75962003, 74668575, 73365396, 72148938, 70992935, 69891880, 68819925, 67789948, 66774299, 65844865, 65067138, 64296956, 63743041, 63332681, 63051932, 62938954, 62931536, 63041261, 63268281, 63605810, 64081731, 64742604, 65527018, 66546484, 67822174, 69310948, 71102283, 73235900, 75781551, 78752250, 82189611, 86203184, 90807232, 96077011, 101979576, 108752152, 116550960, 125485597, 135869302, 147859159, 161904932, 178249327, 196750928, 217033531, 238145318, 258334921, 275440372, 287617541, 293855606, 294347820, 290228173, 283075448, 274626836, 266325813, 259117064, 253707025, 250102604, 248069645, 247265199, 246789508, 245823958, 243319132, 238298653, 230029859, 218254365]
3939B18254365j4775910j6729103j7253285j6625854j5138875j3234404j1314097
3932A13182837r547488q023927o779877n722328n019979m470109m092313l780127
3924F5746689l608512l552066l435815l312861l193515k943458k728102k468506
3916D0503854k182307k055088j806851j637849j486712j351485j257718j127598
3908B7598246j007205r68764r58689r24675p95412p73681p55132p66726p28538
3899A9919424o88762o13910n90610n14204n53059n14657m68895m79715l96891
3890A5098721l56986l73333m63485l58526l63768l18598l60992l28015l50571
3881A1824447k64231k74067j90381k38614k09492j64701k17990j23213j50565
$$ y = [218254365, 203478455, 186749352, 169496067, 152870213, 137731338, 124496934, 113182837, 103635349, 95611422, 88831545, 83109217, 78089238, 73619129, 69526816, 65746689, 62138177, 58586111, 55150296, 51837435, 48643920, 45700462, 42972360, 40503854, 38321547, 36266459, 34459608, 32821759, 31335047, 29983562, 28725844, 27598246, 26591041, 25622277, 24663588, 23738913, 22943501, 22169820, 21414688, 20647962, 19919424, 19230662, 18616752, 18026142, 17511938, 16958879, 16444222, 15975327, 15495612, 15098721, 14741735, 14368402, 13904917, 13546391, 13182623, 12864025, 12503033, 12175018, 11824447, 11560216, 11286149, 11095768, 10857154, 10647662, 10482961, 10264971, 10141758, 9991193]
3872I991193q9817j40882j20951j21772j42803j62433j78714j97877j75408j80798
3862H479738j77454j81043j29079p3898r8819p3091o1945o3477p6665j16401o4455
3851G363411j46407j75709j00717k04399j75290j25188j19484j31578p4481j7112
3841F093046l8375n2394m0666l4467l7393l8895m5100o9871l5007q691k7303m2926
3829E621958k4858n9510j1599J2884K3349K6494J2838L6563n0985m8002N4544
3818E593676M7687l7625j4349J0986l9222m4106J4202k5644o6887n1442R854p0851
3806E326279o9004m1944j2224o9928l7874n192k1782o3258l6868r168l5894q5344
3794D837799m8764n2109j1824n5486l5844n0933k7617M4260p4003k2083P212J03977
$$ y = [9991193, 9901376, 9760494, 9639543, 9517771, 9374968, 9212535, 9033821, 8835944, 8660536, 8479738, 8302284, 8121241, 7992162, 7918264, 7819445, 7746354, 7684409, 7620932, 7544267, 7427866, 7363411, 7217004, 7041295, 6940578, 6736179, 6560889, 6435701, 6316217, 6184639, 6110158, 6093046, 6054671, 6002277, 5961611, 5927144, 5889751, 5850856, 5805756, 5735885, 5700878, 5692187, 5664884, 5621958, 5597100, 5537590, 5525991, 5538875, 5562224, 5588718, 5601556, 5638119, 5587134, 5539132, 5593676, 5641363, 5603738, 5589389, 5600375, 5561153, 5517047, 5531249, 5505605, 5438718, 5387276, 5397130, 5326279, 5257275, 5215331, 5203107, 5133179, 5095305, 5090113, 5068331, 5005073, 4968205, 4959037, 4923143, 4837799, 4789035, 4736926, 4725102, 4669616, 4633772, 4582839, 4555222, 4599482, 4525479, 4503396, 4510608, 4614585]
3782D614585J8480k7898j1244L2022J1317O8078N6340O8018J11397M2453P0253
3771E053801O1641P2615J24831N7070O1349N8798N6252O0492Q3515J33777N7890
3760E882031R6171O3928J38844J47370J31464J52211J13584J25507P4075J38030
3750G063215J45133R5535J31393J46296J28020J34113J42741J77308J64528J88438
3740H516720J79091K21430K44570J66354K06699J31269J83412K22980J83514J61050
3730A0417089K32897K51236K20038K62722K75837K68541L04199L03397K70079
3721A2806035K86732K93476L35915L28825L01303K81966L45294L41655L34970
3712A5656171L80838L37459L11623L48411M27430L66812M66277N16249M41340
$$ y = [4614585, 4633065, 4605167, 4593923, 4625945, 4637262, 4705340, 4761680, 4829698, 4941095, 4983548, 5053801, 5115442, 5188057, 5312888, 5369958, 5431307, 5490105, 5546357, 5606849, 5690364, 5824141, 5882031, 5978202, 6042130, 6180974, 6328344, 6459808, 6612019, 6725603, 6851110, 6925185, 7063215, 7208348, 7303883, 7435276, 7581572, 7709592, 7843705, 7986446, 8163754, 8328282, 8516720, 8695811, 8917241, 9161811, 9328165, 9534864, 9666133, 9849545, 10072525, 10256039, 10417089, 10649986, 10901222, 11121260, 11383982, 11659819, 11928360, 12232559, 12535956, 12806035, 13092767, 13386243, 13722158, 14050983, 14352286, 14634252, 14979546, 15321201, 15656171, 16037009, 16374468, 16686091, 17034502, 17461932, 17828744, 18295021, 18811270, 19252610]
3703A9252610N34826M54279M67319M74401M47452M32878M76970M79764N35552
3694B3556051O12452N51309N73789O64382O39389P57031P59925Q26616Q44156
3685B9785100Q70517R39421R27259R91507J040914J119634J232201J397112J459157
3676C9762822J536050J725343K008484K080035K335442K615073K859310L100868
3668E8023427L477370L823124M249797M768711N366498O098259O945651Q020133
3660A00772970R148662J0417886J1551876J2280381J2327350J1301906R056190
3653A76857221O036309L079217J403262J171424K016039L605190N536481P405394
3645B07110537R036103R968032R884342Q432877N706682J885084k334940o174997
$$ y = [19252610, 19787436, 20241715, 20709034, 21183435, 21630887, 22063765, 22540735, 23020499, 23556051, 24168503, 24719812, 25293601, 25957983, 26597372, 27354403, 28114328, 28940944, 29785100, 30655617, 31595038, 32522297, 33513804, 34554718, 35674352, 36906553, 38303665, 39762822, 41298872, 43024215, 45032699, 47112734, 49448176, 52063249, 54922559, 58023427, 61500797, 65323921, 69573718, 74342429, 79708927, 85807186, 92752837, 100772970, 109921632, 120339518, 131891394, 144171775, 156499125, 167801031, 176857221, 182893530, 185972747, 187376009, 188547433, 190563472, 194168662, 199705143, 207110537, 216146640, 226114672, 235999014, 244431891, 250138573, 252023657, 249688717, 243513720]
3637B43513720r149337j1088604j1772169j1368149j0083392q379016o498437
3630A75174616m885284l732747l103741l101134l748806n257973p179665q946001
3622A35219265j0075767j0401151r874106q852280p626143o412179n271221m277916
3614G2428502l449904k842242k201904j837919j634864j564407j523045j633956
3606E5740261j818061j962903j970390k001285j934910j908171j793504j727836
3598D0623201j609243j505265j464911j327241j230417j205842j273966j303634
3590B9702682j361291j408426j360900j411578j246550j155424j099114r47367
3582A9712032q74904q05677p15217o34583n92388n64965n10088m19095m29799
$$ y = [243513720, 234364383, 223275779, 211503610, 200135461, 190052069, 181673053, 175174616, 170289332, 166556585, 163452844, 160351710, 156602904, 151344931, 144165266, 135219265, 125143498, 114742347, 104868241, 96015961, 88389818, 81977639, 76706418, 72428502, 68978598, 66136356, 63934452, 62096533, 60461669, 58897262, 57374217, 55740261, 53922200, 51959297, 49988907, 47987622, 46052712, 44144541, 42351037, 40623201, 39013958, 37508693, 36043782, 34716541, 33486124, 32280282, 31006316, 29702682, 28341391, 26932965, 25572065, 24160487, 22913937, 21758513, 20659399, 19712032, 18837128, 18031451, 17316234, 16681651, 16089263, 15524298, 15014210, 14595115, 14165316]
3573A4165316l61833l41370l41787l64339k80103k66282k89012k75917k49335
3564A1395338k46046k76503k22741k03957j54719k03978j23076r3120p4496l9096
3554I757606m3849l4542q2640o8470r9616j17066k09125k00994j63704k14941
3544H522659k19803j57583j91177j04132j36613p9734r7302j83424j72082j51845
3534G028964j35764j94821l12347k17008k43268l19261j80166j29011j40233j91055
3524D966030j24954j13603q4599l1493j23469p8059q4135n6406j08718l0347l3191
3513D097056j22891k7270J0280m6498o5135k5414j2476p5443m6137M6453o1247
3502C671278p4156j8191k4708l3170p2087n8098q4991j2447n9674p4906n7862
$$ y = [14165316, 13803483, 13462113, 13120326, 12755987, 12475884, 12209602, 11920590, 11644673, 11395338, 11149292, 10872789, 10650048, 10446091, 10291372, 10087394, 9964318, 9871198, 9796702, 9757606, 9713757, 9679215, 9596575, 9528105, 9428489, 9311423, 9102298, 8901304, 8737600, 8522659, 8302856, 8145273, 7954096, 7849964, 7713351, 7633617, 7536315, 7352891, 7180809, 7028964, 6893200, 6698379, 6386032, 6169024, 5925756, 5606495, 5426329, 5297318, 5157085, 4966030, 4841076, 4727473, 4642874, 4611381, 4487912, 4409853, 4325718, 4269312, 4160594, 4130247, 4097056, 3974165, 3946895, 3957175, 3910677, 3845542, 3820128, 3807652, 3732209, 3686072, 3732525, 3671278, 3597122, 3578931, 3554223, 3521053, 3448966, 3390868, 3305877, 3293430, 3233756, 3158850, 3100988]
3491C100988p9954o7076n5017q5477q3811o5101L956n1477j04676q0392m0491
3480B391472j1496n3081o6359m0819M632l1797j115k3645k1269M2845J1725n4731
3468B146362l1544r094k6751o8536o3600m6649L2655p4536m5437k8368k3656J2224
3456A773070N47j5883k1019m7395j2273j4854R577M3306j1971K5783K387J7017
3444A748292L770o0799M7774O2812J3840n3951k026o1624K987l82j8857l2494
3432A649342k6405k1510K6319P843m1241j9457o1549k6885P7554J5799m131q0262
3420A495417k5397M1407q268K6950j1179j5637J828M8744p201P565j520J323K4475
3407A578507j3640J2929M7413k8589j3795j1160l8092O1420K9984k9099l871m7890
$$ y = [3100988, 3021034, 2953958, 2898941, 2813464, 2729653, 2664552, 2668508, 2617031, 2512355, 2431963, 2391472, 2379976, 2326895, 2260536, 2219717, 2224349, 2192552, 2191437, 2167792, 2146523, 2189368, 2201093, 2146362, 2114818, 2105724, 2078973, 2010437, 1946837, 1900188, 1932843, 1858307, 1812870, 1784502, 1760846, 1773070, 1773617, 1757734, 1736715, 1689320, 1677047, 1662193, 1671770, 1715076, 1703105, 1728888, 1731275, 1748292, 1752062, 1691263, 1739037, 1801849, 1815689, 1761738, 1759712, 1698088, 1701075, 1700693, 1681836, 1649342, 1622937, 1601427, 1627746, 1635589, 1594348, 1574891, 1513342, 1486457, 1564011, 1579810, 1575679, 1495417, 1470020, 1511427, 1503159, 1530109, 1518930, 1503293, 1505121, 1553865, 1546664, 1554229, 1552709, 1554032, 1578507, 1564867, 1577796, 1625209, 1596620, 1582825, 1571665, 1533573, 1594993, 1624977, 1595878, 1592007, 1544117]
3395A544117l8446O8495K6144K085k498M0672Q8278k7159l2963k3137J13035k9127
3383A729496K5478K7173q659k512J4246q938J8201R2051J9446R0237N795K0775
3371B022789J23553K7839L6292M2461k933m445M7065P0852j921O3298O5071L7674
3359B527595L2647O7213O4552j4840O9562K5340J8418j213l436l730m357j704
3347B776047m1846p442L8992q7385R06J1356N876J4597k8308M8692M887K4831
3335B761203q493p012l6598l416j6191J2782L1105J0781N8096Q9039P0258K3422
3323B984976P3126J52412J30100J19452J87793J49896L5345l8857k394N9171M5671
3312C896691Q5867P9108N0588j3715j37225j80119j62534j22699r8322j505j3783
$$ y = [1544117, 1505671, 1574166, 1600310, 1602395, 1599897, 1640569, 1728847, 1701688, 1668725, 1645588, 1758623, 1729496, 1754974, 1782147, 1773488, 1770976, 1785222, 1776284, 1794485, 1886536, 1905982, 1996219, 2002014, 2022789, 2146342, 2174181, 2210473, 2252934, 2250001, 2245556, 2292621, 2363473, 2361552, 2424850, 2489921, 2527595, 2560242, 2627455, 2692007, 2677167, 2746729, 2772069, 2790487, 2789274, 2785838, 2782108, 2777751, 2776047, 2734201, 2726759, 2765751, 2678366, 2679272, 2690628, 2696504, 2711101, 2682793, 2731485, 2736372, 2761203, 2752710, 2745698, 2709100, 2705684, 2689493, 2702275, 2733380, 2744161, 2802257, 2891296, 2961554, 2984976, 3058102, 3210514, 3340614, 3460066, 3647859, 3797755, 3833100, 3794243, 3791849, 3851020, 3896691, 3982558, 4061666, 4112254, 4098539, 3961314, 3781195, 3618661, 3495962, 3397640, 3396135, 3382352]
3301C382352J7324J2486J5539N9805Q7310J06438R8423J30290J21299J62732J28127
3290D322125J42205L4186p210L789M7036J44775J59428K15102Q6007p783q1516
3279E058144j58339j55595j36024m2927j4490l2706M7603J37557O3987J827N9674
3268D828711J01487P6911J24926J32363J56041J70751J42074J73582K56624K53951
3258F417421K98087L44532L71637L38020M16974M81633M17784M13291N25033N62454
3248A0586866P20555Q86203J037134J224137J243045N31098p81163j396904j450119
3239A2600852j115437p96334n88330m50823l13617j85947j46262o7529O5329J44630
3229I146532K31166L04369L29578L89486L95606M87982O36499P87860Q34702J075013
$$ y = [3382352, 3399676, 3412162, 3427701, 3487506, 3574816, 3681254, 3779677, 3909967, 4031266, 4193998, 4322125, 4464330, 4498516, 4491306, 4495095, 4542131, 4686906, 4846334, 5061436, 5147443, 5139660, 5058144, 4899805, 4744210, 4608186, 4565259, 4550769, 4518063, 4565666, 4703223, 4767210, 4769037, 4828711, 4930198, 5007109, 5132035, 5264398, 5420439, 5591190, 5733264, 5906846, 6163470, 6417421, 6715508, 7060040, 7431677, 7769697, 8186671, 8668304, 9086088, 9499379, 10024412, 10586866, 11307421, 12193624, 13230758, 14454895, 15697940, 16229038, 15447875, 14050971, 12600852, 11485415, 10689081, 10100751, 9649928, 9336311, 9150364, 9004102, 8936573, 9001902, 9146532, 9377698, 9682067, 10011645, 10401131, 10796737, 11284719, 11921218, 12709078, 13543780, 14618793]
3219A4618793J247158J360326J538570J432997N38197n17505j022805q71148k95745
3210A8028838L01023P31824J010973J376034N43360j424272j963519j612724j097138
3201A5894399o18348k25170Q5666K50792M42658N58320Q68863J103350J447769
3192A9808299J979836K833074L618736M288827M853332N262849K57032m721361
3184C8180624m285488l098610j861665j102628l99596M26326P093j920615k599040
3175B3346401k243499j724769j273135q85107o58360l73884j62201J9156L11412
3166A6356014P21409J053514J606878K386615L205986L819192M501586L991300
3158C7642494j861976n792186n004892m090615k926809j891758j134930q18456
$$ y = [14618793, 15865951, 17226277, 18764847, 20197844, 20736041, 20218536, 19195731, 18324583, 18028838, 18329861, 19061685, 20072658, 21448692, 21992052, 20567780, 18604261, 16991537, 15894399, 15276051, 15050881, 15136547, 15387339, 15829997, 16388317, 17257180, 18360530, 19808299, 21788135, 24621209, 28239945, 32528772, 37382104, 42644953, 42901985, 38180624, 33895136, 30796526, 28934861, 27832233, 27432637, 27858963, 27866056, 25945441, 23346401, 21102902, 19378133, 18104998, 17219891, 16561531, 16187647, 16025446, 16044602, 16356014, 17077423, 18130937, 19737815, 22124430, 25330416, 29149608, 33651194, 37642494, 35780518, 29988332, 24983440, 20892825, 17966016, 16074258, 14939328, 14120872]
3150A4120872q21070q93780r34922q25917o94905o40443o24339o48506o05522
3141G431468n24227n16715l98082l99528l25809k00631k16389j78544j77177j79025
3131D315341j21215k18526j38582j23677j01207j33287j64556m2353j11088j55837
3121C005013j85026p3224j22499p9226o6693m98M103o9425r4384m6085p0656m8760
3109B152640L479l3125o9312o4244O692r2013m8078j1695l1208m4273q2175n965
3097A680723n5772p4322o2681L1906M126o6843n3555j8585n2457J2542k624O045
3085A348503o283l9643P426K7708J1301q050j9198j6125p200n8633j7759l6301
3073A185746K2159K174n5244o9969K9334K0318N47r9779k0686L5070l2818n908
$$ y = [14120872, 13299802, 12406022, 11471100, 10645183, 9950278, 9309835, 8685496, 8036990, 7431468, 6907241, 6390526, 5992444, 5592916, 5267107, 5066476, 4850087, 4671543, 4494366, 4315341, 4194126, 3975600, 3837018, 3713341, 3612134, 3478847, 3314291, 3271938, 3160850, 3005013, 2819987, 2746763, 2624264, 2545038, 2478345, 2477847, 2481950, 2412525, 2318141, 2272056, 2201400, 2152640, 2156119, 2122994, 2053682, 1989438, 1996130, 1904117, 1856039, 1844344, 1813136, 1768863, 1686688, 1680723, 1624951, 1550629, 1487948, 1519854, 1523980, 1457137, 1403582, 1384997, 1332540, 1345082, 1342458, 1348503, 1342220, 1302577, 1310003, 1337711, 1349012, 1340962, 1321764, 1305639, 1298439, 1239806, 1222047, 1185746, 1207905, 1210079, 1154835, 1084866, 1114200, 1134518, 1135065, 1035286, 1014600, 1049670, 1016852, 1010944]
3061A010944N2942O735j6033N9323K7249K6022O0880N9870J527j017l3263o9628
3049A185551j42828n8348k3994p2500L65k4412J0390M1537m974n9405M784m2553
3037H13613o530J2827k2307L1662j2652M3066M2802M1735L965K1541M1980K9114
3025A040816J479j0533m7180j8916m5849p3120k6799o9754j9085p6746J646K8615
3013F84574m684j3223M9687N9098K9159J2506L1347L5278K0925K8924k0946K5381
3001I38026m2739m3023n1032M142l1751p2617j1009r970Q302K0034J7371K921
2989G28655m3772k0082K7976M2210j4044k918r516J8693O5650j0945k3209N4809
2977H13507N1167M0883L0287K0312J530o3551n1166m7072J6539n4121r238K7397
$$ y = [1010944, 1063886, 1070621, 1054588, 1113911, 1141160, 1167182, 1228062, 1287932, 1289459, 1288442, 1255179, 1185551, 1042723, 984375, 960381, 887881, 888246, 863834, 874224, 915761, 910787, 851382, 856166, 813613, 807083, 819910, 797603, 829265, 816613, 859679, 902481, 944216, 948181, 969722, 1011702, 1040816, 1042295, 1031762, 984582, 965666, 919817, 846697, 819898, 750144, 731059, 654313, 655959, 684574, 679890, 666667, 716354, 775452, 804611, 817117, 848464, 883742, 904667, 933591, 912645, 938026, 895287, 852264, 801232, 805374, 773623, 701006, 689997, 680027, 688329, 708363, 725734, 728655, 684883, 664801, 692777, 734987, 720943, 718025, 708509, 727202, 792852, 781907, 758698, 813507, 864674, 905557, 935844, 956156, 957686, 894135, 842969, 795897, 812436, 758315, 749077, 776474]
2965G76474l2583L2734O48k9474K3878l1549j7822K8735n1895L1276J2765l3070
2953G10117k0801k8958j905O036P791j1537J8792J9954Q419J1437k9485P248L6676
2940G33784K2045l3804j8873j0948m0494J9097L5859J7852L6874K3240K7517Q0825
2928H92974K2521M8214N9561j0303l1455K0872o205K1608l055j7555J9438o9790
2916I46825n7580k862m5445J031K4922l0598k9325J4248p611l5279L3207k9891
2904G81642J1734l846j7812J8967N8861K5607j1210j6642j5111K7290P163o151
2892H60492J3123K5091J4726j0783p8296m4394j9998m8627l8836j8995k3810k4295
2880F05398p4157l2699j3883O1588p822o2129M3119O3836n4934m7684L1021o6029
$$ y = [776474, 743891, 776625, 777273, 747799, 771677, 740128, 722306, 751041, 699146, 730422, 743187, 710117, 689316, 660358, 658453, 664489, 672280, 660743, 679535, 699489, 707908, 719345, 689860, 697108, 733784, 755829, 722025, 703152, 692204, 651710, 670807, 706666, 724518, 761392, 784632, 812149, 892974, 915495, 963709, 1023270, 1012967, 981512, 1002384, 996179, 1017787, 1014732, 997177, 1016615, 946825, 889245, 886383, 840938, 841969, 866891, 836293, 806968, 821216, 813605, 778326, 811533, 781642, 793376, 789530, 771718, 790685, 849546, 875153, 863943, 847301, 832190, 859480, 866643, 860492, 873615, 898706, 913432, 902649, 824353, 779959, 759961, 711334, 672498, 653503, 629693, 605398, 531241, 498542, 484659, 546247, 538425, 476296, 519415, 583251, 528317, 480633, 511654, 445625]
2868D45625p0111n7252O8211L1690l5005O917o7299k4176k112J7135R173k8796
2856B94000m091j6549n2539k3818n859K3883J4614j0444K552K7461k7434o7007
2844A54769M2246K32K473m042k9342K1292L790N740L8343L8404j1141k0355o0251
2831A82158n2860n1777N0363N6668K9723l9422o893l9895P092K7255j8557L296
2819A47151j6647L2286m2707L793j9480j4691o561K4670M0145J3580m4337n567
2807A11635m4768M4135O198l5397M482R758j3459L2556p9219K9529j2137k6210
2795B7103j1815J0560M3190r222l625j5915P8463k05k7814L6788K4051l9471L729
2782A15817k6072M798O3627k7412l3065J0865N277L5373p6225N0271R072o7929
$$ y = [445625, 375514, 318262, 386473, 418163, 383158, 390075, 322776, 298600, 296488, 313623, 322796, 294000, 289909, 273360, 220821, 197003, 191144, 215027, 229641, 219197, 221749, 249210, 221776, 154769, 197015, 197247, 199720, 195678, 166336, 187628, 191418, 197158, 235501, 273905, 262764, 242409, 182158, 129298, 77521, 127884, 184552, 214275, 174853, 167960, 128065, 135157, 162412, 143855, 147151, 130504, 162790, 120083, 123876, 104396, 89705, 83144, 107814, 147959, 161539, 117202, 111635, 66867, 111002, 117200, 81803, 86285, 96043, 82584, 115140, 35921, 65450, 53313, 27103, 15288, 25848, 69038, 59816, 56191, 40276, 118739, 118534, 90720, 127508, 151559, 112088, 115817, 89745, 94543, 158170, 130758, 97693, 108558, 113835, 149208, 72983, 123254, 132326, 64397]
2770F4397j0985p702m1971N9262K6288k21k1078j1865K145J2768j9494k5981j444
2757B4119L3165j0492k4841n481j8341k699J4084J6616L241j4512N3317J1912
2745H0088l5968J3206Q777k9816l8899j2580M050N3175K3770j1175m158N636l9116
2732A6990l2924j8481J6608K8394m0978q369J2569K5776l8670k6985N9629n0356
2720e6797L1832M8635l5052k5688M4748K9157k09q8739q417M1332J8365J3130
2708A2297m6637j2312N606L988k092k8254O872J2792M3334m1430K3065l6086j0739
2695f9596O8966l9557M0693Q42j591P226l9282K1472J3612L2565n8462L491J5024
2682d597Q857k2079l7523M0904K6840N044p785j8713p957L1571l566N374J6564
$$ y = [64397, 53412, 45710, 3739, 63001, 89289, 89068, 67990, 56125, 58270, 71038, 51544, 25563, 24119, 57284, 46792, 21951, 16470, -1871, -4570, 9514, 26130, 29371, 14859, 68176, 80088, 44120, 57326, 66103, 36287, -2612, -15192, -11142, 42033, 65803, 54628, 50470, 56106, 16990, -15934, -34415, -17807, 10587, -30391, -38760, -26191, -415, -39085, -66070, -6441, -56797, -24965, 23670, -11382, -37070, 7678, 36835, 36626, -52113, -60530, -19198, -833, 12297, -34340, -46652, -41046, -37058, -39150, -67404, -60532, -47740, -4406, -45836, -22771, -58857, -69596, -630, -40187, 506, 1348, -243, 6983, -32299, -10827, 2785, 35350, -23112, -19621, -4597, 4260, -17819, -55342, -14438, 12402, 17446, 9661, -9052, -17009, 14562, 10996, 16370, 32934]
2669C2934k524k9503K8679k166r809l0905K0672L1555J4344l8861k3052K3392
2657A4756K4236J2236k2063n5252L6373J1269j7220k3670M0334k65j3805M2551
2645D9480j1748J6404o835j0658j1205J4888K0461l7898r696J7294M239n837J2902
2632D1791L8124l3926j0954j1014n3036l0543K5482M4904K2181J1473M723l9662
2620I543R649n3595p901M5782q0176J6489O8974j5497P0110o4963k2650M4412
2608B0177l5093l0321j1848N1283R191j0915K9697l763l7791K8054J954J0621
2596B1246J9240k3725j987j3856k2228M6643j1185N3126k4619j8718k6443J5990
2584A3484j812q0889j3194M7921k7086N47M787N119j3109j1717K3997O361j7044
$$ y = [32934, 30410, 907, 29586, 27420, 17611, -13294, 7378, 38933, 53277, 14416, -8636, 14756, 38992, 51228, 29165, -26087, 10286, 21555, 4335, -19335, 20999, 20734, 6929, 49480, 37732, 54136, 47301, 36643, 25438, 40326, 60787, 22889, 13193, 30487, 34726, 28889, 41791, 79915, 45989, 35035, 24021, -29015, -59558, -34076, 10828, 33009, 44482, 49205, 9543, 19192, -34403, -42304, 3478, -76698, -60209, 8765, -6732, 63378, -1585, -24235, 20177, -14916, -45237, -57085, -5802, 3389, -7526, 22171, 18408, -19383, 8671, 10625, 21246, 40486, 16761, 14774, 918, -21310, 25333, 14148, 67274, 42655, 23937, -2506, 13484, 11672, -69217, -82411, -34490, -61576, -61029, -56242, -51123, -64232, -75949, -51952, -45591, -62635]
2571f2635r016P5192J3935m617J8606n0052j557o378J9592r045k5060K7215o1799
2558g5619n522j9135N2882J3440J5222p285o715J0280j3772N749J5642j4853N514
2545b4172R118k5926J7060K187l8336k0656m174N0149J905l0628k8006O7131J9147
2532e201o3665M8316K9233n335m0587o66r19K0417J7727m6902l990J4883m186
2519d0875l7696o319L6530j3533L1452L8787m8095l3083N6458k6015j1874L1879
2507b2384n454J4110l6818L6999j3337M9390j7529q7796J6512J0351L3794J108
2495b1054n3149J3125K3032j269k8299L1452J4766n8720J432m4214j8063N6546
2483h4415J4764k1792M3676L3448k2387k95O504j204k9584J567O825Q514O905
$$ y = [-62635, -71651, 3541, 17476, 12859, 31465, -18587, -20144, -26522, -6930, -15975, -41035, -13820, -75619, -81141, -100276, -47394, -33954, -18732, -26017, -32732, -22452, -36224, -30475, -14833, -29686, -24172, -15054, -40980, -23920, -21733, -60069, -80725, -84899, -34750, -32845, -63473, -91479, -24348, -5201, -68866, -20550, 8683, 3348, -37239, -37905, -38824, -18407, -680, -47582, -51572, -36689, -40875, -78571, -84890, -48360, -61893, -30441, 8346, -39749, -72832, -16374, -42389, -54263, -22384, -27838, -13728, -50546, -13547, -26884, 22506, 4977, -82819, -66307, -55956, -22162, -21054, -74203, -61078, -38046, -39315, -67614, -36162, -21396, -80116, -78684, -122898, -140961, -84415, -69651, -91443, -47767, -14319, -36706, -37001, -30497, -31701, -61285, -59718, -52893, -44379, -37474]
2470c7474L7408l1617l6380l3031k2619M5176M6200J9591l1355m0759M0767K8531
2458a5562j0969O264k152J452M8649j6086j4798O2500m0238q757M242j2532j6727
2445a4714k2420M4672J4711k2854J494p262J0950m117k846j1555J9401j0481J0402
2432E381l5539m9367L50L1040r127K50K3579K1512j0688K1653J4431o4115K7345
2419b3295K7155q584K3715l8164n4866N987K6487M6472P5172K262q6871p3856
2407g8386M3997J1470m160N2305p108o0174M9718j6001n8612J9545M4916l1734
2395c4224K6915L0537j3875m9008K3972p251N795N209j4637J6820N467M7577m7792
2382d495l589N6304J0625k379j4727j5396J1259n2920n7663k2508J0162K4565
$$ y = [-37474, -66, -31683, -68063, -101094, -123713, -78537, -32337, -12746, -44101, -84860, -44093, -15562, -26531, -20267, -22419, -20967, 27682, 11596, -3202, 59298, 19060, 10303, 14545, 2013, -14714, -37134, 7538, 22249, -605, 889, -6373, 4577, 460, -2386, -13941, 5460, -5021, 5381, -30158, -79525, -79175, -48135, -57262, -57012, -33433, -11921, -22609, -956, 13475, -50640, -23295, 3860, -4724, 18991, -19173, -74039, -68052, -41565, 4907, 80079, 82341, -4530, -78386, -34389, -22919, -27079, 25226, 18118, -42056, 7662, -8339, -66951, -47406, -2490, -34224, -7309, 23228, 9353, -39655, -15683, -22934, -17139, -11930, -26567, -9747, -4280, 43297, -4495, -8084, 48220, 58845, 56466, 41739, 26343, 37602, -15318, -72981, -95489, -85327, -60762]
2370f0762M0826J2081j2369l8833n777j9694M3711j87J3832L509j2771k1113O7746
2357A0199l3210m5285O2650k3536n5049N3182K2523k4131J3474J4596M1636L591
2345D0640o6860m5393J2888R208J0916N876M1461n403Q77k0654j0730j7440l6817
2332h1431N5109j0211m2153M8795K6960j1109k4626L3535K5194n4584q502o093
2320d9116Q88m3019j3519K6537L7062k86q124J8987j0874K9867k035q329j3328
2307c5289L0586n3447j7545P1290o885J7493J3333r379m2485n252k6217K905K9283
2294c1609J7989P449J7414r172m2674L2154J4443K634M3487j108m0991K2414l5660
2281c230j8945J6004j3246n686j368M064k7085J734L5423N179n0550j3252j0835
$$ y = [-60762, -19936, -7855, -20224, -59057, -64834, -84528, -40817, -41004, -27172, -23663, -36434, -57547, 10199, -23011, -68296, -5646, -29182, -84231, -31049, -8526, -32657, -19183, -4587, 37049, 40640, -26220, -71613, -58725, -49517, -38601, -32725, 8736, 3333, 4210, -16444, -27174, -44614, -81431, -26322, -36533, -78686, -29891, -2931, -14040, -38666, -5131, 20063, -34521, -43023, -49116, -48228, -91247, -104766, -78229, -41167, -41453, -49577, -30590, -41464, -11597, -13632, -21961, -35289, -4703, -58150, -75695, -4405, -11290, 6203, 19536, 10157, -32328, -37580, -63797, -60892, -31609, -13620, -6171, 11243, 2071, -40603, -8449, 5994, 8628, 52115, 51007, 10016, 32430, -3230, -22175, -6171, -19417, -25103, -26471, -22407, -49492, -47758, -12335, -7156, -57706, -70958, -81793]
2268h1793M2599K2731l1475O3117m626J3962M2783p033j8490m2217J7013J4389
2256C0960l0260k5770k3035K5393J1056K3647J8923k6408n7232J1484L9742j9673
2244b1173L1082J2657r29l0212l1471K7590K0885j6736N4223K1730P500m3010
2232C2136l661N3752m5519r235L8908j9312J71J377m0737J6856j603K5392j9103
2219B9422r791J6236k2790K263P6815N505n394l939L1093j4636m3094L639j7061
2206D8268N2740J4831k8844K7311P0053L2592J5849m918j4124q739M4232p359
2194B41892m4796l6952j0327J6765J1040M4166L6403m1679m0078L7215K5406n36
2182B38519L5360L3840n8824n13j5423N3599K3335L9828J3807l0998m9824R274
$$ y = [-81793, -39194, -16463, -47938, 15179, 10553, 24515, 67298, 60265, 41775, -442, 16571, 30960, 700, -25070, -48105, -22712, -11656, 11991, 30914, 4506, -52726, -41242, -1500, -21173, 9909, 22566, 21637, -8575, -40046, -12456, 8429, -8307, 45916, 67646, 75146, 32136, 28475, 82227, 36708, 27473, 66381, 47069, 47240, 48617, 7880, 24736, 23133, 48525, 29422, 19631, 35867, 13077, 15340, 92155, 97660, 92266, 88327, 119420, 104784, 61690, 65329, 48268, 101008, 115839, 86995, 114306, 184359, 216951, 232800, 227882, 213758, 205019, 249251, 241892, 197096, 160144, 149817, 166582, 177622, 221788, 258191, 216512, 176434, 213649, 239055, 238519, 273879, 307719, 248895, 248382, 232959, 286558, 309893, 349721, 363528, 332530, 282706, 291980]
2170B91980Q1665L395N5990n3063J1795L571J7412L4279J0890K1393J4773K8744
2158E22824r172N6505k2448J9380O0207Q3226J6573k3040J696M0670n269M7006
2146G88158K5392K1945N0837J4732P30l1094N9955K7990N6915P9459M9332O3944
2134A208295R7326R2906J26744J35070J80879J87575J84480K44261J33935J55810
2124B747281J20209K52975K26840L40667M78000N55832P64627J056865J457209
2115H000505J541937J639805K617568J313666k410253k984333k375826j760000
2107E583069j088807q49580o25884m84678l37847l18747k02658j25830o1259J0480
2097A498259l4481q0943j62927j12167j6755r4659o0776j5171n5260q6473p7280
$$ y = [291980, 373645, 377040, 433030, 379967, 391762, 395333, 412745, 447024, 457914, 479307, 494080, 522824, 513652, 570157, 547709, 567089, 627296, 710522, 727095, 704055, 705751, 746421, 741152, 788158, 813550, 835495, 886332, 901064, 901794, 870700, 930655, 958645, 1015560, 1095019, 1144351, 1208295, 1305621, 1398527, 1525271, 1660341, 1841220, 2028795, 2213275, 2457536, 2591471, 2747281, 2867490, 3120465, 3347305, 3687972, 4165972, 4721804, 5486431, 6543296, 8000505, 9542442, 11182247, 13799815, 15113481, 12703228, 9718895, 7343069, 5583069, 4494262, 3644682, 3018798, 2534120, 2196273, 1877526, 1674868, 1549038, 1487779, 1498259, 1463778, 1382835, 1219908, 1107741, 1090986, 996327, 935551, 920380, 865120, 778647, 701367]
2086G01367k6912m1367J382o7242P479r324l7115o659m7175n5905J6390l3418
2074D01501l5102j5789q565J1253m1375k851L6490K4322k0444l8337l7222p782
2062B66099n680p794L1212l8359l3219K4379J8279m7009m1406l0612n9867K9255
2050A05278N6163M3384j7120m2049l9095l0696J293M4057l349L5262n103k0251
2038A27774n0973l1096K1346Q237j5794Q591N0856j6016J6182K3654j00875J674
2026D3560P3544J9579m2700M560l9239j1364l0218l123M3532J2362P459j9687
2014E8265l0452K7704p267R294K6213o06k3386k1576K7938L7243p0407l3028Q0631
2001H0566j5418n663j1919k2591K3847n152l9465j1042L2307j5631j4374M9016
$$ y = [701367, 674455, 633088, 634470, 567228, 574707, 565383, 528268, 521609, 474434, 418529, 434919, 401501, 366399, 350610, 342045, 353298, 311923, 309072, 345562, 369884, 349440, 311103, 273881, 266099, 260419, 252625, 283837, 245478, 212259, 236638, 254917, 207908, 166502, 135890, 76023, 105278, 161441, 204825, 187705, 145656, 106561, 75865, 77158, 121215, 117866, 153128, 148025, 127774, 76801, 45705, 67051, 75288, 59494, 68085, 118941, 102925, 119107, 142761, 41886, 43560, 117104, 136683, 93983, 98543, 59304, 47940, 17722, 14599, 58131, 70493, 77952, 58265, 27813, 55517, 48250, 57544, 83757, 83151, 59765, 38189, 66127, 103370, 32963, -65, 80566, 65148, 59485, 47566, 24975, 48822, 43670, 4205, -6837, 25470, 9839, -4535, 44481]
1989D4481K466K8662r047j6872J1589O7112o1380j01165Q5765j4887o8972k04
1977c2452K7539o636J5186O998K8755k9711J1216L0560k1088m9690K308j9093
1965c6108L3529J442m064M4134K6691k5141q3249M9142K522J571n503q95K4650
1952B8721j3005k979m8057n865M7238n0605N6780L7486l5444K533L048j7016K266
1939E101L477k2823n0348N151L0226k5931j4064M2339o76j4717J223J4917j7036
1926d3161K6223M325m341k478K0840K1283p955l5581L0287l3733K0093K386k5417
1913b7229O3132l4831J1182l9386k1981J2255K0093j0404k7222K2718M2339q239
1901B427J3549k2762J089o215n3892m279N313J4605J1496J2390l0913L4060j1537
$$ y = [44481, 46947, 75609, 66562, 49690, 61279, 128391, 67011, -34154, 51611, 36724, -32248, -32452, -4913, -11549, 3637, 10635, 39390, 9679, 20895, 51455, 30367, -19323, -17015, -36108, -2579, -1137, -5201, 38933, 65624, 40483, -42766, 6376, 8898, 10469, 4966, 4071, 28721, 15716, 12737, -35320, -41185, 6053, -44552, 12228, 49714, 14270, 16803, 19851, 2835, 5101, 8578, -14245, -64593, -59442, -29216, -55147, -69211, -26872, -27548, -42265, -41042, -26125, -43161, -16938, -12613, -16954, -19432, 1408, 22691, 14736, -20845, 9442, -24291, -4198, -1812, -27229, 35903, 1072, 12254, -27132, -49113, -36858, -16765, -27169, -54391, -31673, 10666, 2427, 15976, -6786, -5697, -11912, -65804, -70083, -64770, -50165, -38669, -26279, -57192, -23132, -34669]
1888c4669K170L4951l3836L4809J4362n4091r336J5825j6115J0305q861K5599
1876a8887M0069j2580m6341j1777K3583j5752K5799J6663K6558l4750m1557j5772
1864f4744R572J7905K3198J3844K0416n5500K7529q139L6116K0320k5332l4969
1852a9784K161j5119l6345J1100n2706J3804K6801K5788m0697P7894O9466l9719
1840B2644k7419j2449O5646k9937o429L325m0051M2700l561m3232l6849L1735
1828c3877M8593J3540l3464m608j5907K3234k8934j4805O8791r819K370K6322
1816D1436m4622j2561m5076J8525K1909L6043l5047k4143j7113L0386k7811j9382
1804g7456J9938M6081J6364n6328K0130J4304k0707L944o3054M0305J7148P64
$$ y = [-34669, -32499, 2452, -31384, 3425, 17787, -36304, -45640, -29815, -45930, -35625, -44486, -18887, 21182, 8602, -37739, -49516, -25933, -41685, -15886, 777, 27335, -7415, -48972, -64744, -55172, -37267, -14069, -225, 20191, -35309, -7780, -15919, 20197, 40517, 15185, -19784, -17623, -32742, -69087, -57987, -110693, -96889, -70088, -44300, -84997, -7103, 62363, 22644, -4775, -17224, 48422, 18485, 12056, 15381, -24670, 18030, 14469, -28763, -65612, -33877, 14716, 28256, -5208, -9816, -25723, -2489, -31423, -46228, 22563, 12744, 15114, 41436, -3186, -15747, -60823, -42298, -20389, 15654, -19393, -43536, -60649, -30263, -58074, -77456, -57518, -11437, 4927, -51401, -31271, -16967, -37674, -33730, -96784, -56479, -39331, -38567]
1792c8567j1311j8838k1039M6012N474k0293K4268q746q856M615M1105k4199Q211
1779b2164J6299k2610o455N2648n57j3743l2242r954O525L9846k2649J2395J4894
1766A2233L376l5829m152M1050k2636k3387j4735q925J6166M7246p122j0166N180
1753a701k3739l9748O795L9494O4r970K334M9099l3379M609l3730J1665l1768
1740e9975k559J8970J8110n2881J2415Q4067n9312p0190M0593K1615K7676n077
1728b6548k1305p661K5495j6264R736M2583K3577n4652j8066K7426n6664J0099
1716f2244L1719K2185J2250K7830o4373N040p445K0000J5973l5629k1016J0247
1704d5463L5590J1172l5863o0108K0379O4843M2580M4031r0451l9096K1905M9749
$$ y = [-38567, -49878, -68716, -89755, -43743, -38269, -58562, -34294, -43040, -51896, -47281, -6176, -30375, -22164, -5865, -28475, -34930, 17718, 17161, 3418, -28824, -38778, -32253, 7593, -15056, -2661, 12233, 15609, -20220, -24372, 16678, -5958, -29345, -44080, -53005, -36839, 10407, 3285, -6881, -1701, -25440, -65188, -58393, -18899, -18835, -28805, -26471, 22628, -10751, -6142, -39872, -28207, -59975, -62534, -43564, -25454, -78335, -65920, 18147, -41165, -111355, -70762, -49147, -21471, -26548, -47853, -55514, -30019, -46283, -36547, 6036, 29613, -25039, -43105, -15679, -72343, -62244, -30525, -8340, 3910, 31740, -32633, -27593, -35038, -15038, 935, -34694, -55710, -45463, -9873, 1299, -34564, -94672, -74293, -9450, 33130, 77161, -13290, -52386, -30481, 19268]
1692A9268j5435k9409Q718L029J6760j1246n1673k9651J9458J7599l2673K8283
1680e6972L9406r799k0190J4903K1370n0841L7133M1781L8243l2548k7545K9256
1668B4197N620o4980J6757R386J3993J5950q469O0488j5827n9385j4415J0657
1656f028p440P240K9641l6671k315k5002J5818J9025k9352J2385n4626M9111K6235
1643a979L6464L5244n6718n9201J330P447L0930L1929o594k1324k6281Q817L1783
1630A1847M2264m3212k4984N0855l7503k4471K1950Q144j835M9608N1606q7815
1618A6454o5476K6686j4891L52L7480O907j9852Q638k1182Q929j0853k956m314
1605c4078K0239k8397J8781j109j8060r396J6570L6576K6697l2872L7741L6840
$$ y = [19268, 3833, -25576, -16858, -13829, 2931, -8315, -59988, -89639, -70181, -52582, -85255, -56972, -17566, -27365, -47555, -32652, -11282, -62123, -24990, 16791, 55034, 22486, -5059, 24197, 29817, -35163, -18406, -9020, 4973, 20923, 12454, 72942, 57115, -2270, -16685, -6028, -13468, -6228, 23413, -13258, -15573, -40575, -24757, -5732, -35084, -22699, -77325, -28214, -1979, 34485, 69729, 13011, -46190, -44860, -37413, -6483, 25446, 18852, -2472, -28753, -19936, 11847, 54111, 10899, -14085, 36770, -733, -25204, -3254, 4890, 3055, 52663, 104269, 16454, -49022, -22336, -37227, -36875, 605, 7512, -12340, -3702, -24884, -15955, -26808, -29764, -34078, -13839, -42236, -23455, -24564, -42624, -52020, -35450, 1126, 27823, -5049, 32692, 69532]
1593F9532l6914L5191m0207q5409J0944M2170n1342N8989l2055J6241n926N7030
1581C8244K1244K408n3651l5052j7499M1843N7580k3905n3074m0765j641M3547
1569b0721L5123m0386j0456k3550J6562L2787Q174J1897k0146k0725K1327L0396
1557B0282n4684m8982O328K9302j0796J7034q278M4053M358l4601K2477n7069
1545g0576O3553k0558l6601o391N6145K654k544o805M2633n7169k787N0147k0479
1532h778j4756K3196m053j0250J5923L5708J1662K0434n666l0149j1794J0818
1520C2295q804j3528k0221k7110O1856l6005q235q624J6092j1727k0904K8421
1508a6494L6430k329M9922m5376p5606P861J0427j5080P38o531k2590J7944k3010
$$ y = [69532, 32618, 67809, 27602, -57807, -46863, -4693, -56035, 2954, -29101, -12860, -18786, 38244, 59488, 61896, 8245, -26807, -44306, -2463, 55117, 31212, -21862, -62627, -64268, -20721, 14402, -25984, -36440, -59990, -43428, -10641, -2467, 9430, -10716, -31441, -10114, 20282, -34402, -83384, -77056, -47754, -58550, -41516, -49794, -5741, -1383, -35984, -13507, -70576, -7023, -27581, -64182, -70573, -14428, -11774, -14318, -21123, 21510, -35659, -38446, 11701, -8778, -23534, -338, -4391, -14641, 1282, 36990, 48652, 69086, 63420, 33271, 21477, 32295, 23491, 9963, -10258, -37368, 24488, -11517, -19752, -28376, -12284, -24011, -44915, -16494, 19936, 17607, 67529, 22153, -53453, -45592, -35165, -50245, -49507, -56038, -78628, -60684, -83694]
1495h3694M1161J0152R075N988K0456l240L443L829N726n98o1301L0682j9857
1482c8178j0695l7932N3284K2649j7034k7749J1823n010j376O3844o265m649o672
1469c960o8659j4229N5440K008m3621K8529K5125M0385m8764K4905O4351k0634
1457D0876k1966k1905K5492k9670m379k4602j2072K8857P495L2409n5395M3270
1445H410L4895l6505M1136k8419n5611k3736k3201J9925M8102l5556M0353L0442
1433B0235K274J6994k5008k6484j1657k0693O8510m1665Q316J0293J84o7659N7709
1420h651L1386j1750j9041m3351K8627L3565N164O341l1852J5618p691M648J0626
1407A3639J0803k4013m8175M4052Q192K7788n368n6737k3881J0377L7195N0042
$$ y = [-83694, -42533, -32381, -23306, -17318, 3138, -102, 3341, 7170, 12896, 12298, -49003, -18321, -38178, -48873, -86805, -33521, -10872, -27906, -55655, -43832, -48842, -50218, 13626, 7361, 2712, -3960, -72619, -86848, -31408, -29400, -73021, -44492, -19367, 21018, -27746, -2841, 61510, 40876, 18910, -2995, 22497, -7173, -11552, -36154, -48226, -19369, -11874, 20535, -34860, 8410, 43305, 6800, 47936, 19517, -36094, -59830, -83031, -63106, -15004, -50560, -10207, 20235, 22509, 39503, 14495, -11989, -23646, -44339, 24171, -17494, -9178, 1115, 1299, -66360, -8651, 22735, 10985, -8056, -51407, -22780, 10785, 15949, 22290, -9562, 6056, -1635, 3013, 13639, 24442, 429, -47746, -3694, 4498, 32286, 26918, -29819, -53700, -43323, -6128, 43914]
1395D3914n4184j8974J482n946J2611Q855N1156K645P299j6402n8054O806m0193
1382e8985K7191M3251j0289k8090O1894l0550K0419Q255j4075m7970j1504l710
1370d4163M530L6542J7787k321j5768n863J1714n660p644K4301l746K3246L5801
1357F8756J1142l6077j2877k7831P347j2730N2563k6512q328j6532j4116J4064
1345a131m3458J7365M190N5139J5344K4979n3602j0943J4056k7452O98o112j8324
1332b9251O0230J034q2731k2540M6879L4330m5891j2612K0531J3831l5797R759
1320d2228L5882K6535L0649j9069j9564l1034M0629J7608J9010k1449l6321n193
1308d545k7527J5022k0869N0283J7110K8837m5487J2930J864m809M017O456P350
$$ y = [43914, -10270, -29244, -27762, -33708, -21097, -12242, 38914, 41559, 48858, 32456, -25598, -18792, -58985, -31794, 11457, 1168, -26922, 34972, 4422, 24841, 33096, 19021, -28949, -40453, -44163, -39633, -3091, 14696, 12375, -3393, -9256, 2458, -3202, -10846, 13455, 9709, 32955, 68756, 79898, 43821, 30944, 3113, 10460, -2270, 50293, 23781, 15453, -1079, -15195, -1131, -44589, -27224, -23034, 32105, 47449, 72428, 18826, 7883, 21939, -5513, -4815, -10927, -29251, 30979, 32013, -50718, -73258, -26379, 7951, -37940, -50552, -30021, -16190, -51987, -42228, -6346, 20189, 50838, 31769, 12205, -18829, 21800, 39408, 58418, 36969, 648, -4545, -32072, -17050, -37919, 12364, 29474, 58311, 12824, 25754, 27618, 22809, 26826, 33282, 40632]
1295D0632n5113o501J999P2413j5444k3961L2735o552J1141J5012l3247r119K2949
1282D6944k4300m1136K4940K4113l924k8629l2227K422K8322j9657k4288L7452
1270i968J7674p2121m436J9654j9931P3641M1320o449m296K389m2071K4795j5184
1257E017m4328L661j5206Q5524j3586l8712j5085l493j3884l2919Q3255N216M146
1244I606L3775j02307M4560M2312j8535J8103j4164j0054j0252K9725j5925N355
1232A2199k0290J1607q70R82j3185j1713J1222K3378k3053q309j3566l6417Q687
1219e9328L7731P063j5083J627q318J4608K3432O35j7218l3561q332l175K1292
1206c8627K2660J1726j3623k3887K3633j3694j9236o044Q5509l4210l646P5760
$$ y = [40632, -14481, -20982, -18983, 53430, 37986, 14025, 46760, 40208, 51349, 66361, 33114, 23995, 46944, 22644, -18492, 6448, 30561, 26637, -1992, -34219, -31797, -3475, -23132, -47420, -9968, 7706, -64415, -68851, -49197, -69128, 4513, 45833, 39384, 35088, 37477, -4594, 20201, 5017, -39311, -35650, -50856, 34668, 21082, -17630, -32715, -36208, -50092, -83011, 244, 5460, 9606, 43381, -58926, -14366, 27946, 9411, 27514, 13350, 3296, -6956, 22769, 6844, 12199, -8091, 3516, 2646, 3628, -9557, -21270, -10048, 13330, -9723, -18032, -31598, -68015, -59328, -21597, -14534, -29617, -27990, -36308, -21700, 1732, 2367, -14851, -48412, -56744, -59919, -38627, -15967, -4241, -17864, -41751, -18118, -31812, -51048, -57092, 28417, -5793, -9439, 66321]
1194F6321m7488k7798K7574j013j4032r118j6090m2084Q394M6430j5903k5775
1182e0582K0517L0753j0740j2065k963R09J4472j105l9047O4264j7210J6903l5611
1169b1505l4116N7772P60j4894J2701n178o435O568l28N361n3070L0276J8575
1156c513j2652j1648J5103K944k235q644k4016K908O7341k1746m3020L907m381
1143c9652j1768P224j4766l3811Q1234M1734n0570L2818l4305J6953J8126k5228
1131a2011K2798K0901K4958k1139m8106J0422m7220k6546P049J5870Q904m06J742
1118d2784J5061L3250N187M0023m7756O139k9943K1562N970m0636m325Q660O153
1105b3439L5693m1972J1372J6508m5140o122R10j079M990l9473l2991N5804M8961
$$ y = [66321, 18833, -8965, 18609, 17596, 3564, -5554, -21644, -63728, -55334, -8904, -24807, -50582, -30065, 688, -10052, -22117, -25080, -24171, -9699, -10804, -49851, 14413, -2797, 14106, -21505, -55621, 2151, 2911, -11983, 718, -4460, -10895, -4327, -4655, 706, -52364, -22088, -3513, -16165, -27813, -12710, -9766, -12001, -20645, -44661, -41753, 25588, 3842, -39178, -35271, -39652, -51420, -44196, -58962, -92773, -11539, 30195, -20375, 12443, -21862, -4909, 13217, -12011, 10787, 31688, 56646, 35507, -12599, -2177, -49397, -75943, -68894, -53024, -44120, -44526, -42784, -27723, 5527, 10714, 50737, 2981, 9120, -20823, 739, 6709, -33927, -38252, -29592, -23439, 12254, -29718, -18346, -1838, -46978, -53100, -52190, -53269, -48279, -87752, -120743, -64939, -15978]
1092a5978K3056o212l9804q306O3839k2329K2971n1653K5944k250M7754J7404
1080E4436p5235j4508k3905J9731P3992m3140n2271J2657M1437k3355k5905l2015
1068h8081M1968M5132J6334J3037l5564p459N0467r153p5736K0467j0756l086
1056d2430k2547N9934Q3140l1814r4049K6136K1988R745L6832m3742J0252J8005
1044C1450o1603K2145J6320O2059m0974l4100l167J02K6696j0363L3144l328l9359
1031i78K0312j2674Q85k6301j0689j5525M0839J821k8080N0919J3148k010O872
1018C8539j6952l7694l2790K2265r86l836L6514K3211k6507k7441J6079k3096
1006c2694J5362Q05M9144R467k0779M6261l6602M2552J6352j212n2809l9737m4237
$$ y = [-15978, 7078, 866, -38938, -47244, 16595, -5734, 17237, -34416, -8472, -10722, 37032, 54436, -20799, -35307, -59212, -39481, 34511, -8629, -60900, -48243, -6806, -30161, -56066, -88081, -46113, -981, 15353, 28390, -7174, -14633, 35834, 26681, -49055, -28588, -39344, -42430, -64977, -5043, 78097, 46283, -47766, -21630, 358, 10103, 46935, 3193, 13445, 31450, -30153, -8008, 8312, 70371, 29397, -4703, -7870, -7768, 18928, 8565, 41709, 38381, -978, 19334, 6660, 7545, -18756, -29445, -44970, -4131, -2310, -30390, 20529, 33677, 31667, 38539, 21587, -16107, -48897, -26632, -27618, -31454, 5060, 28271, 1764, -25677, -9598, -32694, -17332, -16527, 32617, 42084, 21305, 67566, 30964, 73516, 89868, 88656, 35847, -3890, -48127]
993d8127j8262O8897K5046l29K3432m5497m6746J3485k9845J9309O4538m9066
981b3165J5672M7167n581l9933m0538L5304k4259k6656N976O9657l4254p32J8980
968b362j6494m8649K3477J6090P50P1804L5850o8052j2239n865j855J6755R075
955A8285m4645K0034L8158j4040K3021L1106k6771J659M1159m5252m6351r240
943a2877l9186N544k382N4975O642n2350p899O1301R879r165k2872K8636m5220
930b4974k3201N2821J8932k4134l1854j6026K8275k7395n108M9065M230K8196
918B8827k6105j4137P991j7381j8132o58L1773J6273n3601K1248J703j401l7403
905f1003P5884n954J5203n062m1431K557K8854q860m3920K9997p979r474M8332
$$ y = [-48127, -66389, 2508, 27554, 27225, 50657, 5160, -41586, -28101, -57946, -38637, 25901, -23165, -7493, 39674, 34093, -5840, -46378, -11074, -35333, -61989, -56013, 13644, -20610, -21342, -2362, -18856, -67505, -44028, -27938, -27188, 44616, 80466, 12414, 175, -5690, -7545, 9210, 18285, -26360, -6326, 31832, 17792, 40813, 71919, 45148, 46807, 87966, 42714, -3637, -12877, -52063, -46519, -48901, 6074, 12716, -39634, -47533, 13768, 23647, 14482, -8390, 20246, -24974, -48175, 4646, 23578, -556, -32410, -48436, -20161, -47556, -52664, -3599, 631, 28827, 2722, -11415, -3424, -20805, -38937, -39595, -7822, 8451, -45150, -23902, -22199, -23600, -61003, 14881, 8927, 24130, 19068, -22363, -19806, 9048, 188, -43732, -13735, -21714, -31188, 17144]
892A7144l2480P747J7497k7031j558M4417l2037J6030r763J4294R400L0479L703
879E7842l2169N486m8100Q1773O660m1169M215N612k8789l2736J1453M1516K9121
866F0715J822q6301J9986O0678k2148j6721J8716j6245m4220k513n2990J5670
854f3551l556Q279R125K2524M3567o789K3707k8457J6777M4199l0352O11j5238
841B0846j0673R892k3414r742R01K3545o482M218n2743J5724R6048J6197n9168
828B5149j3228n0145K3734M4043m9273R351K5055k4455l0224K1056N6323L1988
816F9374n7798l9970R807L0880J982k6067j3035O6071j876k9084L7109O276N083
803E8752k8277J9091Q341n984j2250K3162J0221o3663K2459R819J017N622m439
$$ y = [17144, -15336, -7589, 9908, -17123, -18681, 25736, -6301, 9729, -34, 14260, 23660, 54139, 57842, 25673, 31159, -16941, 64832, 71492, 30323, 34538, 40150, 11361, -21375, -9922, 31594, 60715, 62537, -23764, -3778, 56900, 34752, 18031, 36747, 20502, -23718, -26231, -79221, -63551, -67107, -58828, -49703, -27179, 16388, 9599, 33306, 4849, 21626, 65825, 35473, 36084, 20846, 10173, 20065, -3349, -13091, -12190, 11355, 4873, 9091, -43652, -27928, 68120, 84317, 25149, 11921, -38224, -14490, 29553, -19720, -10369, 14686, -9769, -39993, -18937, 37386, 69374, 11576, -28394, -18587, 12293, 14275, -11792, -24827, 41244, 39368, 10284, 47393, 53669, 58752, 30475, 49566, 57907, 51923, 39673, 62835, 73056, 9393, 31852, 41671, 42688, 48310, 43871]
790D3871K1908p2690j9940K4702J3419K1576m9478l5909L9622K7370J6454O4057
778I4962n9490m2896j543j3095j9587L6194j5071m8872L0709K3333L531J892L6194
765B6261l7906m1056O8852M9098l3081j8642j2691o938J3276K5928J639j6151
753A8589j2045n040l1528m284N385r872J9067M4356L0704j0513m3552L2136j6654
740A6749n177J5682K6186K3920o756n807j01299Q477N8883k1111J686l8096M926
727b1737L5292n2776J9376l015k5097J5135n261k117L3331m5744j5120Q3637K0611
714C6515K0495l6781p330j6058l390K8244J5759k0442n3608J5809L7438L3904
702E0555j8761k7683J5090l7091p230O2984K872K0890k8358k7746n566K948J0551
$$ y = [43871, 65779, -6911, -26851, -2149, 11270, 32846, -16632, -52541, -12919, 14451, 30905, 94962, 35472, -7424, -8967, -22062, -41649, -5455, -20526, -69398, -38689, -15356, -11825, -9933, 26261, -11645, -52701, 16151, 65249, 32168, 13526, 835, -6103, 7173, 33101, 34740, 18589, 6544, 1504, -30024, -34308, -28923, -38795, -19728, 24628, 55332, 44819, 1267, 33403, 16749, 11572, 27254, 53440, 77360, 70604, 64797, -36502, -28025, 30858, 9747, 11433, -26663, -21737, 13555, -39221, -19845, -22860, -47957, -32822, -38083, -40200, -6869, -52613, -67733, 15904, 36515, 57010, 20229, 12899, -3159, -6549, 21695, 37454, 17012, -36596, -20787, 16651, 50555, 31794, 4111, 19201, -17890, -25120, 37864, 40736, 61626, 33268, 5522, -44, 2904, 13455]
689A3455L1016n2749J8492J2567K6099K6000l2577m0564p993J5999J3429n444
677A7730l370K9108K1130J3343p3686j9498J8783L5528l1640j1091M6376n3591
665a0878k1914M2712J5247L2530L129J0129J3748j6693k946o5053j0690J7558
653F879J2116n416M3464N6501l8000n7350j3881M3710n0257N4109l8419l7563
641b4107M2064m596P367K9958q75J1189n0565k4063M3876J7967L1289J1936j7739
$$ y = [13455, 44471, -8278, 10214, 22781, 48880, 74880, 42303, 1739, -6254, 9745, 23174, 17730, 14360, 43468, 64598, 77941, 4255, -15243, 3540, 39068, 7428, -3663, 42713, -10878, -32792, 9920, 25167, 57697, 60826, 70955, 84703, 68010, 65064, 11, -10679, 6879, 18995, 13579, 57043, 113544, 75544, 18194, 4313, 48023, -2234, 51875, 13456, -24107, 17957, 13361, 20728, 50686, 49811, 61000, 10435, -13628, 30248, 48215, 79504, 91440, 73701]
$$ [...]
##END NTUPLES=NMR SPECTRUM
##END=
