##TITLE=1H_EC-3297(3)
 CDCl3
 8 sc, 
 12.7.2023
##JCAMPDX= 6.0         $$ Bruker NMR JCAMP-DX V2.0
##DATA TYPE= NMR SPECTRUM
##DATA CLASS= NTUPLES
##ORIGIN= UXNMR, Bruker Analytische Messtechnik GmbH
##OWNER= root
$$ XWIN-NMR		Version 3.5
$$ Wed Jul 12 13:41:39 2023 Russian Standard Time (UT+4h)  she@DPX200
##.OBSERVE FREQUENCY= 200.13135
##.OBSERVE NUCLEUS= ^1H
##.ACQUISITION MODE= SIMULTANEOUS
##.ACQUISITION SCHEME= undefined
##.AVERAGES= 8
##.DIGITISER RES= 18
##SPECTROMETER/DATA SYSTEM= spect
##.PULSE SEQUENCE= zg30
##.SOLVENT NAME= CDCl3
##.SHIFT REFERENCE= (INTERNAL, CDCl3, 0, 15.7634)
##AUDIT TRAIL= $$ (NUMBER, WHEN, WHO, WHERE, WHAT)
$$ ##TITLE= Audit trail, XWIN-NMR		Version 3.5
$$ ##JCAMPDX= 5.01
$$ ##ORIGIN= Bruker BioSpin GmbH
$$ ##OWNER= she
$$ F:/spectra/data/she/nmr/H-F/1/pdata/1/auditp.txt
$$ ##AUDIT TRAIL=  $$ (NUMBER, WHEN, WHO, WHERE, WHAT)
(   1,<2023-07-12 13:40:27.79 +0400>,<she>,<DPX200>,
      <created by zg, POWCHK disabled, PULCHK disabled
       configuration hash MD5:
       00 E9 B6 7A A2 85 ED C7 34 08 36 98 17 FE 4E 26
       data hash MD5: 16K
       CB 9F 34 BE FE B8 77 E3 AC CA 30 FF EA 03 D2 49>)
(   2,<2023-07-12 13:40:31.00 +0400>,<she>,<DPX200>,
      <Start of raw data processing
       efp BC_mod = 2 LB = 0.24 FT_mod = 6 PKNL = 1 PHC0 = -20984.67 PHC1 = 5.25272 SI = 16K 
       data hash MD5: 16K
       10 C0 12 3B BC 2D 8C 38 DD 7B 21 CE D8 61 E9 6E>)
(   3,<2023-07-12 13:40:47.65 +0400>,<she>,<DPX200>,
      <pk PHC0 = 0.6220196 PHC1 = 0.4 
       data hash MD5: 16K
       4F 7E EB E1 CC B5 1C CC AF 9D 24 0A 73 0D 65 69>)
(   4,<2023-07-12 13:40:50.79 +0400>,<she>,<DPX200>,
      <abs ABSG = 5 
       data hash MD5: 16K
       52 C8 7D 00 8F 6C 99 5E A6 BE 99 A8 90 63 6E 7D>)
$$ ##END=
$$ 
$$ hash MD5
$$ AE 3B 5C 04 60 91 E1 37 9E 28 9C A1 6C 13 CA 3C
##$RELAX= 
##$RELAX= 
##$RELAX= 
##$RELAX= 
##$RELAX= 
##$RELAX= 
$$ Bruker specific parameters
$$ --------------------------
##$DU= <F:/spectra>
##$EXPNO= 1
##$NAME= <H-F>
##$PROCNO= 1
##$TYPE= <nmr>
##$USER= <she>
##$AMP= (0..31)
100 100 100 100 100 100 100 100 100 100 100 100 100 100 100 100 100 100 
100 100 100 100 100 100 100 100 100 100 100 100 100 100 
##$AQSEQ= 0
##$AQ_mod= 1
##$AUNM= <au_zg>
##$AUTOPOS= <>
##$BF1= 200.13
##$BF2= 200.13
##$BF3= 200.13
##$BF4= 200.13
##$BF5= 200.13
##$BF6= 200.13
##$BF7= 200.13
##$BF8= 200.13
##$BYTORDA= 1
##$CFDGTYP= 0
##$CFRGTYP= 5
##$CHEMSTR= <none>
##$CNST= (0..31)
1 1 145 1 1 1 1 1 1 1 1 1 1 1 1 1 1 1 1 1 1 1 1 1 1 1 1 1 1 1 1 1 
##$CPDPRG= <>
##$CPDPRG1= <>
##$CPDPRG2= <>
##$CPDPRG3= <>
##$CPDPRG4= <mlev>
##$CPDPRG5= <mlev>
##$CPDPRG6= <mlev>
##$CPDPRG7= <mlev>
##$CPDPRG8= <mlev>
##$CPDPRGB= <>
##$CPDPRGT= <>
##$D= (0..31)
0 1.2 0 0 0 0 0 0 0 0.06 0 0.03 0 0 0 0 0.0002 0 0 0 0 0 0 0 0 0 0 0 0 
0 0 0 
##$DATE= 1689154827
##$DBL= (0..7)
120 120 120 120 120 120 120 120 
##$DBP= (0..7)
150 150 150 150 150 150 150 150 
##$DBP07= 0
##$DBPNAM0= <>
##$DBPNAM1= <>
##$DBPNAM2= <>
##$DBPNAM3= <>
##$DBPNAM4= <>
$$ [...]
##$SUBNAM3= <"">
##$SUBNAM4= <"">
##$SUBNAM5= <"">
##$SUBNAM6= <"">
##$SUBNAM7= <"">
##$SUBNAM8= <"">
##$SUBNAM9= <"">
##$SW= 18.05172834244
##$SWIBOX= (0..15)
0 0 2 0 0 0 0 0 0 0 0 0 0 0 0 0 
##$SW_h= 3612.71676300578
##$TD= 16384
##$TD0= 1
##$TE= 0
##$TE2= 300
##$TE3= 300
##$TEG= 300
##$TL= (0..7)
0 120 120 120 120 120 120 120 
##$TP= (0..7)
150 150 150 150 150 150 150 150 
##$TP07= 0
##$TPNAME0= <>
##$TPNAME1= <>
##$TPNAME2= <>
##$TPNAME3= <>
##$TPNAME4= <>
##$TPNAME5= <>
##$TPNAME6= <>
##$TPNAME7= <>
##$TPOAL= (0..7)
0.5 0.5 0.5 0.5 0.5 0.5 0.5 0.5 
##$TPOFFS= (0..7)
0 0 0 0 0 0 0 0 
##$TUNHIN= 0
##$TUNHOUT= 0
##$TUNXOUT= 0
##$USERA1= <user>
##$USERA2= <user>
##$USERA3= <user>
##$USERA4= <user>
##$USERA5= <user>
##$V9= 5
##$VALIST= <valist>
##$VCLIST= <CCCCCCCCCCCCCCC>
##$VD= 0
##$VDLIST= <DDDDDDDDDDDDDDD>
##$VPLIST= <PPPPPPPPPPPPPPP>
##$VTLIST= <TTTTTTTTTTTTTTT>
##$WBST= 1024
##$WBSW= 4
##$XGAIN= (0..3)
0 0 0 0 
##$XL= 0
##$YL= 0
##$YMAX_a= 505334
##$YMIN_a= -702278
##$ZGOPTNS= <>
##$ZL1= 120
##$ZL2= 120
##$ZL3= 120
##$ZL4= 120
##$ABSF1= 15.77113
##$ABSF2= -2.28072
##$ABSG= 5
##$ABSL= 3
##$ALPHA= 0
##$AQORDER= 0
##$ASSFAC= 0
##$ASSFACI= 0
##$ASSFACX= 0
##$ASSWID= 0
##$AUNMP= <proc_1d>
##$AZFE= 0.1
##$AZFW= 0.1
##$BCFW= 0
##$BC_mod= 2
##$BYTORDP= 0
##$COROFFS= 0
##$CY= -3
##$DATMOD= 1
##$DC= 0
##$DFILT= <>
##$DTYPP= 0
##$F1P= 0
##$F2P= 0
##$FCOR= 1
##$FTSIZE= 16384
##$FT_mod= 6
##$GAMMA= 0
##$GB= 0
##$INTBC= 1
##$INTSCL= 3.70164e-10
##$ISEN= 128
##$LB= 0.24
##$LEV0= 0
##$LPBIN= 0
##$MAXI= 10000
##$MC2= 0
##$MEAN= 0
##$ME_mod= 0
##$MI= 1.114404
##$NCOEF= 0
##$NC_proc= -6
##$NLEV= 6
##$NOISF1= 3.799351
##$NOISF2= 2.8
##$NSP= 0
##$NTH_PI= 0
##$NZP= 0
##$OFFSET= 15.76342
##$PC= 1
##$PHC0= -20984.05
##$PHC1= 5.65272
##$PH_mod= 1
##$PKNL= yes
##$PPARMOD= 0
##$PSCAL= 0
##$PSIGN= 0
##$REVERSE= no
##$SF= 200.130001626324
##$SI= 16384
##$SIGF1= 3
##$SIGF2= 2
##$SINO= 5.538805
##$SIOLD= 16384
##$SREGLST= <1H.CDCl3>
##$SSB= 0
##$STSI= 16384
##$STSR= 0
##$SW_p= 3612.71676300578
##$SYMM= 0
##$S_DEV= 0
##$TDeff= 16384
##$TDoff= 0
##$TI= <>
##$TILT= no
##$TM1= 0
##$TM2= 0
##$TOPLEV= 0
##$USERP1= <user>
##$USERP2= <user>
##$USERP3= <user>
##$USERP4= <user>
##$USERP5= <user>
##$WDW= 1
##$XDIM= 16384
##$YMAX_p= 494913835
##$YMIN_p= -330754
$$ End of Bruker specific parameters
$$ ---------------------------------
##NTUPLES= NMR SPECTRUM
##VAR_NAME=  FREQUENCY,     SPECTRUM/REAL,   SPECTRUM/IMAG
##SYMBOL=    X,             R,               I
##VAR_TYPE=  INDEPENDENT,   DEPENDENT,       DEPENDENT
##VAR_FORM=  AFFN,          ASDF,            ASDF
##VAR_DIM=   16384,         16384,           16384
##UNITS=     HZ,            ARBITRARY UNITS, ARBITRARY UNITS
##FACTOR=    0.220516191357247, 1,           1
##FIRST=     3154.73329124617, 0,            0
##LAST=      -457.98347175961, 0,            0
##MIN=       -457.98347175961, -330754,      0
##MAX=       3154.73329124617, 494913835,    0
$$ Real data points
##PAGE= N=1
##DATA TABLE= (X++(R..R)), XYDATA
$$ [...]
6159A19080p8930k2637o2106k2824r825Q3576l9646o3934K6398L2347L1060K2099
$$ 119080 40150 17513 -44593 -67417 -77242 6334 -33312 -97246 -70848 -38501 -7441 14658
6147A4658n1080Q8025o3842K740J6005q665k534N1934p8792l7793O3678K9605
$$ 14658 -36422 51603 -12239 -9499 6506 -2159 -4693 47241 -31551 -69344 -5666 23939
6135B3939j01833j1493J03711q147K4407o106K541L4540R615n1580j1296r0088
$$ 23939 -77894 -89387 14324 6177 30584 24478 27019 61559 71174 19594 8298 -81790
6123h1790N455O3868J6360k3943P5093P989n7804K8649l1620o0615N6645N875
$$ -81790 -76335 -12467 3893 -20050 55043 63032 5228 33877 2257 -58358 -1713 4162
6111D162l2401P1835l5928K3483J3390k429R2798o6304p2320q0756O3329N5097
$$ 4162 -28239 43596 7668 31151 44541 42112 134910 68606 -3714 -84470 -21141 33956
6099C3956o3871M5818K0302J5977R9482p451J5464K0681o9999O5339l729l5422
$$ 33956 -29915 15903 36205 52182 151664 144213 159677 180358 110359 175698 171969 136547
6087A36547j6595O5051q0977q0451J91632j12409K8825m9853l0859n4125P6316
$$ 136547 119952 185003 104026 23575 215207 102798 131623 81770 50911 -3214 73102
6076G3102N4678n1509J2380j54226J13588Q4458p5375l4004R2468j7506O4323
$$ 73102 127780 76271 88651 -65575 48013 132471 57096 23092 115560 98054 162377
6065A62377n4484N1253Q1715j12475j4549j3840L0422k1362P4336n4231L8271
$$ 162377 107893 159146 240861 128386 113837 99997 130419 109057 183393 129162 167433
6054A67433J05373M0949l9619l3119K788n1378n5462P7982m6426J33112q5780
$$ 167433 272806 313755 274136 241017 243805 192427 136965 214947 168521 301633 215853
6043B15853M4533Q3761m8686j16J4462o4114o5151R3107J7767L3685n8672J21402
$$ 215853 260386 344147 295461 295345 309807 245693 180542 273649 291416 325101 266429 387831
6031C87831l8778j23738J5333O5474q146q546P8876m2715j31988j0605l2034J1319
$$ 387831 349053 225315 240648 306122 297976 289430 368306 325591 193603 182998 150964 162283
6019A62283L6581l6079Q638m7675L3857q123L3178N0592n7122L0371l4540M6651
$$ 162283 198864 162785 171423 123748 157605 149482 182660 233252 176130 206501 171961 218612
6007B18612l4400j16699k6705o6896O731J17838k5847l048P6414m374l5919O7722
$$ 218612 184212 67513 40808 -26088 -19357 98481 72634 69586 146000 141626 105707 173429
5995A73429j7923j46223m139J25804N9063J391l1861K6470l4894n5337n2003J50606
$$ 173429 155506 9283 5144 130948 190011 191402 159541 186011 151117 95780 43777 194383
5983A94383j05594j9132m8277J34369K076k5158N9196m6403o369P8959n8707m8189
$$ 194383 88789 69657 21380 155749 157825 132667 191863 145460 139091 218050 159343 111154
5971A11154Q4246j2799l9194p712L2284q8934o4512m4008J43995j584J3285Q6472
$$ 111154 195400 182601 143407 135695 167979 79045 14533 -29475 114520 112936 126221 212693
5959B12693L9792k3319k1980Q0258q0812K8007M1412j1041j3626l9586n6806O3459
$$ 212693 252485 229166 207186 287444 206632 234639 276051 265010 251384 211798 154992 218451
5947B18451K5296j29772J15645Q4394M697p5375l3109o386r9155J16758R3903
$$ 218451 243747 113975 229620 314014 318711 243336 210227 203841 104686 221444 315347
5936C15347j29217n3552q73p3926K8829K9935Q5861j013j21010M5178Q8108Q052
$$ 315347 186130 132578 131705 57779 86608 116543 202404 201391 80381 125559 213667 221719
5924B21719r7466K2686k2550N2047N864J11860n3240m8039j20588L0675M2309
$$ 221719 124253 146939 124389 176436 182300 294160 240920 192881 72293 102968 145277
5913A45277J23399j402n2142o9140r44J16982l3040J7807K2582p6901k2152M374
$$ 145277 268676 267274 215132 145992 145048 262030 228990 246797 269379 192478 170326 174700
5901A74700l598P9232l7026n0410J23217k2762o6342K0468J718o5584q511J12878
$$ 174700 171102 250334 213308 162898 286115 263353 197011 217479 219197 153613 145102 257980
5889B57980K3778M6645L1717k297q1945J967J9323l748r828q611p7643n6726L8699
$$ 257980 281758 328403 360120 357823 275878 277845 297168 293420 283592 274981 197338 140612 179311
5876A79311r586P3856Q0571O6724J02747n8746n9050m6642k5868N4455R377l2300
$$ 179311 169725 243581 324152 390876 493623 434877 375827 329185 303317 357772 367149 334849
5864C34849L724k043M4017k4416Q698Q717J3512m1504M911L4620n2076N6261j569
$$ 334849 338573 336530 380547 356131 364829 373546 387058 345554 350465 385085 333009 389270 387701
5851C87701l0695L6622k2168K3699K8761J202j34221J22758O2624p1595J381N0914
$$ 387701 357006 393628 371460 395159 423920 425122 290901 413659 476283 404688 406069 456983
5839D56983k560N7072J5624J3846Q5755J0718o0623J7074L4208l8059l2760K8186
$$ 456983 454423 511495 527119 540965 626720 637438 576815 593889 628097 590038 557278 585464
5827E85464K0036n9937k1250M1719J5654J20153P1916n8279M0425L7192p0500
$$ 585464 605500 545563 524313 566032 581686 701839 773755 715476 755901 793093 722593
5816G22593j13508J08160j2013j798P3987M4740K810P6159L6866m7500O315L5715
$$ 722593 609085 717245 705232 703434 777421 822161 824971 901130 937996 890496 896811 932526
5804I32526m1622p103m9516J23717Q815m3255L4073K8235J1350M9652j7519N1427
$$ 932526 890904 883801 834285 958002 966817 923562 957635 985870 997220 1046872 1029353 1080780
5792A080780P4999r1929k8274l1574N5549J06655l1574j37291J15154M1375j4827
$$ 1080780 1155779 1063850 1035576 1004002 1059551 1166206 1134632 997341 1112495 1153870 1139043
5781A139043J07507p438N170J33689m5503P561J30583Q889J4530m9554j8325J8906
$$ 1139043 1246550 1239112 1244282 1377971 1332468 1340029 1470612 1479501 1494031 1444477 1426152 1445058
5769A445058R6980J14685J2181R4439o5444n2558J20622k1826J06160K0448R3659
$$ 1445058 1542038 1656723 1668904 1763343 1697899 1645341 1765963 1744137 1850297 1870745 1964404
5758A964404O3331P0325n4212m329R307o6413Q7025j0822M5631M4448L0528o1864
$$ 1964404 2027735 2098060 2043848 2039519 2048826 1982413 2069438 2058616 2104247 2148695 2179223 2117359
5746B117359M2873m3219N8086J0363P3845M4448L6066n2330R0804M5229l0739
$$ 2117359 2160232 2117013 2175099 2185462 2259307 2303755 2339821 2287491 2378295 2423524 2392785
5735B392785K5175j3186L1184J01808J00578J27093J45212n3368p7676L2184L6744
$$ 2392785 2417960 2404774 2435958 2537766 2638344 2765437 2910649 2857281 2779605 2811789 2848533
5724B848533M4469L4847O6565p838Q9968R924o7245M120j9715j04222j18530n3959
$$ 2848533 2893002 2927849 2994414 2986576 3076544 3086468 3019223 3023343 3003628 2899406 2780876 2726917
5712B726917K0851m9090r5082J4168o8244j0324j31526J9374L8345L3895j26613
$$ 2726917 2747768 2698678 2603596 2617764 2549520 2539196 2407670 2427044 2465389 2499284 2372671
5701B372671l475L6625n1051m662m7634j3202m671M1477o9941q048j9120K2886
$$ 2372671 2369196 2405821 2354770 2350108 2302474 2289272 2284601 2326078 2256137 2248089 2228969 2251855
5689B251855k0937k1953j9103j6035P1113j4221q5130K4955M863j35306J0726
$$ 2251855 2230918 2208965 2189862 2173827 2244940 2230719 2145589 2170544 2175407 2040101 2050827
5678B050827j5763O6217r7743K3747j38909j25577O6267k7267j4742k9609j8396
$$ 2050827 2035064 2101281 2003538 2027285 1888376 1762799 1829066 1801799 1787057 1757448 1739052
5667A739052o0692j5948p189j44785j0275j06466N0514R6527r0314j5325j40674
$$ 1739052 1678360 1662412 1655223 1510438 1500163 1393697 1444211 1540738 1450424 1435099 1294425
5656A294425j3773J60009j13106j8002o989q9101j38606K8365L8100M1501k9595
$$ 1294425 1280652 1440661 1327555 1309553 1302564 1213463 1074857 1103222 1141322 1182823 1153228
5645A153228q4104k586j07105P1139r938J00203m097o3680n1075J00768M7355
$$ 1153228 1069124 1066538 959433 1030572 1020634 1120837 1116740 1053060 1001985 1102753 1150108
5634A150108p1086J162M0146L1030l9787j00106j06053l6182R2869M4047J03983
$$ 1150108 1079022 1080184 1120330 1151360 1111573 1011467 905414 869232 962101 1006148 1110131
5623A110131p9471m1232L9830O3355k9210k3811m955o7100l3351P2086j5928J7005
$$ 1110131 1030660 989428 1029258 1092613 1063403 1039592 1034637 967537 934186 1006272 990344 1007349
5611A007349J9442j5901N8487J7836o9536o6425L9239M5703N2684j08666l3596
$$ 1007349 1026791 1010890 1069377 1087213 1017677 951252 990491 1036194 1088878 980212 946616
5600I46616p1778Q2682Q1543n3037m6597j5498N4525M9116j55787l6311m0996
$$ 946616 874838 957520 1039063 986026 939429 923931 978456 1027572 871785 835474 794478
5589G94478J8332N0443L0535O4108l3542q1496K0568o2092k0756J1381k83O4951
$$ 794478 812810 863253 893788 957896 924354 842858 863426 801334 780578 791959 791676 856627
5577H56627p5333l8560J12580L2279l1270m3301j5441J98n086L7583P4408p4027
$$ 856627 781294 742734 855314 887593 856323 813022 797581 797779 792693 830276 904684 830657
5565H30657n7249Q3190n1131O6329k2866p1010l9202N7876j6744m6056O6444J00251
$$ 830657 773408 856598 805467 871796 848930 777920 738718 796594 779850 733794 800238 900489
5553I00489k7459q8372O4084J6871n0005J39041J2881N2139J4621j14572p2387
$$ 900489 873030 784658 848742 865613 815608 954649 967530 1019669 1034290 919718 847331
5542H47331j81k532O0674N6966o6734K9670p363j29227J34043P942L7946L6852
$$ 847331 847150 844618 905292 962258 895524 925194 917831 788604 922647 930589 968535 1005387
5530A005387N6226q8647k2908P0049J07329j8189j08333N3049O4411L2783N818
$$ 1005387 1061613 972966 950058 1020107 1127436 1109247 1000914 1053963 1118374 1151157 1156975
5519A156975M7627M7490M8287n0997O3621K8038K5453n0273n9426M8859M7889
$$ 1156975 1204602 1252092 1300379 1249382 1313003 1341041 1366494 1316221 1256795 1305654 1353543
5508A353543q8258l4035L760j5037L0103N7521j4327M9625o0502j7445n688K6745
$$ 1353543 1265285 1231250 1235010 1219973 1250076 1307597 1293270 1342895 1282393 1264948 1259260 1286005
5496A286005m6714M0037m6592L9948J13273J26818N47q1969m5450O5412O293L9120
$$ 1286005 1239291 1279328 1232736 1272684 1385957 1512775 1513322 1431353 1385903 1451315 1457608 1496728
5484A496728M7096L8467m9438j75991O6242O7963N3545P83J5193k1517L1654p394
$$ 1496728 1543824 1582291 1532853 1356862 1423104 1491067 1544612 1545395 1560588 1539071 1570725 1563331
5472A563331l4520P9055J09043j25500P6056Q8275o432m6554Q6850J04868j0338
$$ 1563331 1528811 1607866 1716909 1591409 1667465 1755740 1749308 1702754 1789604 1894472 1884134
5461A884134k1791J39080N9443r3551Q6450k0421P1868k3688J558J38755m8083
$$ 1884134 1862343 2001423 2060866 1967315 2053765 2033344 2105212 2081524 2083082 2221837 2173754
5450B173754M8728R9235Q9758M784N2583N4840j39852O7645N7439J4649K4670
$$ 2173754 2222482 2321717 2411475 2416259 2468842 2523682 2383830 2451475 2508914 2523563 2548233
5439B548233K0365R0206N3335j8369n8692R9595P1529k3090Q4347J06946P1462
$$ 2548233 2568598 2658804 2712139 2693770 2635078 2734673 2806202 2783112 2867459 2974405 3045867
5428C045867J12103O3411l6924M2900Q2753N0027K657l0028K4340J24213R2841
$$ 3045867 3157970 3221381 3184457 3227357 3310110 3360137 3362794 3332766 3357106 3481319 3574160
5417C574160n4429q0428J44476P0412l2326p468L7385R6663O2656P3540k0920
$$ 3574160 3519731 3439303 3583779 3654191 3621865 3614397 3651782 3748445 3811101 3884641 3863721
5406C863721m4439M4070J0911N4522j6304P9609m3963k5573K3073k6122L4341
$$ 3863721 3819282 3863352 3874263 3928785 3912481 3992090 3948127 3922554 3945627 3919505 3953846
5395C953846k8406J68446J35430J274O3214J04319K0034N2955J36315q4481o6114
$$ 3953846 3925440 4093886 4229316 4230590 4293804 4398123 4418157 4471112 4607427 4522946 4456832
5384D456832J6825N8933k826k1897L3973L54m3117p8190j09317J0967K2197k394
$$ 4456832 4473657 4532590 4529764 4507867 4541840 4542194 4499077 4420887 4311570 4322537 4344734 4342340
5372D342340p188j37110j34011k3818L1177o8279Q3343m444j13317j6782l858
$$ 4342340 4335152 4198042 4064031 4040213 4071390 4003111 4086454 4082010 3968693 3951911 3948053
5361C948053K7055k9492K0276K4274j21426j038L0421J411j2827P30l3042k5140
$$ 3948053 3975108 3945616 3965892 3990166 3868740 3867702 3898123 3899534 3886707 3887437 3854395 3829255
5349C829255l5884K6962j19632N6085o238j10817K3380N8847q995q3173J1203
$$ 3829255 3793371 3820333 3700701 3756786 3750548 3639731 3663111 3721958 3712963 3629790 3640993
5338C640993n2725k35585p9967j352L8540q2949l2465J03057j26509r0420n634
$$ 3640993 3588268 3352683 3272716 3271364 3309904 3226955 3194490 3297547 3171038 3080618 3074984
5327C074984L2641n6361j10726L9898P865o7191n3640j9068j2069j025j173q1590
$$ 3074984 3107625 3051264 2940538 2980436 2988301 2921110 2867470 2848402 2836333 2835308 2834135 2752545
5315B752545j24323J28830K5762J5187p0498o956n7487m9970J4187j12051P5667
$$ 2752545 2628222 2757052 2782814 2798001 2727503 2720547 2663060 2613090 2627277 2515226 2590893
5304B590893p8583O3788r8176M2241N2113J03340r3152n5707j5220j04930J55728
$$ 2590893 2512310 2576098 2477922 2520163 2572276 2675616 2582464 2526757 2511537 2406607 2562335
5293B562335m5320o238J0342r1085P650q1283K2606K1326K170J05862m5805k9844
$$ 2562335 2517015 2510777 2521119 2430034 2437684 2356401 2379007 2400333 2402503 2508365 2462560 2432716
5281B432716N3860P4944j29848l5041J3175m6727n0500O4417k0329m1935J4256
$$ 2432716 2486576 2561520 2431672 2396631 2409806 2363079 2312579 2376996 2356667 2314732 2328988
5270B328988K2799j6057R7898n076l9314P3030K0605M6453n3874j02443N3698
$$ 2328988 2351787 2335730 2433628 2428552 2389238 2462268 2482873 2529326 2475452 2373009 2426707
5259B426707L8954k3136O8147M2946r5883o2752N1778J5356k7489m6707O9268
$$ 2426707 2465661 2442525 2510672 2553618 2457735 2394983 2446761 2462117 2434628 2387921 2457189
5248B457189p0422O7585J8792j26474Q158K8924N6696o522j13998m4659M0774
$$ 2457189 2386767 2454352 2473144 2346670 2354828 2383752 2440448 2433926 2319928 2275269 2316043
5237B316043P1889j10446K6754m681K8362O0035N081q2158j01653P6712O5598
$$ 2316043 2387932 2277486 2304240 2299559 2327921 2387956 2393037 2310879 2209226 2285938 2351536
5226B351536L8813O5945l5216q0141Q4662m0412j10824K0357K2956L3129n4595
$$ 2351536 2390349 2456294 2421078 2340937 2425599 2385187 2274363 2294720 2317676 2350805 2296210
5215B296210R9821J9061P1476n8679j2827j0520p2339k6086R2462R104J25524
$$ 2296210 2396031 2415092 2486568 2427889 2415062 2404542 2332203 2306117 2398579 2407683 2533207
5204B533207L9140o7242Q4329J6848Q425P5446N5247J6635k5488Q896J24294m2026
$$ 2533207 2572347 2505105 2589434 2606282 2614707 2690153 2745400 2762035 2736547 2745443 2869737 2827711
5192B827711m933Q0029R8487p256K7739N0464j4318P4116O848J027J58526N8874
$$ 2827711 2822778 2902807 3001294 2994038 3021777 3072241 3057923 3132039 3138887 3139914 3298440 3357314
5180C357314o5177M1939J45614m9330O0323R9705j9048P9672j9401O4829Q2588
$$ 3357314 3292137 3334076 3479690 3430360 3490683 3590388 3571340 3651012 3631611 3696440 3779028
5169C779028q4215O9109q1765K3791l2355M9360k4991N3656j12471n420O63l1938
$$ 3779028 3694813 3763922 3682157 3705948 3673593 3722953 3697962 3751618 3639147 3633727 3634390 3602452
5157C602452M3098L7614q3322j2241r5099j04052K6255j79503j28826R9046m5164
$$ 3602452 3645550 3683164 3599842 3587601 3492502 3388450 3414705 3235202 3106376 3205422 3160258
5146C160258m8836j01529r2509n2476p8256K458l3556n644o4406m1055p8436n1770
$$ 3160258 3111422 3009893 2917384 2864908 2786652 2789110 2755554 2749910 2685504 2644449 2566013 2514243
5134B514243n0345P5890m7363j23976j07665R614Q4852j9670r4911P888P8386
$$ 2514243 2463898 2539788 2492425 2368449 2260784 2270398 2355250 2335580 2240669 2248557 2326943
5123B326943l2785n1167j14502j5019q589p925O514p4766l0135j7054n3674K0385
$$ 2326943 2294158 2242991 2128489 2113470 2104881 2096956 2103470 2028704 1998569 1981515 1927841 1948226
5111A948226j1153N048L8585K7057j67621J1608Q052j571N1835j8854n151k2231
$$ 1948226 1937073 1942121 1980706 2007763 1840142 1851750 1859802 1858231 1910066 1891212 1886061 1863830
5099A863830P4203m8545K0263l9160n0251l0425K7661Q4229P3277n3494o5554
$$ 1863830 1938033 1889488 1909751 1870591 1820340 1789915 1817576 1901805 1975082 1921588 1856034
5088A856034j53383R4969l2610p7886J00758p8331K1674J60650l6748P8528j27583
$$ 1856034 1702651 1797620 1765010 1687124 1787882 1709551 1731225 1891875 1855127 1933655 1806072
5077A806072M7947j7803m6103k1568O9028L9680N5735l7689J27089q7458j56107
$$ 1806072 1854019 1836216 1790113 1768545 1837573 1877253 1932988 1895299 2022388 1934930 1778823
5066A778823K8867O8559P3793J4234m272M9170J42232j73305K0448J33982P2591
$$ 1778823 1807690 1876249 1950042 1964276 1960004 2009174 2151406 1978101 1998549 2132531 2205122
5055B205122m0646K7504L9910O472j4143J43577n8525M5476R4443M8263k944O9322
$$ 2205122 2164476 2191980 2231890 2238362 2224219 2367796 2309271 2354747 2449190 2497453 2494509 2563831
5043B563831J78318J09276m7724Q794J79782J52704J58695J22879k3257N4037
$$ 2563831 2742149 2851425 2803701 2812495 2992277 3144981 3303676 3426555 3403298 3457335
5033C457335L2390l6569j95800j41186j44382M608L1185j29055j24226r1935R1881
$$ 3457335 3489725 3453156 3257356 3116170 2971788 2976396 3007581 2878526 2754300 2662365 2754246
5022B754246n6603M5016M252j23924L7224m3316k5517k4944K4845P2053j1611
$$ 2754246 2697643 2742659 2746911 2622987 2660211 2616895 2591378 2566434 2591279 2663332 2651721
5011B651721K540M0721o1513k1995k9115r0012o5709J83003j419q6564P5469p7492
$$ 2651721 2654261 2694982 2633469 2611474 2582359 2492347 2426638 2609641 2608222 2521658 2597127 2519635
4999B519635k6128p5851O1416k0210L930j03001K5584P8272q3400K2000P3625
$$ 2519635 2493507 2417656 2479072 2458862 2462792 2359791 2385375 2463647 2380247 2402247 2475872
4988B475872k6764l3061K9024q4838P0801R9371J30386o4167o1467o2183j01070
$$ 2475872 2449108 2416047 2445071 2360233 2431034 2530405 2660791 2596624 2535157 2472974 2371904
4977B371904N1566P4765L0764L6424j3363r946J17016l1821n8709R2772n3242
$$ 2371904 2423470 2498235 2528999 2565423 2552060 2542114 2659130 2627309 2568600 2661372 2608130
4966B608130j8335J08702L8976N7424k9926L9876k0773p0602L0860N9694R1009
$$ 2608130 2589795 2698497 2737473 2794897 2764971 2804847 2784074 2713472 2744332 2804026 2895035
4955B895035o234M4809L4095L16o2664q7893r6589M0854J28678j14255o5401P9922
$$ 2895035 2888801 2933610 2967705 2968021 2905357 2817464 2720875 2761729 2890407 2776152 2710751 2790673
4943B790673Q860j39956m7398m2630L2023m408r153j7268K1196k4094R0403K2803
$$ 2790673 2799533 2659577 2612179 2569549 2601572 2597164 2588011 2570743 2591939 2567845 2658248 2681051
4931B681051j10929m0033R9276Q5266m1610J20759J39558n8666m4752q4983J4776
$$ 2681051 2570122 2530089 2629365 2714631 2673021 2793780 2933338 2874672 2829920 2744937 2759713
4920B759713O7676q0578K6079J00326M5553r0317J07674P7538o7332m670k3967
$$ 2759713 2827389 2746811 2772890 2873216 2918769 2828452 2936126 3013664 2946332 2941662 2917695
4909B917695n6651N4469J6986P9301J54510l7487n5477L8015L3115R7200L871
$$ 2917695 2861044 2915513 2932499 3011800 3166310 3128823 3073346 3111361 3144476 3241676 3245547
4898C245547K4547K9538l8578N0784P9226J95785n6950o2334N8668l3932P6674
$$ 3245547 3270094 3299632 3261054 3311838 3391064 3586849 3529899 3467565 3526233 3492301 3568975
4887C568975N3864r1490L5132N5764N0427J07650J27264L3266Q1478N2538q0549
$$ 3568975 3622839 3531349 3566481 3622245 3672672 3780322 3907586 3940852 4022330 4074868 3994319
4876C994319J7703O0301O6954O4037J03585m4879k2123P5266Q5371N4327J4024
$$ 3994319 4012022 4072323 4139277 4203314 4306899 4262020 4239897 4315163 4400534 4454861 4468885
4865D468885k0639M7141J11125n1501j6948K21914J93574R0758r0559J02419J55237
$$ 4468885 4448246 4495387 4606512 4555011 4538063 4759977 4953551 5044309 4953750 5056169 5211406
4854E211406p7893J23504Q5200J75211J30630k5750J31884M774J04984J35958
$$ 5211406 5133513 5257017 5342217 5517428 5648058 5622308 5754192 5758966 5863950 5999908
4844E999908J84122P0061J99892R3490J22705O3491K33293J81118J46842J46137
$$ 5999908 6184030 6254091 6453983 6547473 6670178 6733669 6966962 7148080 7294922 7441059
4834G441059K00802K23688J00216J02340J51157K41087N667J44413j5406J25553
$$ 7441059 7641861 7865549 7965765 8068105 8219262 8460349 8466016 8610429 8595023 8720576
4824H720576J99553O2591J2153J06282N5766K19415J64687K15632K69048J38220
$$ 8720576 8920129 8982720 8994873 9101155 9156921 9376336 9541023 9756655 10025703 10163923
4814A0163923J64751J42263K44737K84881J74899J91683M0063K18023K42972L35055
$$ 10163923 10328674 10470937 10715674 11000555 11175454 11367137 11407200 11625223 11868195 12203250
4804A2203250L76151K90785L00702K97746L52867K90088K76713L75599M62877
$$ 12203250 12579401 12870186 13170888 13468634 13821501 14111589 14388302 14763901 15226778
4795A5226778L85615L13029L60918N03308N38419M43985L02001M26190L67483
$$ 15226778 15612393 15925422 16286340 16789648 17328067 17772052 18074053 18500243 18867726
4786A8867726K48091L92634K87027L46105K75402J39733K12702J92154J74263
$$ 18867726 19115817 19508451 19795478 20141583 20416985 20556718 20769420 20961574 21135837
4777B1135837R3009K22212P1009J32075K13584K15263K25381K99582L41637K23007
$$ 21135837 21228846 21451058 21522067 21654142 21867726 22082989 22308370 22607952 22949589 23172596
4767B3172596L10880L87754L77416N74935N22232N87487N60226N43045N40314
$$ 23172596 23483476 23871230 24248646 24823581 25345813 25933300 26493526 27036571 27576885
4758B7576885P00684P27458N83131Q82110Q49763Q42871J016769R61665Q83906
$$ 27576885 28277569 29005027 29588158 30470268 31320031 32162902 33179671 34141336 35025242
4749C5025242J000296J092031J178469J348183J505208J627658J733523J913866
$$ 35025242 36025538 37117569 38296038 39644221 41149429 42777087 44510610 46424476
4741D6424476K032389K131095K380088K490546K667299L030689L348756L419005
$$ 46424476 48456865 50587960 52968048 55458594 58125893 61156582 64505338 67924343
4733F7924343L780634L795807L904153L834344L787228L455504K761356K138583
$$ 67924343 71704977 75500784 79404937 83239281 87026509 90482013 93243369 95381952
4725I5381952J222856K72819p90948j783504k468506l170775l521776l704269
$$ 95381952 96604808 96877627 96086679 94303175 91834669 88663894 85142118 81437849
4717H1437849l878552l559957l581406l412998l113282k921591k661010k445755
$$ 81437849 77559297 73999340 70417934 67004936 63891654 60970063 58309053 55863298
4709E5863298k203728j936603j879535j772633j440551j411427j295090j180524
$$ 55863298 53659570 51722967 49843432 48070799 46630248 45218821 43923731 42743207
4701D2743207j048265j006546q28691o83793p44832p28879n97356n14523n62433
$$ 42743207 41694942 40688396 39859705 39175912 38431080 37702201 37104845 36590322 36027889
4692C6027889m86595n17771k92802k11315l07581k06338j44476j94471j58842
$$ 36027889 35541294 35023523 34730721 34519406 34211825 34005487 33861011 33666540 33507698
4683C3507698r2653O1478M8514K5808M8226J04155K80009K27579L17226L94178
$$ 33507698 33415045 33476523 33525037 33550845 33599071 33703226 33983235 34210814 34528040 34922218
4673C4922218M79792L87673M14239N43646N95856N62880O04660Q33461Q22673
$$ 34922218 35402010 35789683 36203922 36747568 37343424 37906304 38510964 39344425 40167098
4664D0167098Q16430Q94843R42347R43479J175000J230795J240357J437605J582722
$$ 40167098 40983528 41878371 42820718 43764197 44939197 46169992 47410349 48847954 50430676
4655E0430676J821532J821019J902863K251991K260125K472684K558164K439593
$$ 50430676 52252208 54073227 55976090 58228081 60488206 62960890 65519054 67958647
4647F7958647K444823K520731K223793K047588J591505J045500O41894P1738o82604
$$ 67958647 70403470 72924201 75147994 77195582 78787087 79832587 80474481 80546219 79863615
4638G9863615j187266j683229k186859k601575k789135k899468k921027k882452
$$ 79863615 78676349 76993120 74806261 72204686 69415551 66516083 63595056 60712604
4630F0712604k850254k712148k640624k449724k310198k289831k054591j844979
$$ 60712604 57862350 55150202 52509578 50059854 47749656 45459825 43405234 41560255
4622D1560255j730301j612941j594280j496169j265072j104814j050028j034681
$$ 41560255 39829954 38217013 36622733 35126564 33861492 32756678 31706650 30671969
4614C0671969r64221q96515p89816p38487q04627o89818n78614m79072n37938
$$ 30671969 29707748 28811233 28021417 27282930 26478303 25788485 25209871 24730799 24192861
4605B4192861m68189m36967n44054m27258l64347m24008k79664l40703m17360
$$ 24192861 23724672 23287705 22743651 22316393 21952046 21528038 21248374 20907671 20490311
4596B0490311m55212k97484l05797m57325l02591k72327m56964l59564k98679
$$ 20490311 20035099 19737615 19431818 18974493 18671902 18399575 17942611 17583047 17284368
4587A7284368l62638k65465l37597k88013l25483k84377j57213j82008j68233
$$ 17284368 16921730 16656265 16318668 16030655 15705172 15420795 15263582 15081574 14913341
4578A4913341k49378k62120l70330j45541j2573j23974j31562j71671q1999r9571
$$ 14913341 14663963 14401843 14031513 13885972 13873399 13749425 13617863 13446192 13364193 13264622
4568A3264622j89582r9704n7418j02432j69211n2479j37050n5414k27497j79171
$$ 13264622 13075040 12975336 12917918 12815486 12646275 12593796 12456746 12401332 12173835 11994664
4558A1994664q4812k00374j92566j20732k34130k14473k85003k33096r7915j83010
$$ 11994664 11909852 11709478 11516912 11396180 11162050 10947577 10662574 10429478 10331563 10148553
4548A0148553j83291k10191o9140p8300k54173j23514k16232j29184o3997k46069
$$ 10148553 9965262 9755071 9685931 9607631 9353458 9229944 9013712 8884528 8820531 8574462
4538H574462j95641j35106r4410l083j12216k22467j94354m5891j50891p1804
$$ 8574462 8378821 8243715 8149305 8146222 8034006 7811539 7617185 7571294 7420403 7348599
4528G348599j09896o8203j31747j43409p3252m4883l9036j12424l3987j09806
$$ 7348599 7238703 7170500 7038753 6895344 6822092 6777209 6738173 6625749 6591762 6481956
4518F481956j5469l4137L4066m848j93233m3125L4460j13299k251n2000J9281
$$ 6481956 6466487 6432350 6466416 6461568 6268335 6225210 6259670 6146371 6144120 6092120 6111401
4507F111401j13551j7822j72452N645O3018m9535j92926J07821r1395m3695N5589
$$ 6111401 5997850 5980028 5807576 5813221 5876239 5826704 5633778 5741599 5650204 5606509 5662098
4496E662098k1183l6011o7192k7142j31038P0085k2814n5689K269j8876O7881
$$ 5662098 5640915 5604904 5537712 5510570 5379532 5449617 5426803 5371114 5373383 5354507 5422388
4485E422388p1998J6127n5855k2532j1953k6407L265l5850j0805l4442n7039J09519
$$ 5422388 5350390 5366517 5310662 5288130 5276177 5249770 5253035 5217185 5206380 5171938 5114899 5224418
4473E224418M5293p484J4423j08101L0542J2932L2798j29256J01173N3732n4873
$$ 5224418 5269711 5262227 5276650 5168549 5199091 5212023 5244821 5115565 5216738 5270470 5215597
4462E215597k6437K9077P5698M3986J35981O168M4884M6975l9007m2498J01942
$$ 5215597 5189160 5218237 5293935 5337921 5473902 5480070 5524954 5571929 5532922 5490424 5592366
4451E592366J21875l4544j5640P705J18561m1660k0748k9204R694L8668r140J3222
$$ 5592366 5714241 5679697 5664057 5671762 5790323 5748663 5727915 5698711 5708405 5747073 5737933 5751155
4439E751155O0707J04329L0348R8165R483J9697N33L0667N3637O8978J02656K8668
$$ 5751155 5811862 5916191 5946539 6044704 6054187 6073884 6074417 6105084 6158721 6227699 6330355 6359023
4427F359023O8095r3132R3659J13728p6983R1825M8747J13616J51840O0286J25984
$$ 6359023 6427118 6333986 6427645 6541373 6464390 6556215 6604962 6718578 6870418 6930704 7056688
4416G056688R096J84568M5249P4065J28809J07730J17750R3899j0356O988J00503
$$ 7056688 7065784 7250352 7295601 7369666 7498475 7606205 7723955 7817854 7807498 7814486 7914989
4405G914989J9670R3948N8109q7004r3037k9717J80056j1032j21477K1761M7037
$$ 7914989 7934659 8028607 8086716 7999712 7906675 7876958 8057014 8045982 7924505 7946266 7993303
4394G993303p0902j0627j0077O046J4306j08166p0426J00462P0102o9063j19968
$$ 7993303 7922401 7911774 7901697 7907743 7922049 7813883 7743457 7843919 7914021 7844958 7724990
4383G724990j352K9398p7864L4151M7543l4884j46716l5173l0323J14922R8112
$$ 7724990 7723638 7753036 7675172 7709323 7756866 7721982 7575266 7540093 7509770 7624692 7722804
4372G722804P1490j02483l5640L4103k5719M7660K3349J1019J40570J00160k583
$$ 7722804 7794294 7691811 7656171 7690274 7664555 7712215 7735564 7746583 7887153 7987313 7984730
4361G984730P0707p0356o2382Q400K49151Q2527n511L6861r6878O9262J63974
$$ 7984730 8055437 7985081 7922699 7931099 8180250 8262777 8257266 8294127 8197249 8266511 8430485
4350H430485O7371N0557k888P7343J34626J01952K6781l7859J79823J20995P1797
$$ 8430485 8497856 8548413 8545525 8622868 8757494 8859446 8886227 8848368 9028191 9149186 9220983
4339I220983o2235J74771M6830K3005P444J41024J22310M2039p7227j8694L7933
$$ 9220983 9158748 9333519 9380349 9403354 9410798 9551822 9674132 9716171 9638944 9620250 9658183
4328I658183M9546J2765J6414J61676r866K0863K11887m9513j34446j6174J6276
$$ 9658183 9707729 9720494 9736908 9898584 9888718 9909581 10121468 10071955 9937509 9921335 9937611
4317I937611M7724P0568L8932J1666J18832P9l3657O6744J30318k2069l942k8709
$$ 9937611 9985335 10055903 10094835 10106501 10225333 10225412 10191755 10258499 10388817 10366748 10362806 10334097
4305A0334097n0410N4717J07149J7343j534N7810J08512M6517l2614k8374J06465
$$ 10334097 10283687 10338404 10445553 10462896 10461362 10519172 10627684 10674201 10641587 10613213 10719678
4294A0719678m8911Q0218k0276J7804J11804o4505j09218p0991L2396O5668o2004
$$ 10719678 10670767 10750985 10730709 10748513 10860317 10795812 10686594 10615603 10647999 10713667 10651663
4283A0651663p8759J4392P244K5711O5694N9174p3583O2838P0943k4513K6010
$$ 10651663 10572904 10587296 10594540 10620251 10685945 10745119 10671536 10734374 10805317 10780804 10806814
4272A0806814J36695N2181p7110J64772P7484l4012M6313J52673J3511J52648
$$ 10806814 10943509 10995690 10918580 11083352 11160836 11126824 11173137 11325810 11339321 11491969
4262A1491969J17572O2523P3762J04203R2733M6495J13229J80503J23693J7421
$$ 11491969 11609541 11672064 11745826 11850029 11942762 11989257 12102486 12282989 12406682 12424103
4252A2424103P7682J22383P2823J91409J43642J67847J61607J13130Q6504J93060
$$ 12424103 12501785 12624168 12696991 12888400 13032042 13199889 13361496 13474626 13561130 13754190
4242A3754190J95160J43200K69040L18687K13586J68252J38170Q3174K13914K7020
$$ 13754190 13949350 14092550 14361590 14680277 14893863 15062115 15200285 15283459 15497373 15524393
4232A5524393J41925K25209K28650R6550K67399J66484J12285J4002M8506R8514
$$ 15524393 15666318 15891527 16120177 16216727 16484126 16650610 16762895 16776897 16825403 16923917
4222A6923917L0195j03639l5921Q9047K04025P5566P5751J01105J57912J89548
$$ 16923917 16954112 16850473 16814552 16903599 17107624 17183190 17258941 17360046 17517958 17707506
4212A7707506K25514K47550J18767J50494J60899K23299K25443K08214J63747
$$ 17707506 17933020 18180570 18299337 18449831 18610730 18834029 19059472 19267686 19431433
4203A9431433J39902K35833K46352K30534K86308K38148L18668L76322M31137
$$ 19431433 19571335 19807168 20053520 20284054 20570362 20808510 21127178 21503500 21934637
4194B1934637K91423M21197L85697L19485M30693N55583M44958L65106M92062
$$ 21934637 22226060 22647257 23032954 23352439 23783132 24338715 24783673 25148779 25640841
4185B5640841L82938L64775M24447M41432M11786L37382K88584M81549M37134
$$ 25640841 26023779 26388554 26813001 27254433 27666219 28003601 28292185 28773734 29210868
4176B9210868M43520M69939M15070M34965K89085N04134M92214M95294N04583
$$ 29210868 29654388 30124327 30539397 30974362 31263447 31767581 32259795 32755089 33259672
4167C3259672M13511M17325M19678M23898L41519L36103L69647K82286K49980
$$ 33259672 33673183 34090508 34510186 34934084 35275603 35611706 35981353 36263639 36513619
4158C6513619L38417K88865L30256M27262K57485J67228K07529J58181K69147
$$ 36513619 36852036 37140901 37471157 37898419 38155904 38323132 38530661 38688842 38957989
4149C8957989K04899K98023J59410J43598J76422K29763J29467K75771K51017
$$ 38957989 39162888 39460911 39620321 39763919 39940341 40170104 40299571 40575342 40826359
4140D0826359K4951L39275J67809J81940K33061J76178J63331L01099K75247L08458
$$ 40826359 40851310 41190585 41358394 41540334 41773395 41949573 42112904 42414003 42689250 42997708
4130D2997708K45587J12954K11669K45694K38829J97117K43703J59834J96886
$$ 42997708 43243295 43356249 43567918 43813612 44052441 44249558 44493261 44653095 44849981
4121D4849981J29689J90350L09537K86248K82653J81535K55358K86865L05652
$$ 44849981 44979670 45170020 45479557 45765805 46048458 46229993 46485351 46772216 47077868
4112D7077868K84359M05514M80421M25752L12641M81851M59896O27136N99032
$$ 47077868 47362227 47767741 48248162 48673914 48986555 49468406 49928302 50555438 51154470
4103E1154470N03744N65052P61487P55953O74103P20042P30746R30489P78042
$$ 51154470 51658214 52223266 52984753 53740706 54414809 55134851 55865597 56796086 57574128
4094E7574128P42391P04101P31086O49675O31051O12636O35870M86565O53303
$$ 57574128 58316519 59020620 59751706 60401381 61032432 61645068 62280938 62767503 63420806
4085F3420806O41974N77043N54611M92279N19151M89252N02168M72001N09087
$$ 63420806 64062780 64639823 65194434 65686713 66205864 66695116 67197284 67669285 68178372
4076F8178372L52417M08352K22197K64066K99679J54762L8297m0962p1828k6093
$$ 68178372 68530789 68939141 69161338 69425404 69725083 69879845 69918142 69877180 69805352 69779259
4066F9779259j65339k25041k53310l00138l12587l58467m71316m00654j85806
$$ 69779259 69613920 69388879 69135569 68835431 68522844 68164377 67693061 67292407 67106601
4057F7106601m45032l96074l15669k89592k29434l99109l60589m04663l60106
$$ 67106601 66661569 66265495 65949826 65660234 65430800 65031691 64671102 64266439 63906333
4048F3906333l52520l92404k43013k61678k24631j54393p6173j66196N3670k2914
$$ 63906333 63553813 63161409 62918396 62656718 62432087 62277694 62201521 62035325 62088995 62066081
4038F2066081R6917K06065N6922J37824q2382j565p475R2476J55940K18543K69093
$$ 62066081 62162998 62369063 62425985 62563809 62481427 62479862 62472387 62564863 62720803 62939346 63208439
4027F3208439M13756O06741N95479O30244P20166Q83606J106853J102479J155994
$$ 63208439 63622195 64228936 64824415 65454659 66174825 67058431 68165284 69267763 70423757
4018G0423757J404310J706981J951360K168397K414203K745970K987947L427517
$$ 70423757 71828067 73535048 75486408 77654805 80069008 82814978 85802925 89230442
4010H9230442M030577M443401M871192N249828N615236N481327N406044M767528
$$ 89230442 93261019 97704420 102575612 107825440 113440676 118922003 124328047 129095575
4002A29095575L450128J723335k94037k221338m052905n345794n935778o160385
$$ 129095575 132545703 134269038 133975001 131753663 127700758 122354964 116419186 110258801
3994A10258801n905747n532499n099382m685875m040696l736198l249580k785253
$$ 110258801 104353054 98820555 93721173 89035298 84994602 81258404 78008824 75223571
3986G5223571k585760k326549j990822j745169j473177j365024j247017r26908
$$ 75223571 72637811 70311262 68320440 66575271 65102094 63737070 62490053 61563145
3978F1563145p92384p08201n37509m16487r7417J6519Q3433J71605J94171K36801
$$ 61563145 60770761 60062560 59525051 59108564 59011147 59027666 59111099 59282704 59476875 59713676
3968E9713676K88115L97340K77628K03663j61348l87795n21305p55896j128633
$$ 59713676 60001791 60399131 60676759 60880422 60719074 60331279 59809974 59054078 57925445
3959E7925445j223842j110161j090286j209931j147982j004948r03491q65418
$$ 57925445 56701603 55591442 54501156 53291225 52143243 51138295 50234804 49369386
3951D9369386r03202r53536p73994p32804p10808p94732p33492p37696n57242
$$ 49369386 48466184 47512648 46738654 46005850 45295042 44500310 43766818 43029122 42471880
3942D2471880n18621n92808m81337m73307l41674l31740l86536l77578k77486
$$ 42471880 41953259 41360451 40879114 40405807 40064133 39732393 39345857 38968279 38690793
3933C8690793k79723k63380j27895k25346j92111k32864j90142o6452k35263p2727
$$ 38690793 38411070 38147690 38019795 37794449 37602338 37369474 37179332 37112880 36877617 36804890
3923C6804890j80508j63647k20452k45112j27521k14109o7328j27562r2759m3772
$$ 36804890 36624382 36460735 36240283 35995171 35867650 35653541 35586213 35458651 35365892 35322120
3913C5322120j47418j11136r8603p5495m1802O0827m855m2882j17186J9705m0646
$$ 35322120 35174702 35063566 34964963 34889468 34847666 34908493 34903638 34860756 34743570 34763275 34722629
3902C4722629L2223k5510k05979j13766j48784j46972k37665m8230j73853j10328
$$ 34722629 34754852 34729342 34523363 34409597 34260813 34113841 33876176 33827946 33654093 33543765
3892C3543765j80204k64201l46393k74890m16256k65272l61497m67838m18675
$$ 33543765 33363561 33099360 32752967 32478077 32061821 31796549 31435052 30967214 30548539
3883C0548539l62381l63484l34669k98178m26569l95372m37328m22864k13402
$$ 30548539 30186158 29822674 29488005 29189827 28763258 28367886 27930558 27507694 27294292
3874B7294292l48627l29702k88590m09300k69576k83726k85211k16044l21390
$$ 27294292 26945665 26615963 26327373 25918073 25648497 25364771 25079560 24863516 24542126
3865B4542126k68107j11630k33599j99300r7356Q141j95105k44538k27007r7133
$$ 24542126 24274019 24162389 23928790 23729490 23632134 23640275 23445170 23200632 22973625 22876492
3855B2876492p4584n6884j45494j91728q2187k6663o8805o308j16421k865k1545
$$ 22876492 22801908 22745024 22599530 22407802 22325615 22298952 22230147 22223839 22107418 22104553 22083008
3844B2083008q0307k43171m7178p4693m6909j9879k3470j13702p4893n0573o6460
$$ 22083008 22002701 21759530 21712352 21637659 21590750 21570871 21547401 21433699 21358806 21308233 21241773
3833B1241773k9438J6963o5192r6742j37029m8228l8602l7924k3285k7717P5655
$$ 21241773 21212335 21229298 21164106 21067364 20930335 20882107 20843505 20805581 20782296 20754579 20830234
3822B0830234r8458n0092l3729K2695m5104J07284n8859j5483K0723k3406o3402
$$ 20830234 20731776 20681684 20647955 20670650 20625546 20732830 20673971 20658488 20679211 20655805 20592403
3811B0592403Q1776L2216n5202o8528J02694k6568L4902J64146l173P1155K12352
$$ 20592403 20674179 20706395 20651193 20582665 20685359 20658791 20693693 20857839 20854666 20925821 21138173
3800B1138173Q8913R4116J62705J01448K47348M7954J03976J47767J00988K59418
$$ 21138173 21227086 21321202 21483907 21585355 21832703 21880657 21984633 22132400 22233388 22492806
3790B2492806J15071J04837J02756L3026L7049J90326J3613O5106L9075J49639
$$ 22492806 22607877 22712714 22815470 22848496 22885545 23075871 23089484 23154590 23193665 23343304
3780B3343304K0794Q4852O9834q7364K11181J8610P2781J64749J5173j05673O0247
$$ 23343304 23364098 23448950 23518784 23431420 23642601 23661211 23733992 23898741 23913914 23808241 23868488
3769B3868488N153m6500O1527Q5199m3212k4095q0748o715j44419j9417j59198
$$ 23868488 23873641 23827141 23888668 23973867 23930655 23906560 23825812 23819097 23674678 23655261 23496063
3758B3496063q9403r6663q9973k53631j13672J726r7300j22910j91162r3518n1750
$$ 23496063 23406660 23309997 23220024 22966393 22852721 22854447 22757147 22634237 22443075 22349557 22297807
3747B2297807K1353o4880k1545n2158j44593k24386j28115k7900j9077p0842q3968
$$ 22297807 22319160 22254280 22232735 22180577 22035984 21811598 21683483 21655583 21636506 21565664 21481696
3736B1481696r8084j96917k23488k84280q2018j66864j93846j58264k32109j85308
$$ 21481696 21383612 21186695 20963207 20678927 20596909 20430045 20236199 20077935 19845826 19660518
3726A9660518j96888q5894j04478k14347j04785n5929k01589o3607j21629m3006
$$ 19660518 19463630 19377736 19273258 19058911 18954126 18898197 18696608 18633001 18511372 18468366
3716A8468366r9286j22168j32190m7644p4268M5078p2663k63923l8143j9892j25065
$$ 18468366 18369080 18246912 18114722 18067078 17992810 18037888 17965225 17701302 17663159 17643267 17518202
3705A7518202k08830m856r5628k39823o6976j81961j09966k19474j79762j79786
$$ 17518202 17309372 17304516 17208888 16969065 16902089 16720128 16610162 16390688 16210926 16031140
3695A6031140k03214k32540j58469j60489j93308j70297j21283L351p0715k00132
$$ 16031140 15827926 15595386 15436917 15276428 15083120 14912823 14791540 14794891 14724176 14524044
3685A4524044j65735j34289j26704j42749q2328o1024j56195q4227n7672j88866
$$ 14524044 14358309 14224020 14097316 13954567 13872239 13811215 13655020 13570793 13513121 13324255
3675A3324255j06278k103k03692j44351j24079k09244r0214j98140j90211j50873
$$ 13324255 13217977 13215874 13012182 12867831 12743752 12534508 12444294 12246154 12055943 11905070
3665A1905070j33853k26011j57784j27905k56459k02781j6715j41265j76194q2495
$$ 11905070 11771217 11545206 11387422 11259517 11003058 10800277 10783562 10642297 10466103 10383608
3655A0383608n2496r7194j03249j91212r9689j02727j61025o6418K3126J1616
$$ 10383608 10331112 10233918 10130669 9939457 9839768 9737041 9576016 9509598 9532724 9544340
3645I544340l5300q8376r8453Q912p8784j0559M4859M844j18994l7044L0831q0321
$$ 9544340 9509040 9420664 9322211 9331123 9252339 9241780 9286639 9291483 9172489 9135445 9166276 9085955
3633I085955q8016M8306N128k2673p2386o4575R9318J41291k1725q355j26501
$$ 9085955 8997939 9046245 9051373 9028700 8956314 8891739 8991057 9132348 9110623 9102268 8975767
3622H975767j09608P8716P83R1453K9155p3233K6964l9745J73474P8805k3588
$$ 8975767 8866159 8944875 8945658 9037111 9066266 8993033 9019997 8980252 9153726 9232531 9208943
3611I208943L8589P4509k9184M8064P9979J51391m9365j14787o2152K2134J5496
$$ 9208943 9247532 9322041 9292857 9340921 9420900 9572291 9522926 9408139 9345987 9368121 9383617
3600I383617J46727m0053J43751R2144N0817J17263R6568L7382O4039J92953J65733
$$ 9383617 9530344 9490291 9634042 9726186 9777003 9894266 9990834 10028216 10092255 10285208 10450941
3589A0450941R9812J97653R5190J00834J80260Q6583J91202J97223K21582L34113
$$ 10450941 10550753 10748406 10843596 10944430 11124690 11211273 11402475 11599698 11821280 12155393
3579A2155393M9717l0737K33639J68051p5579L8033m3415O4381J78101P2896J13305
$$ 12155393 12205110 12174373 12408012 12576063 12500484 12538517 12495102 12559483 12737584 12810480 12923785
3568A2923785J2191J59537J15359R7351m2654K76711J54255K31599K25450J21955
$$ 12923785 12935976 13095513 13210872 13308223 13265569 13542280 13696535 13928134 14153584 14275539
3558A4275539M6320J36274J11415J35854J02980l8236l0901n9786J54404J44085
$$ 14275539 14321859 14458133 14569548 14705402 14808382 14770146 14739245 14679459 14833863 14977948
3548A4977948n7149j6147J35766J09324J34885J42674O5759R0232R3819J78696
$$ 14977948 14920799 14904652 15040418 15149742 15284627 15427301 15493060 15583292 15677111 15855807
3538A5855807K07292J56510J21828J35816Q9822J79799J62628K16781J91944O4570
$$ 15855807 16063099 16219609 16341437 16477253 16567075 16746874 16909502 17126283 17318227 17382797
3528A7382797J59436L62849K54994J62032K35859J72432J78585K26075J87640
$$ 17382797 17542233 17905082 18160076 18322108 18557967 18730399 18908984 19135059 19322699
3519A9322699L40506J98287K75683L44617O4171P3751K36594J96832J91978M5923
$$ 19322699 19663205 19861492 20137175 20481792 20545963 20619714 20856308 21053140 21245118 21291041
3509B1291041l4715K0789J34186K2961l3820K4563K3152M56O9486k7338Q0828
$$ 21291041 21256326 21277115 21411301 21434262 21400442 21425005 21448157 21448613 21518099 21490761 21571589
3498B1571589L1159p574P9727M9065N9071M766n0065n7809P4867J58842J52760
$$ 21571589 21602748 21595174 21674901 21723966 21783037 21787803 21737738 21679929 21754796 21913638 22066398
3487B2066398O9796k0100L7314J05051N7918J8420N3289Q7700j2965J21054n1377
$$ 22066398 22136194 22116094 22153408 22258459 22316377 22334797 22388086 22475786 22462821 22583875 22532498
3476B2532498j37272M4093M793L9469J4562O9391M6220N4509J83689M1916J32178
$$ 22532498 22395226 22439319 22444112 22483581 22498143 22567534 22613754 22668263 22851952 22893868 23026046
3465B3026046K76720J63193j18300p5532l2236l7655j69911j71537j63265p9233
$$ 23026046 23302766 23465959 23347659 23272127 23239891 23202236 23032325 22860788 22697523 22618290
3455B2618290l6888p5892R055J32373J19360K14076J38252K59946K71661L08222
$$ 22618290 22581402 22505510 22514565 22646938 22766298 22980374 23118626 23378572 23650233 23958455
3445B3958455J82908J57104j25655k37955k68458l27564l16174m42934l87320
$$ 23958455 24141363 24298467 24172812 23934857 23666399 23338835 23022661 22579727 22192407
3436B2192407k72967j57002j58149p155q5181j46126k3668N4576k2686K9748J23588
$$ 22192407 21919440 21762438 21604289 21597134 21511953 21365827 21342159 21396735 21374049 21403797 21527385
3425B1527385K45187J15034J47529L21391K97417L48195L21320L01454L11977
$$ 21527385 21772572 21887606 22035135 22356526 22653943 23002138 23323458 23624912 23936889
3416B3936889K95023K37989J86722M1322k4153K2431j75701k4175r0581L9631
$$ 23936889 24231912 24469901 24656623 24697945 24673792 24696223 24520522 24496347 24405766 24445397
3406B4445397N6305o0037K36444J79652K17584K16709J17937P3153L00955J19725
$$ 24445397 24501702 24441665 24678109 24857761 25075345 25292054 25409991 25483144 25784099 25903824
3396B5903824L33161K56152K33205L56149K38867M43309M51311M55159N72329
$$ 25903824 26236985 26493137 26726342 27082491 27321358 27764667 28215978 28671137 29243466
3387B9243466M38006M36357N02048N96108P33148O66410P57831O45293O52188
$$ 29243466 29681472 30117829 30619877 31215985 31949133 32615543 33373374 34018667 34670855
3378C4670855Q38573P31550O94176M38948L64776K79174J42860K90039L88152
$$ 34670855 35509428 36240978 36935154 37374102 37738878 38018052 38160912 38450951 38839103
3369C8839103L11710L56641M94887N00284O98064P27802P40662O37653P71857
$$ 38839103 39150813 39507454 40002341 40502625 41200689 41928491 42669153 43306806 44078663
3360D4078663O63389P03566P00256O49341Q49848Q18522P54850Q60364Q11520
$$ 44078663 44742052 45445618 46145874 46795215 47645063 48463585 49218435 50078799 50890319
3351E0890319P44766R23087R98903Q74385J130753J140452J091298J166713J174950
$$ 50890319 51635085 52558172 53557075 54431460 55562213 56702665 57793963 58960676 60135626
3342F0135626J280785J383895J334211J445464J552562J530815J696898J716533
$$ 60135626 61416411 62800306 64134517 65579981 67132543 68663358 70360256 72076789
3334G2076789J681324J792429J901134K077692K026335K214709K335790K305310
$$ 72076789 73758113 75550542 77451676 79529368 81555703 83770412 86106202 88411512
3326H8411512K455933K675301K762686K890367K888247K998007L304128L367720
$$ 88411512 90867445 93542746 96305432 99195799 102084046 105082053 108386181 111753901
3318A11753901L518875L997575M159994M374944M790277N295931N703526O152920
$$ 111753901 115272776 119270351 123430345 127805289 132595566 137891497 143595023 149747943
3310A49747943O879907P768357Q745967R671460J0664042J1808358J3051073J4495389
$$ 149747943 156627850 164396207 173142174 182813634 193477676 205286034 218337107 232832496
3302B32832496J6154870J7931722J9950969K2075202K4537790K6314045K7060352
$$ 232832496 248987366 266919088 286870057 308945259 333483049 359797094 386857446
3295C86857446K5891940K1742603J4415860M754258n176498j3026993j7207416
$$ 386857446 412749386 434491989 448907849 453662107 448485609 435458616 418251200
3288D18251200j7631516j5794956j2549831q845024n306765j707854J402477M578709
$$ 418251200 400619684 384824728 372274897 363429873 358123108 356415254 357817731 362396440
3280C62396440P663886J0491985J3402967J5824021J7306334J7265207J5068044
$$ 362396440 370060326 380552311 393955278 409779299 427085633 444350840 459418884
3273D59418884J0238947K770104o105905j4365540k0510651k3870352k4757321
$$ 459418884 469657831 472427935 466322030 451956490 431445839 407575487 382818166
3266C82818166k3481732k1558038j9219513j7000405j4965303j3205599j1616098
$$ 382818166 359336434 337778396 318558883 301558478 286593175 273387576 261771478
3259B61771478j0140336q648918p590039o550924n549379m755860m054440l627737
$$ 261771478 251631142 242982224 235392185 228841261 223291882 218536022 214481582 210853845
3251B10853845k831147k506037j972270j655848j180958p48453l01607O7695K91128
$$ 210853845 208022698 205516661 203544391 201888543 200707585 199959132 199657525 199725220 200016348
3242B00016348P27033R92137J353457J802551K309535K871459L467807M108293
$$ 200016348 200743381 201735518 203088975 204891526 207201061 210072520 213540327 217648620
3234B17648620M811850N568891O456302P394087Q548611R701143J1099183J2572960
$$ 217648620 222460470 228029361 234485663 241879750 250428361 260129504 271228687 283801647
3226B83801647J4097842J5963807J7729123J9482550K1140806K2415193K3014349
$$ 283801647 297899489 313863296 331592419 351074969 372215775 394630968 417645317
3219D17645317K2331843K0071007J6526459J1929895O409314n3758p163397j4352207
$$ 417645317 439977160 460048167 476574626 488504521 494913835 494860077 487696680 473344473
3211D73344473k1003429k5485680k7841967k8321709k7333717k5506268k3180129
$$ 473344473 452341044 426855364 399013397 370691688 343357971 317851703 294671574
3204B94671574k0909019j8881344j6969843j5050753j3653639j2271447j0961448
$$ 294671574 273762555 254881211 237911368 222860615 209206976 196935529 185974081
3197A85974081j0041707r207308q309559p605936o899388o156105n866928n235764
$$ 185974081 175932374 166725066 158415507 150809571 143910183 137754078 131887150 126651386
3189A26651386m760230m442935m058182l963202l664257l506127l305202l000148
$$ 126651386 121891156 117448221 113390039 109426837 105762580 102256453 98951251 95951103
3181I5951103k690755k633275k487814k288527k105729k034169j982986j878215
$$ 95951103 93260348 90627073 88139259 85850732 83745003 81710834 79727848 77849633
3173G7849633j914554j679930j437747j585179j479260j435032j395882j303962
$$ 77849633 75935079 74255149 72817402 71232223 69752963 68317931 66922049 65618087
3165F5618087j230174j180656j202661j049062j077961j055541j039781r32966
$$ 65618087 64387913 63207257 62004596 60955534 59877573 58822032 57782251 56849285
3157E6849285r11825r04527r60401r30407q91564r92296r10912q84089p84756
$$ 56849285 55937460 55032933 54072532 53142125 52250561 51258265 50347353 49463264 48678508
3148D8678508p91919q93170p35613p02152n90516n50889l70883n64311o17367
$$ 48678508 47886589 46993419 46257806 45555654 44965138 44414249 44043366 43479055 42861688
3139D2861688n08035l93393m41708n05291l93083m17134k05440k85153l43254
$$ 42861688 42353653 41960260 41518552 41013261 40620178 40203044 39997604 39712451 39369197
3130C9369197l14794m20680m12742m07930k54247l17310m48381k85176k98711
$$ 39369197 39054403 38633723 38220981 37813051 37558804 37241494 36793113 36507937 36209226
3121C6209226k34808j13326k97604k42382o0069l4134j47258r2809j79447J0499
$$ 36209226 35974418 35861092 35563488 35321106 35261037 35226903 35079645 34986836 34807389 34817888
3111C4817888J26793k6220K9673O958J55778J38094J18891Q6464J98405J51179
$$ 34817888 34944681 34918461 34948134 34955092 35110870 35248964 35367855 35454319 35652724 35803903
3101C5803903J81786M2628R1619J70189J35206J40527K84121L09237M42336M75477
$$ 35803903 35985689 36028317 36119936 36290125 36425331 36565858 36849979 37159216 37601552 38077029
3091C8077029N75746O37423P20846R31759R61055R84592J360239J433976J597454
$$ 38077029 38652775 39290198 40011044 40942803 41903858 42888450 44248689 45682665 47280119
3082D7280119J861576J852914K100518K220414K315883K473770K487307K207516
$$ 47280119 49141695 50994609 53095127 55315541 57631424 60105194 62592501 64800017
3074F4800017K025303J632310R41785J75851m95552j024956j715572k225818k428146
$$ 64800017 66825320 68457630 69399415 69575266 69079714 68054758 66339186 64113368 61685222
3065F1685222k692545k595984k489135k425932k404373k287577j864551j737768
$$ 61685222 58992677 56396693 53907558 51481626 49077253 46789676 44925125 43187357
3057D3187357j762645j540239j503052j285217j337602j411617j286776j221697
$$ 43187357 41424712 39884473 38381421 37096204 35758602 34346985 33060209 31838512
3049C1838512j189652j217935j062851j040867r18863p94478p21216q03864o49898
$$ 31838512 30648860 29430925 28368074 27327207 26408344 25613866 24892650 24088786 23438888
3040B3438888n91624o41779n55045n05369m71090l71738k73271l72326m04411
$$ 23438888 22847264 22205485 21650440 21145071 20673981 20302243 20028972 19656646 19252235
3031A9252235l61071m00623k39558l23994k12793k20645l43850k84592k61485
$$ 19252235 18891164 18490541 18250983 17926989 17714196 17493551 17149701 16865109 16603624
3022A6603624k13187k33394k79758k49606j32395k00599q9294k02169j80142n4291
$$ 16603624 16390437 16157043 15877285 15627679 15495284 15294685 15205391 15003222 14823080 14768789
3012A4768789l1513p9591l3323J963p5073m7491m5738k5050j12639j14252p0117
$$ 14768789 14737276 14657685 14624362 14626325 14551252 14503761 14458023 14432973 14320334 14206082 14135965
3001A4135965r4807k16285k25386K175j74644o9909o1012p7993k4315j71294N811
$$ 14135965 14041158 13824873 13599487 13601662 13427018 13357109 13296097 13218104 13193789 13022495 13028306
2990A3028306m1876j85701n7252k1611n5794j31786r8423k6513o5653j75599j07901
$$ 13028306 12986430 12800729 12743477 12721866 12666072 12534286 12435863 12409350 12343697 12168098 12060197
2979A2060197k25147j29875j12018j26469j02339j49277K1724r3415r3825N2026
$$ 12060197 11835050 11705175 11593157 11466688 11364349 11215072 11236796 11143381 11049556 11101582
2969A1101582j67982L5868P3162j25644n2816k4647R577j65950j4054L5324m5123
$$ 11101582 10933600 10969468 11042630 10916986 10864170 10839523 10849100 10683150 10669096 10704420 10659297
2958A0659297l0313r5227o7399N9312O7045n6418k31812M1666J95123m4451j6769
$$ 10659297 10628984 10533757 10466358 10525670 10592715 10536297 10304485 10346151 10541274 10496823 10480054
2947A0480054J14878M5765p1399J0022m3391J51028K02482j3111R5567L4823J4499
$$ 10480054 10594932 10640697 10569298 10579320 10535929 10686957 10889439 10876328 10971895 11006718 11021217
2936A1021217Q8476J58894J65972J17578N0595P4959J98871K02401R5101N5194
$$ 11021217 11109693 11268587 11434559 11552137 11602732 11677691 11876562 12078963 12174064 12229258
2926A2229258K72801N0013J59584K00806r589Q5822K35331K53884J59206J59184
$$ 12229258 12502059 12552072 12711656 12912462 12902873 12988695 13224026 13477910 13637116 13796300
2916A3796300L28714L86596L03606K75918L75939N12818N44383M30142O24093
$$ 13796300 14125014 14511610 14815216 15091134 15467073 15979891 16524274 16954416 17578509
2907A7578509N87926P40199P32448M98945N87936L69296L74296J48692J83231
$$ 17578509 18166435 18906634 19639082 20138027 20725963 21095259 21469555 21618247 21801478
2898B1801478J00400Q2903J03366n4734k1029J49328L4407L5861L6481J01363
$$ 21801478 21901878 21984781 22088147 22033413 22012384 22161712 22196119 22231980 22268461 22369824
2888B2369824J22907K27648K56415L48048L82346M11946M80643P62059Q91778
$$ 22369824 22492731 22720379 22976794 23324842 23707188 24119134 24599777 25361836 26253614
2879B6253614J155637J214919J332490J743381J782553J416569L92769q59301
$$ 26253614 27409251 28624170 29956660 31700041 33482594 34899163 35291932 34432631
2871C4432631j617386j982598k016880j896893j711631j373301j057330r40924
$$ 34432631 32815245 30832647 28815767 26918874 25207243 23833942 22776612 21835688
2863B1835688q09246p13244o10310n06009n13234k95751l15137k36119j88857
$$ 21835688 21026442 20313198 19702888 19196879 18683645 18387894 18072757 17836638 17647781
2854A7647781j38058k16555p2869J15832N7724J31678K50208J74440K35251O9577
$$ 17647781 17509723 17293168 17220299 17336131 17393855 17525533 17775741 17950181 18185432 18255009
2844A8255009J4424j02748k59609m58544o79799o48339p45479p03016o86278o72007
$$ 18255009 18269433 18166685 17907076 17448532 16768733 16120394 15374915 14671899 13985621 13313614
2834A3313614n78991o42665m89764m20215l91085m01704l42687l07342l03293
$$ 13313614 12734623 12091958 11602194 11181979 10790894 10389190 10046503 9739161 9435868
2825I435868k35746k83485k28991k85702j88522j76748k55936j89296j65081k28842
$$ 9435868 9200122 8916637 8687646 8401944 8213422 8036674 7780738 7591442 7426361 7197519
2815G197519k49426j57731q3115m6286r8092j18001j79995j74401O1411o930j37633
$$ 7197519 6948093 6790362 6707247 6660961 6562869 6444868 6264873 6090472 6151883 6144953 6007320
2804F007320j50681j96576J6238N6361l0095k00041q058k9718q4838o7974l3316
$$ 6007320 5856639 5660063 5676301 5732662 5702567 5502526 5494468 5464750 5379912 5311938 5278622
2793E278622j6851j9139r2041n6331j08593p9399k6872k4430j8945L775j6639
$$ 5278622 5261771 5242632 5150591 5094260 4985667 4906268 4879396 4854966 4836021 4839796 4823157
2782D823157p0342k6282j24547o6433p9209P645j16881p672j151j3597L2901j5078
$$ 4823157 4752815 4726533 4601986 4535553 4456344 4463989 4347108 4339436 4338285 4324688 4357589 4342511
2770D342511q6947r9678j03925o3516J7813J13260o9543j27517k0904m4717o1837
$$ 4342511 4255564 4155886 4051961 3988445 4006258 4119518 4049975 3922458 3901554 3856837 3795000
2759C795000K0305r4460m0245M5086j6724M1512J5754k0710K2316n5019j13225
$$ 3795000 3815305 3720845 3680600 3725686 3708962 3750474 3766228 3745518 3767834 3712815 3599590
2748C599590m9629M0206K8291N1780L0729l227m5814n0135n2788j32528Q499L9842
$$ 3599590 3549961 3590167 3618458 3670238 3700967 3697740 3651926 3601791 3549003 3416475 3424974 3464816
2736C464816p1862j5881q2925o5879k0662L0301o246O77j3861j20677k9189J5063
$$ 3464816 3392954 3377073 3294148 3228269 3207607 3237908 3231662 3232339 3218478 3097801 3068612 3083675
2724C083675m6407n0388j5811p364J08465r5753m3188n1700q016k0132M7642k9303
$$ 3083675 3037268 2986880 2971069 2963705 3072170 2976417 2933229 2881529 2873513 2853381 2901023 2871720
2712B871720m9442M750j31201J4502m0189R3873M5588k1404p3885o1817K9082
$$ 2871720 2822278 2827028 2695827 2710329 2670140 2764013 2809601 2788197 2714312 2652495 2681577
2701B681577r1282M9568o8435R2516P128m5283L5005J1395K55j4936o4284j9587
$$ 2681577 2590295 2639863 2571428 2663944 2671072 2625789 2660794 2672189 2672444 2657508 2593224 2573637
2689B573637R4885M9412j73639L0932j1073r8716J89506j6165o4217K3848j38163
$$ 2573637 2668522 2717934 2544295 2575227 2564154 2465438 2654944 2638779 2574562 2598410 2460247
2678B460247l0924n9926m9847J61130l2914j5535O1374r3697p5370j00635O3638
$$ 2460247 2429323 2369397 2319550 2480680 2447766 2432231 2493605 2399908 2324538 2223903 2287541
2667B287541J2275n6333r035P604Q1134l5326p6210k0577P5022p3836o7978J536
$$ 2287541 2299816 2243483 2234448 2242052 2323186 2287860 2211650 2191073 2266095 2192259 2124281 2125817
2655B125817m8099j08538l725m486M7210J9533l5158q2323m3518j14555J13029
$$ 2125817 2077718 1969180 1965455 1960969 2008179 2027712 1992554 1910231 1866713 1752158 1865187
2644A865187o285j59856N2046q2604l4568M5676M7408K246k7229j35458m0200
$$ 1865187 1858902 1699046 1751092 1668488 1633920 1679596 1727004 1729250 1702021 1566563 1526363
2633A526363J02094j16440M9167J0088j7748J11634o5887k402o0217q4889J59916
$$ 1526363 1628457 1512017 1561184 1571272 1553524 1665158 1599271 1596869 1536652 1451763 1611679
2622A611679p9574q4824n294j1300l4108O0937J9056j01746k96j4516l2599j035
$$ 1611679 1532105 1447281 1441987 1430687 1396579 1457516 1476572 1374826 1374530 1360014 1327415 1326380
2610A326380P2441j4106q6364R4865p3406J6391O3028j5083p3491n6782j09609
$$ 1326380 1398821 1384715 1298351 1393216 1319810 1336201 1399229 1384146 1310655 1253873 1144264
2599A144264N6031J27376n0854p3733N817J7740m5118J2101j20549J00644K6825
$$ 1144264 1200295 1327671 1276817 1203084 1208901 1226641 1181523 1193624 1073075 1173719 1200544
2588A200544J205r5672j5227J33370j10114k7902l5756L1970J4932l9812l645
$$ 1200544 1201749 1106077 1090850 1224220 1114106 1086204 1050448 1082418 1097350 1057538 1053893
2577A053893n183K6369k7911L4568r4683q014P0446l3631J9777n4456j29801K6064
$$ 1053893 1048710 1075079 1047168 1081736 987053 979039 1049485 1015854 1035631 981175 851374 877438
2565H77438J9777O2428j8126m0309l2052K0947J0515m2720m1082M0881J5987l2843
$$ 877438 897215 959643 941517 901208 869156 890103 900618 857898 816816 857697 873684 840841
2553H40841o7718P3178k1626j6384J50250j27114J7361J04406j85085m0833Q5004
$$ 840841 773123 846301 824675 808291 958541 831427 848788 953194 768109 727276 812280
2542H12280r0639J3827J53307k9575r5502k5075q1055J32249J89305r1447r6930
$$ 812280 721641 735468 888775 859200 763698 738623 657568 789817 979122 887675 790745
2531G90745o685M8460j43267M3324Q6827m7057j3066j5941j14652l9934K797k8329
$$ 790745 784060 832520 689253 732577 819404 772347 759281 743340 628688 588754 591551 563222
2519E63222M7968Q3428J5487k1711q8127P3813J61687p3691j33387M7320N00j31129
$$ 563222 611190 694618 710105 688394 600267 674080 835767 762076 628689 676009 676509 545380
2507E45380l9372m983n12m6749R4539K711m2098j8252j1387L0756K9845J0819
$$ 545380 506008 501025 500513 453764 548303 551014 508916 490664 479277 510033 539878 550697
2495E50697N5008K9648q4914L9266m2308l8671m6238r5357J43098L1948L2040
$$ 550697 605705 635353 550439 589705 547397 508726 462488 367131 510229 542177 574217
2484E74217L9676M7578q9435o6133K7359M393O2907o2166o5268n6892O660K1112
$$ 574217 613893 661471 572036 505903 533262 537655 600562 538396 473128 416236 422896 444008
2472D44008k1139L3064o7554K7668N6408k0579p460P70L913o81l5581m1425P3487
$$ 444008 422869 455933 388379 416047 472455 451876 444416 445186 449099 448418 412837 371412 444899
2459D44899P1251o3946j21638M3943P7398L1122j8603m9162r050M7092k7541J198
$$ 444899 516150 452204 330566 374509 451907 483029 464426 415264 406214 453306 425765 426963
2447D26963K4934K137q327j17297Q7573j15392p64l4426J39817L3707j10018R4480
$$ 426963 451897 454034 445707 328410 415983 300591 299827 265401 405218 438925 328907 423387
2435D23387O7394m3404r5405p8283l471R170m6810P1614q3240Q9534M9032j00729
$$ 423387 490781 447377 351972 273689 270218 279388 232578 304192 220952 310486 359518 258789
2423B58789N3763J2340O163j38976m0265Q0352P5447p1510J3005R7481l1706L2057
$$ 258789 312552 324892 331055 192079 151814 232166 307613 236103 249108 346589 314883 346940
2411C46940m3478L4449j7968r1198O2386O3242J8555j00367q133N6045o8777K4455
$$ 346940 303462 337911 319943 228745 291131 354373 372928 272561 264428 320473 251696 276151
2399B76151P5172R7333j88474j03857o7687Q0565P6419J4081K833q2469O8589
$$ 276151 351323 448656 260182 156325 88638 169203 245622 259703 262536 180067 248656
2388B48656J1056n3299K2819J14060L1029n5594M9132q1031n2456N6252O923j00736
$$ 248656 259712 206413 229232 343292 374321 318727 367859 286828 234372 290624 297547 196811
2376A96811k4268M4648O6103n8619Q7029M5806q5405L8464J4384j5547n1191o2420
$$ 196811 172543 217191 283294 224675 311704 357510 272105 310569 324953 309406 258215 195795
2364A95795L4009J1183l7912J2266J9072r4115o8579J07946n305J16155k9638
$$ 195795 229804 240987 203075 215341 234413 140298 71719 179665 174360 290515 260877
2353B60877r0529q4428O1761J05941k6890M5594l0171M0904J03508K7460N041
$$ 260877 170348 85920 147681 253622 226732 272326 242155 283059 386567 414027 419068
2342D19068r3741j0774N3452j258o5197K0461P4233r2355m9334m0095k0095j6678
$$ 419068 325327 314553 368005 366747 301550 322011 396244 303889 254555 214460 194365 177687
2330A77687K1721J25422k5385n8774J6714l6909J7551k270K9278o2162r3283K672
$$ 177687 199408 324830 299445 240671 257385 220476 238027 235757 265035 202873 109590 112262
2318A12262k6648K4212L1057l7621P6356O9283m3102r5789q4823L8254J04051
$$ 112262 85614 109826 140883 103262 179618 248901 205799 110010 25187 63441 167492
2307A67492K5356K2821n5624n5098O7358Q5427k0572j05077M3674K8068o2207
$$ 167492 192848 215669 160045 104947 172305 257732 237160 132083 175757 203825 141618
2296A41618J5964O5465j4680o5918J9910Q5414p0613N1784k5573j3145l0068K3190
$$ 141618 157582 223047 208367 142449 162359 247773 177160 228944 203371 190226 160158 183348
2284A83348K8281K2849J7565j7030j21207M1081M969M545R0150j01170n7139M0648
$$ 183348 211629 234478 252043 235013 113806 154887 159856 164401 254551 153381 96242 136890
2272A36890L7598P2846j02614q0718L0481Q2433J9543O3281L2365k6792j2987
$$ 136890 174488 247334 144720 64002 94483 176916 196459 259740 292105 265313 252326
2261B52326M9982R3182k27926N4999K24n2086r3999M2129m904N5769O9131r4203
$$ 252326 302308 395490 167564 222563 222787 170701 76702 118831 113927 169696 238827 144624
2249A44624o0089Q5532j2935J01277m6537K346N8949q6147K8441q8106k9311l3919
$$ 144624 84535 170067 157132 258409 211872 214218 273167 187020 215461 127355 98044 64125
2237F4125J12139P5386R3546o5378p3638l6323m1814N6726L1663Q8565L507p1630
$$ 64125 176264 251650 345196 279818 206180 169857 128043 184769 216432 304997 308504 236874
2225B36874n5582O5050K4602j3877j6812M816l8938K0434P2325M0111m4921n046
$$ 236874 181292 246342 270944 257067 240255 245071 206133 226567 298892 339003 294082 289036
2213B89036j33580K8132N818q752n3947N1400J20512l5733k0886N0815l4898k122
$$ 289036 155456 183588 189406 180654 126707 178107 298619 262886 242000 292815 257917 255795
2201B55795J7255K1361J8029k816J0556R7629L5936n7463j6964j26459P6792k8591
$$ 255795 273050 294411 312440 309624 320180 417809 453745 396282 379318 252859 329651 301060
2189C01060P8762k7388j18512j6368P1246L6268m0804m6653N2493N9456J3513
$$ 301060 379822 352434 233922 217554 288800 325068 284264 237611 290104 349560 363073
2178C63073P0602K5858j06717j6677L3759L7855m2200Q0883O8486k382j7423N8623
$$ 363073 433675 459533 352816 336139 369898 407753 365553 446436 514922 512540 495117 553740
2166E53740j8072M3964j4962r5977l0858K2800P1300k4869q6999m9864R7204J16365
$$ 553740 535668 579632 564670 468693 437835 460635 531935 507066 420067 370203 467407 583772
2154E83772j14519J9695L2744L070o449J36183K8814Q4905K8040m1377O0650j13678
$$ 583772 469253 488948 521692 524762 518313 654496 683310 768215 796255 754878 815528 701850
2142G01850k5408l0188J2517R9620l2049N6188J0155J1187o0030K6861O3235l7552
$$ 701850 676442 646254 658771 758391 726342 782530 792685 803872 743842 770703 833938 796386
2130G96386P5612J15489Q0818r2586q686J58026m0238k9955P6257j33561Q8496
$$ 796386 871998 987487 1068305 975719 967033 1125059 1084821 1054866 1131123 997562 1086058
2119A086058J20061q055k2786J14029K75K2069J37308R4277M9139J30520M1447
$$ 1086058 1206119 1198064 1175278 1289307 1289582 1311651 1448959 1543236 1592375 1722895 1764342
2108A764342J07943R5425j1163O1302J05669K2056P9334J33533R4619R2132J46052
$$ 1764342 1872285 1967710 1956547 2017849 2123518 2145574 2224908 2358441 2453060 2545192 2691244
2097B691244O9212J02187J82374L25867J59827K01508M31865L01293K11508L86446
$$ 2691244 2760456 2862643 3045017 3370884 3530711 3732219 4164084 4465377 4676885 5063331
2087E063331N23528P05037P50512J081256J401773J626427J986315K657082L619897
$$ 5063331 5586859 6291896 7042408 8123664 9525437 11151864 13138179 15795261 19415158
2078A9415158M092601K588391j006511l766012m255008l624390k536278j775230
$$ 19415158 23507759 26096150 25089639 21323627 17068619 13444229 10907951 9132721
2070I132721j316153j016130q25534n68735n82265l79327k48575k57019k22986
$$ 9132721 7816568 6800438 5974904 5406169 4823904 4444577 4196002 3938983 3715997
2061C715997l09153k82622k51713k91792j74893j76696k26132j50589j7448n2318
$$ 3715997 3406844 3124222 2872509 2580717 2405824 2229128 2002996 1852407 1834959 1782641
2051A782641j34444j57792j7478j6142n4146j42345k06630K2733R618n9495q4197
$$ 1782641 1648197 1490405 1472927 1456785 1402639 1260294 1053664 1076397 1086015 1026520 942323
2040I42323p0327L5468K6839l2549p4979l7584q2008O860R8543q9039q2339n7331
$$ 942323 871996 907464 934303 901754 826775 789191 707183 714043 812586 723547 641208 583877
2028E83877n7841k666L6268O4863M224j43924M2543n2307j03920K9560k7082L8901
$$ 583877 526036 523370 559638 624501 628725 484801 527344 475037 371117 400677 373595 412496
2016D12496m7854N9350P2125k1158l2077p0988o9205L383l6783q939N2337l9256
$$ 412496 364642 423992 496117 474959 442882 371894 302689 306072 269289 260350 312687 273431
2004B73431K3856Q084p4870O7465k6502j19490L4263K3455L6027q3859O678K4845
$$ 273431 297287 305371 230501 297966 271464 151974 186237 209692 245719 161860 168538 193383
1992A93383m6232J12461j3884L2178K7211l813j10561K808L132L4616q4488k1438
$$ 193383 147151 259612 245728 277906 305117 301304 190743 193551 196683 231299 146811 125373
1980A25373K8006J8522L1117O8832K9359M7082j7315l0838M589q2565o2476l3701
$$ 125373 153379 171901 203018 271850 301209 348291 330976 300138 304727 222162 159686 125985
1968A25985m9570L1989p0030O9035P8847K0679k9291O384r8409J2238J06695j09002
$$ 125985 76415 108404 38374 107409 186256 206935 177644 184028 85619 97857 204552 95550
1956I5550Q0091O7818j36474j2520P122o9781L4005M110j4434k1442J0149j5173
$$ 95550 175641 243459 106985 94465 101587 31806 65811 69921 55487 34045 44194 29021
1944B9021P6935o1160K0128M2098K7249p9052m2681k7160j07106J24028J17223
$$ 29021 105956 44796 64924 107022 134271 55219 12538 -14622 -121728 2300 119523
1933A19523r6248m4252j5918N6057Q5772P3972j23333n0302M7700O3140j36766
$$ 119523 23275 -20977 -36895 19162 104934 178906 55573 5271 52971 116111 -20655
1922b0655l8082J23776O9157J9942n1686q5490J7539O9248j8532N9321L059p9060
$$ -20655 -58737 65039 134196 154138 102452 16962 34501 103749 85217 144538 147597 68537
1910F8537L971p8102m0769K1581K7914J0727j3880N5956k2467k7102r0312m9521
$$ 68537 72508 -5594 -46363 -24782 3132 13859 -21 55935 33468 6366 -83946 -133467
1898a33467P5644R7160k1750n3685k0730J5682N1247L1307n4152P756J5665o028
$$ -133467 -57823 39337 17587 -36098 -56828 -41146 10101 41408 -12744 -4988 10677 4649
1886D649P2805K2116l3609O1880r0139q2740J15711K9991n6499M0828r9710j02463
$$ 4649 77454 99570 65961 127841 37702 -45038 70673 100664 44165 84993 -14717 -117180
1874a17180O4676N4817k1089O114J969M5044P4493o1472Q4310k7455j45878q6909
$$ -117180 -52504 2313 -18776 -12662 -10693 34351 108844 47372 131682 104227 -41651 -128560
1862a28560M4330P6536J5546j860n6697J07594k9729L7312M0376m7171k2984q420
$$ -128560 -84230 -7694 7852 5992 -50705 56889 27160 64472 104848 57677 34693 26273
1850B6273L2235j48639N2594J13568O4358o8452l5333M2741l4022J25167q0141
$$ 26273 58508 -90131 -37537 76031 140389 71937 36604 79345 45323 170490 90349
1839I0349q8196N8622j9722o2714j14614J0997M7400P2911O0219q4892k98P280
$$ 90349 2153 60775 41053 -21661 -136275 -125278 -77878 -4967 55252 -29640 -29938 -22658
1827b2658m0171R3344K9160r6358K6316J29684p1549q112J9767J1169k8216J451
$$ -22658 -62829 30515 59675 -36683 -10367 119317 47768 39656 59423 70592 42376 43827
1815D3827K7914P8108j18852m4328M9078P0597r5765J04102m643q5362P4255k6402
$$ 43827 71741 149849 30997 -13331 35747 106344 10579 114681 110038 24676 98931 72529
1803G2529m500m7675L6582P6220l0574k6539N9047l0639j36872M9746J3085J1404
$$ 72529 68029 20354 56936 133156 102582 76043 135090 104451 -32421 17325 30410 41814
1791D1814m9302r125N6982r8676J16993p8379L3408J7175q3701n262K3287j07782
$$ 41814 -7488 -16613 40369 -58307 58686 -19693 13715 30890 -52811 -58073 -34786 -142568
1779a42568N5086J10356n8608k7122J10862l3748O3076l9535l9816L756N827L889
$$ -142568 -87482 22874 -35734 -62856 48006 14258 77334 37799 -2017 1739 7566 11455
1767A1455N9292j59173p7203Q7895q482L47N1548O7455J5249J4607k5979o6732
$$ 11455 70747 -88426 -165629 -77734 -86216 -85869 -34321 33134 48383 62990 37011 -29721
1755b9721L68L4369N5140n1061k8872L391n0131m7266j1035k451J08468L679k635
$$ -29721 -29353 5016 60156 9095 -19777 -16386 -66517 -113783 -124818 -127269 -18801 -15122 -17757
1742a7757k0067l3245O5026j0807l9406n4173q310Q161K4625J19082k0785j15291
$$ -17757 -37824 -71069 -6043 -16850 -56256 -110429 -118739 -110578 -85953 33129 12344 -102947
1730a02947m8222N1298K1475K7773j1212q3568L1673L3171K0666J1660l9774r0619
$$ -102947 -151169 -99871 -78396 -50623 -61835 -145403 -113730 -80559 -59893 -48233 -88007 -178626
1718a78626J24176J761n4660l7457M7039M2815P3024O4031L8892j82196N7646
$$ -178626 -54450 -52689 -107349 -144806 -97767 -54952 18072 82103 120995 -61201 -3555
1707c555P7315p1465L4040N9300r2521j2400L5347k1285L6865r6432k1693r525
$$ -3555 73760 2295 36335 95635 3114 -9286 26061 4776 41641 -54791 -76484 -86009
1695h6009k8915O5977l1308j06385M8642P294r942J6900o2819J10002n0419r7106
$$ -86009 -114924 -48947 -80255 -186640 -137998 -130704 -140646 -123746 -186565 -76563 -126982 -224088
1683b24088M1546m5016m048J52036K6024q2455K5060J39326R1105j09726J070
$$ -224088 -182542 -227558 -231606 -79570 -53546 -136001 -110941 28385 119490 9764 10834
1672A0834k224r5379P6130k8880l0460j00O6900K8612q9696p017m2553m93O6649
$$ 10834 8610 -86769 -10639 -39519 -69979 -70079 -3179 25433 -64263 -71280 -113833 -114326 -47677
1659d7677j1557o906j32129L733P3093J65321l924n6444K4137j0905p4631O9035
$$ -47677 -59234 -66140 -198269 -194536 -121443 43878 39954 -16490 7647 -3258 -77889 -8854
1647h854m477q4963O4281m2361l822k2565J91603j5586m9110K7073r0644J5270
$$ -8854 -13331 -98294 -34013 -76374 -80196 -102761 88842 73256 24146 51219 -39425 -24155
1635b4155L7761J6308L225r9177R5829j07705J521N105l8655M215K1413M669Q0372
$$ -24155 13606 29914 33139 -66038 29791 -77914 -76393 -71288 -109943 -105728 -84315 -79646 726
1622G26j2303p820n4700j9749l2525q8036r806P0419K6052O1032L7933k7272n9741
$$ 726 -11577 -19397 -74097 -93846 -126371 -214407 -224213 -153794 -127742 -66710 -28777 -56049 -115790
1609a15790M7123m2368o331P4283l0401o699J2311K0059Q513K5144o0294P1722
$$ -115790 -68667 -111035 -117366 -43083 -73484 -80183 -67872 -47813 -39300 -14156 -74450 -2728
1597b728L0169j9189l4340p6725l6935J17971j4084o05l9173J37129J8735j07800
$$ -2728 27441 8252 -26088 -102813 -139748 -21777 -35861 -36466 -75639 61490 80225 -27575
1585b7575j28927J28937k8401K5919P0528k3301o1958k2063M9035O1781M8390
$$ -27575 -156502 -27565 -55966 -30047 40481 17180 -44778 -66841 -17806 43975 92365
1574I2365q4224M0555n3367o509n4684j51821P685P2178n246J22086k415j38158
$$ 92365 8141 48696 -4671 -11180 -65864 -217685 -210000 -137822 -143068 -20982 -23397 -161555
1562a61555N6589N0076K6672k1627j9255O3840k4206P6114l7745o1768M6993K9768
$$ -161555 -104966 -54890 -28218 -49845 -69100 -5260 -29466 46648 8903 -52865 -5872 23896
1550B3896k0494k059q5255j8338o7477k3249J20844L7528O7508L9200k6831n4644
$$ 23896 3402 1343 -83912 -102250 -169727 -192976 -72132 -34604 32904 72104 45273 -9371
1538i371l0986q74K2998M6647k2722K754M160j12364n3847K9123K2145J698n645
$$ -9371 -40357 -41231 -18233 28414 5692 8446 12606 -99758 -153605 -124482 -102337 -100639 -106284
1525a06284p2n8234L3863J89094j07566P8149r855j44755k365k3884O7532m467
$$ -106284 -106356 -164590 -130727 58367 -49199 28950 19095 -125660 -128025 -151909 -84377 -88844
1513h8844P7044l9890o4352O8334q846k7994O039m62l34p8475l727R4051R5132
$$ -88844 -11800 -51690 -116042 -47708 -56554 -84548 -78509 -78971 -79305 -157780 -161507 -67456 27676
1500B7676j25246r4323j1613M7012K044J04333m6641M1238n531p2734Q4486q4614
$$ 27676 -97570 -191893 -203506 -156494 -154450 -50117 -96758 -55520 -61051 -133785 -49299 -133913
1488a33913j5796J9083M266Q096P382M9936k879p998O9348j1024o6606M0729N092
$$ -133913 -149709 -130626 -126360 -118264 -110882 -60946 -63825 -71823 -2475 -13499 -80105 -39376 -34284
1475c4284o9246K397l8687P0574l740J8020l0727q2046j785l1092N1739L9710
$$ -34284 -103530 -101133 -139820 -69246 -72986 -54966 -85693 -167739 -169524 -200616 -148877 -109167
1463a09167p3763J7065J18067k6510j28616Q9133P3008L5618k2061o5375k2178
$$ -109167 -182930 -165865 -47798 -74308 -202924 -113791 -40783 -5165 -27226 -92601 -114779
1452a14779J05924M525m6547K2272R9720l6687q3517k4107N7511n8616m5640K7182
$$ -114779 -8855 -4330 -50877 -28605 71115 34428 -49089 -73196 -15685 -74301 -119941 -92759
1440i2759n6669o664L3059Q7014N5661r76j40674M7117L013K2812n7783p0994
$$ -92759 -149428 -156092 -123033 -36019 19642 18666 -122008 -74891 -71878 -49066 -106849 -177843
1428a77843l74J05211R5244n2693k0007J5549K495m0368k7890n7628P5834Q3374
$$ -177843 -178217 -73006 22238 -30455 -50462 -34913 -32418 -72786 -100676 -158304 -82470 904
1416I04K433p1172Q7366j1258R472j7083o7908k3980l4928J05342n9291l8651
$$ 904 3337 -67835 19531 8273 17745 662 -67246 -91226 -126154 -20812 -80103 -118754
1404a18754q5422J69630R0102r2240q3088P505J15065j3904o1502N4760j00285
$$ -118754 -204176 -34546 55556 -36684 -119772 -112267 2798 -11106 -72608 -17848 -118133
1393a18133O9260J2516O523K7879j03925K1794N0049k3983j8980M4575M575j5366
$$ -118133 -48873 -36357 -29834 -1955 -105880 -84086 -34037 -58020 -77000 -32425 -27850 -43216
1381d3216O0965N1933l6727n5702k3163R3835O0666j14545j08331M4979M0759
$$ -43216 17749 69682 32955 -22747 -45910 47925 108591 -5954 -114285 -69306 -28547
1370b8547n1217m0258Q0386p236j0263j13212j3383m1852M1085J57315k9817j32265
$$ -28547 -79764 -120022 -39636 -46872 -57135 -170347 -183730 -225582 -184497 -27182 -56999 -189264
1358a89264L9414J07068K7461J4411l7871L5577L3324r8081j9670l8592M8772
$$ -189264 -149850 -42782 -15321 -910 -38781 -3204 30120 -67961 -87631 -126223 -77451
1347g7451M2061m7894m6116l8258J8705j487r4338J10658R2771O2197p8463N5560
$$ -77451 -35390 -83284 -129400 -167658 -148953 -150440 -244778 -134120 -41349 20848 -57615 -2055
1335b055Q3715j09913r9730M7885N4466L5702q4374R9147O2600o7400j299O986
$$ -2055 81660 -28253 -127983 -80098 -25632 10070 -74304 24843 87443 20043 18744 25730
1323B5730n5701L3382N4900p5786R054L8653p152j3308m4071j0437L0327o0427
$$ 25730 -29971 3411 58311 -17475 -8421 30232 23080 9772 -34299 -44736 -14409 -74836
1311g4836k9707L723J16661K8356j5687m3888q7659n6836P3506m2295R3406k2594
$$ -74836 -104543 -100820 15841 44197 28510 -15378 -103037 -159873 -86367 -128662 -35256 -57850
1299e7850m8213M6190J7810J4901m0958q256M5943l3017Q918L9762P6926p9556
$$ -57850 -106063 -59873 -42063 -27162 -68120 -76376 -30433 -63450 -54532 -14770 62156 -17400
1287a7400n837J439M3813N6003n5465l2869l0307n0751R9781m0419R9959K323
$$ -17400 -23237 -21798 22015 78018 22553 -10316 -40623 -91374 8407 -32012 67947 70270
1275G0270r8408J5844O0500o2112q5735j9193J31419k1809o7814N5611k8558J00039
$$ 70270 -28138 -12294 48206 -13906 -99641 -118834 12585 -9224 -77038 -21427 -49985 50054
1263E0054J1022L9694r0839k4157q0187l2964J1070m5654J70439P4268j24317
$$ 50054 61076 100770 9931 -14226 -94413 -127377 -116307 -161961 8478 82746 -41571
1252d1571P4758j2894j60482L4801P9845n3815M832m6260P415J12982Q7591N0868
$$ -41571 33187 20293 -140189 -105388 -25543 -79358 -74526 -120786 -113371 -389 87202 138070
1240A38070j21995r8985K2910o0587L5600O3360N5218P6620j52853q493r9723
$$ 138070 16075 -82910 -60000 -120587 -84987 -21627 33591 110211 -42642 -51135 -150858
1229a50858k3875J39895M8976O7201n3652M7803k8012p8270l3273m3389l7453
$$ -150858 -174733 -34838 14138 81339 27687 75490 47478 -30792 -64065 -107454 -144907
1218a44907N3721j3544o1718O5992q8003M6616O2387r176Q4949L7524q4040M355
$$ -144907 -91186 -104730 -166448 -100456 -188459 -141843 -79456 -88632 -3683 33841 -50199 -45844
1206d5844m5029n8323j5698J4322n353l4868N3259J18290k0223K6161R973j9525
$$ -45844 -90873 -149196 -164894 -150572 -155925 -190793 -137534 -19244 -39467 -13306 -3333 -22858
1194b2858L1700J00650k9878r7856M8992n8117N0297m7572r7894j7653J50348
$$ -22858 8842 109492 79614 -18242 30750 -27367 22930 -24642 -122536 -140189 10159
1183A0159n9123R0229l0032k5773q5927l6089P884J1116O8697J8477n7613O5230
$$ 10159 -48964 41265 11233 -14540 -100467 -136556 -128672 -117556 -48859 -30382 -87995 -22765
1171b2765L2003j28755l2041J09938Q615k0088L8670k4896L465j4791l1512O3471
$$ -22765 9238 -119517 -151558 -41620 -33005 -53093 -14423 -39319 -35854 -50645 -82157 -18686
1159a8686Q729n1725J6367J50033j8431J9557k6640O9721m8925o1794j664p9212
$$ -18686 -9957 -61682 -45315 104718 86287 105844 79204 148925 100000 38206 36542 -42670
1147d2670P202r022j2759q7167P8574l9561P464K6949K1458N3298k4473r8319
$$ -42670 -35468 -44490 -57249 -144416 -65842 -105403 -97939 -70990 -49532 3766 -20707 -119026
1135a19026k2153R4734O9758L7958k0375j24600N0875m0153k4561L910N5787l6694
$$ -119026 -141179 -46445 23313 61271 40896 -83704 -32829 -72982 -97543 -93633 -37846 -74540
1123g4540m6735O5630Q8598l8701j02811J27499L0329l0507j5857j6779m4611
$$ -74540 -121275 -55645 32953 -5748 -108559 18940 49269 18762 2905 -13874 -58485
1112e8485k4516P4551M3393N6612n9616P7448j06232m5641J2760n523J04289O3056
$$ -58485 -83001 -8450 34943 91555 31939 109387 3155 -42486 -29726 -35249 69040 132096
1100A32096r9568p9515J8194n475J98m4960K4413R0414r8905m1942J27547p197
$$ 132096 32528 -46987 -28793 -34268 -34070 -79030 -54617 35797 -63108 -105050 22497 15300
1088A5300n7614m5057N3497K7339p1827L5361l5286L3268j514N0781q1854J04090
$$ 15300 -42314 -87371 -33874 -6535 -78362 -43001 -78287 -45019 -46533 4248 -77606 26484
1076B6484J18525o9322p8914j23514N8910j908j6909l2160J39296R5999j09798
$$ 26484 145009 75687 -3227 -126741 -67831 -69739 -86648 -118808 20488 116487 6689
1065F689n5092n6640M5733O6463n5325n6900R3490k2236m6675O9173j10871J3320
$$ 6689 -48403 -105043 -59310 7153 -48172 -105072 -11582 -33818 -80493 -11320 -122191 -108871
1053a08871P7586l974n807K23K5756p4218l8456N9450k31o542M75J37596p8385
$$ -108871 -31285 -35259 -41066 -40843 -15087 -89305 -127761 -68311 -68542 -75084 -74609 62987 -15398
1040a5398N8114P6260r3291l2715j2277m312O0528R752j8861J18254K2606j51307
$$ -15398 42716 118976 25685 -7030 -19307 -23619 36909 46661 27800 146054 168660 17353
1028A7353j14202K4501j5454K3883L9534J4567n91L8420l0492m7055J0852K4497
$$ 17353 -96849 -72348 -87802 -63919 -24385 -9818 -10409 28011 -2481 -49536 -38684 -14187
1016a4187L663J3443N3583l5745k1389J08975r4382p5941J43478r9560P4173j3960
$$ -14187 -10524 2919 56502 20757 -632 108343 13961 -61980 81498 -18062 56111 42151
1004D2151p9211J0926M9625M2218q4670o9748j5188Q7533N9252J2106L2349L793
$$ 42151 -37060 -26134 23491 65709 -18961 -88709 -103897 -16364 42888 54994 87343 91136
992I1136j59008M2367j8985k451l2494J2908K8442o6561N2180O167l422P1411
$$ 91136 -67872 -25505 -44490 -46941 -79435 -66527 -38085 -104646 -52466 -46299 -49721 21690
980B1690j6777j28259N9616M6679O3095j7964L6383m721q3235r5050l4037j2810
$$ 21690 4913 -123346 -63730 -17051 46044 28080 64463 59742 -23493 -118543 -152580 -165390
968a65390N6829R956l4682k9956K8717Q7772l0624K8431J3784l119Q6917o4147
$$ -165390 -108561 -98605 -133287 -163243 -134526 -46754 -77378 -48947 -35163 -38282 48635 -15512
956a5512K4451P9284j9059j60367j8518j5306N1234L6804N9488O6387O9024p517
$$ -15512 8939 88223 69164 -91203 -109721 -125027 -73793 -36989 22499 88886 157910 150393
944A50393o559J1559o0188j21133m890j0408j11044Q8564M1790N352l6029Q8383
$$ 150393 143834 155393 95205 -25928 -30818 -41226 -152270 -63706 -21916 -16564 -52593 35790
932C5790k2910K1832k6378m8460L8741J4050L5481q7529r5534J56514K6331j01896
$$ 35790 12880 34712 8334 -40126 -1385 12665 48146 -39383 -134917 21597 47928 -53968
920e3968p4930P422L5114J18010p3837j6271J51529J1988j1670o0929j51331J45472
$$ -53968 -128898 -121476 -86362 31648 -42189 -58460 93069 105057 93387 32458 -118873 26599
908B6599L2739o9502k4156j01140Q3732J23518l4899q7574L3883K0564r4333j511
$$ 26599 59338 -10164 -34320 -135460 -51728 71790 36891 -50683 -16800 3764 -90569 -92080
896i2080J36250m6382q4217p1555j2980J65859P5409j75262l4038J00188K0642
$$ -92080 44170 -2212 -86429 -157984 -170964 -5105 70304 -104958 -138996 -38808 -18166
885a8166J4431P3673q8727K7231Q579o6512K7125p2703Q3406N2872J136m5933
$$ -18166 -3735 69938 -18789 8442 17021 -49491 -22366 -95069 -11663 41209 42345 -3588
873c588O0283J3563n8833M700k4801j7158J7987k35l4649j62471P5671J12084
$$ -3588 56695 70258 11425 16125 -8676 -25834 -7847 -8082 -42731 -205202 -129531 -17447
861a7447R9349q8855o4911Q8476o7943O4698O061M8098q260r2543M3709M8529
$$ -17447 81902 -6953 -71864 16612 -51331 13367 19428 67526 59266 -33277 10432 58961
849E8961j8996l8250n9890M999R1225j02507n358M0868P0306M7726p0349J2586
$$ 58961 39965 1715 -58175 -53176 38049 -64458 -69816 -28948 41358 89084 18735 31321
837C1321L665o3316K6841j7629p7906L8392m4538K1527Q7326o7123n0834K6022
$$ 31321 34986 -28330 -1489 -19118 -97024 -58632 -103170 -81643 5683 -61440 -112274 -86252
825h6252O3633J15617N3993q1455m6354J05723N3682o0652j50042l1856n738M1508
$$ -86252 -22619 92998 146991 65536 19182 124905 178587 117935 -32107 -63963 -69701 -28193
813b8193J128K0741M469l0169Q2468o4271k8656M8316k9346l4295M1996J05686
$$ -28193 -27065 -6324 -1855 -32024 50444 -13827 -42483 5833 -23513 -57808 -15812 89874
801H9874j04365n5148k032P0397M5751L6581n8346m7553Q2312P1344r0955j2688
$$ 89874 -14491 -69639 -71671 -1274 44477 81058 22712 -24841 57471 128815 37860 25172
789B5172J1731r6510Q3709L4432j11367l2495N2213Q3427K8196k9688n4429m9235
$$ 25172 36903 -59607 24102 58534 -52833 -85328 -33115 50312 78508 48820 -5609 -54844
777e4844M8714k2661k3377M9991M6373P1193M4670M249p8599k6594n1745o2093
$$ -54844 -6130 -28791 -52168 -2177 44196 115389 160059 164308 85709 59115 7370 -54723
765e4723O7470J44347o5991n2231j00388Q5120j6427K1956l2697K7653Q5261L2429
$$ -54723 12747 157094 91103 38872 -61516 23604 7177 29133 -3564 24089 109350 141779
753A41779L4216j08148M428M0558j31137r0296J03054K1566K604R241K6812k10670
$$ 141779 175995 67847 72275 112833 -18304 -108600 -5546 16020 18624 27865 54677 -155993
741a55993J04229O3304q0972n5855M3425J654N1210N1447p4113O4402N7394R4525
$$ -155993 -51764 11540 -69432 -125287 -81862 -80208 -28998 22449 -51664 12738 70132 164657
729A64657k0009j06948k0723k7946J5167J3723P961J8815j53655n9638Q2637Q1937
$$ 164657 144648 37700 16977 -10969 4198 17921 25882 44697 -108958 -168596 -85959 -4022
717d022r348n8698K0485n0160J46875q023o199O8693p1260l1697P0401j4700m4913
$$ -4022 -13370 -72068 -51583 -101743 45132 37109 30910 99603 28343 -3354 67047 52347 7434
704G434N0237J07558n9050j1868j9128l6924m0204j2547Q2327k6485P0992o7765
$$ 7434 57671 165229 106179 94311 75183 38259 -1945 -14492 67835 41350 112342 44577
692D4577k2611L9548j34507P7160m1701m0967K6631M3913J04497m1808j05428
$$ 44577 21966 61514 -72993 4167 -37534 -78501 -51870 -7957 96540 54732 -50696
681e0696M4178M6316P6634j5731N131j4528n6771Q359o749M8441l4045k7144K8625
$$ -50696 -6518 39798 116432 100701 105832 91304 34533 42892 36143 84584 50539 23395 52020
668E2020l4128N8860j2855J4059O3489m1823O289l3755l3378o5137J3487L7335
$$ 52020 17892 76752 63897 77956 141445 99622 105911 72156 38778 -26359 -12872 24463
656B4463j0660o085n2519M8654L4262k4442p1292M3412J35023k2958k1129j31820
$$ 24463 13803 7718 -44801 3853 38115 13673 -57619 -14207 120816 97858 76729 -55091
644e5091k2805Q2896M0438j27426K056N9304J2672m1281J07846o0280m7688J8023
$$ -55091 -77896 5000 45438 -81988 -79932 -20628 -7956 -49237 58609 -1671 -49359 -31336
632c1336O0517n3146K4001M4798Q148O4267o2041r377M2545j12584r2631M5725
$$ -31336 29181 -23965 36 44834 52982 117249 55208 45831 88376 -24208 -116839 -71114
620g1114N6605l153J2586n6778k854P0184P90P0633j180n0790Q2478J4393l6787
$$ -71114 -14509 -17662 -5076 -61854 -64708 5476 6266 76899 75719 24929 107407 121800 85013
607H5013o9315K28J24074m6339j07167L1532j2517P2576j0652Q954J7913j9761
$$ 85013 15698 15926 140000 93661 -13506 18026 5509 78085 67433 76387 94300 74539
595G4539q4629o0034J25538P3728J4688n2357n478q7424M9602N3630K0258M2085
$$ 74539 -10090 -70124 55414 129142 143830 91473 85995 -1429 48173 101803 122061 164146
583A64146M2039j43930j8231Q4687p412k42195l641J82046R862q4537p96P1611
$$ 164146 206185 62255 44024 128711 121299 -120896 -124537 57509 67371 -17166 -17962 53649
571E3649Q0138m5183l5605K8716m2990l2997R1431K5728j4265o5613J30347M2959
$$ 53649 133787 88604 52999 81715 38725 5728 97159 122887 108622 43009 173356 216315
559B16315p2437o234m5645r1950m7848N4582k9820J17518j7991J3912j05679r5535
$$ 216315 143878 137644 91999 49 -47799 6783 -23037 94481 76490 90402 -15277 -110812
547a10812J47737M5744P877N1339l9992o9655k2212j9471k0177k6539Q4213p60
$$ -110812 36925 82669 90546 141885 101893 32238 10026 -9445 -29622 -56161 28052 27292
535B7292o8271O9113p3419p8967J21993k389J3486Q322k6789J88k3256M4353J4861
$$ 27292 -40979 28134 -45285 -124252 -2259 -4648 8838 17160 -9629 -9441 -32697 11656 26517
522B6517j633N8515l5126J597N7575M7407n4132m7847Q6323j29275j5650P870
$$ 26517 24884 83399 48273 49870 107445 154852 100720 52873 139196 9921 -5729 2141
510B141j5528L4064Q1j5660k2843k3698o3049J08981J00658K1193r684j1784N141
$$ 2141 -13387 20677 20758 5098 -17745 -41443 -104492 4489 105147 126340 116656 104872 110013
497A10013l6591j8815o1032O4232R3930m8418n1854J6501k0472J3545N6715k2286
$$ 110013 73422 54607 -6425 57807 151737 103319 51465 67966 47494 61039 117754 95468
485I5468l7350l9895Q553M271m2509O9110J36412p2919k175o7979P7443N8233
$$ 95468 58118 18223 26776 31047 -11462 57648 194060 121141 118966 50987 128430 186663
473A86663r1841j3850j16777J18832M4403n3260N6846p7735j29027K2685N2234
$$ 186663 94822 80972 -35805 83027 127430 74170 131016 53281 -75746 -53061 -827
462h27Q6293j10752Q38j9149k483o820L0347P1018n1113m5986Q4740k6139N8128
$$ -827 85466 -25286 -24448 -43597 -46080 -52900 -22553 48465 -2648 -48634 36106 9967 68095
449F8095m9217l9635L6382O0498P9594p6268k2494p0790K3619k9041N7313m1352
$$ 68095 18878 -20757 15625 76123 155717 79449 56955 -13835 9784 -19257 38056 -3296
437c296M2498O1637l4358O2758k4907k384k8599j5810N3975J9454P509k7572j1017
$$ -3296 39202 100839 66481 129239 104332 101948 73349 57539 111514 130968 138477 110905 99888
424I9888m803O4153j8761J825l1950r5564K3819N1419L1438q8518j0042O5315
$$ 99888 95085 159238 140477 142302 110352 14788 38607 90026 121464 32946 22904 88219
412H8219K3637j7202J6949j26466j4873L4830M3163k4457N5586k3919o3329J12750
$$ 88219 111856 94654 111603 -14863 -29736 5094 48257 23800 79386 55467 -7862 104888
400A04888r5850K3413J33507l5192j03112P1766j47157J3557J0601q3021M55J57864
$$ 104888 9038 32451 165958 130766 27654 99420 -47737 -34180 -23579 -106600 -106145 51719
388E1719k9200l1060R9977M1344l6313n8577r60J1085N4068K3733n0306l8284
$$ 51719 22519 -8541 91436 132780 96467 37890 36930 48015 102083 125816 75510 37226
376C7226k8630m828P9317K0364r9229p3438L9159J00379K1430M11J5634j3356
$$ 37226 8596 3768 83085 103449 4220 -69218 -30059 70320 91750 92161 107795 94439
364I4439k4411J455m3963q522Q060J1854J05409L6545j2235K0828M1615o1534
$$ 94439 70028 71483 27520 18998 27058 38912 144321 180866 168631 189459 231074 169540
352A69540j24230l0777M7877p3286P1655n313o270K7501J5369p714j3114k85o0303
$$ 169540 45310 14533 62410 -10876 60779 55466 49196 76697 92066 84352 71238 70953 10650
339A0650J15162K3852K0414k9606r63j03945j05359k6943N5555K3119J1741m2532
$$ 10650 125812 149664 170078 140472 139509 35564 -69795 -96738 -41183 -18064 -6323 -48855
327d8855O8816Q0750j45988L491q488R5927p6815M673J0410l4802N1657L1568
$$ -48855 19961 100711 -45277 -41786 -50274 45653 -31162 -26489 -16079 -50881 776 32344
315C2344N1252o468q186M9560J8136J8199k432l6079l4273p7766M3264O4007k089
$$ 32344 83596 77128 68942 118502 136638 154837 152405 116326 82053 4287 47551 111558 109469
302A09469j76j19250R3224j07450J8692R0817l2830J0806K8843p045r9825N9089
$$ 109469 109293 -9957 83267 -24183 -5491 85326 52496 63302 92145 85100 -14725 44364
290D4364L9169j8337N4915r966j24785j1646N3471J0751p0075R1691K7j00459
$$ 44364 83533 65196 120111 110145 -14640 -26286 27185 37936 -32139 59552 59579 -40880
278d0880M4730j2144J4297o5971K5254P0952p029R5208k7152j6851K1100R2266
$$ -40880 3850 -8294 6003 -59968 -34714 36238 29209 124417 97265 80414 101514 193780
266A93780p1357j13646K7300j4713k5071o1962J02370O3475r4380P7242K7521
$$ 193780 122423 8777 36077 21364 -3707 -65669 36701 100176 5796 83038 110559
255A10559m4765n2128N0157N0001Q385k1035j18354L2013J15740o6397L3014N2951
$$ 110559 65794 13666 63823 113824 122209 101174 -17180 14833 130573 64176 97190 150141
243A50141k5771K1080q5782N096o2824O4865Q4843k5214o6743R0966m7892n9777
$$ 150141 124370 145450 59668 64764 1940 66805 151648 126434 59691 150657 102765 42988
231D2988J11235O7573k6023j21407m0953j1931L8572J9463j6845l9773J66O5654
$$ 42988 154223 221796 195773 74366 33413 21482 60054 79517 62672 22899 23065 88719
219H8719r7166j39341L9473N9982J07396l6438J4647K1427P263O7322O4230k8355
$$ 88719 -8447 -147788 -108315 -48333 59063 22625 37272 58699 65962 133284 197514 169159
207A69159l0780J7402p209q1922m5586j6500J754L9185n2484J691O4015k7164
$$ 169159 138379 155781 148572 66650 21064 4564 6318 45503 -6981 -5290 58725 31561
195C1561J4850P5531R5131q3652j9495j1467j0457n6031p2900L5035M8116K6716
$$ 31561 46411 121942 217073 133421 113926 102459 92002 35971 -36929 -1894 46222 72938
183G2938N4065l941p8280N2237o8028J2083M1320L2298j3388J2113L0674p6800
$$ 72938 127003 123062 44782 97019 28991 41074 82394 114692 101304 113417 144091 67291
171F7291m0001K551L9737p3196M4264L4014M3545k3563J0981l3956r8890J28353
$$ 67291 27290 29841 69578 -3618 40646 74660 118205 94642 105623 71667 -27223 101130
159A01130N2998o9604l7528P9527Q2046n4248j09741R226m7025P7487K2420o1294
$$ 101130 154128 84524 46996 126523 208569 154321 44580 53806 6781 84268 106688 45394
147D5394N986O9476O544p4442l1031O7623n3243K5495J9159l247J7985O5952q0449
$$ 45394 51380 120856 127400 52958 21927 89550 36307 61802 80961 77714 95699 161651 81202
134H1202K1950o715m8750M4819J7065o762j1052o7269J597J2447j6243J3405q178
$$ 81202 103152 96437 47687 92506 109571 102809 91757 24488 26085 38532 22289 35694 27516
121B7516P1199j07589P4046O1722k3603j4176l8750j4675J0817M5999l6431j1231
$$ 27516 98715 -8874 65172 126894 103291 89115 50365 35690 46507 92506 56075 44844
109D4844K211k9254Q5645K1503j6881p6142P5512O2518k1421K5415J5396q7251
$$ 44844 47055 17801 103446 124949 108068 31926 107438 169956 148535 173950 189346 102095
97A02095l9983l6173q274N9111M5605N7831m2337m9761k3983k2882N1192J2534
$$ 102095 62112 25939 17665 76776 122381 180212 137875 88114 64131 41249 92441 104975
85A04975J0313r5039K4402m9572R1704J2405n2737J92K3754K0904N7127n0598
$$ 104975 115288 20249 44651 -4921 86783 99188 46451 46643 70397 91301 148428 97830
73I7830J2264N1197j7576q5895Q725J25144o9006j8638k8797J40843k0143P056
$$ 97830 110094 161291 143715 57820 66545 191689 122683 104045 75248 216091 195948 203004
61B03004m9870j2895k9886q0824o9305J70365K7855r0787M853Q5886o4891k2530
$$ 203004 153134 140239 110353 29529 -39776 130589 158444 67657 72510 158396 93505 70975
49G0975O8435j5029n5126n9127J2946J341O476N4908o3651J414J7719K9573K0958
$$ 70975 139410 124381 69255 10128 23074 24415 30891 85799 22148 23562 41281 70854 91812
36I1812j1393n9078K7074L4931k3119L0817m3013l5047n3141O7334K4356M043
$$ 91812 80419 21341 48415 83346 60227 91044 48031 12984 -40157 27177 51533 55576
24E5576J0815M5980j757j2488R329k8542N2208l1328m4902M055L0077L3297J932
$$ 55576 66391 112371 110614 98126 107455 78913 131121 99793 54891 58946 89023 122320 124252
11A24252Q648j1977n8286k0578N1936L6761O90O0099K9389q6217O179
$$ 124252 132900 120923 62637 42059 93995 130756 131446 191545 220934 134717 140896
0A40896
$$ 140896
$$ Imaginary data points
##PAGE= N=2
##DATA TABLE= (X++(I..I)), XYDATA
16383b872378O1351q2401M1260J78790O7485K2299J3343J19323J3632Q3001N0581
$$ -2872378 -2811027 -2893428 -2852168 -2673378 -2605893 -2583594 -2570251 -2450928 -2437296 -2354295 -2303714
16372b303714n0170J9350P1196J24665P1174j0212R0048P2273O8547P288l0065
$$ -2303714 -2353884 -2334534 -2263338 -2138673 -2067499 -2077711 -1987663 -1915390 -1846843 -1839555 -1869620
$$ [...]
##END NTUPLES=NMR SPECTRUM
##END=
