##TITLE=1H_EC-3297(1)
 CDCl3
 8 sc, 
 12.7.2023
##JCAMPDX= 6.0         $$ Bruker NMR JCAMP-DX V2.0
##DATA TYPE= NMR SPECTRUM
##DATA CLASS= NTUPLES
##ORIGIN= UXNMR, Bruker Analytische Messtechnik GmbH
##OWNER= root
$$ XWIN-NMR		Version 3.5
$$ Wed Jul 12 13:47:35 2023 Russian Standard Time (UT+4h)  she@DPX200
##.OBSERVE FREQUENCY= 200.13135
##.OBSERVE NUCLEUS= ^1H
##.ACQUISITION MODE= SIMULTANEOUS
##.ACQUISITION SCHEME= undefined
##.AVERAGES= 8
##.DIGITISER RES= 18
##SPECTROMETER/DATA SYSTEM= spect
##.PULSE SEQUENCE= zg30
##.SOLVENT NAME= CDCl3
##.SHIFT REFERENCE= (INTERNAL, CDCl3, 0, 15.7282)
##AUDIT TRAIL= $$ (NUMBER, WHEN, WHO, WHERE, WHAT)
$$ ##TITLE= Audit trail, XWIN-NMR		Version 3.5
$$ ##JCAMPDX= 5.01
$$ ##ORIGIN= Bruker BioSpin GmbH
$$ ##OWNER= she
$$ F:/spectra/data/she/nmr/H-F/1/pdata/1/auditp.txt
$$ ##AUDIT TRAIL=  $$ (NUMBER, WHEN, WHO, WHERE, WHAT)
(   1,<2023-07-12 13:46:19.84 +0400>,<she>,<DPX200>,
      <created by zg, POWCHK disabled, PULCHK disabled
       configuration hash MD5:
       00 E9 B6 7A A2 85 ED C7 34 08 36 98 17 FE 4E 26
       data hash MD5: 16K
       0E D4 10 5E C5 2B CB AD 4F 5E 99 5E 55 E4 16 29>)
(   2,<2023-07-12 13:46:22.06 +0400>,<she>,<DPX200>,
      <Start of raw data processing
       efp BC_mod = 2 LB = 0.24 FT_mod = 6 PKNL = 1 PHC0 = -20984.05 PHC1 = 5.65272 SI = 16K 
       data hash MD5: 16K
       0F B2 FF 56 63 01 7C F6 49 09 62 E4 29 5D B7 BD>)
(   3,<2023-07-12 13:46:45.29 +0400>,<she>,<DPX200>,
      <pk PHC0 = -14.65506 PHC1 = 16.8 
       data hash MD5: 16K
       97 A7 B3 96 50 5B 71 4B 59 14 7D 7C 14 1A 67 9F>)
(   4,<2023-07-12 13:46:48.65 +0400>,<she>,<DPX200>,
      <abs ABSG = 5 
       data hash MD5: 16K
       C3 08 82 2C 51 EB 28 F7 6F 75 CC 0A 18 32 AF A5>)
$$ ##END=
$$ 
$$ hash MD5
$$ 46 F8 A0 C1 7C 4D EA 8B C5 94 6F AF C2 25 EA 7B
##$RELAX= 
##$RELAX= 
##$RELAX= 
##$RELAX= 
##$RELAX= 
##$RELAX= 
$$ Bruker specific parameters
$$ --------------------------
##$DU= <F:/spectra>
##$EXPNO= 1
##$NAME= <H-F>
##$PROCNO= 1
##$TYPE= <nmr>
##$USER= <she>
##$AMP= (0..31)
100 100 100 100 100 100 100 100 100 100 100 100 100 100 100 100 100 100 
100 100 100 100 100 100 100 100 100 100 100 100 100 100 
##$AQSEQ= 0
##$AQ_mod= 1
##$AUNM= <au_zg>
##$AUTOPOS= <>
##$BF1= 200.13
##$BF2= 200.13
##$BF3= 200.13
##$BF4= 200.13
##$BF5= 200.13
##$BF6= 200.13
##$BF7= 200.13
##$BF8= 200.13
##$BYTORDA= 1
##$CFDGTYP= 0
##$CFRGTYP= 5
##$CHEMSTR= <none>
##$CNST= (0..31)
1 1 145 1 1 1 1 1 1 1 1 1 1 1 1 1 1 1 1 1 1 1 1 1 1 1 1 1 1 1 1 1 
##$CPDPRG= <>
##$CPDPRG1= <>
##$CPDPRG2= <>
##$CPDPRG3= <>
##$CPDPRG4= <mlev>
##$CPDPRG5= <mlev>
##$CPDPRG6= <mlev>
##$CPDPRG7= <mlev>
##$CPDPRG8= <mlev>
##$CPDPRGB= <>
##$CPDPRGT= <>
##$D= (0..31)
0 1.2 0 0 0 0 0 0 0 0.06 0 0.03 0 0 0 0 0.0002 0 0 0 0 0 0 0 0 0 0 0 0 
0 0 0 
##$DATE= 1689155179
##$DBL= (0..7)
120 120 120 120 120 120 120 120 
##$DBP= (0..7)
150 150 150 150 150 150 150 150 
##$DBP07= 0
##$DBPNAM0= <>
##$DBPNAM1= <>
##$DBPNAM2= <>
##$DBPNAM3= <>
##$DBPNAM4= <>
$$ [...]
##$SUBNAM3= <"">
##$SUBNAM4= <"">
##$SUBNAM5= <"">
##$SUBNAM6= <"">
##$SUBNAM7= <"">
##$SUBNAM8= <"">
##$SUBNAM9= <"">
##$SW= 18.05172834244
##$SWIBOX= (0..15)
0 0 2 0 0 0 0 0 0 0 0 0 0 0 0 0 
##$SW_h= 3612.71676300578
##$TD= 16384
##$TD0= 1
##$TE= 0
##$TE2= 300
##$TE3= 300
##$TEG= 300
##$TL= (0..7)
0 120 120 120 120 120 120 120 
##$TP= (0..7)
150 150 150 150 150 150 150 150 
##$TP07= 0
##$TPNAME0= <>
##$TPNAME1= <>
##$TPNAME2= <>
##$TPNAME3= <>
##$TPNAME4= <>
##$TPNAME5= <>
##$TPNAME6= <>
##$TPNAME7= <>
##$TPOAL= (0..7)
0.5 0.5 0.5 0.5 0.5 0.5 0.5 0.5 
##$TPOFFS= (0..7)
0 0 0 0 0 0 0 0 
##$TUNHIN= 0
##$TUNHOUT= 0
##$TUNXOUT= 0
##$USERA1= <user>
##$USERA2= <user>
##$USERA3= <user>
##$USERA4= <user>
##$USERA5= <user>
##$V9= 5
##$VALIST= <valist>
##$VCLIST= <CCCCCCCCCCCCCCC>
##$VD= 0
##$VDLIST= <DDDDDDDDDDDDDDD>
##$VPLIST= <PPPPPPPPPPPPPPP>
##$VTLIST= <TTTTTTTTTTTTTTT>
##$WBST= 1024
##$WBSW= 4
##$XGAIN= (0..3)
0 0 0 0 
##$XL= 0
##$YL= 0
##$YMAX_a= 46655
##$YMIN_a= -70416
##$ZGOPTNS= <>
##$ZL1= 120
##$ZL2= 120
##$ZL3= 120
##$ZL4= 120
##$ABSF1= 15.76341
##$ABSF2= -2.28844
##$ABSG= 5
##$ABSL= 3
##$ALPHA= 0
##$AQORDER= 0
##$ASSFAC= 0
##$ASSFACI= 0
##$ASSFACX= 0
##$ASSWID= 0
##$AUNMP= <proc_1d>
##$AZFE= 0.1
##$AZFW= 0.1
##$BCFW= 0
##$BC_mod= 2
##$BYTORDP= 0
##$COROFFS= 0
##$CY= -3
##$DATMOD= 1
##$DC= 0
##$DFILT= <>
##$DTYPP= 0
##$F1P= 0
##$F2P= 0
##$FCOR= 1
##$FTSIZE= 16384
##$FT_mod= 6
##$GAMMA= 0
##$GB= 0
##$INTBC= 1
##$INTSCL= 3.70164e-10
##$ISEN= 128
##$LB= 0.24
##$LEV0= 0
##$LPBIN= 0
##$MAXI= 10000
##$MC2= 0
##$MEAN= 0
##$ME_mod= 0
##$MI= 1.114404
##$NCOEF= 0
##$NC_proc= -10
##$NLEV= 6
##$NOISF1= 3.799351
##$NOISF2= 2.8
##$NSP= 0
##$NTH_PI= 0
##$NZP= 0
##$OFFSET= 15.72816
##$PC= 1
##$PHC0= -20998.71
##$PHC1= 22.45272
##$PH_mod= 1
##$PKNL= yes
##$PPARMOD= 0
##$PSCAL= 0
##$PSIGN= 0
##$REVERSE= no
##$SF= 200.130008681015
##$SI= 16384
##$SIGF1= 3
##$SIGF2= 2
##$SINO= 5.538805
##$SIOLD= 16384
##$SREGLST= <1H.CDCl3>
##$SSB= 0
##$STSI= 16384
##$STSR= 0
##$SW_p= 3612.71676300578
##$SYMM= 0
##$S_DEV= 0
##$TDeff= 16384
##$TDoff= 0
##$TI= <>
##$TILT= no
##$TM1= 0
##$TM2= 0
##$TOPLEV= 0
##$USERP1= <user>
##$USERP2= <user>
##$USERP3= <user>
##$USERP4= <user>
##$USERP5= <user>
##$WDW= 1
##$XDIM= 16384
##$YMAX_p= 424314144
##$YMIN_p= -4313599
$$ End of Bruker specific parameters
$$ ---------------------------------
##NTUPLES= NMR SPECTRUM
##VAR_NAME=  FREQUENCY,     SPECTRUM/REAL,   SPECTRUM/IMAG
##SYMBOL=    X,             R,               I
##VAR_TYPE=  INDEPENDENT,   DEPENDENT,       DEPENDENT
##VAR_FORM=  AFFN,          ASDF,            ASDF
##VAR_DIM=   16384,         16384,           16384
##UNITS=     HZ,            ARBITRARY UNITS, ARBITRARY UNITS
##FACTOR=    0.220516191357247, 1,           1
##FIRST=     3147.67677821997, 0,            0
##LAST=      -465.03998478581, 0,            0
##MIN=       -465.03998478581, -4313599,     0
##MAX=       3147.67677821997, 424314144,    0
$$ Real data points
##PAGE= N=1
##DATA TABLE= (X++(R..R)), XYDATA
$$ [...]
$$ plain form
6970 201355 -1171936 -2483809 -629788 -626300 415562 694756 -1612494 -1138057 -1084107
6961 -1084107 -1034551 -2006471 -3071684 -1690390 -1276112 -1365358 636947 387146 547020
6952 547020 905913 -872791 -227762 1248523 92404 634903 -78778 -765809 -734249
6943 -734249 -1584325 -240365 694833 90591 -763507 -854879 -270532 1393638 2096933 2056258
6933 2056258 1519272 730977 1319618 2296634 3392969 1688658 -83113 -1341409 -1556653
6924 -1556653 -129098 -585948 -794518 366144 1214417 2115416 3091815 2568034 1093165
6915 1093165 -624357 -884494 -1751075 -812058 317692 -813079 -2162791 -891661 840577
6906 840577 652983 1745235 618547 160426 -323905 -2106785 -2359220 -1507933 -1800485
$$ packed form
6970B01355j373291j311873J854021L488J041862K79194k307250M74437N3950
6961a084107M9556r71920j065213J381294M14278q9246K002305k49801J59874
6952E47020L58893j778704O45029J476285j156119N42499p13681o87031L1560
6943g34249q50076J343960R35198o04242q54098r1372N84347J664170P03295m0675
6933B056258n36986p88295N88641R77016J096335j704311j771771j258296k15244
6924a556653J427555m56850k08570J160662Q48273R00999R76399n23781j474869
6915A093165j717522k60137q66581R39017J129750j130771j349712J271130J732238
6906H40577j87594J092252j126688m58121m84331j782880k52435Q51287k92552
$$ plain form
6897 -1800485 -383046 -1782125 -982554 -507240 -1337551 -1006738 -738021 -1685348 -1244506
6888 -1244506 -949241 -1278104 1191695 482056 -757159 526363 -37581 -394310 1006722
6879 1006722 629449 -1684067 -1517960 -508387 -43318 -1074347 -2156909 -2323405 -1854019
6870 -1854019 -935242 -607705 -76031 -1575293 -2921275 -2903081 -1931501 -1755424 99901
6861 99901 1237180 -72122 -1063985 -70814 -549454 -808504 -1884416 -2385702 -1740154
6852 -1740154 -1294155 -760505 -30774 -364237 -1755435 -874195 -388030 -312807 -330936 -1414509
6842 -1414509 -933026 -1600245 -725899 -237005 61754 303081 -417919 -210601 579366 -470965
6832 -470965 -559022 658467 1845542 1832028 871327 357770 1115076 897256 938691 606110
$$ packed form
6897a800485J417439j399079P99571M75314q30311L30813K68717r47327M40842
6888a244506K95265l28863K469799p09639j239215J283522n63944l56729J401032
6879A006722l77273k313516J66107J009573M65069j031029j082562j66496M69386
6870a854019R18777L27537N31674j499262j345982J8194R71580J76077J855325
6861I9901J137279j309302r91863R93171m78640k59050j075912n01286O45548
6852a740154M45999N33650P29731l33463j391198Q81240M86165P5223j8129j083573
6842a414509M81483o67219Q74346M88894K98759K41327p21000K07318P89967j050331
6832d70965q8057J217489J187075j3514r60701n13557P57306k17820M1435l32581
$$ plain form
6822 606110 -21584 501651 -1201508 -293217 -357331 -1484618 -1998669 -642429 -473382
6813 -473382 -912375 181791 -994140 -731398 631763 2179710 1376994 720996 269111
6804 269111 -377308 896943 68601 1550663 782486 203293 872223 410553 469394 951737
6794 951737 853399 444477 -1555342 -3105491 -2141176 -1591532 -711098 -1009450 190805
6785 190805 -442246 -253497 798988 148850 -1910281 -713083 58602 -847089 -866119
6776 -866119 -454071 652432 567516 369682 -419134 -1527104 -1248228 -1732589 -2825862
6767 -2825862 -1407445 1046116 408048 -914594 -1941656 -2168039 -667614 1004957 1217923
6758 1217923 851087 87935 -466285 -58317 367903 1217254 869910 -246479 -833393
$$ packed form
6822F06110o27694N23235j703159R08291o4114j127287n14051J356240J69047
6813d73382m38993J094166j175931K62742J363161J547947q02716o55998m51885
6804B69111o46419J274251q28342J482062p68177n79193O68930m61670N8841M82343
6794I51737r8338m08922j999819j550149R64315N49644Q80434k98352J200255
6785A90805o33051J88749J052485o50138k059131J197198P71685r05691j9030
6776h66119M12048J106503q4916j97834p88816j107970K78876m84361j093273
6767b825862J418417K453561o38068j322642j027062k26383J500425J672571K12966
6758A217923l66836p63152n54220M07968M26220Q49351l47344j116389n86914
$$ plain form
6749 -833393 -457601 1250366 1084851 -1014961 -3194437 -1611522 1394603 1753136 2134484
6740 2134484 1515518 168590 -148873 448059 242316 -116649 679844 -459793 -1802493
6731 -1802493 -565472 -911297 -1074819 132076 -75313 -1355091 -723076 -1308968 -355077
6722 -355077 -2107349 -2800913 -2010275 -516752 -700534 -256601 -2144170 -2305584 -1196605
6713 -1196605 -740729 -57357 -881637 -908506 -811601 -1429873 -2310139 -2902873 -2491543 -3090267
6703 -3090267 -3074062 -2159908 -3392921 -2265315 -1695182 -772742 142541 77052 -1119331
6694 -1119331 -1353674 -709920 215056 761333 174295 762715 -429217 -2863370 -2333366
6685 -2333366 -2124645 -1773699 -1598155 -200180 921453 1230894 740646 -167702 -570305
$$ packed form
6749h33393L75792J707967j65515k099812k179476J582915L006125L58533L81348
6740B134484o18966j346928l17463N96932k05743l58965P96493j139637j342700
6731a802493J237021l45825j63522J206895k07389j279778O32015n85892R53891
6722c55077j752272o93564P90638J493523j83782M43933j887569j61414J108979
6713a196605M55876O83372q24280k6869R6905o18272q80266n92734M11330n98724
6703c090267J6205R14154j233013J127606N70133R22440R15283o5489j196383
6694a119331k34343O43754R24976N46277n87038N88420j191932k434153N30004
6685b333366K08721L50946J75544J397975J121633L09441m90248r08348m02603
$$ plain form
6676 -570305 147558 -168633 -646419 307335 -327602 -2063342 -1893527 -1409908 -897105 -691997
6666 -691997 -581187 -757948 -1510410 -835556 -251713 1564786 1072763 914407 1401189 1284933
6656 1284933 871959 484706 -1031438 -1465831 -618619 -124475 -133150 -852875 -288999 -958765
6646 -958765 -1794102 -621072 -1195679 -1345113 -101758 142908 -412254 -167420 -1230149
6637 -1230149 -1195579 -1794043 -1217295 -822669 -977353 -589599 -1084563 -2098750 -1662511 -342821
6627 -342821 -1090170 -1444961 -2062698 -1590068 -1286566 -1165682 -253734 -884824 -39553 535474
6617 535474 -60625 359035 -1864527 -294853 1039701 -1124591 -1044887 -135283 -214839
6608 -214839 710279 -685228 -500454 -33999 -521864 -825116 272470 1015487 1409668
$$ packed form
6676e70305P17863l16191m77786R53754o34937j735740J69815M83619N12803K05108
6666f91997J10810j76761p52462O74854N83843J816499m92023j58356M86782j16256
6656A284933m12974l87253j516144m34393Q47212M94144q675p19725N63876o69766
6646i58765q35337J173030n74607j49434J243355K44666n55162K44834j062729
6637a230149L4570n98464N76748L94626j54684L87754m94964j014187M36239J319690
6627c42821p47349l54791o17737M72630L03502J20884R11948o31090Q45271N75027
6617E35474n96099M19660k223562J569674J334554k164292P9704R09604p9556
6608b14839R25118j395507J84774M66455m87865l03252J097586P43017L94181
$$ plain form
6599 1409668 1033834 501875 885362 -332431 -2237593 -1045497 -1390680 -1013317 -1853159
6590 -1853159 -661563 -1804504 -1569285 -962137 -1604180 -2255006 -2204640 -1326994 -1599475
6581 -1599475 -1460780 -1214707 -1535255 -1197773 -642383 -1035244 -1111342 -99192 1821949
6572 1821949 3142397 687010 -354888 489816 -897511 -1668835 -585117 -320543 339143
6563 339143 1251365 169774 -1135609 -725437 -644063 -1263236 -1783329 -2890876 -1543103
6554 -1543103 -1338803 -2248894 -2562594 -903114 -1779157 -2091724 -2190681 -107197 -1459807
6545 -1459807 -1651758 -177635 179821 147737 -330889 -2315292 -2398091 -1911143 -2205228 -793395
6535 -793395 -1208758 -1287269 -1655158 -1425978 -650988 -1013702 193392 -506086 -1068104 -1280713
$$ packed form
6599A409668l75834n31959L83487j217793j905162J192096l45183L77363q39842
6590a853159J191596j142941K35219O07148o42043o50826N0366Q77646k72481
6581a599475J38695K46073l20548L37482N55390l92861p6098J012150J921141
6572A821949J320448k455387j041898Q44704j387327p71324J083718K64574O59686
6563C39143R12222j081591j305383M10172Q1374o19173n20093j107547J347773
6554a543103K04300r10091l13700J659480q76043l12567r8957K083484j352610
6545a459807j91951J474123L57456l2084m78626j984403q2799M86948k94085J411833
6535g93395m15363p8511l67889K29180P74990l62714J207094o99478n62018k12609
$$ plain form
6525 -1280713 -780952 -1690808 -1840781 -1462996 -1292025 -1195594 61292 -44310 -1418464
6516 -1418464 -2674080 -2216277 -3563873 -3270586 -1029407 -1356800 -1389363 -529147 -351642
6507 -351642 -1399793 -495178 386356 -480571 793664 647129 449420 -950980 -1301331
6498 -1301331 -742351 -148016 -989249 -2137963 -2350386 -3431486 -2567571 -2456756 -1784399
6489 -1784399 -73211 585450 -1092938 -159528 693388 -192625 -1281086 -274659 132243
6480 132243 -2239875 -2639704 -1849598 -992197 -129386 12037 397183 -1573389 -682370
6471 -682370 -593061 518400 1270643 115682 -1755234 -577807 533693 713858 -554670
6462 -554670 -588028 807737 62934 -1709849 -565297 1519722 1984535 432547 -548411
$$ packed form
6525a280713M99761r09856j49973L77785J70971R6431J256886j05602j374154
6516a418464j255616M57803j347596K93287K241179l27393l2563Q60216J77505
6507c51642j048151R04615Q81534q66927J274235j46535j97709j400400l50351
6498a301331N58980N94335q41233j148714k12423j081100Q63915J10815O72357
6489a784399J711188O58661j678388R33410Q52916q86013j088461J006427M06902
6480A32243k372118l99829P90106Q57401Q62811J41423L85146j970572Q91019
6471f82370Q9309J111461P52243j154961j870916J177427J111500J80165j268528
6462e54670l3358J395765p44803j772783J144552K085019M64813j551988r80958
$$ plain form
6453 -548411 -1471731 -1465528 -280753 -1201762 -317212 -1079258 -221217 42871 -496029 -1474298
6443 -1474298 -860329 -657260 74549 257299 -492768 -1220473 -1396228 -2040696 -2658544 -560590
6433 -560590 -45931 747865 556467 850474 -1215964 -1479631 -1436131 -357940 1238304
6424 1238304 -877954 -2124613 -2924327 -2214763 -1198343 -642395 -917060 -1803735 -1441112
6415 -1441112 -1976642 -1383639 -397603 -828125 -697426 -1472628 -1621214 -2490064 -1600195 -827774
6405 -827774 168962 -274249 -805238 -2197450 -2654394 -1972227 -891605 37539 408174
6396 408174 -37785 -585767 -471905 970408 1058436 483316 1336249 -360603 -551770 -1514390
6386 -1514390 130757 -573192 -2013236 127930 396456 -570715 -706788 -2604474 -2125591
$$ packed form
6453e48411r23320O203J184775r21009Q84550p62046Q58041K64088n38900r78269
6443a474298O13969K03069P31809J82750p50067p27705j75755o44468o17848K097954
6433e60590N14659P93796j91398K94007k066438k63667M3500J078191J596244
6424A238304k116258j246659p99714P09564J016420N55948k74665q86675L62623
6415a441112n35530N93003R86036m30522J30699p75202j48586q68850Q89869P72421
6405h27774R96736m43211n30989j392212m56944O82167J080622R29144L70635
6396D08174m45959n47982J13862J442313Q8028n75120Q52933j696852j91167r62620
6386a514390J645147p03949j440044K141166K68526r67171j36073j897686M78883
$$ plain form
6377 -2125591 -2734132 -2177985 -413863 -136906 -1423328 244558 643007 -550917 -672221
6368 -672221 -2595165 -1050544 -782904 -861305 708965 812019 491701 -365618 -507545
6359 -507545 -1733052 -1265202 2020 326521 -40902 391642 -110992 -1163987 -2410897
6350 -2410897 -1784208 -67156 -27640 1064790 697925 769223 1234287 2202750 81685
6341 81685 -1023425 891966 863405 -904584 -1674605 -440938 -683207 163625 2264736
6332 2264736 1336682 -740156 -1353599 -73997 -716612 -108092 -544053 -292735 41732
6323 41732 -1159934 -911729 88235 1854224 633131 -1095665 -399435 128321 -1256526
6314 -1256526 -713780 51614 -924777 -2173505 -1081890 -18062 -1564718 -319272 208918
$$ packed form
6377b125591o08541N56147J764122K76957j286422J667886L98449j193924j21304
6368f72221j922944J544621K67640p8401J570270J03054l20318q57319j41927
6359e07545j225507M67850J267222L24501l67423M32544n02634j052995j246910
6350b410897O26689J717052L9516J092430l66865P1298M65064R68463k121065
6341H1685j105110J915391k8561j767989p70021J233667k42269Q46832K101111
6332B264736r28054k076838o13443J279602o42615O08520m35961K51318L34467
6323D1732j201666K48205R99964J765989j221093j728796O96230N27756j384847
6314a256526N42746P65394r76391j248728J091615J063828j546656J245446N28190
$$ plain form
6305 208918 21572 -2643965 -1693282 -861461 -1116336 -555019 -2234034 -2432751 -752476
6296 -752476 -1945466 -1310756 -381061 492988 -651798 -1723641 -1056619 -314898 -484012
6287 -484012 -988867 207238 -404934 -18059 -1895173 -2081572 986751 1577606 984716
6278 984716 -704401 28240 825912 747926 -1804256 -932831 742608 -737723 816272
6269 816272 -913830 -2209626 -2077772 -1272461 -1842157 -2287008 -1023111 -169614 431474
6260 431474 122451 198414 506765 193695 -786671 -1399724 -715451 -975691 -724220 -880120
6250 -880120 -1724842 -1431598 129764 351973 -1582814 -1600160 -487100 -2018233 -7131
6241 -7131 341853 -898940 -2091914 -1794717 -590822 -1756694 -1426665 -2517765 -1734161
$$ packed form
6305B08918j87346k665537R50683Q31821k54875N61317j679015j98717J680275
6296g52476j192990O34710R29695Q74049j144786j071843O67022P41721j69114
6287d84012n04855J196105o12172L86875j877114j86399L068323N90855n92890
6278I84716j689117P32641P97672p7986k552182Q71425J675439j480331J553995
6269H16272j730102j295796J31854Q05311n69696m44851J263897Q53497O01088
6260D31474l09023P5963L08351l13070r80366o13053O84273k60240K51471j55900
6250h80120q44722K93244J561362K22209j934787j7346J113060j531133K011102
6241g131L48984j240793j192974K97197J203895j165872L30029j091100P83604
$$ plain form
6232 -1734161 -1150801 -1192868 -276941 -146385 -476270 -40738 -504092 65141 463803 583757
6222 583757 14570 -916196 850033 -1325238 -2731292 -1122123 -903381 -2727025 -955520
6213 -955520 475767 -571985 -912042 364747 27620 -2578872 -4069619 -2341468 -408380
6204 -408380 -1443324 -859090 -1852729 -1120617 -337425 260499 -634690 606973 103055
6195 103055 -3171591 -3110267 -834402 -12003 -1390559 -497726 -21013 1171216 443923
6186 443923 889590 1326571 2680460 1006566 -928191 -1059668 -1129955 -755218 -1032167
6177 -1032167 -1190213 -1301005 -2389448 -770188 -516133 -1038838 -1493736 -1267683 553736
6168 553736 1068939 -417528 -532853 -2596970 -2609084 -1936839 -2867188 12782 858757
$$ packed form
6232a734161N83360m2067R15927J30556l29885M35532m63354N69233L98662J19954
6222E83757n69187r30766J766229k175271j406054J609169K18742j823644J771505
6213i55520J431287j047752l40057J276789l37127k606492j490747J728151J933088
6204d08380j034944N84234r93639P32112P83192N97924q95189J241663n03918
6195A03055l274646O1324K275865Q22399j378556Q92833M76713J192229p27293
6186D43923M45667M36981J353889j673894j934757j31477p0287L74737k76949
6177a032167j58046j10792j088443J619260K54055n22705m54898K26053J821419
6168E53736N15203j486467j15325k064117j2114O72245r30349K879970Q45975
$$ plain form
6159 858757 -276217 553732 -9702 1079533 1052989 -29089 679907 646401 25290 -350845
6149 -350845 1065042 152351 -234497 249707 106007 -589817 -34976 -1363313 -1427818 -1956661
6139 -1956661 -801015 -283789 630853 597723 1935704 2832427 1086644 -577744 1055369
6130 1055369 351834 994097 2316775 1091695 -362670 -144311 1896686 2710117 1326964
6121 1326964 -173788 -715927 -640174 312864 1166115 737263 596590 1221879 -821374
6112 -821374 361161 1892580 1870055 1454383 1050513 329239 1319694 -5663 -2287996
6103 -2287996 -2354217 -1840500 362776 597767 -390157 -494895 947617 579205 868854
6094 868854 1540546 825139 2453939 1986526 1616580 1192115 600825 454639 -133631 -2184329
$$ packed form
6159H58757j134974Q29949n63434J089235k6544j082078P08996l3506o21111l76135
6149c50845J415887r12691l86848M84204j43700o95824N54841j328337o4505n28843
6139a956661J155646N17226R14642l3130J337981Q96723j745783j664388J633113
6130A055369p03535O42263J322678j225080j454365K18359K040997Q13431j383153
6121A326964j500752n42139P5753R53038Q53251m28852j40673O25289k043253
6112h21374J182535J531419k2525m15672m03870p21274R90455j325357k282333
6103b287996o6221N13717K203276K34991r87924j04738J442512l68412K89649
6094H68854O71692p15407J628800m67413l69946m24465n91290j46186n88270k050698
$$ plain form
6084 -2184329 -2173558 -1238313 -246583 274752 1514958 1491638 835986 1646290 1911509 991227
6074 991227 -3231 710292 825977 864099 502895 702550 571272 743405 2098015 1735343
6064 1735343 1451702 1733243 1552495 1653165 2727766 3891909 2277108 4247259 3582270
6055 3582270 2628882 3481576 2383571 3135889 3985499 3801309 3637669 4981176 6159345
6046 6159345 6546142 6345054 4714831 4131261 4335161 4542434 3875872 4837501 4362993
6037 4362993 2435239 1953537 3284212 3269702 4103043 5517737 4490194 4395417 5194893
6028 5194893 5746429 5010275 4481326 6206528 6459354 7605991 9452978 9340116 10914311
6019 10914311 12363894 12373554 10388665 9625288 8941403 8641202 7469751 6523379 5655863
$$ packed form
6084b184329J0771R35245R91730N21335J240206k3320o55652Q10304K65219r20282
6074I91227r94458P13523J15685L8122l61204J99655j31278J72133J354610l62672
6064A735343k83641K81541j80748J00670J074601J164143j614801J970151o64989
6055C582270r53388Q52694j098005P52318Q49610j84190j63640J343507J178169
6046F159345L86797k01088j630223n83570K03900K07273o66562R61629m74508
6037D362993j927754m81702J330675j4510Q33341J414694j027543r4777P99476
6028E194893N51536p36154n28949J725202K52826J146637J846987j12862J574195
6019A0914311J449583R660j984889p63377o83885l00201j171451r46372q67516
$$ plain form
6010 5655863 5921733 4364446 3873383 2532053 1805369 2521543 1104869 1092818 2733065
6001 2733065 1970348 1634501 1857549 4167029 4125532 1763966 3852675 5234116 4483272
5992 4483272 4462401 5374743 5459447 5851842 6823749 6248643 5885776 4929634 4807654 5158624
5982 5158624 3680723 2874846 2494455 1739473 2548175 1383814 1015200 2489901 2573116
5973 2573116 3275786 2522343 3586151 3280048 2462985 830153 1451739 1267331 2081503
5964 2081503 1707190 1669017 2226601 1822216 1938790 1353979 3188764 3294919 4292042 4190895
5954 4190895 3142999 3033158 2241371 1225123 -16651 454347 2025659 4122334 2702869
5945 2702869 601631 401957 45053 48778 -598761 468889 781537 1527916 1273633 2744240
$$ packed form
6010E655863K65870j557287m91063j341330p26684P16174j416674j2051J640247
6001B733065p62717l35847K23048K309480m1497k361566K088709J381441p50844
5992D483272k0871R12342Q4704L92395R71907n75106l62867r56142j21980L50970
5982E158624j477901q05877l80391p54982Q08702j164361l68614J474701Q3215
5973B573116P02670p53443J063808l06103q17063j632832O21586j84408Q14172
5964B081503l74313l8173N57584m04385J16574n84811J834785J06155R97123j01147
5954D190895j047896j09841p91787j016248j241774M70998J571312K096675j419465
5945B702869k101238j99674l56904L725o47539J067650L12648P46379k54283J470607
$$ plain form
5935 2744240 4076787 2930921 488076 -31240 5320 1794966 3721683 2784530 4066775
5926 4066775 4844386 4455776 4806133 5376314 2746611 1974797 2941836 2994309 2464791 2789319
5916 2789319 3300519 4504199 4755956 3650350 3465394 4802363 3020911 2624111 2687749
5907 2687749 2632070 2194709 2882476 4595815 4873487 2965809 2014200 1923454 2540381 1560665
5897 1560665 1927671 4573660 3520050 1452886 872006 613826 2381686 3951091 3507006
5888 3507006 3429426 3686398 4557330 4752251 5616885 5323204 6697615 6232115 7216083 7153361
5878 7153361 8496651 7953239 8403444 7588621 7181189 6543327 6305913 6076396 4693870
5869 4693870 4012930 3311117 3754737 3688114 4351638 4331539 2859936 2680704 4170244 4069754
$$ packed form
5935B744240J332547j145866k442845n19316L6560J789646J926717r37153J282245
5926D066775P77611l88610L50357N70181k629703p71814R67039N2473n29518L24528
5916B789319N11200J203680K51757j105606j84956J336969j781452l96800O3638
5907B687749n5679m37361O87767J713339K77672j907678r51609r0746O16927r79716
5897A560665L67006K645989j053610k067164n80880k58180J767860J569405m44085
5888C507006p7580K56972Q70932J94921Q64634k93681J374411m65500R83968o2722
5878G153361J343290n43412M50205q14823m07432o37862k37414k29517j382526
5869D693870o80940p01813M43620o6623O63524k0099j471603j79232J489540j00490
$$ plain form
5859 4069754 3089343 4731394 2889105 3186472 3471072 3224645 2692889 4089991 7049446
5850 7049446 6646210 6726356 7018558 6592084 8794462 8612042 8669963 7176405 4635491
5841 4635491 5096930 5025944 5279742 3568136 4203114 2045911 2726466 2354845 3077495
5832 3077495 3268300 2115096 912253 796890 1993685 1982100 1806768 3445591 3756563
5823 3756563 5631442 3885208 2749656 3756333 5787938 5470258 3334344 2239282
5815 2239282 4934105 5748277 5027544 4428522 2939401 2482181 1876168 1809581 3245804
5806 3245804 2798414 2272842 1761671 2184906 2671950 2661643 2336542 1961977 2941841 2892608
5796 2892608 3016261 699099 1286289 2646736 1955806 1411404 1848221 2052638 2000379
$$ packed form
5859D069754r80411J642051j842289K97367K84600k46427n31756J397102K959455
5850G049446m03236Q0146K92202m26474K202378j82420N7921j493558k540914
5841D635491M61439p0986K53798j711606O34978k157203O80555l71621P22650
5832C077495J90805j153204j202843j15363J196795j1585j75332J638823L10972
5823C756563J874879j746234j135552J006677K031605l17680k135914j095062
5815B239282K694823Q14172p20733n99022j489121m57220o06013o6587J436223
5806C245804m47390n25572n11171M23235M87044j0307l25101l74565R79864m9233
5796B892608J23653k317162N87190J360447o90930n44402M36817K04417n2259
$$ plain form
5787 2000379 2011790 420858 604516 1389681 -1099410 -2161822 -368326 674657 -1064260
5778 -1064260 40662 274567 151841 573980 414212 697565 839939 221004 -478336
5769 -478336 -614655 642095 2043688 1611781 1496304 944412 633812 -288069 -203488 1891175
5759 1891175 1258548 -339452 -313984 2666100 1532657 212163 -375843 358346 129145
5750 129145 -737270 1239712 1121298 2548 -586615 -1111949 -24387 1218552 430877
5741 430877 1141045 846105 -347443 597404 363437 1150504 1213333 971487 -308216 -449139
5731 -449139 -683873 -374635 -199843 -583172 -78902 1323576 2200296 1773940 1459220 -78088
5721 -78088 199315 1021465 1111144 1238710 1203753 1524243 1291079 1207378 1327447 1582975
$$ packed form
5787B000379J1411j590932J83658P85165k489091j062412J793496J042983j738917
5778a064260J104922K33905j22726M22139j59768K83353J42374o18935o99340
5769d78336j36319J256750J401593m31907j15477n51892l10600r21881Q4581K094663
5759A891175o32627j598000K5468K980084j133443j320494n88006P34189k29201
5750A29145q66415J976982j18414j118750n89163n25334J087562J242939p87675
5741D30877P10168k94940j193548R44847k33967P87067O2829k41846j279703j40923
5731d49139k34734L09238J74792l83329N04270J402478Q76720m26356l14720j537308
5721g8088K77403Q22150Q9679J27566l4957L20490k33164q3701J20069K55528
$$ plain form
5711 1582975 1536566 2468193 1257737 517118 531701 2041188 -20815 -786094 750144
5702 750144 31099 -591319 -64452 1105465 983009 2185521 1318762 1929954 3754290
5693 3754290 4069344 4179710 4344072 4175997 6090919 5945865 6396799 6828473 5208170
5684 5208170 3589547 3284732 3494114 3342650 2651099 3374215 2388295 1519191 1452082 1853307
5674 1853307 2818603 2418978 1456108 1413924 1055411 -426928 -2891 250785 967001 1387299
5664 1387299 1165360 1846738 973663 -321654 -737040 500989 72678 -787464 -1494453
5655 -1494453 -531694 -961713 -1417711 305214 793667 560618 527417 126976 171406 855207
5645 855207 509627 -54422 -299073 -605372 -704496 717204 1172577 -43273 448427 268333
$$ packed form
5711A582975m6409R31627j210456p40619J4583J509487k062003p65279J536238
5702G50144p19045o22418N26867J169917j22456J202512q66759O11192J824336
5693C754290L15054J10366J64362j68075J914922j45054M50934M31674j620303
5684E208170j618623l04815K09382j51464o91551P23116r85920q69104o7109M01225
5674A853307R65296l99625r62870m2184l58513j482339M24037K53676P16216M20298
5664A387299k21939O81378q73075j295317m15386J238029m28311q60142p06989
5655a494453R62759m30019m55998J722925M88453k33049l3201m00441M4430O83801
5645H55207l45580n64049k44651l06299r9124J421700M55373j215850M91700j80094
$$ plain form
5635 268333 290504 289260 714180 694030 2010608 2126423 1921543 955642 598341 786529
5625 786529 693672 484063 -156438 -1128294 336328 1378738 397750 847386 1862822
5616 1862822 1835091 942176 1162630 477788 2487099 3175451 2574974 2946990 2443326 2241562
5606 2241562 1426440 1810469 1757681 1017297 841204 1479049 799548 -232436 805550
5597 805550 2305391 2291219 594452 1844555 1424391 1076085 980639 918078 915422 105353
5587 105353 1684956 587978 -1559767 458663 631390 392752 -1319209 -1193537 -1216545
5578 -1216545 -496993 -1175893 -450982 -216371 -799345 417530 486401 -612057 686255
5569 686255 1363481 89345 -1354584 -925124 397440 1062636 70973 92542 -221102
$$ packed form
5635B68333K2171j244M24920k0150J316578J15815k04880r65901l57301J88188
5625G86529r2857k09609o40501r71856J464622J042410r80988M49636J015436
5616A862822k7731q92915K20454o84842K009311O88352o00477L72016n03664k01764
5606B241562q15122L84029n2788p40384j76093O37845o79501j031984J037986
5597H05550J499841j4172j696767J250103m20164l48306r5446o2561k656q10069
5587A05353J579603j096978k147745K018430J72727k38638j711961J25672k3008
5578a216545P19552o78900P24911K34611n82974J216875O8871j098458J298312
5569F86255O77226j274136j443929M29460J322564O65196r91663K1569l13644
$$ plain form
5560 -221102 -651739 -3260423 -2186273 1581254 535419 430698 1034317 2137366 2101103
5551 2101103 2068851 1648897 610535 1251948 1503767 392642 -290484 65629 723435
5542 723435 -285031 -683058 802343 792839 -136401 1899958 1919958 1112963 603588 1333325
5532 1333325 2297946 2628336 1408996 -364723 -576070 1146631 1240080 947098 862439
5523 862439 1158616 2347155 2385318 1988828 2686919 2987739 4106523 3215018 1977407
5514 1977407 1770678 1117539 2267317 2349134 1914171 954854 1087384 1294081 1459032 2072553
5504 2072553 502745 1547951 1462620 1080818 271725 1881581 2346834 2015404 3644433
5495 3644433 2865887 2910586 2247841 971365 1059438 737695 1730937 1960725 2350488 1532927
$$ packed form
5560b21102m30637k608684J074150L767527j045835j04721O03619J103049l6263
5551B101103l2252m19954j038362O41413K51819j111125o83126L56113O57806
5542G23435j008466l98027J485401r504r29240K036359K0000q06995n09375P29737
5532A333325R64621L30390j219340j773719k11347J722701R3449k92982q4659
5523H62439K96177J188539L8163l96490O98091L00820J118784q91505j237611
5514A977407k06729o53139J149778Q1817m34963r59317J32530K06697J64951O13521
5504B072553j569808J045206q5331l81802q09093J609856M65253l31430J629029
5495C644433p78546M4699o62745j276476Q8073l21743R93242K29788L89763q17561
$$ plain form
5485 1532927 594042 -103271 355308 1497934 2762993 4773776 5399505 2428214 1380667
5476 1380667 2002673 1177881 1681216 1258161 95185 1086486 1758705 1467272 3878647
5467 3878647 5055787 5025490 3689060 3846256 2004465 1270807 1851750 1729038 1633392
5458 1633392 1982192 806609 2085740 769233 -1628111 617654 1901159 687892
5450 687892 1598144 1447374 1482474 2157781 841454 2121071 3114216 2716986 3059803 3615569
5440 3615569 3166018 2181828 3080320 1932838 565519 1479928 2495197 1690846 3066998
5431 3066998 2223814 2477309 2561828 1825341 3349455 4005381 2289818 1981287 2982572
5422 2982572 1539392 1790775 1892887 543376 1140160 2651311 1865891 2409403 1957913
$$ packed form
5485A532927r38885o97313M58579J142626J265059K010783O25729k971291j047547
5476A380667O22006q24792N03335m23055j162976R91301O72219k91433K411375
5467C878647J177140l0297j336430J57196j841791p33658N80943j22712r5646
5458A633392L48800j175583J279131j316507k397344K245765J283505j213267
5450F87892R10252j50770L5100O75307j316327J279617R93145l97230L42817N55766
5440C615569m49551r84190Q98492j147482j367319R14409J015269q04351J376152
5431C066998q43184K53495Q4519p36487J524114O55926j715563l08531J001285
5422B982572j443180K51383J02112j349511N96784J511151p85420N43512m51490
$$ plain form
5413 1957913 3090778 2429273 2011451 1927694 3104160 2301756 1697461 1864136 2869044
5404 2869044 3123105 1283446 2243091 2731481 2916004 1796284 1961278 1951613 764702
5395 764702 1620110 1591606 2154852 2932404 2078177 1784334 3742880 2924432 2238198 393598
5385 393598 -12711 998147 1067107 504725 1460933 762819 -15101 543233 2762297 3783395
5375 3783395 2212791 1486938 1568849 1487393 1290011 2181323 883671 1426318 1084641 2036775
5365 2036775 1755694 1846288 2302477 1518433 1036218 2669459 2905634 3029351 2455436 3416966
5355 3416966 2657529 3358200 2719367 2700215 4477947 2989996 1601615 3010231 4206102
5346 4206102 4127061 3502861 2302548 1464144 247854 1362055 1183657 1708661 2918570
$$ packed form
5413A957913J132865o61505m17822q3757J176466q02404o04295J66675J004908
5404B869044K54061j839659R59645M88390J84523j119720J64994r665j186911
5395G64702Q55408k8504N63246P77552q54227k93843J958546q18448o86234j844600
5385C93598m06309J010858O8960n62382R56208o98114p77920N58334K219064J021098
5375C783395j570604p25853Q1911q1456j97382Q91312j297652N42647l41677R52134
5365B036775k81081R0594M56189p84044m82215J633241K36175J23717n73915R61530
5355C416966p59437P00671o38833j9152J777732j487951j388381J408616J195871
5346D206102p9041o24200j200313q38404j216290J114201j78398N25004J209909
$$ plain form
5337 2918570 2225395 2891063 3546191 2839201 2732505 1923389 2270746 3117525 2992896 2505865
5327 2505865 1216285 3140436 4862813 4326514 6238284 4668728 4063797 3815645 4772773
5318 4772773 3771964 3398300 3956733 3395519 2679819 2369451 330922 1061611 2294089
5309 2294089 3266960 2698955 2231589 2052431 3013323 2198854 3590409 5374932 5331578
5300 5331578 3763441 2027453 2513871 1825653 4059111 3994527 4872965 5494922 5763555
5291 5763555 4786904 4521432 4616087 4831623 4078875 5079958 6644313 5418421 5557303
5282 5557303 5040400 4675998 4247746 4060068 4939323 5753177 7057437 6401544 5624394
5273 5624394 5939452 5421067 4436213 6490112 6900919 7270486 8098138 7491110 7838803
$$ packed form
5337B918570o93175O65668O55128p06990j06696q09116L47357Q46779j24629m87031
5327B505865j289580J924151J722377n36299J911770j569556o04931k48152R57128
5318D772773j000809l73664N58433n61214p15700l10368k038529P30689J232478
5309B294089R72871n68005m67366j79158R60892q14469J391555J784523m3354
5300E331578j568137j735988M86418o88218K233458o4584Q78438O21957K68633
5291E763555r76651k65472R4655K15536p52748J001083J564355j225892J38882
5282E557303n16903l64402m28252j87678Q79255Q13854J304260o55893p77150
5273E624394L15058n18385r84854K053899M10807L69567Q27652o07028L47693
$$ plain form
5264 7838803 8650020 10547660 11404126 10128536 10777886 10244170 11157478 12232936 13273594
5255 13273594 13227073 14617507 16622029 17169504 18640516 21762876 24166362 24113864 27411367
5246 27411367 30400319 30076680 32157069 32995505 32384719 32454145 33725481 32723152 31393522
5237 31393522 31229347 28816641 26081103 23368718 21032963 19291672 17149653 16473889
5229 16473889 15397543 13797419 13688990 12837824 12343540 13293655 11124771 12333818 12639517
5220 12639517 11298500 9964898 9183976 9552834 7371611 9556713 11664720 10541046
5212 10541046 8095705 6863217 8986835 9641887 10404802 10344523 9074788 9317867 7855518
5203 7855518 8077242 9644468 9772587 11405761 10359131 9063223 8217017 8413684 8254999
$$ packed form
5264G838803Q11217J897640Q56466j275590O49350n33716R13308J075458J040658
5255A3273594m6521J390434K004522N47475J471012L122360K403486n2498L297503
5246B7411367K988952l23639K080389Q38436o10786O9426J271336j002329j329630
5237C1393522j64175k412706k735538k712385k335755j741291k142019o75764
5229A6473889j076346j600124j08429q51166m94284R50115k168884J209047L05699
5220A2639517j341017j333602p80922L68858k181223K185102K108007j123674
5212A0541046k445341j232488K123618O55052P62915o0279j269735K43079j462349
5203G855518K21724J567226J28119J633174j046630j295908q46206J96667j58685
$$ plain form
5194 8254999 9260146 9793317 11391787 11051273 10756895 13982263 13272980 14365692 12891552
5185 12891552 14803651 14849329 15819390 15562402 17323400 18303085 18973132 19610294 22261099
5176 22261099 23995339 25141308 26516535 30492567 34171397 38515385 41259038 43142612
5168 43142612 48001745 52190431 56718435 58978998 60253570 61219107 61137404 61265794 60580363
5159 60580363 60035201 56454584 51494080 47828854 44808112 39636528 36422223 33273107
5151 33273107 30475681 26810203 23317257 23137170 21227009 18804150 17851633 15806767
5143 15806767 12743852 12228164 12856157 13010129 12480775 12613729 12206312 10076471 8928653
5134 8928653 9390328 8446896 9062546 8328040 8695672 7630092 6418263 5422132 7273670
$$ packed form
5194H254999J005147N33171J598470l40514k94378L225368p09283J092712j474140
5185A2891552J912099M5678R70061k56988J760998R79685O70047O37162K650805
5176B2261099J734240J145969J375227L976032L678830M343988K743653J883574
5168D3142612M859133M188686M528004K260563J274572R65537q1703J28390o85431
5159F0580363n45162l580617m960504l665226l020742n171584l214305l149116
5151C3273107k797426l665478l492946j80087j910161k422859r52517k044866
5143A5806767l062915n15688O27993J53972n29354J32954m07417k129841j147818
5134H928653M61675r43432O15650p34506L67632j065580j211829r96131J851538
$$ plain form
5125 7273670 7389723 6232048 6951933 7066312 6610022 6816980 7188513 6539775 5662260
5116 5662260 4890601 4779778 5271256 4782840 5403255 4747642 3511686 3335902 5916740
5107 5916740 6059378 5342114 4620714 4891132 4422261 2619307 4062907 4433542 5014571
5098 5014571 6197429 4244101 4628912 4118439 3473731 4805568 5896056 4899317 4148706
5089 4148706 3886176 3726753 3301011 3649193 3041732 4086820 3495487 4470600 3892209
5080 3892209 3692710 4439965 4181339 4772571 4105989 6148477 5003676 4169065 3851468
5071 3851468 2762901 4478726 5557633 5560903 5134219 5571462 7127654 7033649 5322943
5062 5322943 3896534 2516085 4354924 4992012 4257394 4447247 5048878 3838046 3698284
$$ packed form
5125G273670J16053j157675P19885J14379m56290K06958L71533o48738q77515
5116E662260p71659j10823M91478m88416O20415o55613j235956j75784K580838
5107E916740J42638p17264p21400K70418m68871j802954J443600L70635N81029
5098E014571J182858j953328L84811n10473o44708J331837J090488r96739p50611
5089D148706k62530j59423m25742L48182o07461J045088n91333R75113n78391
5080C892209j99499P47255k58626N91232o66582K042488j144801q34611l17597
5071C851468j088567J715825J078907L270m26684M37243J556192r4005j710706
5062E322943j426409j380449J838839O37088p34618J89853O01631j210832j39762
$$ plain form
5053 3698284 2479853 3354402 4672356 3795218 4513320 4530738 4448488 4579934 4842797 5428792
5043 5428792 6815815 6405367 7318384 6354622 7094025 5922767 5486714 6535036 9194246
5034 9194246 9809353 10892654 11409095 10949681 9073299 9603143 9361168 11521777 11790404
5025 11790404 11234674 11665682 13489344 13844864 13064023 13123516 13487617 12819489 15813541
5016 15813541 17695352 17919920 17664927 18947282 20973528 25084919 27626821 30426214
5008 30426214 32882515 34761317 39662956 43956543 47925241 52316601 56995253 59854263
5000 59854263 63982735 63758011 63922666 63902721 64639819 61331006 56588146 53256749 48898734
4991 48898734 43582178 40308195 36797629 33199830 29631908 26735267 23836023 22135716
$$ packed form
5053C698284j218431Q74549J317954q77138P18102J7418q2250J31446K62863N85995
5043E428792J387023m10448R13017r63762P39403j171258m36053J048322K659210
5034I194246O15107J083301N16441m59414j876382N29844k41975K160609K68627
5025A1790404n55730M31008J823662L55520p80841N9493L64101o68128K994052
5016A5813541J881811K24568k54993J282355K026246M111391K541902K799393
5008C0426214K456301J878802M901639M293587L968698M391360M678652K859010
5000E9854263M128472k24724J64655j9945P37098l308813m742860l331397m358015
4991D8898734n316556l273983l510566l597799l567922k896641k899244j700307
$$ plain form
4983 22135716 18874031 15953761 16140262 16541259 13721056 13557985 12742253 11502986 12227700
4974 12227700 11979358 11913580 11191967 10812677 9425486 10123739 11467762 12646208 12681421
4965 12681421 11503711 11856621 11624000 11519778 9859888 8479638 8663419 10372450 9336354
4956 9336354 10140564 11702788 12683568 11504465 11539685 9534719 8278663 9081497 9993170
4947 9993170 11188426 13035148 14134205 13000251 11915385 10940404 12400960 13346821 13107459
4938 13107459 11575951 12491121 12865206 13560433 14560081 16279551 16346411 16570012 16708458
4929 16708458 19437960 21714476 24132358 25230582 28304818 30273595 32819590 34950168
4921 34950168 36414284 35572233 34188070 34490648 34552369 35184119 33076224 31465771 28568809
$$ packed form
4983B2135716l261685k920270J86501M00997k820203j63071q15732j239267P24714
4974A2227700k48342o5778p21613l79290j387191O98253J344023J178446L5213
4965A2681421j177710L52910k32621j04222j659890j380250J83781J709031j036096
4956I336354Q04210J562224R80780j179103L5220k004966j256056Q02834R11673
4947I993170J195256J846722J099057j133954j084866r74981J460556R45861k39362
4938A3107459j531508R15170L74085O95227R99648J719470O6860K23601J38446
4929A6708458K729502K276516K417882J098224L074236J968777K545995K130578
4921C4950168J464116q42051j384163L02578O1721O31750k107895j610453k896962
$$ plain form
4912 28568809 26740071 25239886 22980291 20681475 18940762 15945212 13261074 13089677
4904 13089677 10901975 9526087 10503310 9844384 9121002 7861835 8677585 7295086 6604909
4895 6604909 7637067 8508095 8874990 8383321 8393887 8601440 8966622 9004103 6959097 6539601
4885 6539601 5270646 6756515 7111194 6928541 7160913 5411821 5921876 7202621 7201357
4876 7201357 6666924 7398594 8241821 6916241 6264238 7877444 7011715 5346213 4718547
4867 4718547 5422697 4701805 4819640 3943024 4419130 5993109 7056157 5015771 4611829
4858 4611829 4922216 5836789 5188058 6586441 6977330 5258693 5736967 5316423 4061568
4849 4061568 5168169 6058146 6404564 7096804 5864095 5324468 2685927 5234834 4621961
$$ packed form
4912B8568809j828738j500185k259595k298816j740713k995550k684138j71397
4904A3089677k187702j375888R77223o58926p23382j259167Q15750j382499o90177
4895F604909J032158Q71028L66895m91669J0566K07553L65182L7481k045006m19496
4885F539601j268955J485869L54679j82653K32372j749092N10055J280745j264
4876G201357n34433P31670Q43227j325580o52003J613206q65729j665502o27666
4867D718547P04150p20892J17835q76616M76106J573979J063048k040386m03942
4858D611829L10387R14573o48731J398383L90889j718637M78274m20544j254855
4849D061568J106601Q89977L46418O92240j232709n39627k638541K548907o12873
$$ plain form
4840 4621961 4796721 5122856 3682221 3865549 4775842 5192146 3868298 3900250 4191747
4831 4191747 3812222 4325825 3895692 3570087 4453888 4347570 3844275 4539412 2221610
4822 2221610 2241398 6434298 5789074 6381231 4420004 2097882 2831856 5213482 4544882
4813 4544882 4033858 4743736 5724616 4963358 3455470 5311940 3651042 3791102 5269697
4804 5269697 4441433 4508806 5007168 5254081 5204884 2502834 2512258 4120315 4329736 4532974
4794 4532974 6224894 6270005 4110620 4596862 5054654 5368033 6121072 5781971 5396184
4785 5396184 6288953 5773907 4895289 3641217 3362427 4307335 3320540 2920737 4233939
4776 4233939 3819675 5016806 5318028 3846310 5283243 4811835 4712816 4819321 2777714
$$ packed form
4840D621961J74760L26135j440635J83328R10293M16304j323848L1952K91497
4831D191747l79525N13603m30133l25605Q83801j06318n03295O95137k317802
4822B221610J9788M192900o45224N92157j961227k322122P33974K381626o68600
4813D544882n11024P09878R80880p61258j507888J856470j660898J40060J478595
4804E269697q28264O7373M98362K46913m9197k702050R424J608057K09421K03238
4794D532974J691920M5111k159385M86242M57792L13379P53039l39101l85787
4785E396184Q92769n15046q78618j254072k78790R44908r86795l99803J313202
4776D233939m14264J197131L01222j471718J436933m71408r9019J06505k041607
$$ plain form
4767 2777714 5201147 4966375 5192766 3600516 3096060 4273938 3715998 1880211 1139854
4758 1139854 4050163 3065462 2848437 3929408 4511911 3224974 4142948 4469679 3409022
4749 3409022 3611864 3483697 4968611 5567850 4724136 4498587 4523612 2819829 2884078 4782556
4739 4782556 4387036 2898135 2291003 3403828 4811625 5197254 3926325 2984562 2576698
4730 2576698 3294431 4282539 5693902 4867362 6459332 6216161 5633141 5638035 5084133 3620920
4720 3620920 3542906 5742987 5300418 5168809 3914215 2348223 1944478 2933826 2034422
4711 2034422 4245225 4714808 5018244 6332153 5660524 6078762 5258061 5992025 5684590
4702 5684590 6052149 5884801 5043582 5118619 5148241 4352666 5583372 4517493 4835563 6375462
$$ packed form
4767B777714K423433k34772K26391j592250n04456J177878n57940j835787p40357
4758A139854K910309r84701k17025J080971N82503j286937R17974L26731j060657
4749C409022K02842j28167J484914N99239q43714k25549K5025j703783O4249J898478
4739D782556l95520j488901o07132J112825J407797L85629j270929r41763m07864
4730B576698P17733R88108J411363q26540J591970k43171n83020M894n53902j463213
4720C620920p8014K200081m42569j31609j254594j565992m03745R89348q99404
4711B034422K210803M69583L03436J313909o71629M18238q20701P33964l07435
4702E684590L67559j67348q41219P5037K9622p95575J230706j065879L18070J539899
$$ plain form
4692 6375462 6195628 5976097 5624246 6289381 5083538 4512323 3778345 3930020 4798259
4683 4798259 5464551 6057250 5592372 6414615 6559090 4382992 5348030 7006461 6606734
4674 6606734 5982834 4689857 4569070 5803668 6632854 5593794 4104866 3590457 4086651
4665 4086651 5902757 5393366 6229390 5611471 5310919 4522039 6031342 5520672 5613441
4656 5613441 4748038 5980709 7330535 7447847 7989141 7196889 7814906 7528648 7638958
4647 7638958 6291025 6090677 6067283 4641413 3461243 4493983 4505913 4787730 5883876
4638 5883876 6183917 5207234 5638567 5643191 4558090 4878871 5752024 6239840 5881573 6730729
4628 6730729 5600042 5496833 7127840 5452139 6621143 7608768 6558908 6992683 6476279
$$ packed form
4692F375462j79834k19531l51851O65135j205843n71215p33978J51675Q68239
4683D798259O66292N92699m64878Q22243J44475k176098R65038J658431l99727
4674F606734o23900j292977j20787J234598Q29186j039060j488928n14409M96194
4665D086651J816106n09391Q36024o17919l00552p88880J509303n10670R2769
4656E613441q65403J232671J349826J17312N41294p92252O18017k86258J10310
4647G638958j347933k00348k3394j425870j180170J032740J1930K81817J096146
4638E883876L00041r76683M31333M624j085101L20781Q73153M87816l58267Q49156
4628F730729j130687j03209J631007j675701J169004R87625j049860M33775n16404
$$ plain form
4619 6476279 7169559 7459623 6215233 8282841 8383946 7136416 6935099 8686327 8178946
4610 8178946 6516938 5049632 6386379 6250656 4197932 5993626 4413985 4073498 4430121
4601 4430121 4500041 5340952 5091390 5562146 4348382 4856808 4757499 4523204 6371467 7140494
4591 7140494 6304078 5637789 6172905 5097911 5498775 5969632 5479703 4721300 7138355
4582 7138355 7587816 6854239 5986641 4514644 6938901 6656183 8124605 7693713 7598042
4573 7598042 7409670 5802606 4450181 6278672 8343650 7325616 6960122 6903506 5758911
4564 5758911 5760440 4156416 5149571 7123539 8158805 6895426 6233876 7292034 7051611
4555 7051611 9556606 10031855 10559634 9201275 10102414 8380569 8425326 8227599 9156490
$$ packed form
4619F476279O93280K90064j244390K067608J01105j247530k01317J751228n07381
4610H178946j662008j467306J336747j35723k052724J795694j579641l40487L56623
4601D430121O9920Q40911k49562M70756j213764N08426r9309k34295J848263P69027
4591G140494q36416o66289N35116j074994M00864M70857m89929p58403K417055
4582G138355M49461p33577q67598j471997K424257k82718J468422m30892r5671
4573G598042j88372j607064j352425J828491K064978j018034l65494n6616j144595
4564E758911J529j604024R93155J973968J035266j263379o61550J058158k40423
4555G051611K504995M75249N27779j358359R01139j721845M4757j97727R28891
$$ plain form
4546 9156490 9918838 8709377 8469398 7703043 9029264 9208143 11282080 10169895 8840019
4537 8840019 7964560 7704821 8228422 6735774 6544166 7334233 8277924 6487164 7196249
4528 7196249 6928750 7809221 9259442 7764851 10119282 8093064 7432678 8968907 8042519
4519 8042519 8108428 8085531 8547455 10096515 11428072 8293895 8937732 8641224 9205478
4510 9205478 9343369 9249801 9559282 8556292 9780455 9939605 10591238 10892855 9639292
4501 9639292 9136407 10819993 11890396 12227346 12944692 12344456 11892706 12329173 13006224
4492 13006224 11398305 11117804 11215907 10532006 11077992 12094059 12282681 13679534 13359431
4483 13359431 11699094 12474717 11287499 13000164 13375470 12648217 12923027 11725921 12649852
$$ packed form
4546I156490P62348j209461k39979p66355J326221J78879K073937j112185j329876
4537H840019q75459k59739N23601j492648j91608P90067R43691j790760P09085
4528G196249k67499Q80471J450221j494591K354431k026218o60386J536229r26388
4519H042519O5909k2897M61924J549060J331557l134177O43837k96508N64254
4510I205478J37891r3568L09481j002990J224163J59150O51633L01617j253563
4501I639292n02885J683586J070403L36950P17346o00236m51750M36467O77051
4492A3006224j607919k80501R8103o83901N45986J016067J88622J396853l20103
4483A3359431j660337P75623j187218J712665L75306p27253K74810j197106R23931
$$ plain form
4474 12649852 11527598 11723561 11621640 11899193 13012798 11424438 11121223 12362277 13774084
4465 13774084 11754687 10619362 11347237 10330346 10869229 11673008 10342877 11184488 12893802
4456 12893802 14384936 14000381 13449478 11552167 13236531 13458782 11672978 11252090 10573715
4447 10573715 11592882 13020273 13211491 11800080 11011596 10435659 11290104 12288547 11892253
4438 11892253 10454854 10827593 10564851 10299483 10437979 10375665 11566412 10125376 10404546
4429 10404546 10930787 11246744 10630831 12051770 10982378 9802237 10128190 12058333 14488994
4420 14488994 13749960 13524248 13303216 13989179 13614001 12176743 11135617 13567209 14468591
4411 14468591 13802921 14255532 13424884 13980325 15190453 14834983 14094997 14117608 14026215 14355638
$$ packed form
4474A2649852j122254J95963j01921K77553J113605j588360l03215J241054J411807
4465A3774084k019397j135325P27875j016891N38883Q03779j330131Q41611J709314
4456A2893802J491134l84555n50903j897311J684364K22251j785804m20888o78375
4447A0573715J019167J427391J91218j411411p88484n75937Q54445R98443l96294
4438A1892253j437399L72739k62742k65368J38496o2314J190747j441036K79170
4429A0404546N26241L15957o15913J420939j069392j180141L25953J930143K430661
4420A4488994p39034k25712k21032O85963l75178j437258j041126K431592R01382
4411A4468591o65670M52611q30648N55441J210128l55470p39986K2611r1393L29423
$$ plain form
4401 14355638 13231680 12950151 14745248 15684638 13896974 12969291 14366092 14230712 15454221
4392 15454221 14717763 14785248 15191360 14180989 14388286 14684786 15506557 15007499 15723475
4383 15723475 15653087 14902083 15965708 14943766 14237158 15968483 15996323 16207875 16963488
4374 16963488 15881946 15253166 16522458 17465387 16826233 17174559 17368186 17205521 18156841
4365 18156841 18159827 17772980 17965559 16780501 16686667 17360934 17209934 16827289 15667013 15420116
4355 15420116 16624798 16989496 16658388 16982667 18927974 18598584 19566463 20564326 18499721
4346 18499721 19065064 19520639 19425383 20313191 20731920 21131358 20600548 21348129 21234292 22539269
4336 22539269 21695311 22990345 22682103 21216261 21632323 20160369 21041478 21809592 21590784
$$ packed form
4401A4355638j123958k81529J795097R39390j787664r27683J396801j35380J223509
4392A5454221p36458O7485M06112j010371K07297K96500Q21771m99058P15976
4383A5723475p0388p51004J063625j021942p06608J731325K7840K11552P55613
4374A6963488j081542o28780J269292R42929o39154L48326J93627j62665R51320
4365A8156841K986l86847J92579j185058r3834O74267j51000l82645j160276k46897
4355A5420116J204682L64698l31108L24279J945307l29390R67879R97863k064605
4346A8499721N65343M55575r5256Q87808M18729L99438n30810P47581j13837J304977
4336B2539269q43958J295034l08242j465842M16062j471954Q81109P68114k18808
$$ plain form
4327 21590784 23496438 24537528 23531367 23754626 24020319 24597043 25422140 27424673 26750481
4318 26750481 26364321 27541691 27487544 28637198 28771404 27934209 29709266 30816982 30896906
4309 30896906 31174020 30453927 32580196 34081599 34225511 35275566 36587466 37163138 37277915
4300 37277915 35849813 38620358 39118098 38864518 39555280 41659959 44771914 47299545 48263427
4291 48263427 50182937 50554171 50073103 53759748 55379475 57992174 58960017 60954793 64947148
4282 64947148 68152587 69393549 73004459 78586216 84118638 88198214 94174080 100912316
4274 100912316 109574060 120976676 132844712 144742667 161208960 182285458 206879060
4267 206879060 238166465 275439695 316039118 359759898 395765822 409509601 395731507
$$ packed form
4327B1590784J905654J041090j006161K23259K65693N76724Q25097K002533o74192
4318B6750481l86160J177370n4147J149654J34206q37195J775057J107716P9924
4309C0896906K77114p20093K126269J501403J43912J050055J311900N75672J14777
4300C7277915j428102K770545M97740k53580O90762K104679L111955K527631R63882
4291D8263427J919510L71234m81068L686645J619727K612699R67843J994776L992355
4282F4947148L205439J240962L610910N581757N532422M079576N975866O738236
4274A00912316Q661744J1402616J1868036J1897955J6466293K1076498K4593602
4267B06879060L1287405L7273230M0599423M3720780L6005924J3743779j3778094
$$ plain form
4260 395731507 359635252 315018111 271251904 235872385 208269320 184526391 167045218
4253 167045218 152532838 143236823 136193242 132982757 129675483 127845880 129329797 130396078
4245 130396078 126063051 119718230 110978709 102035057 94007031 89280879 83408639 77482952
4237 77482952 73660950 70006290 66152658 62636157 60569251 56413308 55700973 54652956
4229 54652956 53441429 52004367 50419978 49558813 48657938 47880985 46772203 45881039 46126668
4220 46126668 44840750 44183397 43710482 42151145 41853321 39984810 39347802 39799813 39233166
4211 39233166 38618498 37156104 38556623 39445634 37696825 38612284 41101274 37151678 35990545
4202 35990545 36395574 35419018 35203724 38215313 39297195 37338554 37400938 35986252 33757716
$$ packed form
4260C95731507l6096255m4617141m3766207l5379519k7603065k3742929j7481173
4253A67045218j4512380r296015p043581l210485l307274j829603J483917J066281
4245A30396078m333027o344821q739521q943652q028026m726152n872240n925687
4237G7482952l822002l654660l853632l516501k066906m155943p12335j048017
4229E4652956j211527j437062j584389q61165r00875p76953j108782q91164K45629
4220D6126668j285918o57353m72915j559337k97824j868511o37008M52011n66647
4211C9233166o14668j462394J400519Q89011j748809R15459K488990l949596j161133
4202C5990545M05029r76556k15294L011589J081882j958641O2384j414686k228536
$$ plain form
4193 33757716 34685678 35383349 34446939 34032953 34599959 33200626 34533695 34951421 35314505
4184 35314505 33808443 33007508 33516409 33596904 34116617 34471498 34663649 34823767 35497368
4175 35497368 35580482 38423161 38771340 39459461 41896165 44574635 46128394 49110823 53986176
4166 53986176 56594612 60333066 63268590 62907823 60819967 57751460 51041927 46972183
4158 46972183 44267786 42389632 40712093 37864092 36352819 34588646 35544705 34551574
4150 34551574 34823028 36206183 34051828 33938043 34434675 33342264 32153180 31768831 32157923
4141 32157923 33785646 32480281 30467120 31958364 32081683 29884510 30554011 29854712 30464428
4132 30464428 32253910 30944005 32022410 32599157 33131312 32274720 33199430 33766074 34740140
$$ packed form
4193C3757716R27962O97671r36410m13986N67006j399333J333069M17726L63084
4184C5314505j506062q00935N08901Q0495N19713L54881J92151J60118O73601
4175C5497368Q3114K842679L48179O88121K436704K678470J553759K982429M875353
4166E3986176K608436L738454K935524l60767k087856l068507o709533m069744
4158D6972183k704397j878154j677539k848001j511273j764173R56059r93131
4150C4551574K71454J383155k154355j13785M96632j092411j189084l84349L89092
4141C2157923J627723j305365k013161J491244J23319k197173O69501o99299O09716
4132C0464428J789482j309905J078405N76747N32155q56592R24710N66644R74066
$$ plain form
4123 34740140 34411978 34122387 35286909 35455295 32738928 32290831 32718496 32992936 34265881
4114 34265881 35603544 34923592 35820129 37109752 36865130 37196314 38859792 39534385 38096270
4105 38096270 38803749 39363907 39182652 38936415 38560278 39994216 40651849 39590448 41362287
4096 41362287 42355103 43316347 43108255 44332377 46365756 47919701 48148571 49973878 55130186
4087 55130186 57483904 59809517 62617714 65257397 69994411 75253883 79391244 80387056
4079 80387056 78413023 76621831 72992430 72647047 72941028 71943271 73616437 74445819 77293050
4070 77293050 80351050 82398714 86204735 90464686 96543269 102526548 110025080 118280001
4062 118280001 128634400 140544155 155205936 173054712 192658450 215519755 239727861
$$ packed form
4123C4740140l28162k89591J164522J68386k716367m48097M27665K74440J272945
4114C4265881J337663o79952Q96537J289623k44622L31184J663478O74593j438115
4105C8096270P07479N60158j81255k46237l76137J433938O57633j061401J771839
4096D1362287R92816R61244k08092J224122K033379J553945K28870J825307N156308
4087E5130186K353718K325613K808197K639683M737014N259472M137361R95812
4079H0387056j974033j791192l629401l45383K93981r97757J673166Q29382K847231
4070G7293050L058000K047664L806021M259951O078583N983279P498532Q254921
4062A18280001J0354399J1909755J4661781J7848776J9603738K2861305K4208106
$$ plain form
4055 239727861 260583899 278735535 296422387 313342096 322178006 320559028 311680818
4048 311680818 297408313 280384822 261520060 241021438 219233983 198051067 175591856
4041 175591856 156214635 141813574 129250857 116766670 108848174 102008089 94358698
4034 94358698 89315667 84750614 80385329 78018580 75364418 74198438 72751095 71067052
4026 71067052 69562881 69305427 69873097 67336454 62822650 61827920 60787881 61041172 59970942
4017 59970942 58875916 59778273 59765491 58211371 57807737 56437391 54741111 53219634 53159212
4008 53159212 53988834 52700974 52589475 50501306 53044472 54187997 52718652 54366505
4000 54366505 54628314 55406162 56904717 57601110 59214731 59494080 60559736 60963025 62627804
$$ packed form
4055B39727861K0856038J8151636J7686852J6919709Q835910j618978q878210
4048C11680818j4272505j7023491j8864762k0498622k1787455k1182916k2459211
4041A75591856j9377221j4401061j2562717j2484187p918496o840085p649391
4034I4358698n043031m565053m365285k366749k654162j165980j447343j684043
4026G1067052j504171k57454N67670k536643m513804r94730j040039K53291j070230
4017E9970942j095026R02357j2782j554120m03634j370346j696280j521477o0422
4008E3159212Q29622j287860j11499k088169K543166J143525j469345J647853
4000E4366505K61809P77848J498555O96393J613621K79349J065656M03289J664779
$$ plain form
3991 62627804 65173509 66913263 68172587 67351070 67631330 68803936 69912669 71444976
3983 71444976 69836486 69992512 70511356 73867570 74060655 76005059 79515855 81229229 83980108
3974 83980108 84766754 88884093 94181369 100817226 104829652 109386843 114489778 121939872
3966 121939872 131787952 143246765 156239996 173318847 192119965 214348308 242675564
3959 242675564 278234539 323652558 369640382 409512865 424314144 405963340 365679328
3952 365679328 317963967 272020216 232765947 204598463 179695286 158864752 142588843
3945 142588843 129745212 120346426 110209803 101781334 94830085 90892088 86472709 81183490
3937 81183490 79659135 76515476 73925762 72009728 69580706 67617601 66946037 66288702
$$ packed form
3991F2627804K545705J739754J259324q21517K80260J172606J108733J532307
3983G1444976j608490J56026N18844L356214J93085J944404L510796J713374K750879
3974H3980108P86646M117339N297276O635857M012426M557191N102935P450094
3966A21939872R848080J1458813J2993231J7078851J8801118K2228343K8327256
3959B42675564L5558975M5418019M5987824L9872483J4801279j8350804m0284012
3952C65679328m7715361m5943751l9254269k8167484k4903177k0830534j6275909
3945A42588843j2843631r398786j0136623q428469o951249l937997m419379n289219
3937H1183490j524355l143659k589714j916034k429022j963105o71564o57335
$$ plain form
3929 66288702 66474845 62462156 61060224 60487174 58530049 57653669 58667277 60776973 61137684
3920 61137684 61712582 61732435 63517545 65210354 67353085 68367234 69500809 69021270 65108951
3911 65108951 62313694 60507602 57005246 54092029 50989650 49866119 50621091 48323406
3903 48323406 46050128 45422182 44788586 45007539 42700235 43561285 45462846 48457257 48601408
3894 48601408 48414632 51247976 52336102 53960768 56359447 57536241 53904872 51708945
3886 51708945 49101690 45961956 43725923 41088578 38991783 35748900 35203757 32834764
3878 32834764 33339251 33631351 33077990 32657168 31845503 31256175 31118834 32025718 30372644
3869 30372644 33478575 32400519 30957281 31025635 32309237 33557959 31967562 31550075 32752548
$$ packed form
3929F6288702J86143m012689j401932n73050j957125q76380J013608K109696L60711
3920F1137684N74898J9853J785110J692809K142731J014149J133575m79539l912319
3911F5108951k795257j806092l502356k913217l102379j123531P54972k297685
3903D8323406k273278o27946o33596K18953k307304Q61050J901561K994411J44151
3894D8601408j86776K833344J088126J624666K398679J176794l631369k195927
3886E1708945k607255l139734k236033k637345k096795l242883n45143k368993
3878C2834764N04487K92100n53361m20822q11665n89328j37341R06884j653074
3869C0372644L105931j078056j443238O8354J283602J248722j590397m17487J202473
$$ plain form
3860 32752548 32240295 29496445 30042292 30892582 30287098 29321145 29015380 29225157 29306802
3851 29306802 27899755 27012749 29310986 29686782 30170069 29259404 27206628 28088754 28404108
3842 28404108 27996564 27413973 29064723 29741394 30394101 29302432 28127495 29091308 29818164
3833 29818164 29342720 31066954 32885452 30586109 30405895 31203022 30102691 30686188 31905955
3824 31905955 31334826 32460277 32446221 33269902 34089612 34957679 35302322 37257003 39177331
3815 39177331 40057577 41562871 46335786 51566990 52616175 52201270 52148155 50780404 48270589
3806 48270589 46055153 42704096 40814392 37327814 36809872 36874106 36448313 36233311 36532529
3797 36532529 36837409 36874765 37750536 38000207 38373795 39466615 39393977 41613256 42479420
$$ packed form
3860C2752548n12253k743850N45847Q50290o05484r65953l05765K09777Q1645
3851B9306802j407047q87006K298237L75796M83287r10665k052776Q82126L15354
3842B8404108m07544n82591J650750O76671O52707j091669j174937R63813P26856
3833B9818164m75444J724234J818498k299343j80214P97127j100331N83497J219767
3824C1905955n71129J125451j4056Q23681Q19710Q68067L44643J954681J920328
3815C9177331Q80246J505294M772915N231204J049185m14905n3115j367751k509815
3806D8270589k215436l351057j889704l486578n17942O4234m25793k15002K99218
3797C6532529L04880L7356Q75771K49671L73588J092820p2638K219279Q66164
$$ plain form
3788 42479420 44072181 47396486 48585034 49289929 48795268 48470491 46215168 42555151 41963208
3779 41963208 42304067 40299593 39764791 39352922 37211017 36546724 34149853 34894147 35842669
3770 35842669 34980968 35908268 35106568 34774151 35479432 35415127 36355035 36246171 35678853 36202970
3760 36202970 35807162 35419243 35909749 36376117 36183979 37294475 38177509 38491120 37440779
3751 37440779 35797571 36051484 37006149 37200125 36606321 38358451 38772896 36296303 36016137
3742 36016137 37524463 38675895 38243294 39755436 39779355 37989058 38112867 40059090 39367789
3733 39367789 39412684 39129438 39011642 38089929 40483884 40043176 40435614 40026082 39830064
3724 39830064 39760237 40503660 41554702 40704977 42479003 41664783 42314927 44193896 44681886
$$ packed form
3788D2479420J592761L324305J188548P04895m94661l24777k255323l660017n91943
3779D1963208L40859k004474n34802m11869k141905o64293k396871P44294R48522
3770C5842669q61701R27300q01700l32417P05281o4305R39908j08864n67318N24117
3760C6202970l95808l87919M90506M66368j92138J110496Q83034L13611j050341
3751C7440779j643208K53913R54665J93976n93804J752130M14445k476593k80166
3742C6016137J508326J151432m32601J512142K3919j790297J23809J946223o91301
3733C9367789M4895k83246j17796r21713K393955m40708L92438m09532j96018
3724C9830064o9827P43423J051042q49725J774026q14220O50144J878969M87990
$$ plain form
3715 44681886 45414577 45198331 44697250 45024760 45274311 46782900 48437722 49198925 50356447
3706 50356447 50528574 49737934 51429856 51692930 51359531 52090384 53195321 53485446 52761550
3697 52761550 53943768 54897872 54655681 53862755 53970029 53677030 54287031 55859780 55914533
3688 55914533 56055303 56690982 58012615 58654144 58421834 58522507 60467029 59937366 59737902
3679 59737902 60630042 61075086 61713611 62138136 63686451 62903012 63196684 62510772 63160700
3670 63160700 65513578 66998854 66848260 64261076 64622186 64633640 66217672 67534320 67634288
3661 67634288 66236738 66585564 68601978 68499502 69116283 68716653 67880219 67659222 67024131
3652 67024131 67626262 66597920 67156184 67333486 66908401 66957789 69059333 69105763 70761965
$$ packed form
3715D4681886P32691k16246n01081L27510K49551J508589J654822P61203J157522
3706E0356447J72127p90640J691922K63074l33399P30853J104937K90125p23896
3697E2761550J182218R54104k42191p92926J07274k92999O10001J572749N4753
3688E5914533J40770O35679J321633O41529k32310J00673J944522n29663j99464
3679E9737902Q92140M45044O38525M24525J548315p83439K93672o85912O49928
3670F3160700K352878J485276j50594k587184L61110J1454J584032J316648R9968
3661F7634288j397550L48826K016414j02476O16781l99630q36434k20997o35091
3652F7024131O02131j028342N58264J77302m25085M9388K101544M6430J656202
$$ plain form
3643 70761965 71798061 72504164 74369323 74989990 73598064 74635792 72638286 72883193 73669810
3634 73669810 74266229 73481736 73135650 72340022 70844394 70192132 70750471 71066352 69661034
3625 69661034 69825546 69235252 70383742 71485882 71165608 69300238 69301055 69816915 71877452
3616 71877452 72648456 71747492 70175944 71199047 71472310 69958147 69377425 69775040 70301536
3607 70301536 71450523 70583867 69783203 69145891 68224767 68866461 68540878 67206257 66315878
3598 66315878 67124667 67976480 66767738 66296797 65553915 66000520 65559602 64879424 64823615
3589 64823615 65764309 63925640 62959482 64421983 64649626 64355781 65207076 65069988 64449732
3580 64449732 62546564 62812775 62602691 62238621 61731501 62622183 62136707 61751912 60686275
$$ packed form
3643G0761965J036096P06103J865159O20667j391926J037728j997506K44907P86617
3634G3669810N96419p84493l46086p95628j495628o52262N58339L15881j405318
3625F9661034J64512n90294J148490J102140l20274j865370Q17N15860K060537
3616G1877452P71004r00964j571548J023103K73263j514163n80722L97615N26496
3607G0301536J148987q66656q00664o37312r21124O41694l25583j334621q90379
3598F6315878Q08789Q51813j208742m70941p42882M46605m40918o80178n5809
3589F4823615R40694j838669r66158J462501K27643k93845Q51295j37088o20256
3580F4449732j903168K66211k10084l64070n07120Q90682m85476l84795j065637
$$ plain form
3571 60686275 62271221 63235085 61717960 60485627 59414379 60774788 60517291 61587159
3563 61587159 60397867 59368589 58521715 58734144 59325737 58951035 59834276 59813193 60529581
3554 60529581 60325340 60756920 61740181 60453127 60247369 60805040 59474141 60374258 59622415
3545 59622415 57697076 57830684 58855156 59696206 57448233 58651908 57160887 56411715 56479304
3536 56479304 55682383 56393472 56725664 56353318 56020085 54773644 55584315 55320768 54582917
3527 54582917 54631407 55441779 55501758 54495737 54310913 52641357 52773536 53823161 54850464
3518 54850464 54546069 55608106 57866771 56931632 56337786 54688087 53944886 53502118 53544401
3509 53544401 55234203 55015553 54034495 54140317 53366309 53525595 54432383 54357883 54675240
$$ packed form
3571F0686275J584946R63864j517125j232333j071248J360409k57497J069868
3563F1587159j189292j029278q46874K12429N91593l74702Q83241k1083P16388
3554F0529581k04241M31580R83261j287054k05758N57671j330899R00117p51843
3545E9622415j925339J33608J024472Q41050k247973J203675j491021p49172O7589
3536E6479304p96921P11089L32192l72346l33233j246441Q10671k63547p37851
3527E4582917M8490Q10372N9979j006021j84824j669556J32179J049625J027303
3518E4850464l04395J062037K258665r35139n93846j649699p43201m42768M2283
3509E3544401J689802k18650r81058J05822p74008J59286R06788p4500L17357
$$ plain form
3500 54675240 53819317 53747926 52966052 53759460 53907454 53875189 55362741 54778889 52623499
3491 52623499 54544094 54468052 53914471 52751537 52304785 54187110 55190727 55625742 54581263
3482 54581263 54066693 52221216 54195981 56092128 55798584 55133481 54765540 53846058 53918558
3473 53918558 55278517 56067072 56480207 55819527 55502367 55925522 55703568 57061593 55849746
3464 55849746 54825028 56347935 55646407 54773427 55777334 55312927 55658292 58854715 58173259
3455 58173259 56074117 57909324 58063856 59924426 61268455 61167539 62602352 62905207 63511859
3446 63511859 65705198 68393285 68620700 71985360 74240849 74002492 74477113 76266272 75881885
3437 75881885 77892684 78575618 81232657 84605701 86831553 88545962 87666903 86798740 85333519
$$ packed form
3500E4675240q55923p1391p81874P93408J47994l2265J487552n83852k155390
3491E2623499J920595p6042n53581j162934m46752J882325J003617M35015j044479
3482E4581263n14570j845477J974765J896147k93544o65103l67941r19482P2500
3473E3918558J359959P88555M13135o60680l17160M23155k21954J358025j211847
3464E5849746j024718J522907p01528q72980J003907m64407L45365L196423o81456
3455E8173259k099142J835207J54532J860570J344029j00916J434813L02855O06652
3446F3511859K193339K688087K27415L364660K255489k38357M74621J789159l84387
3437G5881885K010799O82934K657039L373044K225852J714409q79059q68163j465221
$$ plain form
3428 85333519 80784984 77487062 76592317 75562194 75279775 75229800 75003908 74140446 73823593
3419 73823593 73959066 75389491 76833012 78049819 78159967 80970715 83585217 86392593
3411 86392593 86844907 88823123 90510205 89660401 88024570 87547381 85700142 81975406 80406336
3402 80406336 80614436 78173725 78905014 78425764 78051521 77729551 78474058 78921421 77803619
3393 77803619 79292044 80060594 80610932 80361524 80854030 83137516 83459628 84464088 85857815
3384 85857815 90294518 95661656 99463519 105559869 112993701 122183636 131395604 136802503
3376 136802503 139471720 137724672 128381524 121507012 114953630 108685311 103084281 100073054
3368 100073054 97766147 97422322 96878896 97539142 96919288 95022393 91704296 87161835 84824342
$$ packed form
3428H5333519m548535l297922q94745j030123k82419m9975k25892q63462l16853
3419G3823593J35473J430425J443521J216807J10148K810748K614502K807376
3411H6392593M52314J978216J687082q49804j635831m77189j847239l724736j569070
3402H0406336K08100k440711P31289m79250l74243l21970P44507M47363j117802
3393G7803619J488425P68550N50338k49408M92506K283486L22112J004460J393727
3384H5857815M436703N367138L801863O096350P433832R189935R211968N406899
3376A36802503K669217j747048r343148o874512o553382o268319n601030l011227
3368A00073054k306907l43825n43426O60246o19854j896895l318097m542461k337493
$$ plain form
3359 84824342 83945928 83288305 82112174 84189921 84340448 82974587 82745117 84300175 83569749
3350 83569749 82523532 84191040 84879105 85630573 85842852 85821400 85532817 85763743 83696772
3341 83696772 84069877 85984239 87018208 88396271 87695179 88713014 90311318 91464345
3333 91464345 92308058 89619842 91031980 92718843 93945886 94847585 95892437 95869559 97504670
3324 97504670 97389446 97015031 97384798 99615143 99918545 100074778 104383993 105141073 105256868
3315 105256868 105119661 106100598 108758726 109132631 109935194 113817510 117266786 118499848 120405222
3306 120405222 121596725 121739527 122273018 120344389 121890087 123996558 124921118 124943144 124903483
3297 124903483 126253263 127049433 128598297 131300680 133078714 133926223 135863522 137695137
$$ packed form
3359H4824342q78414o57623j176131K077747J50527j365861k29470J555058p30426
3350H3569749j046217J667508O88065P51468K12279k1452k88583K30926k066971
3341H3696772L73105J914362J033969J378063p01092J017835J598304J153027
3333I1464345Q43713k688216J412138J686863J227043R01699J044852k2878J635111
3324I7504670j15224l74415L69767K230345L03402J56233M309215P57080J15795
3315A05256868j37207R80937K658128L73905Q02563L882316L449276J233062J905374
3306A20405222J191503J42802N33491j928629J545698K106471R24560K2026l9661
3297A24903483J349780P96170J548864K702383J778034Q47509J937299J831615
$$ plain form
3289 137695137 138325901 139858310 142505483 146267340 148988823 151751606 153314185 156392435
3281 156392435 161424566 165022099 166197678 169944095 172973028 176143012 179571783 182644200
3273 182644200 187020870 190627687 193471472 197609970 203326382 208513533 214786471 221391518
3265 221391518 228998577 236669392 244324137 251941557 259076811 268341104 279206813 290191970
3257 290191970 301082026 313552840 326283276 340125921 349534261 358203123 366809880
3250 366809880 372722875 375355030 372275272 364366015 353002196 336366446 318974790 304152748
3242 304152748 289687122 274603902 261361630 251108372 240313116 230699922 222641638
3235 222641638 214283363 208362884 203091881 197700126 191330468 185852560 180517803 176379712
$$ packed form
3289A37695137O30764J532409K647173L761857K721483K762783J562579L078250
3281A56392435N032131L597533J175579L746417L028933L169984L428771L072417
3273A82644200M376670L606817K843785M138498N716412N187151O272938O605047
3265B21391518P607059P670815P654745P617420P135254R264293J0865709J0985157
3257B90191970J0890056J2470814J2730436J3842645R408340Q668862Q606757
3250C66809880N912995K632155l079758p909257j1363819j6635750j7391656j4822042
3242C04152748j4465626j5083220j3242272j0253258j0795256r613194q058284
3235B22641638q358275n920479n271003n391755o369658n477908n334757m138091
$$ plain form
3227 176379712 173632901 169497634 167732090 165267468 162833925 159251639 155634732 152455378
3219 152455378 152362956 152205959 150233609 147623814 144587553 141668056 140284286 139043855
3211 139043855 135692469 132014027 130466029 128629818 127387438 123733125 122316996 119806753
3203 119806753 118013071 116176155 114087804 112623349 110468511 110822887 108920630 108375052
3195 108375052 106276375 103431662 103389996 102268322 100770529 101172629 99723583 98559182
3187 98559182 98218440 95810736 93403870 93869725 92919356 91326455 90675402 90821862 88251198
3178 88251198 87388842 88523916 87877893 86735357 85505660 83894602 84045033 83001232 81993774
3169 81993774 81618016 80244009 80223560 81762371 82275495 78651178 78314907 77772498 78500585
$$ packed form
3227A76379712k746811m135267j765544k464622k433543l582286l616907l179354
3219A52455378r2422j56997j972350k609795l036261k919497j383770j240431
3211A39043855l351386l678442j547998j836211j242380l654313j416129k510243
3203A19806753j793682j836916k088351j464455k154838L54376j902257n45578
3195A08375052k098677k844713m1666j121674j497793M02100j449046j164401
3187I8559182l40742k407704k406866M65855r50369j592901o51053J46460k570664
3178H8251198q62356J135074o46023j142536j229697j611058J50431j043801j007458
3169H1993774l75758j374007k0449J538811N13124l624317l36271n42409P28087
$$ plain form
3160 78500585 77230220 76099519 76822015 77123135 75620752 73536463 73963876 74304157 72738663
3151 72738663 72145325 72687521 71323335 70201579 70676180 70956236 71638251 69499568 68782981
3142 68782981 67977176 67446630 67981630 67562379 66471286 65533385 67710173 65200998 64531298
3133 64531298 63819137 63179386 63106824 62048405 60693920 62033635 62571737 62171838 61104047
3124 61104047 61413949 60896462 60340148 60550992 60667773 60548284 58690579 57348152 56446577
3115 56446577 57328924 58593897 57195606 57380171 57581700 56469727 55990259 55409988 54523123
3106 54523123 55901384 56489100 56846106 56970430 54370843 53770761 54123348 56374978 55695986
3097 55695986 55477566 52844512 52165028 51669650 51076217 52343966 53425034 53294382 50373153
$$ packed form
3160G8500585j270365j130701P22496L01120j502383k084289M27413L40281j565494
3151G2738663n93338N42196j364186j121756M74601K80056O82015k138683p16587
3142F8782981q05805n30546N35000m19251j091093r37901K176788k509175o69700
3133F4531298p12161o39751p2562j058419j354485J339715N38102l99899j067791
3124F1104047L09902n17487n56314K10844J16781j19489j857705j342427r01575
3115E6446577Q82347J264973j398291J84565K01529j111973m79468n80271q86865
3106E4523123J378261N87716L57006J24324k599587o00082L52587K251630o78992
3097E5695986k18420k633054o79484m95378n93433J267749J081068j30652k921229
$$ plain form
3088 50373153 49611099 50142654 51242702 52514001 52432162 51540683 50164279 50322885 50023818
3079 50023818 49374121 47427014 45733208 48256677 49612065 48548174 48356087 48700245 49451394
3070 49451394 48768390 47696162 47586715 47893948 48732390 47936937 46702290 46663443 47247545
3061 47247545 48787184 49018694 47066777 46694294 46276776 46918234 46810631 45910093 47176475
3052 47176475 47150648 46924291 47022776 44854418 45807083 47474886 48038958 47188310 46098981
3043 46098981 46115776 45365195 45110810 44183918 45870202 46535421 46427777 45952001 45977276 44548197
3033 44548197 46979860 47869075 46718338 47150037 46575026 48354760 48814619 47964432 47075090
3024 47075090 47872505 49416415 50063156 51196869 52151025 52955889 52219627 53593638 54735210
$$ packed form
3088E0373153p62054N31555J100048J271299q1839q91479j376404J58606k99067
3079E0023818o49697j947107j693806K523469J355388j063891j92087L44158P51149
3070D9451394o83004j072228j09447L07233Q38442p95453j234647l8847N84102
3061D7247545J539639K31510j951917l72483m17518O41458j07603r00538J266382
3052D7176475k5827k26357R8485k168358R52665J667803N64072q50648j089329
3043D6098981J6795p50581k54385r26892J686284O65219j07644m75776K5275j429079
3033D4548197K431663Q89215j150737M31699n75011J779734M59859q50187q89342
3024D7075090P97415J543910O46741J133713R54156Q04864p36262J374011J141572
$$ plain form
3015 54735210 54264965 55688618 56145375 56939754 56861684 56594676 56802432 55289106 55257039
3006 55257039 54424355 55079816 56351376 56361696 58502730 59423706 58740913 58167055 59364120
2997 59364120 59060872 60458136 61021747 60759156 61493013 61398709 62307394 63649254 64365232
2988 64365232 66572220 67837895 67111270 69396124 71938711 73196430 74197434 74249765 76641212
2979 76641212 76395221 75114463 74966627 74140903 73732452 72526844 71459019 71598676 72423856
2970 72423856 72909184 71253910 72032036 72157062 71301453 71186050 74395725 75648526 76417586
2961 76417586 76268647 74901737 76443388 77773788 79132532 80047675 79992993 82391349 83324046
2952 83324046 84621233 86615468 86416912 87115090 88944255 93079355 95756415 96878271
$$ packed form
3015E4735210m70245J423653M56757P94379p8070k67008K07756j513326l2067
3006E5257039q32684O55461J271560J0320K141034R20976o82793n73858J197065
2997E9364120l03248J397264N63611k62591P33857r4304R08685J341860P15978
2988F4365232K206988J265675p26625K284854K542587J257719J001004N2331K391447
2979G6641212k45991j280758j47836q25724m08451j205608j067825J39657Q25180
2970G2423856M85328j655274P78126J25026q55609j15403L209675J252801P69060
2961G6417586j48939j366910J541651J330400J358744R15143n4682K398356R32697
2952H3324046J297187J994235j98556O98178J829165M135100K677060J121856
$$ plain form
2944 96878271 96837503 96983442 99429679 100794241 101480772 104011002 106421318 107205949 106648457
2935 106648457 106839978 107462484 108812269 109971905 108686429 109811437 111794156 113337090
2927 113337090 113136379 114588321 115818711 118107005 120721800 121273089 123147195 125800661
2919 125800661 127069689 129918531 136079870 140408612 143752682 147408278 152629171 156402982
2911 156402982 162253055 165977073 167498832 168416789 167815408 165281571 162409974 158268193
2903 158268193 153464046 150397586 148445848 146211009 144646490 142288534 141102336 142144806
2895 142144806 141910361 142610224 146003268 147819599 148107634 151566884 154142224 156872857
2887 156872857 159542349 160790214 164123331 164910102 164658528 166712504 168647441 165175991
$$ packed form
2944I6878271m0768J45939K446237J364562O86531K530230K410316P84631n57492
2935A06648457J91521O22506J349785J159636j285476J125008J982719J542934
2927A13337090k00711J451942J230390K288294K614795N51289J874106K653466
2919A25800661J269028K848842O161339M328742L344070L655596N220893L773811
2911A56402982N850073L724018J521759R17957o01381k533837k871597m141781
2903A58268193m804147l066460j951738k234839j564519k357956j186198J042470
2895A42144806k34445O99863L393044J816331K88035L459250K575340K730633
2887A56872857K669492J247865L333117P86771k51574K053976J934937l471450
$$ plain form
2879 165175991 162968284 160296971 157877471 152194273 147184070 144205669 138902291 134723131
2871 134723131 131598178 129663593 129045644 126835782 122806910 120438255 119900716 120072059
2863 120072059 118591282 117311868 116499373 116474297 116319738 114740174 112010455 110019411 106494207
2854 106494207 104246812 101812594 98907437 97372873 94110199 90674053 87801300 85957063
2846 85957063 83015853 82883153 79476375 78141059 77121189 76390806 74663224 70608619
2838 70608619 68978217 66408875 65253769 65043145 63880835 61854613 61122574 60508598 59895699
2829 59895699 59337135 58208965 56772928 58070327 57233378 55394871 54783749 51931450 51571891
2820 51571891 50879648 49998209 49143512 47932348 46231548 46192350 46561855 44823193 44557359
$$ packed form
2879A65175991k207707k671313k419500n683198n010203k978401n303378m179160
2871A34723131l124953j934585o17949k209862m028872k368655n37539J71343
2863A20072059j480777j279414q12495k5076j54559j579564k729719j991044l525204
2854A06494207k247395k434218k905157j534564l262674l436146k872753j844237
2846H5957063k941210j32700l406778j335316j019870p30383j727582m054605
2838G0608619j630402k569342j155106k10624j162310k026222p32039o13976o12899
2829E9895699n58564j128170j436037J297399q36949j838507o11122k852299l59559
2820E1571891o92243q81439q54697j211164j700800l9198L69505j738662k65834
$$ plain form
2811 44557359 42470482 42217032 42504069 42203467 39726975 39011487 41084344 39377426 37454576
2802 37454576 37055795 35322412 34584018 34043066 34160901 34180983 33489830 33246204 33633693
2793 33633693 34832885 34955904 33136141 33847787 32181169 31880121 30120183 30252489 30559058
2784 30559058 29183325 28522641 28494538 26929455 27473693 27736813 25804966 25490099 26183121
2775 26183121 26707311 24103104 23321875 24371860 23175352 22179332 22141786 22236894 23663353
2766 23663353 23272189 23170580 22450084 21240386 21721505 22346649 21198020 21274627 21966374
2757 21966374 21840372 19514394 18418761 18385093 18076404 17137319 17354737 18959888 18064525
2748 18064525 16723962 16906264 16607897 14617247 14750143 15898513 15634619 15589045 17210730
$$ packed form
2811D4557359k086877k53450K87037l00602k476492p15488K072857j706918j922850
2802C7454576l98781j733383p38394n40952J17835K0082o91153k43626L87489
2793C3633693J199192J23019j819763P11646j666618l01048j759938J32306L06569
2784C0559058j375733o60684k8103j565083N44238K63120j931847l14867O93022
2775B6183121N24190k604207p81229J049985j196508r96020l7546R5108J426459
2766B3663353l91164j01609p20496j209698M81119O25144j148629P6607O91747
2757B1966374j26002k325978j095633l3668l08689r39085K17418J605151q95363
2748A8064525j340563J82302k98367j990650J32896J148370k63894m5574J621685
$$ plain form
2739 17210730 16967440 18135461 17619624 16146477 15204059 16284384 16357427 14397453 12893192
2730 12893192 13745811 13441084 12714941 12650323 13141576 13744599 13617923 13128355 12981051 13940045
2720 13940045 14342780 13705535 13903504 12177469 12886707 13280933 12384169 12500311 10954781
2711 10954781 10952480 11455235 12640700 11675072 10931488 9784016 9409411 9624117 11236308
2702 11236308 10318526 9557749 9410782 9841571 10099304 10434209 11155777 9644743 8442237
2693 8442237 9273328 8810833 7914073 8233730 8807073 8629156 8321544 9009073 10367424
2684 10367424 9190718 10982796 10874374 9752616 9038230 9029078 7978595 7740177 8027000
2675 8027000 6804252 8343055 10166792 9185356 8815103 7703743 6928630 7676850 8694281
$$ packed form
2739A7210730k43290J168021n15837j473147r42418J080325P3043j959974j504261
2730A2893192Q52619l04727p26143o4618M91253O03023j26676m89568j47304R58994
2720A3940045M02735o37245J97969j726035P09238L94226q96764J16142j545530
2711A0954781k301N02755J185465r65628p43584j147472l74605K14706J612191
2702A1236308r17782p60777j46967M30789K57733L34905P21568j511034j202506
2693H442237Q31091m62495q96760L19657N73343j77917l07612O87529J358351
2684A0367424j176706J792078j08422j121758p14386r152j050483k38418K86823
2675H027000j222748J538803J823737r81436l70253j111360p75113P48220J017431
$$ plain form
2666 8694281 8995172 8510782 7736384 6611729 6171924 7468200 7343455 6930825 7717707
2657 7717707 6891228 5794416 7016256 8626766 8800000 7927863 7037958 6731096 5588791
2648 5588791 7120821 7966553 8604607 8062129 5921044 6434251 6874833 6111125 6786660
2639 6786660 8200684 8753916 7230864 6368468 5856627 6895727 7218308 6723801 8102047
2630 8102047 8314597 7510394 8804724 10276457 10026045 10334593 8951886 9665991 7865245
2621 7865245 6728478 8051243 9030739 8710836 8819264 7760404 6966666 6246608 5573391
2612 5573391 6722385 6807417 7330478 8219107 7734715 6188629 6935623 6827200 6656013
2603 6656013 7630463 6940159 7285229 6430633 4387498 4528892 4861674 7618103 8050077
$$ packed form
2666H694281L00891m84390p74398j124655m39805J296276j24745m12630P86882
2657G717707q26479j096812J221840J610510J73234q72137q89905l06862j142305
2648E588791J532030Q45732O38054n42478k141085N13207M40582p63708O75535
2639F786660J414024N53232j523052q62396n11841J039100L22581m94507J378246
2630H102047K12550q04203J294330J471733k50412L08548j382707P14105j800746
2621G865245j136767J322765R79496l19903J08428j058860p93738p20058o73217
2612E573391J148994Q5032N23061Q88629m84392j546086P46994j08423j71187
2603F656013R74450o90304L45070q54596k043135J41394L32782K756429M31974
$$ plain form
2594 8050077 7891721 7312608 6886221 5849957 6016718 7516351 7924309 8783679 7655117
2585 7655117 6550431 6233046 6786879 6996996 6382441 6846859 5851173 6117136 6261636
2576 6261636 5948768 6397874 5248071 4747966 5461722 5201231 4701166 5454528 7603574
2567 7603574 9029383 7073560 6874235 6613202 4715095 6029674 5050101 6021989 5136549
2558 5136549 4969304 7275234 7498477 6191613 7245403 8023499 6421988 3585108 3465080
2549 3465080 4044684 3405048 3359341 4904042 5997191 4599157 3175489 4083532 4111692
2540 4111692 5036914 3599718 3722172 4914198 4780241 5111432 5974649 4654536 3462220
2531 3462220 2571377 2636915 3918318 4303099 3004573 3242955 2537185 2648231 3382819
$$ packed form
2594H050077j58356n79113m26387j036264J66761J499633M07958Q59370j128562
2585G655117j104686l17385N53833K10117o14555M64418r95686K65963J44500
2576F261636l12868M49106j149803n00105P13756k60491n00065P53362K149046
2567G603574J425809j955823j99325k61033j898107J314579r79573R71888q85440
2558E136549j67245K305930K23243j306864J053790P78096j601511k836880j20028
2549C465080N79604o39636m5707J544701J093149j398034j423668R08043K8160
2540D111692R25222j437196J22454J192026j33957L31191Q63217j320113j192316
2531C462220q90843O5538J281403L84781j298526K38382p05770J11046P34588
$$ plain form
2522 3382819 2921017 3496701 2980163 2822580 1845224 2837961 1779901 3634732 4907180
2513 4907180 4348086 3484784 2041399 1779723 1718854 1070570 -708530 412191 1147645
2504 1147645 351884 1328214 2877217 4361322 5019208 2138123 1706342 4210201 2713998
2495 2713998 1838749 866125 1395455 1254588 555628 902097 1217293 2198682 1333208 870433
2485 870433 2439832 2620849 1800572 1157454 981196 939476 1262549 1406053 2935384 2268047
2475 2268047 1486210 1372766 1114694 2761845 2932139 2132009 1312271 453496 1689507
2466 1689507 1900777 1184995 3151109 3898652 1380784 2558496 2982349 3934957 2552421
2457 2552421 2378529 3069013 1448829 277535 2461621 1542306 1086799 986563 466440
$$ packed form
2522C382819m61802N75684n16538j57583r77356R92737j058060J854831J272448
2513D907180n59094q63302j443385k61676o0869o48284j779100J120721P35454
2504A147645p95761R76330J549003J484105O57886k881085m31781K503859j496203
2495B713998q75249r72624N29330j40867o98960L46469L15196R81389q65474m62775
2485H70433J569399J81017q20277o43118j76258m1720L23073J43504J529331o67337
2475B268047p81837j13444k58072J647151J70294q00130q19738q58775J236011
2466A689507K11270p15782J966114P47543k517868J177712M23853R52608j382536
2457B552421j73892O90484j620184j171294K184086r19315m55507j00236n20123
$$ plain form
2448 466440 1076752 1150944 286424 1317375 250912 970163 1821082 1101835 2442872
2439 2442872 4217349 2761206 1989003 1347124 1248784 1361287 1556911 1193858 2662580
2430 2662580 1007913 -643890 141585 731565 720148 -339853 657869 773286 1246777
2421 1246777 1818107 987003 1260994 1942848 927243 18303 42442 -487211 -1001171 -537500
2411 -537500 883179 300467 834560 3118893 -186760 -715743 -1200626 216157 666956
2402 666956 2260742 1793355 3582769 1617321 252123 1034540 904572 1809644 2710510
2393 2710510 3464028 2488926 2075731 1734161 1319922 1324621 1954238 2909291 2071238 635948
2383 635948 800157 2171420 1429373 1858798 1755840 1714724 2096166 2097554 1175970 1642950
$$ packed form
2448D66440O10312P4192q64520J030951j066463P19251Q50919p19247J341037
2439B442872J774477j456143p72203o41879r8340J12503J95624l63053J468722
2430B662580j654667j651803P85475N89980j1417j060001R97722J15417M73491
2421A246777N71330q31104K73991O81854j015605r08940K4139n29653n13960M63671
2411e37500J420679n82712N34093K284333l305653n28983m84883J416783M50799
2402F66956J593786m67387J789414j965448j365198P82417j29968R05072R00866
2393B710510P53518r75102m13195l41570m14239M699O29617R55053q38053j435290
2383F35948J64209J371263p42047M29425j02958m1116L81442J388r21584M66980
$$ plain form
2373 1642950 1052659 2385094 1765599 702321 1029547 1503677 247636 1955411 1387791
2364 1387791 2938683 3401842 1899292 770916 1098232 2127411 1427796 1780851 38040
2355 38040 -697011 611900 809122 983644 1597558 1932519 3294485 2950539 1804508
2346 1804508 208667 -1389034 -942953 500527 2598036 2797006 2578110 2938671 2470424
2337 2470424 1098468 562162 1878540 769575 1609505 724222 1566409 1267574 927388
2328 927388 896739 38194 -144859 367954 -1266521 -1796362 -901906 56591 2274574 2327989
2318 2327989 704049 1199802 535400 551904 1134506 1161023 1357249 1188236 571900 1020112
2308 1020112 1053188 1527022 1633499 2794138 3607062 3636776 2238679 194052 73249
$$ packed form
2373A642950n90291J332435o19495j063278L27226M74130j256041J707775n67620
2364A387791J550892M63159j502550j128376L27316J029179o99615L53055j742811
2355C8040p35051J308911J97222J74522O13914L34961J361966l43946j146031
2346A804508j595841j597701M46081J443480K097509J98970k18896L60561m68247
2337B470424j371956n36306J316378j108965Q39930q85283Q42187k98835l40186
2328I27388l0649q58545j83053N12813j634475n29841Q94456R58497K217983N3415
2318B327989j623940M95753o64402J6504N82602K6517J96226j69013o16336M48212
2308A020112L3076M73834J06477J160639Q12924K9714j398097k044627j20803
$$ plain form
2299 73249 1139911 3577438 1460762 2325679 2293905 349013 2329261 1162396 623247
2290 623247 2404219 1078377 -225450 -102241 -84741 -1375920 583786 2136994 1948267
2281 1948267 3275850 2071641 727388 23664 -22563 695439 1206067 189615 67943
2272 67943 1261122 2429390 1347670 1255271 1077510 1783849 -147426 1181645 1983966
2263 1983966 224092 -59617 946539 1807232 442017 171351 297896 -588498 -761570
2254 -761570 -558239 -1259706 185064 1653819 1623702 818999 -393977 231836 -331936
2245 -331936 537672 961784 1792600 443115 182066 7980 520201 2034638 649224
2236 649224 472748 1532329 542787 -962353 555618 1985088 2636322 1256087 273631
$$ packed form
2299G3249J066662K437527k116676Q64917l1774j944892J980248j166865n39149
2290F23247J780972j325842j303827J23209J7500j291179J959706J553208j88727
2281A948267J327583j204209j344253p03724m6227P18002N10628j016452j21672
2272F7943J193179J168268j081720r2399j77761P06339j931275J329071Q02321
2263A983966j759874k83709J006156Q60693j365215k70666J26545q86394j73072
2254g61570K03331p01467J444770J468755l0117q04703j212976O25813n63772
2245c31936Q69608M24112Q30816j349485k61049j74086N12221J514437j385414
2236F49224j76476J059581r89542j505140J517971J429470O51234j380235r82456
$$ plain form
2227 273631 725883 823075 887105 2027131 2053119 3106883 2692395 2002127 2030888 1585293
2217 1585293 1409422 2098806 1265100 721986 1960897 1368093 1095610 2739860 3229247
2208 3229247 2260391 2028288 2855471 1983442 2034964 3382099 4549197 3663623 3036035
2199 3036035 3992586 3850903 2819701 4724995 4316141 5953232 6250948 6471113 5896918
2190 5896918 5003634 6389507 6551415 6427277 7049836 8439303 8202620 8251296 8135563
2181 8135563 8350651 9585071 6829688 6968584 9622236 9860294 8310836 8759562 8976584
2172 8976584 8317374 9242340 9224507 9875257 9019065 9636070 9434754 9892476 10737797 11943609
2162 11943609 11798958 13297987 13065261 14635839 14927356 14958942 16197573 15195635 15162301
$$ packed form
2227B73631M52252R7192O4030J140026K5988J053764m14488o90268K8761m45595
2217A585293j75871O89384q33706n43114J238911n92804k72483J644250M89387
2208C229247r68856k32103Q27183q72029N1522J347135J167098q85574o27588
2199C036035R56551j41683j031202J905294m08854J637091K97716K20165n74195
2190E896918q93284J385873J61908j24138O22559J389467k36683M8676j15733
2181H135563K15088J234420k755383J38896K653652K38058j549458M48726K17022
2172H976584o59210R24966j7833O50750q56192O17005k01316M57722Q45321J205812
2162A1943609j44651J499029k32726J570578K91517L1586J238631j001938l3334
$$ plain form
2153 15162301 14037411 14406918 17202123 17877625 17690095 19796632 19745054 19274347 20672722
2144 20672722 21953971 22681335 23167888 24286387 25848140 26323304 27195962 27986800 29468049
2135 29468049 32357742 33263400 36059290 39576686 41406493 43257399 44365709 48016652
2127 48016652 51725557 57058783 60684441 64319866 69780062 73114325 78002682 86346564
2119 86346564 94781446 105213517 120109365 138079077 160816076 188828391 223820168
2112 223820168 266958547 315645058 362929874 382724550 362824589 319653034 269486949
2105 269486949 223784841 189575658 162596765 138586186 121692572 110114629 98266614
2098 98266614 90807338 82768364 76597412 70345268 66023382 63075590 57546041 53003897
$$ packed form
2153A5162301j124890L69507K795205O75502j87530K106537n1578m70707J398375
2144B0672722J281249P27364M86553J118499J561753M75164Q72658P90838J481249
2135B9468049K889693R05658K795890L517396J829807J850906J108310L650943
2127D8016652L708905N333226L625658L635425N460196L334263M888357Q343882
2119H6346564Q434882J0432071J4895848J7969712K2736999K8012315L4991777
2112B23820168M3138379M8686511M7284816J9794676j9899961m3171555n0166085
2105B69486949m5702108l4209183k6978893k4010579j6893614j1577943j1848015
2098I8266614p459276q038974o170952o252144m321886k947792n529549m542144
$$ plain form
2090 53003897 48830149 46175335 42966216 41812235 40975246 38437059 36276616 36062140
2082 36062140 33952019 31940536 30316999 27529597 27573437 26769061 26383258 24890065 23387543
2073 23387543 23552474 24282659 23722333 21720731 21590823 19598307 18197145 17760135 17340556
2064 17340556 16985489 16853284 16954473 17304410 15508014 14261785 15317504 14749453 13986274
2055 13986274 14403444 13728719 12350382 11760395 12108482 12321664 11321930 12079537 11540677
2046 11540677 10249412 9398643 8126161 9669885 9467986 9296343 8716084 8818750 9156433
2037 9156433 8692147 7324167 8049397 7703747 8031032 7525429 7006539 7170707 7684130
2028 7684130 7292361 6611576 7317966 7731591 6930211 5980014 4958761 3828932 3779076
$$ packed form
2090E3003897m173748k654814l209119j153981q36989k538187k160443k14476
2082C6062140k110121k011483j623537k787402M3840q04376l85803j493193j502522
2073B3387543J64931P30185n60326k001602j29908j992516j401162m37010m19579
2064A7340556l55067j32205J01189L49937j796396j246229J055719n68051p63179
2055A3986274M17170o74725j378337n89987L48087K13182r99734P57607n38860
2046A1540677j291265q50769j272482J543724k01899j71643n80259J02666L37683
2037I156433m64286j367980P25230l45650L27285n05603n18890J64168N13423
2028G684130l91769o80785P06390M13625q01380r50197j021253j129829m9856
$$ plain form
2019 3779076 3261782 3019799 3574893 5040843 4970606 5221338 4127580 4788407 4412288
2010 4412288 2971501 3457906 2921917 3723757 3074823 2489856 3150394 5447259 4946551
2001 4946551 4703232 4541291 4632081 4550100 4934798 6013463 4837923 4778597 4935527 4218062
1991 4218062 5952634 5452306 4542262 4781019 4168166 5540582 5140965 3745600 5213757
1982 5213757 5331290 4562684 3051979 3006389 2776347 1890094 2686240 3990367 4671075
1973 4671075 3395863 3749714 2302448 1809531 1372553 2071793 3096982 3309926 4194594
1964 4194594 3348583 465402 -754425 -61676 653973 1571397 1820003 3140289 2628691
1955 2628691 1229053 3506366 2600746 2955783 2278816 1323094 2558289 2670825 2073903
$$ packed form
2019C779076n17294k41983N55094J465950p0237K50732j093758O60827l76119
2010D412288j440787M86405n35989Q01840o48934n84967O60538K296865n00708
2001D946551k43319j61941R0790q1981L84698J078665j175540n9326J56930p17465
1991D218062J734572n00328r10044K38757o12853J372416l99617j395365J468157
1982E213757J17533p68606j510705m5590k30042q86253P96146J304127O80708
1973D671075j275212L53851j447266m92917m36978O99240J025189K12944Q84668
1964D194594q46011k883181j219827O92749P15649R17424K48606J320286n11598
1955B628691j399638K277313r05620L55037o76967r55722J235195J12536n96922
$$ plain form
1946 2073903 813740 1468243 1411358 525243 1151868 334089 1406384 1032766 1599620
1937 1599620 1334335 2509997 3264705 3375608 2886572 3060902 2890350 2897274 3750101 3491496
1927 3491496 3613740 3579885 2098081 659369 919824 2517669 3029326 2837257 4218335
1918 4218335 3882829 3341015 2983086 2490336 -72490 356058 1619362 1792556 720039
1909 720039 1726550 608290 564036 2080229 1064733 558301 -424183 -790844 753972
1900 753972 942558 -1309752 671800 713351 -245180 714228 2341050 1767733 678040
1891 678040 564686 1999038 2508578 1501691 1521317 465856 -161494 1429238 199774
1882 199774 -1271836 -334718 360101 -226970 613531 1575624 723533 -123726 -491566 -436183
$$ packed form
1946B073903j260163O54503n6885q86115O26625q17779J072295l73618N66854
1937A599620k65285J175662P54708J10903m89036J74330j70552O924Q52827k58605
1927C491496J22244l3855j481804j438712K60455J597845N11657j92069J381078
1918D218335l35506n41814l57929m92750k562826M28548J263304J73194j072517
1909G20039J006511j118260m4254J516193j015496n06432r82484l66661J544816
1900G53972J88586k252310J981552M1551r58531R59408J626822n73317j089693
1891F78040j13354J434352N09540j006887J9626j055461o27350J590732j229464
1882A99774j471610R37118O94819n87071Q40501R62093q52091q47259l67840N5383
$$ plain form
1872 -436183 -1000227 -29242 1898886 2488002 1127158 1009765 675402 651372 529792 1658829
1862 1658829 1759845 265542 299767 1864778 604112 -488009 -399005 676276 -484089
1853 -484089 -110784 486422 -672353 2340920 2390620 1597700 1028515 365580 1127757 1790055
1843 1790055 2447798 2950855 4547310 3092958 3274820 3687197 2714254 2803661 746828
1834 746828 -297523 836302 824755 -79430 339333 1723560 3297520 2033966 2238510
1825 2238510 1192582 360215 13297 -955490 501051 779686 1191298 1488777 2406984
1816 2406984 2051381 2119001 824403 965786 1798207 1988475 744929 597449 951240
1807 951240 591473 50222 165546 -604553 -135531 1620175 1315827 118335 -1001148
$$ packed form
1872d36183n64044R70985J928128N89116j360844j17393l34363k4030j21580J129037
1862A658829J01016j494303L4225J565011j260666j092121Q9004J075281j160365
1853d84089L73305N97206j158775L013273M9700p92920n69185o62935P62177O62298
1843A790055O57743N03057J596455j454352J81862M12377r72943Q9407k056833
1834G46828j044351J133825j1547r04185M18763J384227J573960j263554K04544
1825B238510j045928q32367l46918r68787J456541K78635M11612K97479R18207
1816B406984l55603O7620j294598J41383Q32421J90268j243546j47480L53791
1807I51240l59767n41251J15324p70099M69022J755706l04348j197492j119483
$$ plain form
1798 -1001148 -31740 -585573 -917182 -457301 540905 169514 1322095 -233996 -2835473
1789 -2835473 -1528115 -800039 653171 209861 -817407 984258 643411 -160745 -1895337
1780 -1895337 -965605 -1095987 -1139098 -1943830 -1429905 271163 -1446704 874487 1305354
1771 1305354 -19749 90711 357802 980250 752767 764954 1399946 1316736 985925 25743
1761 25743 587341 1420970 1891740 66008 836709 795798 868937 1723227 587413 891769
1751 891769 -861930 -1410093 522987 1555662 -642449 -2239171 -1097816 -761036 580290
1742 580290 408889 1545520 -824045 -1395214 1148671 1509263 373118 -1319756 2699
1733 2699 828590 -611894 1144650 1934242 3150105 2142251 -410472 -308041 1968326
$$ packed form
1798a001148R69408n53833l31609M59881R98206l71391J152581j556091k601477
1789b835473J307358P28076J453210m43310j027268J801665l40847q04156j734592
1780a895337R29732j30382m3111q04732N13925J701068j717867K321191M30867
1771A305354j325103J10460K67091O22448k27483J2187O34992q3210l30811r60182
1761B5743N61598Q33629M70770j825732P70701m0911P3139Q54290j135814L04356
1751H91769j753699n48163J933080J032675k198111j596722J141355L36780J341326
1742E80290j71401J136631k369565n71169K543885L60592j136145j692874J322455
1733B699Q25891j440484J756544P89592J215863j007854k552723J02431K276367
$$ plain form
1724 1968326 589010 -2185032 -270798 1070507 1865152 1786982 -158529 -2096166 105148
1715 105148 724662 1229745 2282976 1546589 71691 1022430 823108 29735 -404826
1706 -404826 653237 -78122 54572 791212 -240194 35389 1638377 1195967 1082658
1697 1082658 598585 520320 195155 146281 -1067226 -1955947 -1997530 -799307 217081 981420
1687 981420 -661969 -301742 -974750 -1094603 -311460 -303446 -404513 553638 -636708 -914559
1677 -914559 -1008945 22413 1708265 2081584 1488082 -906644 -770394 -276886 -406658
1668 -406658 214271 -745285 -1322296 46248 -961980 -6734 947 913672 5600 -405312
1658 -405312 816116 209210 894403 41475 -505344 -1065112 -1283923 -403010 -463725 554265
$$ packed form
1724A968326j379316k774042J914234J341305P94645p8170j945511j937637K201314
1715A05148O19514N05083J053231p36387j474898R50739j99322p93373m34561
1706d04826J058063p31359J32694P36640j031406K75583J602988m42410j13309
1697A082658m84073p8265l25165m8874j213507q88721m1583J198223J016388P64339
1687I81420j643389L60227o73008j19853P83143Q014j01067R58151j190346k77851
1677i14559r4386J031358J685852L73319n93502k394726J36250M93508j29772
1668d06658O20929r59556n77011J368544j008228R55246P681R12725r08072m10912
1658d05312J221428o06906O85193q52928n46819n59768k18811Q80913o0715J017990
$$ plain form
1648 554265 -226810 -1285960 -742750 1009233 1386729 262762 -1166638 51899 -501443
$$ packed form
1648E54265p81075j059150N43210J751983L77496j123967j429400J218537n53342
$$ [...]
##END NTUPLES=NMR SPECTRUM
##END=
