##TITLE=1H_EC-3296(XVI-3)
 CDCl3
 8 sc, 
 28.9.2023
##JCAMPDX= 6.0         $$ Bruker NMR JCAMP-DX V2.0
##DATA TYPE= NMR SPECTRUM
##DATA CLASS= NTUPLES
##ORIGIN= UXNMR, Bruker Analytische Messtechnik GmbH
##OWNER= root
$$ XWIN-NMR		Version 3.5
$$ Thu Sep 28 14:00:23 2023 Russian Standard Time (UT+4h)  she@DPX200
##.OBSERVE FREQUENCY= 200.13135
##.OBSERVE NUCLEUS= ^1H
##.ACQUISITION MODE= SIMULTANEOUS
##.ACQUISITION SCHEME= undefined
##.AVERAGES= 8
##.DIGITISER RES= 18
##SPECTROMETER/DATA SYSTEM= spect
##.PULSE SEQUENCE= zg30
##.SOLVENT NAME= CDCl3
##.SHIFT REFERENCE= (INTERNAL, CDCl3, 0, 15.7436)
##AUDIT TRAIL= $$ (NUMBER, WHEN, WHO, WHERE, WHAT)
$$ ##TITLE= Audit trail, XWIN-NMR		Version 3.5
$$ ##JCAMPDX= 5.01
$$ ##ORIGIN= Bruker BioSpin GmbH
$$ ##OWNER= she
$$ F:/spectra/data/she/nmr/H-F/1/pdata/1/auditp.txt
$$ ##AUDIT TRAIL=  $$ (NUMBER, WHEN, WHO, WHERE, WHAT)
(   1,<2023-09-28 13:59:03.23 +0400>,<she>,<DPX200>,
      <created by zg, POWCHK disabled, PULCHK disabled
       configuration hash MD5:
       00 E9 B6 7A A2 85 ED C7 34 08 36 98 17 FE 4E 26
       data hash MD5: 16K
       53 28 A7 25 45 77 78 BB A0 B4 CE 25 24 35 5E FC>)
(   2,<2023-09-28 13:59:05.90 +0400>,<she>,<DPX200>,
      <Start of raw data processing
       efp BC_mod = 2 LB = 0.24 FT_mod = 6 PKNL = 1 PHC0 = -21867.7 PHC1 = 9.85271 SI = 16K 
       data hash MD5: 16K
       E3 2D 9F F6 8C 89 A6 23 43 13 6B 17 57 E2 20 28>)
(   3,<2023-09-28 13:59:27.12 +0400>,<she>,<DPX200>,
      <pk PHC0 = -1.504979 PHC1 = 3.2 
       data hash MD5: 16K
       AD E0 9F A8 F5 D5 75 8A 6D 2D D1 0F 96 EC 25 2E>)
(   4,<2023-09-28 13:59:30.54 +0400>,<she>,<DPX200>,
      <abs ABSG = 5 
       data hash MD5: 16K
       28 FE 09 7A 37 4E B0 95 8A 53 98 A0 10 B7 C8 50>)
$$ ##END=
$$ 
$$ hash MD5
$$ 80 66 46 12 2B 80 FE 66 4C 9E 4D 9B D5 D0 19 C6
##$RELAX= 
##$RELAX= 
##$RELAX= 
##$RELAX= 
##$RELAX= 
##$RELAX= 
$$ Bruker specific parameters
$$ --------------------------
##$DU= <F:/spectra>
##$EXPNO= 1
##$NAME= <H-F>
##$PROCNO= 1
##$TYPE= <nmr>
##$USER= <she>
##$AMP= (0..31)
100 100 100 100 100 100 100 100 100 100 100 100 100 100 100 100 100 100 
100 100 100 100 100 100 100 100 100 100 100 100 100 100 
##$AQSEQ= 0
##$AQ_mod= 1
##$AUNM= <au_zg>
##$AUTOPOS= <>
##$BF1= 200.13
##$BF2= 200.13
##$BF3= 200.13
##$BF4= 200.13
##$BF5= 200.13
##$BF6= 200.13
##$BF7= 200.13
##$BF8= 200.13
##$BYTORDA= 1
##$CFDGTYP= 0
##$CFRGTYP= 5
##$CHEMSTR= <none>
##$CNST= (0..31)
1 1 145 1 1 1 1 1 1 1 1 1 1 1 1 1 1 1 1 1 1 1 1 1 1 1 1 1 1 1 1 1 
##$CPDPRG= <>
##$CPDPRG1= <>
##$CPDPRG2= <>
##$CPDPRG3= <>
##$CPDPRG4= <mlev>
##$CPDPRG5= <mlev>
##$CPDPRG6= <mlev>
##$CPDPRG7= <mlev>
##$CPDPRG8= <mlev>
##$CPDPRGB= <>
##$CPDPRGT= <>
##$D= (0..31)
0 1.2 0 0 0 0 0 0 0 0.06 0 0.03 0 0 0 0 0.0002 0 0 0 0 0 0 0 0 0 0 0 0 
0 0 0 
##$DATE= 1695895142
##$DBL= (0..7)
120 120 120 120 120 120 120 120 
##$DBP= (0..7)
150 150 150 150 150 150 150 150 
##$DBP07= 0
##$DBPNAM0= <>
##$DBPNAM1= <>
##$DBPNAM2= <>
##$DBPNAM3= <>
##$DBPNAM4= <>
$$ [...]
##$SUBNAM3= <"">
##$SUBNAM4= <"">
##$SUBNAM5= <"">
##$SUBNAM6= <"">
##$SUBNAM7= <"">
##$SUBNAM8= <"">
##$SUBNAM9= <"">
##$SW= 18.05172834244
##$SWIBOX= (0..15)
0 0 2 0 0 0 0 0 0 0 0 0 0 0 0 0 
##$SW_h= 3612.71676300578
##$TD= 16384
##$TD0= 1
##$TE= 0
##$TE2= 300
##$TE3= 300
##$TEG= 300
##$TL= (0..7)
0 120 120 120 120 120 120 120 
##$TP= (0..7)
150 150 150 150 150 150 150 150 
##$TP07= 0
##$TPNAME0= <>
##$TPNAME1= <>
##$TPNAME2= <>
##$TPNAME3= <>
##$TPNAME4= <>
##$TPNAME5= <>
##$TPNAME6= <>
##$TPNAME7= <>
##$TPOAL= (0..7)
0.5 0.5 0.5 0.5 0.5 0.5 0.5 0.5 
##$TPOFFS= (0..7)
0 0 0 0 0 0 0 0 
##$TUNHIN= 0
##$TUNHOUT= 0
##$TUNXOUT= 0
##$USERA1= <user>
##$USERA2= <user>
##$USERA3= <user>
##$USERA4= <user>
##$USERA5= <user>
##$V9= 5
##$VALIST= <valist>
##$VCLIST= <CCCCCCCCCCCCCCC>
##$VD= 0
##$VDLIST= <DDDDDDDDDDDDDDD>
##$VPLIST= <PPPPPPPPPPPPPPP>
##$VTLIST= <TTTTTTTTTTTTTTT>
##$WBST= 1024
##$WBSW= 4
##$XGAIN= (0..3)
0 0 0 0 
##$XL= 0
##$YL= 0
##$YMAX_a= 67472
##$YMIN_a= -87555
##$ZGOPTNS= <>
##$ZL1= 120
##$ZL2= 120
##$ZL3= 120
##$ZL4= 120
##$ABSF1= 15.78986
##$ABSF2= -2.261992
##$ABSG= 5
##$ABSL= 3
##$ALPHA= 0
##$AQORDER= 0
##$ASSFAC= 0
##$ASSFACI= 0
##$ASSFACX= 0
##$ASSWID= 0
##$AUNMP= <proc_1d>
##$AZFE= 0.1
##$AZFW= 0.1
##$BCFW= 0
##$BC_mod= 2
##$BYTORDP= 0
##$COROFFS= 0
##$CY= -3
##$DATMOD= 1
##$DC= 0
##$DFILT= <>
##$DTYPP= 0
##$F1P= 0
##$F2P= 0
##$FCOR= 1
##$FTSIZE= 16384
##$FT_mod= 6
##$GAMMA= 0
##$GB= 0
##$INTBC= 1
##$INTSCL= 3.70164e-10
##$ISEN= 128
##$LB= 0.24
##$LEV0= 0
##$LPBIN= 0
##$MAXI= 10000
##$MC2= 0
##$MEAN= 0
##$ME_mod= 0
##$MI= 1.114404
##$NCOEF= 0
##$NC_proc= -7
##$NLEV= 6
##$NOISF1= 3.799351
##$NOISF2= 2.8
##$NSP= 0
##$NTH_PI= 0
##$NZP= 0
##$OFFSET= 15.74358
##$PC= 1
##$PHC0= -21869.21
##$PHC1= 13.05271
##$PH_mod= 1
##$PKNL= yes
##$PPARMOD= 0
##$PSCAL= 0
##$PSIGN= 0
##$REVERSE= no
##$SF= 200.130005594475
##$SI= 16384
##$SIGF1= 3
##$SIGF2= 2
##$SINO= 5.538805
##$SIOLD= 16384
##$SREGLST= <1H.CDCl3>
##$SSB= 0
##$STSI= 16384
##$STSR= 0
##$SW_p= 3612.71676300578
##$SYMM= 0
##$S_DEV= 0
##$TDeff= 16384
##$TDoff= 0
##$TI= <>
##$TILT= no
##$TM1= 0
##$TM2= 0
##$TOPLEV= 0
##$USERP1= <user>
##$USERP2= <user>
##$USERP3= <user>
##$USERP4= <user>
##$USERP5= <user>
##$WDW= 1
##$XDIM= 16384
##$YMAX_p= 288799990
##$YMIN_p= -196395
$$ End of Bruker specific parameters
$$ ---------------------------------
##NTUPLES= NMR SPECTRUM
##VAR_NAME=  FREQUENCY,     SPECTRUM/REAL,   SPECTRUM/IMAG
##SYMBOL=    X,             R,               I
##VAR_TYPE=  INDEPENDENT,   DEPENDENT,       DEPENDENT
##VAR_FORM=  AFFN,          ASDF,            ASDF
##VAR_DIM=   16384,         16384,           16384
##UNITS=     HZ,            ARBITRARY UNITS, ARBITRARY UNITS
##FACTOR=    0.220516191357247, 1,           1
##FIRST=     3150.76272635984, 0,            0
##LAST=      -461.954036645941, 0,           0
##MIN=       -461.954036645941, -196395,     0
##MAX=       3150.76272635984, 288799990,    0
$$ Real data points
##PAGE= N=1
##DATA TABLE= (X++(R..R)), XYDATA
$$ [...]
6545a33847M8409J8826Q3499k6827n6123J5731P233J62R25M2285q853J1311J8792
6532B1523L6906k3999K2991q757j22718L589L195M2507m8142l397N9966J07484
6520I1148p3322m8190k342K8838K1337o2004o25O4517K8694n2750k5486J930M3289
6507A5034l1522j7972p412j7624N9501j9072M843m2756m6662L6728p98M2172l6379
6494f1919l0107M0195n9608N3652k5610K9717K3252n9762O9417j19546K5285N6048
6482e8986J8669k1966j46k1200O771J4609l0029N1795P2281o2066j3823L315l0223
6469g0999j9413k5536N789N3691j8433O1735K4979L0359n8869K6075j9215J953
6457g884K7259j5251M7851o2524n8908N0397k9241n3188J0773M8544j8039P650
$$ y = [-133847, -85438, -66612, 16887, -9940, -66063, -50332, -43099, -42937, -42012, 273, -8580, 2731, 21523, 58429, 34430, 57421, 48664, -74054, -70465, -67270, -24763, -72905, -76302, -16336, 91148, 17826, -30364, -32706, -3868, 17469, -44535, -45160, 19357, 48051, -4699, -30185, -28255, 15034, -16488, -34460, -41872, -59496, 5, -19067, -14224, -56980, -103642, -66914, -67712, -25540, -61919, -92026, -51831, -111439, -57787, -83397, -53680, -30428, -90190, -20773, -140319, -115034, -58986, -40317, -62283, -62429, -83629, -76858, -62249, -92278, -40483, 31798, -30268, -44091, -40776, -70999, -90412, -115948, -110159, -56468, -74901, -13166, 11813, 42172, -16697, 9378, -9837, -7884, 19375, 4124, 51975, -10549, -69457, -19060, -48301, -101489, -90716, -42172, -60211, -52561]
6445e2561K3642k0398R0271l1281j1710j96l8877J6625M1744O0277K9844n3488
6433E3892r6672K860K3024j6039l2496O4263K7343j07698L1043k6456J7481K8444
6421c1011J3881J1594M6291m0740N132j6647o8861L6196M5087p608K1453l71p6043
6408f1647O6218J1721L942k1428n7040K6956l3707j6782J13680L5354m7821o1937
6396d2491o2295L9417N719L8966N56J8501O6598k8694m7438n4110l0620l8856
6384a34747K7550P5125m8443L8794m3245O3722p6902K0672p245r957N3791M0906
6372B1k9254K6599l7934j00555J05781k9782M3700O4199o0631o3730M9269l4159
6360f6476N6684r863n9174k2826L7991K1240P4020j7747k1300o4386O5766J2674
$$ y = [-52561, -28919, -49317, 40954, 9673, -2037, -2233, -41110, -24485, 17259, 77536, 107380, 53892, -42780, -39920, -16896, -32935, -65431, -1168, 26175, -81523, -50480, -76936, -59455, -31011, -17130, -5536, 40755, 15, 5147, -11500, -80361, -44165, 922, -6686, 14767, 14396, -61647, 4571, 16292, 20234, -1194, -58234, -31278, -64985, -81767, 31913, 67267, 19446, -42491, -104786, -65369, -59650, -20684, -20128, -1627, 64971, 36277, -11161, -65271, -95891, -134747, -107197, -32072, -80515, -41721, -84966, -21244, -98146, -77474, -84719, -94676, -40885, 21, -29233, -2634, -40568, -141123, -35342, -65124, -21424, 42775, -17856, -81586, -32317, -66476, -9792, -19655, -78829, -101655, -63664, -42424, 31596, 13849, -7451, -71837, -6071, 6603]
6348F603k8861l9561O472M9029j2148K4132J7954j1821K0601o0480n0126J28104
6336D9898L7599r1585Q543N4694J3066k6918o033j9423j7191N883K7312j0664
6324B5181o9339n9326K0545J32762k2164Q077p2033l4111o473m4862L2526N8996
6312c0221n9114L4958J8248K3104q734m839l6770n973m4976k961O8476J7019M8415
6299A6632l5019J8398o140j9799O318q120o2460K3356L4339p1436K762K2767P8438
6286C6n8176j7216J7257j1812L5041j3230P6589j6472M232p2933m5936J3732P203
6273h1685J1117O7316P209J9613n963l9114o145n431p8130q228O5947k636N7453
6260A323r093K874o1459o221L4373O4166j3644N788j4380r266k0125L2608L9828
$$ y = [6603, -22258, -61819, -55347, -6318, -18466, 5666, 23620, 11799, 32400, -28080, -78206, 49898, 87497, -4088, 4455, 59149, 72215, 45297, 39264, 19841, 2650, 8533, 35845, 25181, -44158, -103484, -82939, 49823, 27659, 35736, -36297, -70408, -76881, -121743, -89217, -30221, -89335, -54377, -36129, -13025, -21759, -26598, -63368, -69341, -114317, -117278, -48802, -31783, 16632, -18387, 11, -6129, -25928, -19610, -27730, -90190, -66834, -32495, -103931, -101169, -78402, 36, -58140, -75356, -58099, -69911, -34870, -48100, 28489, 12017, 16249, -56684, -102620, -88888, -81685, -70568, -3252, 3957, 23570, 17607, -21507, -27652, -33083, -111213, -119441, -53494, -56130, 1323, -7770, -4896, -66355, -72576, -38203, 25963, 12319, 18107, 3727, -5539, -25664, 6944, 46772]
6247D6772K0671m1896l6090K3817L374M87j3167j1346j8437K8123m8011J6581
6235b9122K491j9826K3087J5571m0095r259o1347O1523J00652r57k8523l0744
6223a6549j0133N1466q0875l1251J0432M8794J913k061O8269K7064l2797m8825
6211a4553L1724o3159J8552k6768J0597M0452L3064m4146j6561J8290K6498L2008
6199D5998n3709K3533j3588l4035O8342M3679J850l9198k4043L3017k8934J5789
6187C8701o2377j0240k0332N1666M5988o6854k4579L7600K8785K0043k8736k86
6175I379k3238j9998L5175J2590j0246K2443M2651k3972o8997m2572L7377L2317
6163B909J037n6348M0763m3920k0812L4499K7813o407L9297k9034l9507K0789
$$ y = [46772, 67443, 25547, -10543, 13274, 16648, 17135, 3968, -7378, -25815, 2308, -45703, -29122, -26631, -46457, -23370, -7799, -47894, -57153, -118500, -56977, 43675, 42718, 14195, -16549, -26682, 24784, -56091, -87342, -76910, -28116, -26203, -28264, 40005, 67069, 34272, -14553, 17171, -45988, -27436, -54204, -43607, -3155, 29909, -14237, -30798, -12508, 13990, 45998, -7711, 15822, 2234, -31801, 36541, 80220, 82070, 42872, 18829, 51846, 22912, 38701, -23676, -33916, -54248, -2582, 43406, -23448, -48027, -10427, 18358, 38401, 9665, 9379, -13859, -33857, 1318, 13908, 3662, 26105, 68756, 44784, -24213, -66785, -29408, 2909, 3946, -52402, -11639, -55559, -76371, -41872, -14059, -20466, 18831, -10203, -49710, -28921]
6151b8921J1174L4926J3690o1477l6358O1110j2996P593Q739j8502j9823N3011
6139A2166q866k4J5811k6884L9372R210P39k7022k435k0602J4890m6349J7645
6126b2349J8288j634p3748M8317P7066k9872Q518l6632J9476L2748l6059J3369
6114A7488j555k6430o4595q688J5614J26615j1161o7719R0625J401l861l1066
6102C6668k6544o4166Q298m7438J05726l5700k6516K6874J0261l7791l2864P7439
6090e753r304J5683J2160k1109l2822J8841K654O7942l9763q207k5434K1535J8435
6077A4858o6401N5002J2002J11j1642l9862L3785N086o730J2404k2079L2529J7586
6064C6649k1781r6963l546L6628O8625m7487l0382K5195j0459K4601q705Q1488
$$ y = [-28921, -17747, 17179, 30869, -30608, -66966, -5856, -18852, -11259, -2520, -21022, -40845, 12166, 3300, 3276, 19087, -7797, 31575, 40785, 41524, 14502, 12067, -8535, 6355, -39994, -22349, -4061, -5695, -79443, -31126, 45940, 16068, 24586, -12046, 7430, 40178, 4119, 17488, 15933, -10497, -75092, -83780, -68166, 58449, 47288, -20431, 70194, 71595, 67734, 36668, 10124, -54042, -45744, -93182, 12544, -23156, -49672, -22798, -12537, -50328, -83192, -5753, -15057, 626, 12786, -8323, -41145, -22304, -19650, 48292, 8529, 322, -25112, -3577, 14858, -51543, 3459, 15461, 15572, 3930, -35932, -2147, 2939, -3791, 8613, -13466, 19063, 36649, 14868, -82095, -85641, -49013, 19612, -27875, -58257, -33062, -43521, -18920, -27625, 53863]
6052E3863m6554m1295O0185l677l0362J064P0369p6855j280M997k9487J3562l4512
6039e9982j3768J7165L9265N1750j0143l0109j2506q955N4753L3981p9108N7190
6027C9533p1159n8034L9096J8370k1987k5673O0467K7166J0585j2615l5238m3100
6015g2589N1015M1755N435j7132O8364m3388r1393M0756Q5196m9006p685n3708
6003d2380l5439N024M4852P0339n991L4822o034r1200J5166R4446l8389q3135
5991c7919J8070J7141j4503Q9912k9427o3989L850M5038k0828n271j2344j3420
5979b3690J7995K6227N0658l7987k6467k1839m264j6441M0365K9932l2007p697
5967e215K4326Q8960r1085n0706M3112j4319L1230o3201j0960o124N0107K3320
$$ y = [53863, 7309, -33986, 26199, 22522, -7840, -6776, 63593, -13262, -14542, -9545, -39032, -25470, -59982, -73750, -56585, -17320, 34430, 24287, -5822, -18328, -27283, 27470, 61451, -17657, 39533, -31626, -89660, -50564, -32194, -54181, -79854, -19387, 7779, 18364, 5749, -29489, -72589, -21574, 20181, 25616, 8484, 76848, 33460, -57933, -17177, 68019, 19013, 11328, -42380, -77819, -72795, -27943, 42396, 36405, 71227, 65193, -26007, -10841, 83605, 45216, -37919, -19849, -2708, -17211, 72701, 43274, -20715, -16865, 28173, 7345, 2074, -10270, -23690, -5695, 20532, 71190, 33203, 6736, -15103, -19367, -35808, 4557, 34489, 2482, -5215, 19111, 108071, 16986, -33720, 9392, -4927, 26303, -36898, -47858, -53982, -3875, 19445]
5955A9445q22l3961O6963p0350l0585R0685J6535L182m5382R700j1892k9129J2610
5942c001L8546K6316m3978n2514k7894l9397Q1258N2292j3847l135L3949L0397
5930G8992l6413L1831o4662k6545p443r833Q8576n353k6976p35K7282l8084k8543
5917a7906O0737p2300M2726K2168k1847N5499k0709q708j4221N789K5810K2480
5905G9518m8288p198L3983o7548Q166R9690N624p5010j4660P2168N759L5175j5722
5892A11657q6615l9562O878L0784N8370j046L8634n9115p07M6232k5670l0417
5880D9423J5424O37M8137m6949n244j8629M1691J6485k2802P952l7014J1473k5391
5867C5193Q2648k4452q0858Q479J3499m9668j0636O7772M3124M1520K3082k3450
$$ y = [19445, 18623, -15338, 51625, -18725, -49310, 41375, 57910, 61092, 15710, 25410, 13518, -15611, -3001, 35545, 61861, 17883, -34631, -62525, -101922, -20664, 31628, 17781, 14646, 48595, 78992, 42579, 74410, 9748, -16797, -24240, -34073, 54503, 49150, 22174, 21439, 48721, 10637, -17906, 42831, -29469, 13257, 35425, 13578, 69077, 48368, 39660, 25439, 31228, 57038, 79518, 31230, 24032, 58015, -9533, -1367, 98323, 103947, 28937, 14277, 86445, 92204, 127379, 111657, 25042, -14520, -7642, 23142, 81512, 80466, 119100, 59985, 59278, 105510, 79840, 49423, 64847, 65484, 113621, 66672, 61428, 42799, 84490, 100975, 78173, 86125, 49111, 60584, 35193, 117841, 93389, 12531, 21010, 34509, -15159, -25795, 41977, 85101, 126621, 149703, 126253]
5855A26253p3736J2535j6267k2472N6093l2262L3408k8003m5137O5823j5531M0222
5843A00926j1689p8390N6749O3135j1171o957M1169M459r460j7339J2089N2638
5831A96159n0531k318o1170l6987K5333K0892K5833j446K3096L999L4435j4791
5819A62504p306k3072k2255O0448j1248K1073L4908l1160K5973j4558J2203j9306
5807A88204J1964l805m5126l2527P8517J7941K9760J18287j64K1575O4031K3890
5795D72547L3940J01802O4930K27552K62330K51065K83558K5780j61931l19002
5785A242571l02643k37897j39827r7296m8880j0346L2612j0285j19071j12643
5775A96295O3874K8487k4869l9292J4570K641l5819O3467n4746p2341P4797O7908
$$ y = [126253, 52517, 65052, 48785, 26313, 82406, 50144, 83552, 55549, 10412, 76235, 60704, 100926, 89237, 10847, 67596, 130731, 119560, 112603, 153772, 158231, 148771, 131432, 143521, 196159, 145628, 143310, 82140, 45153, 70486, 91378, 117211, 115765, 138861, 142860, 177295, 162504, 155198, 132126, 109871, 170319, 159071, 180144, 215052, 183892, 209865, 195307, 207510, 188204, 200168, 196363, 151237, 118710, 197227, 215168, 244928, 363215, 363051, 384626, 448657, 472547, 506487, 608289, 673219, 900771, 1163101, 1414166, 1697724, 1723504, 1561573, 1242571, 939928, 702031, 562204, 464908, 416028, 405682, 438294, 428009, 308938, 196295, 260169, 288656, 263787, 224495, 239065, 241706, 205887, 269354, 214608, 142267, 217064, 284972]
5763B84972J3149M1569P1306j1863l2612R399m9067l8395o4758m3111o556J2547
5751A86580j467j9179P156O8197j5486q3680O9119j9879m2538j8821K0990o279
5739A44713k3229n634J128k5940q200K6106k1871N4780L1745j4503l3785L419
5727A28729l3558q999N9409Q9o0786J9677O0414p2335k3884k398O6375L8495j0171
5714A61057m4864N0743O3187l9338n0937O002j6134k3160J2816n2730Q014R455
5702H4111M8253k8557P0159q5550k1380k6452P8807k8229K170J2899K3195j8803
5690A10623K1674K2816m3835j9220l9357L7526J1407J5022q3647K9897j2045L7653
5678H8514l9281N7917K0018L5629l2669l9916K2431j2223K3353L2587J6744q1023
$$ y = [284972, 298121, 339690, 410996, 399133, 366521, 375920, 326853, 288458, 223700, 180589, 174033, 186580, 185113, 165934, 173090, 241287, 225801, 142121, 211240, 191361, 148823, 130002, 150992, 144713, 121484, 115850, 116978, 91038, 82838, 108944, 87073, 141853, 173598, 159095, 125310, 128729, 95171, 86172, 145581, 145670, 84884, 104561, 164975, 92640, 68756, 66358, 132733, 171228, 161057, 116193, 166936, 230123, 190785, 139848, 145850, 129716, 106556, 119372, 66642, 74656, 84111, 132364, 103807, 173966, 88416, 67036, 40584, 119391, 91162, 93332, 106231, 129426, 110623, 132297, 155113, 111278, 92058, 52701, 90227, 101634, 116656, 33009, 62906, 50861, 88514, 49233, 107150, 127168, 162797, 130128, 90212, 112643, 100420, 123773, 156360, 173104, 92081]
5666I2081Q199J6850k1744p6414N7874L3560R524j0619l7998j9160J0894L7539
5654A00586N7646o9740o878J8506L822l0401l1269J0084j3887N5487l065j2579
5642G8312L5502k948R084R232m5289J765P524L2140n9025J3576L9561J3426m5427
5629H7433l9778L1850n7775L6888N3863n9897R6904J02440n4059o630N2050l6310
5617B06979J9043n4984O4548j065l9852K7931j0785j288j1928K3044N9176l3951
5605B46868p1243o766L8299j0599l09k468n0539O9814k5069N689J3350n2371j1387
5592A43269J2847j7042N2370L3054M3467M8556m4876K2934n2868O228O9356n4441
5580B62854M7598m2093K129R256J4199p359L6078O3120J0689L3447l6899j9725
$$ y = [92081, 100280, 117130, 95386, 18972, 76846, 110406, 119930, 109311, 71313, 52153, 63047, 100586, 158232, 88492, 81614, 100120, 103942, 73541, 42272, 52356, 38469, 93956, 90891, 78312, 113814, 110866, 119950, 129182, 83893, 85658, 93182, 125322, 66297, 79873, 119434, 132860, 87433, 47655, 79505, 21730, 58618, 112481, 52584, 149488, 251928, 197869, 191239, 243289, 206979, 226022, 171038, 235586, 234521, 194669, 222600, 211815, 210527, 198599, 221643, 280819, 246868, 175625, 168859, 207158, 196559, 196250, 193782, 143243, 213057, 187988, 193677, 207027, 154656, 143269, 156116, 139074, 191444, 224498, 267965, 316521, 271645, 294579, 241711, 247939, 317295, 262854, 310452, 268359, 270488, 279744, 293943, 286584, 322662, 385782, 396471, 429918, 393019, 373294]
5568C73294l8915j9422J7170Q1661p202J2961m7381M5084J1952n8157M370N7009
5556D32424o907l7951N5782L0441N9547P0665J5451q1770j10460J08255N9492
5545E94969q946J36553P7062J5813O3819J51286J77211K37436K98094L92412N26031
5534B661740M01798j19430n12298m97118m12344l10764j50907j05708q1272m7681
5524H26016N9834n1418m9764l1105J4379M2576m0941l0751k5710o6318L4124m5917
5512F35005J6794K4649l8417M5261P2861R0816J02278P1459j9266r8260j25723
5501G77457j0667n2975o0270j4509P7718q3639O7726L829q9122L6314L8868l452
5489F87278j8736m124p6608j3370O9072N7196J8026Q5857R6419Q4151P4949J32763
$$ y = [373294, 334379, 314957, 332127, 413788, 406586, 419547, 372166, 417250, 429202, 371045, 375415, 432424, 425517, 387566, 443348, 473789, 533336, 604001, 619452, 537682, 427222, 535477, 594969, 586023, 722576, 799638, 815451, 879270, 1030556, 1207767, 1445203, 1743297, 2135709, 2661740, 3063538, 2944108, 2431810, 1934692, 1522348, 1211584, 1060677, 954969, 873697, 826016, 885850, 834432, 784668, 753563, 767942, 810518, 769577, 738826, 713116, 646798, 680922, 635005, 651799, 676448, 638031, 683292, 756153, 846969, 949247, 1020706, 1001440, 903180, 777457, 766790, 713815, 653545, 639036, 716754, 633115, 700841, 704670, 615548, 651862, 690730, 687278, 668542, 664418, 587810, 574440, 643512, 700708, 718734, 804591, 901010, 985161, 1060110, 1192873]
5477A192873J07720Q0605j55266j38985j46381j95720k0982K5937N2199n8544
5467G43456m5048n9080N2684j0465r342j9714N5953J2515P598N2888l665O6438
5455H44218J0147R6320Q4162J17397J25341K03839K46281L46421M26066L49941
5445B850133L07935m2352m38159m44621l33017k98198k85581q4672j17952j19595
5435I93921l1259l8922r1469n8769O9619K7134k0718K3522l14j8151Q5946l9652
5423I00888Q3525J30767R9028J38093J10018K08145K52957L68922L68008L34350
5413B994701K10621j7400n22156o09071l65678k70665j44494j20452j35159j25982
5403H94265o547n5693j04219p3785j186K0857j1241k2342l7932M0064k5037j1625
$$ y = [1192873, 1300593, 1381198, 1225932, 1086947, 940566, 744846, 723864, 749801, 802000, 743456, 698408, 639328, 692012, 681547, 672205, 652491, 708444, 720959, 728557, 781445, 777780, 844218, 854365, 950685, 1034847, 1152244, 1277585, 1481424, 1727705, 2074126, 2500192, 2850133, 3158068, 3115716, 2677557, 2232936, 1899919, 1601721, 1316140, 1231468, 1113516, 993921, 962662, 923740, 832271, 773502, 843121, 870255, 849537, 873059, 872745, 854594, 940540, 900888, 984413, 1115180, 1214208, 1352301, 1462319, 1670464, 1923421, 2292343, 2660351, 2994701, 3205322, 3187922, 2665766, 2056695, 1691017, 1420352, 1275858, 1155406, 1020247, 894265, 887718, 832025, 727806, 654021, 652835, 673692, 662451, 640109, 602177, 642241, 617204, 605579]
5391F05579P4241K8820l6489J8331K9938O1425J71234P9895O9601J53788M5288
5380A301651o4123j36008j84605j31386j43516p1671l2442n9706m6880k6532N3528
5369D58310j762n8385N4168R6621n7678o8850o9746o1152L3981j7918l8227N1229
5357C20591J6632r533K3115k025r71l9715n6160K0115K2513k3247p8242O158M0321
5344B39552M54Q78P856L8908n7043k7833Q477J1082Q183p624k6006p929j9049
5331A69906P0822k4689m6920j8407N058R3303k9069j8600j6769j7844J8166N432
5319A90389L9100l6855o751J9026k9435j5886Q4425p2164K7326N8882J53k8665
5307B29545k7079K6429n0377N280L7089m305l4330J3205Q738n4103n8639M0707
$$ y = [605579, 679820, 708640, 672151, 690482, 720420, 781845, 953079, 1032974, 1102575, 1256363, 1301651, 1237528, 1101520, 916915, 785529, 642013, 570342, 537900, 478194, 431314, 404782, 458310, 456548, 398163, 452331, 548952, 491274, 422424, 352678, 291526, 325507, 307589, 269362, 320591, 337223, 327690, 350805, 348780, 347809, 308094, 251934, 272049, 294562, 271315, 193073, 199231, 239552, 240006, 240884, 248740, 287648, 230605, 202772, 211249, 222331, 230514, 222890, 196884, 188955, 169906, 240728, 216039, 169119, 150712, 155770, 249073, 220004, 201404, 184635, 166791, 184957, 190389, 229489, 192634, 185883, 204909, 175474, 159588, 244013, 171849, 199175, 258057, 258210, 229545, 202466, 228895, 178518, 183798, 220887, 216582, 182252, 195457, 204195, 150092, 91453, 132160]
5295A32160O5478K6769q308k4447k4967J0547p5n121l521R957k385O1501M4458
5282B82046l1732m9922p630l837j7460L985l6619P3520j6416j3468M1784M7525
5270B71776N716l4510O0710O998J7350l607k2046O422n026j5086N634L093K794
5257C00218m2172K4396O8364o0568K179M7296m1204j3939j4147L899K8806L8584
5245C41712j8784J6007n3285k6276M1865N3213K9276l7830J6389M172M663K0831
5233C91953L0511j8048K6206Q3573J7956O118k0772K3273J6757q0044J7427Q0525
5221E75435J1624P8620L0313J17913R0250J00396Q7469L1997k3002r5948n7425
5210I47642l9799P8987O5559M059J51667J64489J44377K13769L90669L66725M36856
$$ y = [132160, 197638, 224407, 216099, 191652, 166685, 177232, 177157, 172036, 168515, 178472, 176087, 237588, 282046, 250314, 200392, 192762, 188925, 171465, 175450, 138831, 212351, 195935, 182467, 224251, 271776, 277492, 242982, 303692, 310690, 328040, 324433, 302387, 308809, 303783, 288697, 294331, 297424, 300218, 258046, 282442, 350806, 290238, 292417, 339713, 298509, 284570, 270423, 274322, 303128, 341712, 322928, 338935, 285650, 259374, 301239, 354452, 383728, 345898, 362287, 366459, 371122, 391953, 422464, 404416, 430622, 514195, 532151, 538269, 517497, 540770, 557527, 477483, 494910, 575435, 587059, 665679, 695992, 813905, 904155, 1004551, 1092020, 1124017, 1101015, 1005067, 947642, 907843, 986830, 1052389, 1056448, 1208115, 1372604, 1516981, 1730750, 2121419, 2488144, 2925000]
5199B925000N32660M71201K58057k38951n35018o26721m68146l89853l37829k48932
5189A341468j60635j28600j19216j7983l9137j06835l0640p4300L3132k5525o4420
5178F07309k4102o9521l0171l4525j7849M5167K1219l443q72p7832o4993k7502
5166C22885j4122J0691N5440l9049m8632J4094p589m966j2325m9793j7974O5536
5154B74196l3736j0927J8253k012r296K3883n6106Q653J1307j467O5030N321P112
5141C00211r03o880j0399k7914k0702J3743L9496k4260n928K1171o2939Q375O158
5128B29229j3216J4394l5293L9565P8522l157m6766O7468j3349p8098L581L7884
5116B80764J8436J0423M3621n1525O678l1598n3539N1976Q679L8222O9787l5712
$$ y = [2925000, 3457660, 3928861, 4186918, 3947967, 3412949, 2786228, 2318082, 1928229, 1590400, 1341468, 1180833, 1052233, 933017, 915034, 875897, 769062, 738422, 664122, 697254, 671729, 607309, 583207, 513686, 483515, 448990, 431141, 476308, 497527, 494084, 493212, 415380, 350387, 322885, 308763, 319454, 374894, 335845, 287213, 301307, 293718, 288752, 276427, 226634, 208660, 274196, 240460, 229533, 247786, 245774, 236478, 260361, 204255, 212908, 224215, 222748, 287778, 293099, 300211, 299308, 292428, 282029, 254115, 233413, 247156, 286652, 262392, 256464, 277635, 214696, 223071, 229229, 216013, 230407, 195114, 234679, 313201, 310044, 263278, 330746, 317397, 239299, 242880, 280764, 299200, 309623, 353244, 301719, 308397, 276799, 223260, 275236, 283915, 322137, 391924, 356212]
5104C56212O9518p609K4972J42924j1405J1437O6578m4309J3923R8750Q4380L2549
5092H37920J17177Q0785n990J32037N7733Q0126M9860j02584j26194o5814m3732
5081A011324k9834J948n9900n303j9811j9658L1823P5650J6398J15864M6721J09178
5069A274400R0462O2437M2898L4807m7984n8631k0906j19620j35866o5217l1271
5058A025509p8806p318j8673K4851N6259J09881O9357Q1625J1801L7411J6855
5047A328752k0453L8057n3336n9389J7633o3258m8271n8008N1968p7285l2347
5036A024063l8517M1244P3866J9019j9716J32265O2448m1494l0664J2536J2374
5025A247424j6482p237j03772j27545r9532q4241o9442q4825n9274l5478p2967
$$ y = [356212, 425730, 418121, 443093, 586017, 574612, 586049, 652627, 608318, 622241, 720991, 805371, 837920, 955097, 1035882, 1029892, 1161929, 1219662, 1299788, 1349648, 1247064, 1120870, 1055056, 1011324, 981490, 983438, 923538, 918235, 898424, 878766, 910589, 986239, 1002637, 1118501, 1165222, 1274400, 1364862, 1427299, 1470197, 1505004, 1457020, 1398389, 1377483, 1257863, 1121997, 1056780, 1025509, 946703, 939385, 920712, 945563, 1001822, 1111703, 1181060, 1262685, 1274486, 1311897, 1328752, 1308299, 1346356, 1293020, 1233631, 1251264, 1188006, 1139735, 1081727, 1133695, 1056410, 1024063, 985546, 1026790, 1100656, 1119675, 1099959, 1232224, 1294672, 1253178, 1222514, 1235050, 1247424, 1230942, 1223705, 1119933, 992388, 892856, 808615, 739173, 654348, 595074, 559596, 486629]
5014D86629j2995P5235j5559l0460K8409M2138K9588o6622m0052L7977L1239q1605
5002D83922M3645L9076q5997j6941M9312L5385j622m2072n7386o4211Q3632j3968
4990D52775m518l259N0374o4318n4462k1846K289l8360q4703l8178K0078K1694
4978B37566J1586m9920N9255j4144k2811M2557j1343p7928L3253K0420J4580l5629
4966B07442l9386p640o541J2215K4935L0368l4586m2035O8764o11j2873M004k1190
4953A82866L654m9224O3494n2390j7018n0664Q954J8806P5750l9567N3996l663
4941A94994j33983J6165L7380L880n6687m6407L0761J04086o391K4649o758m9578
4929A12111J5071o038J5557J8400m017j3105l7949j9058J1200l174J3631Q121
$$ y = [486629, 473634, 548869, 533310, 502850, 531259, 573397, 602985, 536363, 496311, 534288, 565527, 483922, 527567, 566643, 480646, 463705, 513017, 548402, 546780, 504708, 447322, 383111, 466743, 452775, 448257, 444998, 495372, 431054, 376592, 354746, 357035, 318675, 233972, 195794, 215872, 237566, 249152, 199232, 258487, 244343, 221532, 264089, 252746, 174818, 208071, 228491, 243071, 207442, 168056, 160416, 153875, 166090, 191025, 221393, 186807, 144772, 213536, 212925, 200052, 204056, 182866, 186520, 137296, 200790, 148400, 131382, 80718, 89672, 108478, 184228, 144661, 198657, 194994, 61011, 77176, 114556, 118436, 61749, 15342, 46103, 150189, 143798, 168447, 161689, 112111, 127182, 121144, 136701, 155101, 151084, 137979, 100030, 80972, 92172, 88998, 102629, 110750]
4917A10750K6223n584j05589L1784K8420o984L7366n4075N2190j9471L6105j3997
4905A17138K3236j1936k6063K9093O896p3636L801K2523J6706J8439k6788J3735
4893A13144J0514K9538k9874Q869j3854l288J4325R704l5104K1260m1195k1151
4881F2888J0247L2315L2130k238k734J9895J0197p6316n019K6766q0234J2705
4869D0602M5989L111M3373M4440r6222J7434J06760j8637k4917j4564N9097k7351
4857A79115M9181N0793p8468j0153J12738l0139J4366k3652l7060R953m9573M5204
4845B32305P9255j868J0793N319l3850J1733j5629k4294L4396k6516L2703R176
4833C13523o4232o1824M4441L9111P61N3922k4783M2248m5409K1445K5389j9856
$$ y = [110750, 136973, 131389, 25800, 57584, 86004, 79020, 116386, 62311, 114501, 95030, 131135, 117138, 140374, 128438, 102375, 131468, 138364, 64728, 68529, 91052, 107758, 126197, 99409, 113144, 123658, 153196, 123322, 132191, 118337, 115049, 129374, 139078, 103974, 125234, 84039, 62888, 73135, 105450, 137580, 135342, 132608, 152503, 162700, 86384, 81365, 108131, 27897, 40602, 86591, 89702, 133075, 177515, 81293, 98727, 205487, 186850, 161933, 147369, 206466, 179115, 228296, 279089, 200621, 190468, 303206, 273067, 287433, 263781, 226721, 236674, 187101, 232305, 311560, 309692, 320485, 325804, 291954, 303687, 288058, 263764, 298160, 271644, 304347, 313523, 249291, 187467, 231908, 271019, 271780, 325702, 300919, 343167, 297758, 319203, 344592, 324736]
4821C24736K8481m7593k5533J14445O3328l574J2081m8652n4665L4831K4826Q458
4809D31169n9128n2082P262O6275M9031p6531m3014M2093m9415j8746M0333Q9842
4797D27089O475k8721K1341o4983Q610j6897K9247N277o507P2651k7104l1801
4785C94677M7512K6490k0737o5851M1941K8230K1402L1187m1257m7392L0605n301
4773D41506P5267Q625q0337M5250j2459j396o0075P972j8804k7025M7105L5101
4761D60730k9553K2676j3114r0477p2133j6301L8338M4908J4781J8692K1082K2312
4749D21941O367K9830M4233O0357l3506n3188M4221O906j03729p8076k7259k672
4737C15425K2259k861P3408j2517j6491K8222j2477K2685P174n6543k5297L3191
$$ y = [324736, 353217, 305624, 280091, 394536, 457864, 454290, 466371, 417719, 363054, 397885, 422711, 431169, 372041, 319959, 327221, 393496, 442527, 365996, 322982, 365075, 315660, 296914, 337247, 427089, 433564, 404843, 426184, 361201, 369811, 352914, 382161, 387438, 380931, 453582, 426478, 394677, 442189, 468679, 447942, 382091, 424032, 452262, 473664, 504851, 463594, 416202, 446807, 441506, 516773, 525398, 445061, 490311, 477852, 476456, 416381, 424353, 405549, 378524, 425629, 460730, 431177, 453853, 440739, 350262, 278129, 261828, 300166, 345074, 359855, 378547, 399629, 421941, 428308, 458138, 502371, 562728, 529222, 476034, 520255, 527161, 423432, 345356, 318097, 315425, 337684, 334823, 408231, 395714, 379223, 407445, 394968, 417653, 424827, 368284, 342987, 376178]
4725C76178O5326K026R00M350J7765j8261n4969K4993o462K3625j1954n4450j9520
4712C49547J6475Q2489l9685k4289j2838K0363P1176p6569l9139o119M6945k6373
4700C61983m6839K1075L4543l090K1589L359k0763J0372r449q7709N291Q7896
4688C78258L1454J8442k7804q2771m2165J9452L664L9707k2474N0485K5374j6864
4676C74758j070p709N0728n0104K347k2571k6073P1826J633n7206j2759K2850
4664C46650n788j1310k0303N7054N631q0741k1981M665l3129P4873K0409k6006
4652C10024k4164N020J6816P636m0656O2736O9343K991n391p2773L1032K2774
4640C85388O956M165n9641Q9317o7994q7313l5604K5319O5572k0862n4037O0060
$$ y = [376178, 441504, 443530, 444430, 448780, 466545, 448284, 393315, 418308, 411846, 435471, 423517, 369067, 349547, 366022, 448511, 408826, 384537, 371699, 392062, 463238, 386669, 347530, 341411, 388356, 361983, 315144, 336219, 370762, 367672, 389261, 392620, 371857, 382229, 372780, 285071, 290362, 378258, 409712, 428154, 400350, 317579, 275414, 294866, 298530, 338237, 315763, 366248, 391622, 374758, 373688, 365979, 416707, 366603, 368950, 346379, 320306, 392132, 393765, 336559, 323800, 346650, 340862, 329552, 309249, 366303, 371934, 291193, 269212, 273877, 240748, 315621, 336030, 310024, 285860, 290880, 307696, 315332, 274676, 337412, 406755, 409746, 404355, 331582, 362614, 385388, 392344, 396509, 336868, 426185, 358191, 270878, 235274, 260593, 326165, 305303, 251266, 311326]
4628C11326R4489o2070k5413L6022l325k4317k5742J6460J7352M0681l4035k9092
4616C12336k648j6491K6708j686k1848K035j2644O9782O9583o0818k2396k5529
4604C16384J8562P0826k0291k5071k416q835L2607J1136M1912n350J2687n9250
4592C82901j0759K0251L9724N7950n37m4409M6441M024l4879P951P235k4191L8920
4579D90622l985J3975K1095M3510O741j18268K3767M4948L9555J6525j9188L3532
4567E92829j0106j8925m279m8023k617J2245K8594m155n4483m2177M1967l9433
4555D51437n0127L4189N9018O5986Q0543k2481j05740l9042k6423M1688l1030
4544D58018J095L0613L4816K0618l7135l7078N2175K6387o528J0112n9054K6204
$$ y = [311326, 405815, 343745, 318332, 354354, 351029, 326712, 300970, 317430, 334782, 375463, 341428, 312336, 309688, 293197, 319905, 318219, 296371, 298406, 285762, 355544, 425127, 364309, 341913, 316384, 334946, 405772, 385481, 360410, 357994, 349159, 381766, 392902, 434814, 429464, 442151, 382901, 372142, 392393, 432117, 490067, 489530, 445121, 491562, 495586, 460707, 468658, 475893, 451702, 490622, 486637, 500612, 521707, 565217, 571958, 453690, 477457, 522405, 561960, 578485, 559297, 592829, 582723, 563798, 559519, 511496, 508879, 521124, 549718, 545563, 491080, 448903, 490870, 451437, 401310, 435499, 494517, 560503, 641046, 618565, 512825, 473783, 447360, 489048, 458018, 459113, 489726, 524542, 545160, 508025, 470947, 523122, 549509, 542981, 553093, 494039, 520243]
4532E20243K99J4557L3825M321j5264k1742K7735k8840k27N9703N1886l2535P3726
4519F87687k5330k1577k8041K0325M3282j4513K650L2406R805O910m479o218Q4738
4506G87645j3741K1841J7866j6260J3401K0360p650n5422J5692K4404P58r31j1189
4493G96774M1636J895M3661K7609K735q94K537l724M0319R7154L8386p3591j443
4480A013054N2395N6445l2795l953N7750J8723o273n065M2424O3177L7207M1777
4468A334866p4471R128J25071N1423J8324L3055N4768M2561J39316K4872J4311
4457A773224L3961L6219P2015Q3028R9751M5751M4847Q7937j1437J59773P1500
4446B496569L2362R7101Q3094J13926K0784O7553L6348J83512J25861J54081Q9642
$$ y = [520243, 520542, 535099, 568924, 573245, 557981, 536239, 563974, 535134, 534907, 594610, 646496, 613961, 687687, 662357, 640780, 612739, 633064, 676346, 661833, 664483, 696889, 706694, 713604, 709125, 702907, 787645, 773904, 795745, 813611, 797351, 810752, 831112, 823462, 768040, 783732, 808136, 808894, 807963, 796774, 838410, 840305, 883966, 911575, 914310, 913416, 915953, 912229, 952548, 1049702, 1088088, 1014497, 1013054, 1065449, 1121894, 1089099, 1085146, 1142896, 1161619, 1155346, 1150281, 1192705, 1255882, 1293089, 1334866, 1260395, 1269523, 1394594, 1446017, 1464341, 1497396, 1552164, 1594725, 1734041, 1758913, 1773224, 1807185, 1843404, 1915419, 1998447, 2098198, 2143949, 2188796, 2276733, 2265296, 2425069, 2496569, 2528931, 2626032, 2709126, 2823052, 2843836, 2911389, 2947737, 3131249, 3257110, 3411191, 3500833]
4435C500833J27822J38349J88844J98887J58645K85597K04009K09704L15193L23437
4425E651320L38903L65188M74313L91842N27286N95519O37701O87938O77707P66355
4415A1114072P09632O25506O17151N06149K11213k02810m27560m19910l66814
4406A2366629j95081k2380j7694M5889L17159L75824M78825N57449N00967M80716
4396A4888303N57247M12001L00595J50052R3156N0968m6622k3010o2140j34010
4386A6186540j78237k95059k57757j94470k34661j32981j22393N3672J71862K67233
4376A5263749K98053K26456K78622J47790j3597j01048j21243j08662r2033k4929
4366A5753158J56657K51128K49795K35476J85281J37016O7488j44482k84846m25461
$$ y = [3500833, 3628655, 3767004, 3955848, 4154735, 4313380, 4598977, 4802986, 5012690, 5327883, 5651320, 5990223, 6355411, 6829724, 7221566, 7748852, 8344371, 8982072, 9670010, 10347717, 11114072, 11823704, 12449210, 13066361, 13572510, 13783723, 13580913, 13153353, 12733443, 12366629, 12171548, 12149168, 12131474, 12177363, 12494522, 12870346, 13349171, 13906620, 14407587, 14888303, 15445550, 15857551, 16158146, 16308198, 16401354, 16452322, 16405700, 16382690, 16320550, 16186540, 16008303, 15713244, 15455487, 15261017, 15026356, 14893375, 14770982, 14824654, 14996516, 15263749, 15561802, 15788258, 16066880, 16214670, 16201073, 16100025, 15978782, 15870120, 15778087, 15753158, 15909815, 16160943, 16410738, 16646214, 16831495, 16968511, 17035999, 16891517, 16606671, 16181210]
4356A6181210m59700n76750p22818p58430q53993q88903q54155p36514p08410
4347I621537o30783m78871n11727m65439m26962l09113l03175k35462k18192j80161
4337E861652j71249j17476o0858q4293n992o598j34504k22750j37026j11772j15629
4326D693505j36935p5323j75513p4242o0665k4121j7062M846J1558J0819J1116
4315D167983m891R9441N4035P0698J47205N8982K3274J41142J25214J32057P5123
4304E090263M956J04210R5887J93448K23209J05307K79217K37194K49316J83464
4294F766471J38056J02871J99867K15972K35869K89594K70661L36032L46432M24467
4284I326292N21304N78229N79175P43394P45630P47666Q59385Q02719O66450O73246
$$ y = [16181210, 15721510, 15144760, 14421942, 13663512, 12809519, 11920616, 11066461, 10329947, 9621537, 8990754, 8511883, 8000156, 7534717, 7107755, 6798642, 6495467, 6260005, 6041813, 5861652, 5690403, 5572927, 5512069, 5427776, 5421784, 5415186, 5280682, 5057932, 4920906, 4809134, 4693505, 4556570, 4481247, 4305734, 4231492, 4170827, 4146706, 4129644, 4134490, 4146048, 4156867, 4167983, 4163092, 4262533, 4316568, 4387266, 4534471, 4593453, 4616727, 4757869, 4883083, 5015140, 5090263, 5095219, 5199429, 5295316, 5488764, 5711973, 5817280, 6096497, 6333691, 6583007, 6766471, 6904527, 7007398, 7207265, 7423237, 7659106, 7948700, 8219361, 8555393, 8901825, 9326292, 9847596, 10425825, 11005000, 11748394, 12494024, 13241690, 14101075, 14903794, 15570244, 16243490]
4274A6243490M95833L86598L32644K17436J55054Q3704q1789k23230k41571k55298
4264A7112871k84998j69987r8693J2297J30272J36854J58395Q8206N2765k6620
4254A7111362q3391j51038k38144j82919j17290j77944R008M3955M0946J74635
4244A6429180Q1426J34518R3006L2588P4824K4530m6989j8954n4870j86284k80771
4233A6282204l62687m73155m05608m73240n02635m67385m13840l56541m05372
4224A2421741k69961k01629j70899r0827j59238j40702j96774k44397j69441l37913
4214A0439960l84726l55078m74869m54128m63345m15564l94191k96298k83256
4205F918505l15076k83396k46587k59692j98569j34793j40128r2856j63535j27340
$$ y = [16243490, 16739323, 17125921, 17458565, 17676001, 17831055, 17914759, 17832970, 17609740, 17368169, 17112871, 16827873, 16657886, 16559193, 16571490, 16701762, 16838616, 16997011, 17085217, 17137982, 17111362, 17027971, 16876933, 16638789, 16455870, 16338580, 16160636, 16169644, 16213599, 16254545, 16429180, 16510606, 16645124, 16738130, 16770718, 16845542, 16870072, 16823083, 16804129, 16749259, 16562975, 16282204, 15919517, 15446362, 15040754, 14567514, 14064879, 13597494, 13183654, 12827113, 12421741, 12151780, 11950151, 11779252, 11688425, 11529187, 11388485, 11191711, 10947314, 10777873, 10439960, 10055234, 9700156, 9225287, 8771159, 8307814, 7892250, 7498059, 7201761, 6918505, 6603429, 6320033, 6073446, 5813754, 5615185, 5480392, 5340264, 5247408, 5083873, 4956533]
4195D956533j70124k13629k07220j35272j31668j30842j14278j58847m5820j47520
4185C501313r4409Q7025n7917k5631L434L524O3925J18665j6627Q4580O9167K5765
4173C762814L5577l4565m406o4192J6827M1070n9899R0950N8474k5522k0259m382
4161C792487n3195j73856o5281L2340K5500M0154k0192j1287n003N5934J14641
4150C732242K8750O8957n83l9524r249p0731K3685J5840j20933m9093l8332J3540
4138C554569j2610m7111j9925J7279Q2610R0293K729J07063R7891q2075K7049
4127C817762J30297J1707L0882P1817J06877J16585J43934K31444K26420J31364
4117E019089j9388p2304q9534j12751j29926p4783j12907p3743q3075j35328n4044
$$ y = [4956533, 4786409, 4572780, 4365560, 4230288, 4098620, 3967778, 3853500, 3694653, 3648833, 3501313, 3406904, 3493929, 3436012, 3410381, 3413815, 3417339, 3481264, 3599929, 3583302, 3667882, 3737049, 3762814, 3798391, 3763826, 3759420, 3695228, 3712055, 3753125, 3693226, 3784176, 3842650, 3817128, 3796869, 3792487, 3739292, 3565436, 3500155, 3532495, 3557995, 3598149, 3577957, 3566670, 3561667, 3617601, 3732242, 3760992, 3829949, 3829366, 3789842, 3780593, 3709862, 3733547, 3749387, 3628454, 3579361, 3541029, 3554569, 3541959, 3494848, 3474923, 3492202, 3574812, 3665105, 3667834, 3774897, 3872788, 3790713, 3817762, 3948059, 3959766, 3990648, 4062465, 4169342, 4285927, 4429861, 4661305, 4887725, 5019089, 4999701, 4927397, 4837863, 4725112, 4595186, 4520403, 4407496, 4333753, 4250678, 4115350, 4061306]
4106D061306N9209m184l5119M8085O380J06164N6630K3014J41464R9951M6880
4095D609780N8051J37255Q7227Q9155R4863J81399N3088M9278R7011J11226P1726
4084E640059Q0166J07583J18865J45038J16979J05400J78152K29046K42910K99467
4074G263665K39266L06214L53218L52262J97113K13110Q5536J64599K12339K39241
4064I626563L05449L03119K70505K31097L22343M03735M09529M93921N58440P83805
4054A3708506R91105J291195J580111K021667K390588K576883K010845P66816
4046B7337716K1642o63808j686414j970729j656670j279384r21665p54943m98108
4037A7927637l04058j53995p2673J06703J78803L28883M47430N13889N19642N22672
$$ y = [4061306, 4120515, 4116331, 4081212, 4129297, 4135677, 4241841, 4298471, 4321485, 4462949, 4562900, 4609780, 4667831, 4805086, 4892313, 4981468, 5076331, 5257730, 5310818, 5360096, 5457107, 5568333, 5640059, 5720225, 5827808, 5946673, 6091711, 6208690, 6314090, 6492242, 6721288, 6964198, 7263665, 7502931, 7809145, 8162363, 8514625, 8711738, 8924848, 9010384, 9174983, 9387322, 9626563, 9932012, 10235131, 10505636, 10736733, 11059076, 11462811, 11872340, 12366261, 12924701, 13708506, 14699611, 15990806, 17570917, 19592584, 21983172, 24560055, 26570900, 27337716, 27359358, 26695550, 25009136, 23038407, 21381737, 20102353, 19180688, 18425745, 17927637, 17623579, 17469584, 17396911, 17503614, 17682417, 18011300, 18458730, 18972619, 19492261, 20014933]
4027B0014933N99135P57977Q06754R24978J100285J318909J633783J929838K283180
4018C1369772K652109L093402L508194L860944L809699L582325M198177N087377
4010F1161999N904385O418200O384578N441934L535622O55642k380459m124036
4002H2997865m555732l827029k170716l02215Q52835J184865j750117o755238
3994F5674518q504772p409240n806370m527889l543581k820652k365069k130332
3986B8566613j815675j570130j227632r71352p84487n92011m25581l77171l64637
3977B0437937k40756j61369k90866k12576j54450j3090J41788K82445L85733M62176
3967B0636972N54043N54826O58235O89700N48513L62498j00851p72926j277716
$$ y = [20014933, 20614068, 21372045, 22178799, 23103777, 24204062, 25522971, 27156754, 29086592, 31369772, 34021881, 37115283, 40623477, 44484421, 48294120, 51876445, 56074622, 61161999, 67066384, 73484584, 79869162, 85311096, 88846718, 89502360, 87121901, 82997865, 78442133, 74615104, 72444388, 72142173, 72995008, 74179873, 72429756, 65674518, 57169746, 49760506, 43954136, 39426247, 35882666, 33062014, 30696945, 28566613, 26750938, 25180808, 23953176, 22981824, 22197337, 21605326, 21179745, 20802574, 20437937, 20197181, 20035812, 19744946, 19532370, 19377920, 19364830, 19506618, 19789063, 20174796, 20636972, 21191015, 21745841, 22404076, 23093776, 23642289, 24004787, 23903936, 23131010, 21853294]
3958B1853294j445060j489899j335179j017161q71571o67113n01705l38154l29267
3949A3858185j34890K4071J66322J58007J70777J6542j29536k55340l73386l03382
3939A3197370k04387j32063J3070J41222K32353K56834J68068k617j25538k37923
3929A3306389k62158l86945k77024j62171q4469o9732L2399q6380k22658l57289
3919A1429962n06011n19831n91265o32567n20039m13246l37858l26008k77877
3910G305260j66058k25047j22855j18849j02448Q315Q8494J14991J53875J73154
3900G108832J39671J23156L539k3706j56869l46991l39115l06085k63586k18977
3890E719869k03342j66234j35402m0562K6091P9768l0964P9749J78714J19544
$$ y = [21853294, 20408234, 18918335, 17583156, 16565995, 15694424, 15027311, 14525606, 14187452, 13858185, 13723295, 13747366, 13913688, 14071695, 14242472, 14259014, 14129478, 13874138, 13500752, 13197370, 12992983, 12860920, 12873990, 13015212, 13247565, 13504399, 13672467, 13669850, 13544312, 13306389, 13044231, 12657286, 12380262, 12218091, 12133622, 12063890, 12096289, 12009909, 11787251, 11429962, 10923951, 10404120, 9812855, 9180288, 8660249, 8247003, 7909145, 7583137, 7305260, 7139202, 6914155, 6791300, 6672451, 6570003, 6578318, 6666812, 6781803, 6935678, 7108832, 7248503, 7371659, 7375198, 7351492, 7194623, 6847632, 6508517, 6202432, 5938846, 5719869, 5516527, 5350293, 5214891, 5174329, 5200420, 5280188, 5249224, 5328973, 5507687, 5627231]
3880E627231Q8056J31994J48525J00050N4234j33021k06146j70958j31920j39902
3870E368143j10856j32728m2578o9926j5127P7896j77J37859J00727l6686m7291
3859E229256m7479j30290j04764k0242n8291O4310k2806L0448p3063l2885J4063
3848D848257M7202k7425L9466J35650K12112J31978K41109L74812M25959N09799
3838F938919N74058N35203N57903L35888J79828o2917k30847l11990m08054m34308
3828G673683l47937j98826j41247r6639p200Q1922J14421J69773K15584J86164
3818G649698K14257L71517L71645M08156M60351O73330O55435P29411O53393N33052
3808A2720245J79427j84893l57317m28998n55256m68639n15724l80142k97955
$$ y = [5627231, 5715287, 5847281, 5995806, 6095856, 6150090, 6017069, 5810923, 5639965, 5508045, 5368143, 5257287, 5124559, 5081981, 5012055, 4996928, 5074824, 5074647, 5212506, 5313233, 5276547, 5229256, 5181777, 5051487, 4946723, 4926481, 4868190, 4932500, 4909694, 4940142, 4867079, 4834194, 4848257, 4895459, 4868034, 4907500, 5043150, 5255262, 5387240, 5628349, 6003161, 6429120, 6938919, 7512977, 8048180, 8606083, 8941971, 9121799, 9058882, 8828035, 8516045, 8107991, 7673683, 7325746, 7126920, 6985673, 6889034, 6881834, 6963756, 7078177, 7247950, 7463534, 7649698, 7863955, 8235472, 8607117, 9015273, 9475624, 10148954, 10804389, 11533800, 12187193, 12720245, 12899672, 12714779, 12357462, 11928464, 11373208, 10904569, 10388845, 10008703, 9710748]
3799I710748k09761j03132l4893J12735L0168R4671O9558q8702p5245j63602l2822
3788I309723N8334P8283J01471J12222M427j38257l03314n06149m13958m93502
3778G809280m25077l65625k82837k22381j56283j54354r1037n119J0545P8470
3768F195582P1627K2585M8566k5103r3241j90977k09655j12741m1423j00356n1224
3757E513640P9534J06734J45586J88575L14539K87987K67125L94905K90796J96605
3747G786026J39150J49364M7002j59768l99532o05448o18549n71404n10107m45921
3737D810813l03556k35763k01416j19709j20383j08318n9864j27953l193K4169
3727C554827j31J34938R3436J35357J60919J51815J91492P0921r3166r0489o716
$$ y = [9710748, 9500987, 9397855, 9362962, 9475697, 9505865, 9600536, 9670094, 9581392, 9506147, 9342545, 9309723, 9368057, 9446340, 9547811, 9660033, 9664460, 9526203, 9222889, 8716740, 8302782, 7809280, 7384203, 7018578, 6735741, 6513360, 6357077, 6202723, 6111686, 6106567, 6117112, 6195582, 6267209, 6289794, 6338360, 6313257, 6220016, 6029039, 5819384, 5706643, 5665220, 5564864, 5513640, 5593174, 5699908, 5845494, 6034069, 6348608, 6636595, 6903720, 7298625, 7589421, 7786026, 7925176, 8074540, 8121542, 7961774, 7562242, 6956794, 6338245, 5766841, 5256734, 4810813, 4507257, 4271494, 4070078, 3950369, 3829986, 3721668, 3661804, 3533851, 3530658, 3554827, 3554696, 3689634, 3783070, 3918427, 4079346, 4231161, 4422653, 4493574, 4400408, 4309919, 4303203]
3716D303203o4183K3863M9522Q4045R0064M4560k8375m3069q8616j71321k30412
3705C969281j79919k60502j85283j80464k13136o3686j06381j07376L696p1033
3695B605197q1398j38876J621O5014K9121L0657K8521M1042m6612r1476p6889
3684B365922j8486m7511l1237k6595K3966Q8154Q0771J31830N3670j54075j50095
3673B316314k24104j79701j34962q3696o9030q8842j01976O808p7794j9066O410
3662A350361n4533k982o5519q9941n9777O0817N4750J4457p7277K0242L329K6127
3650A180054P5825K8018n5486M85J32150O9555l30m9212m0735r3778j12014p3566
3638A060966q1950O24J4266J6936k3748j43391j11432k5452k0046p581L2221M463
$$ y = [4303203, 4239020, 4262883, 4312405, 4396450, 4486514, 4531074, 4502699, 4459630, 4371014, 4199693, 3969281, 3789362, 3528860, 3343577, 3163113, 2949977, 2886291, 2779910, 2672534, 2676230, 2605197, 2523799, 2384923, 2386544, 2451558, 2480679, 2511336, 2539857, 2580899, 2534287, 2442811, 2365922, 2347436, 2299925, 2268688, 2242093, 2266059, 2354213, 2434984, 2566814, 2620484, 2466409, 2316314, 2092210, 1912509, 1777547, 1693851, 1624821, 1535979, 1434003, 1440811, 1363017, 1343951, 1350361, 1295828, 1292846, 1227327, 1137386, 1077609, 1138426, 1193176, 1207633, 1130356, 1150598, 1153927, 1180054, 1255879, 1283897, 1228411, 1228896, 1361046, 1430601, 1430271, 1381059, 1340324, 1246546, 1134532, 1060966, 979016, 979640, 993906, 1010842, 987094, 843703, 732271, 706819, 686773, 679192, 711413, 715876]
3626G15876O4687o7125k6846q406L9066n1099k3066k1282N7923N8607q4117L341
3614F57559p438N964q6116O8580q2837l598J2106M556L0077o2392K3669k3073
3602E37057M85L1520O7704N368m0874j2124K4923J4867J3389L1042l1408k8420
3590F13529m6589J3555Q4311J8709P689j01373J2950M8303n5030N9853J49634
3579H05541J8040n542L3518n2004J8792K0281p1277l319m428L0568J6721m483
3567H02408l8803O0832n9176K4935N3580K7491j9107M3049M9314L6430K6380O720
3555A014053L6973J40626R0142Q7510R6801O7400O9593J72177R3486l8931n6876
3544A772954q33m0161r9502q6194l4925n695j26425j0787n0435o963m1359j0814
$$ y = [715876, 780563, 713438, 686592, 678186, 717252, 666153, 643087, 621805, 679728, 738335, 654218, 657559, 650121, 656085, 569969, 638549, 555712, 552114, 564220, 568776, 598853, 536461, 560130, 537057, 537542, 569062, 636766, 642134, 601260, 589136, 614059, 628926, 642315, 673357, 641949, 613529, 566940, 580495, 664806, 683515, 691204, 589831, 602781, 651084, 596054, 655907, 805541, 823581, 818039, 851557, 799553, 818345, 838626, 767349, 764030, 759602, 790170, 806891, 802408, 763605, 824437, 765261, 790196, 843776, 871267, 852160, 895209, 944523, 980953, 1007333, 1014053, 1051026, 1191652, 1281794, 1369304, 1466105, 1533505, 1603098, 1775275, 1868761, 1829830, 1772954, 1772121, 1731960, 1632458, 1546264, 1511339, 1505644, 1379219, 1368432, 1317997, 1311034, 1269675, 1258861]
3532A258861J3507Q9762K2767p934N0968J16353R5579P2559K5893K8112m1287
3521A725140j07041j46981o2354o1653n5443o9257l6668n2436K7410j9685p9989
3510A061043j3792k7493o1646K2450p7314m236q3482J596L4321j4297m4381k3748
3498G69021O9258K7496K6503Q987Q614l2516K6462R710L3K4497n6557j0521K6255
3485H97242J6701p4979o9798M0678K3790O081M7649Q5510p6824p3864N5865M6928
3473I24979N1468P9789L8980j7681N1937L4844J747L1448q4898J8560N9278n7372
3461A133079L4300M8288N0188J07115L680n5211j5038k86n5481m4477L1085O3427
3449A300669j0694P5011J2269N2113k9564m7137Q984P3300P6181m5290P1403N1101
$$ y = [1258861, 1272368, 1362130, 1384897, 1376963, 1427931, 1544284, 1639863, 1712422, 1738315, 1766427, 1725140, 1618099, 1471118, 1408764, 1347111, 1291668, 1222411, 1185743, 1133307, 1160717, 1141032, 1061043, 1047251, 1019758, 958112, 980562, 903248, 899012, 815530, 817126, 851447, 837150, 792769, 769021, 838279, 865775, 892278, 901265, 909879, 877363, 903825, 913535, 913568, 938065, 881508, 870987, 897242, 913943, 838964, 769166, 809844, 833634, 839715, 887364, 972874, 896050, 822186, 878051, 924979, 976447, 1056236, 1095216, 1077535, 1129472, 1164316, 1166063, 1197511, 1112613, 1131173, 1190451, 1133079, 1167379, 1215667, 1265855, 1372970, 1376650, 1321439, 1306401, 1306115, 1250634, 1206157, 1237242, 1300669, 1289975, 1364986, 1377255, 1429368, 1399804, 1352667, 1361651, 1434951, 1511132, 1465842, 1537245, 1588346]
3437A588346N0174j7540k6982Q4425L2700M5736J28274J6527N9751P2969o115
3426B028265O2489k4674j263n6248l0521Q032K3476O4182J2627P4023J12126N2712
3414B325226R4316q8017p165J29259J43868J38913O5881J1143O5552J01963n5074
3403B925865k1951L8104k8667Q3456J13051O5070L6825o203Q9498k4646N787O0170
3391C336359L5385P9830N1731J23l5424J01793L5103Q3596P2564M8657J40798
3380C950515O9343l608O2768J01379O4593J43705J08158O5363Q0181J50476L8352
3369D831225J03993J52084J15858J44566J12625J30419J64589J30129N7007K38541
3359F181036P7047J82124K30100J37709Q7681J12734J39538J47199J58883J91122
$$ y = [1588346, 1638520, 1620980, 1593998, 1678423, 1711123, 1756859, 1885133, 1901660, 1961411, 2034380, 2028265, 2090754, 2066080, 2064817, 2008569, 1978048, 1986080, 2009556, 2073738, 2086365, 2160388, 2272514, 2325226, 2419542, 2331525, 2324360, 2453619, 2597487, 2736400, 2802281, 2813424, 2878976, 2980939, 2925865, 2903914, 2942018, 2913351, 2996807, 3109858, 3174928, 3211753, 3205550, 3295048, 3270402, 3276189, 3336359, 3371744, 3451574, 3503305, 3503428, 3468004, 3569797, 3604900, 3688496, 3761060, 3809717, 3950515, 4019858, 4016250, 4079018, 4180397, 4244990, 4388695, 4496853, 4562216, 4642397, 4792873, 4831225, 4935218, 5087302, 5203160, 5347726, 5460351, 5590770, 5755359, 5885488, 5942495, 6181036, 6258083, 6440207, 6670307, 6808016, 6895697, 7008431, 7147969, 7295168, 7454051, 7645173]
3349G645173K38655J48854K49112K72551L01447L40085L83078L65019K92897L33558
3339A0570429L26824N09979O66383Q93367J174308J426994J723149J722165J139923
3330B0153521n61640j371368j044206o14640l38761j39896O845O8101J32388J90127
3320A6480471K70584L93646M81686M60389O10267P36366P69918P52354Q78773
3311B1834454R45251J078579J118420J207558J350298J560373J967475K424079
3303C3486487K854073L443620L952171M208609L790770J772557J70157L94121
3295E4072565J752892L484354N273252P290562Q346996P687794K996386m731393
3287H6173408q374552p360274n112077l261263j734409o92546Q995N80604J204804
$$ y = [7645173, 7883828, 8032682, 8281794, 8554345, 8855792, 9195877, 9578955, 9943974, 10236871, 10570429, 10897253, 11407232, 12073615, 12966982, 14141290, 15568284, 17291433, 19013598, 20153521, 19591881, 18220513, 17176307, 16561667, 16222906, 16083010, 16089855, 16157956, 16290344, 16480471, 16751055, 17144701, 17626387, 18086776, 18697043, 19433409, 20203327, 20955681, 21834454, 22779705, 23858284, 24976704, 26184262, 27534560, 29094933, 31062408, 33486487, 36340560, 39784180, 43736351, 47944960, 51735730, 53508287, 53678444, 54072565, 55825457, 59309811, 64583063, 71873625, 80220621, 87908415, 90904801, 86173408, 77798856, 70438582, 65326505, 62065242, 60330833, 59638287, 59647282, 60227886, 61432690]
3278F1432690J669564K342610L047130L539593M215918M950529N743106O793494
3270I3734634Q046503R527879J1508535J4401303J7789776K1567466K5415595
3263B01991691K8158892K8013841K2289073Q346493j0553059k4938380k9741714
3256B23566837k7670047k2866720j7763207j3510395j0185195p311342m818850
3249A19441081k559160o37608J379138L815591O898192J1029022J6386399K3098879
3241A78851534L0735792L4792720K8931920L358252k8652560m1047718l7058091
3234A69911849k9035531k1968832j6392682j2493369r821282p844211o388601
3227F5967341n454692m490254l854412l218127k728441k220893j892534j625162
$$ y = [61432690, 63102254, 65444864, 68491994, 72031587, 76247505, 81198034, 86941140, 93734634, 101781137, 111309016, 122817551, 137218854, 155008630, 176576096, 201991691, 230150583, 258164424, 280453497, 288799990, 278246931, 253308551, 223566837, 195896790, 173030070, 155266863, 141756468, 131571273, 124259931, 119441081, 116881921, 116244313, 117623451, 121439042, 128337234, 139366256, 155752655, 178851534, 209587326, 244380046, 273311966, 276670218, 248017658, 206969940, 169911849, 140876318, 118907486, 102514804, 90021435, 80200153, 72355942, 65967341, 60512649, 56022395, 52167983, 48949856, 46221415, 44000522, 42107988, 40482826]
3219D0482826j361604j802542k206884k140642j957790j656484j540606j504007
3211B6312267j288747j266534j105208j005428j005035q05294p10427o82070n77605
3202A7865919m41026m42751l19406l89228l47543l38089k19047k16913k29587
3193A4922329j30128N2024J43335L72734N09431O60351J21379r38064j439879
3184A4273512j170801p97774o53690n68422m20922l69295l60127l26197l85384
3175I220900k93565l80464l11293k19191j86483k21237j94580j44845q2169j21056
3165G066017j46180r3920j5171J4671P4772O3304K47770K55261K32799K32555
3155G931878k0188m82818p25040n85018m59840m02295k63989k19113j39244j20576
$$ y = [40482826, 39121222, 37318680, 35111796, 32971154, 31013364, 29356880, 27816274, 26312267, 25023520, 23756986, 22651778, 21646350, 20641315, 19836021, 19125594, 18443524, 17865919, 17424893, 16982142, 16662736, 16273508, 15925965, 15587876, 15368829, 15151916, 14922329, 14792201, 14844225, 14987560, 15360294, 15869725, 16530076, 16651455, 15713391, 14273512, 13102711, 12304937, 11651247, 11082825, 10661903, 10292608, 9932481, 9606284, 9220900, 8927335, 8546871, 8235578, 8016387, 7829904, 7608667, 7414087, 7269242, 7187073, 7066017, 6919837, 6825917, 6810746, 6825417, 6900189, 6963493, 7211263, 7466524, 7699323, 7931878, 7911690, 7428872, 6703832, 6118814, 5658974, 5256679, 4992690, 4773577, 4634333, 4513757]
3145D513757j84825j17017j26822j02685o1400m4278j09674r2610j22660q0723
3135C471063r4547j25572m5804q0813l8344j9550l5356j50596M6865o0367j17763
3124B749216j7891J7266m1480n8024l0466k7357o735j03841q4764k2788j7526
3113B355610k6249n8125k7504r0618m0819P990k070p9928q249l7642p9240k3544
3101A889612m6863L0299Q6090j5282N4582l1845r7430L3554L2093Q5299R9267
3090B119376J34161J57778K07291J07091l8794j30580q1122j10635j66584j07053
3080B090929l3152q7483k8844j14910j10281j7770j01439o6549j01337o0943l2364
3069A335857p8697O8685L5720J6022m8434N1076J5801l9250J2612J2683J7144
$$ y = [4513757, 4328932, 4211915, 4085093, 3982408, 3921008, 3876730, 3767056, 3674446, 3551786, 3471063, 3376516, 3250944, 3205140, 3124327, 3085983, 3066433, 3031077, 2880481, 2927346, 2866979, 2749216, 2731325, 2748591, 2707111, 2649087, 2618621, 2591264, 2584529, 2480688, 2395924, 2373136, 2355610, 2329361, 2271236, 2243732, 2153114, 2112295, 2120285, 2118215, 2038287, 2030038, 1992396, 1913156, 1889612, 1842749, 1873048, 1959138, 1943856, 1998438, 1966593, 1869163, 1902717, 1934810, 2020109, 2119376, 2253537, 2411315, 2618606, 2725697, 2686903, 2556323, 2475201, 2364566, 2197982, 2090929, 2057777, 1970294, 1941450, 1826540, 1716259, 1698489, 1597050, 1530501, 1429164, 1368221, 1335857, 1257160, 1325845, 1361565, 1377587, 1329153, 1380229, 1396030, 1356780, 1369392, 1382075, 1399219]
3058A399219m2579L4429Q63o9276k2067K7601n4299r2791K1072K162m6872K7973
3046A185435k1720Q512K2321j2498p4312m5651k1718P2991n5155J3112M5909l0321
3034A086905l8619m9536k8371M4469N773J1532l1898r153J0644l2458n639J8720
3022I82369L2674K1659K3243n6579j0671O2771J4527J1738L735O21l3629o2746
3010I89712j3115k6692J02582N8159J1825j4215L3304J1958Q930n7482N7980j0284
2998A152662R49n0738n6022k0n397o8698M9876j5049l1432m3661j0661J545K3257
2985I46611J29476L170K9744J7654j174L2855R6292O8637J08351J26028N4812
2974A612456J35444O5193O4168J0018n2000j8276j09543j19827r7123n0761q7050
$$ y = [1399219, 1356640, 1391069, 1391932, 1322656, 1300589, 1328190, 1273891, 1181100, 1202172, 1204334, 1157462, 1185435, 1163715, 1172227, 1194548, 1182050, 1107738, 1062087, 1040369, 1113360, 1058205, 1071317, 1117226, 1086905, 1048286, 998750, 970379, 1014848, 1020621, 1032153, 1000255, 991102, 1001746, 969288, 963649, 982369, 1015043, 1036702, 1059945, 1003366, 992695, 1055466, 1069993, 1081731, 1085466, 1086087, 1052458, 989712, 976597, 949905, 1052487, 1110646, 1122471, 1108256, 1141560, 1153518, 1162448, 1104966, 1162946, 1152662, 1153611, 1102873, 1046851, 1046831, 1041434, 972736, 1022612, 1007563, 976131, 932470, 921809, 923354, 946611, 1076087, 1079257, 1109001, 1126655, 1125481, 1158336, 1254628, 1323265, 1431616, 1557644, 1612456, 1747900, 1813093, 1877261, 1887279, 1835279, 1817003, 1707460, 1587633, 1490510, 1439749, 1352699]
2963A352699o4109n1889n3934m0122j6659R5449J01204J5779L3723Q4659J16634
2952A573434K6159J14057M6004o1739q2068j23986j01180j08471r6798n9736p7552
2941A048124l5686K8600q9346p8274J4154L460l2080r7208M3697m4770j0742M035
2929G53964r9936J8488k6627L3860K1158P687O4187j7553m0060l8401J2611l8895
2917F50483L0151j8204J3891J4548K5678j3207K0495m126K7232L1384L9732o3666
2905G54391m415J3985j02998n5458N7651L0537n839j5428k3356L2923J3102M7458
2893G42553P2295J8872j21883L4084o6145N0265j7098j5452o0129p8867K629Q5941
2881F47065J6593p336R079L2618m9217q934P4321K420O011k8888J0875Q712M250
$$ y = [1352699, 1288590, 1236701, 1182767, 1142645, 1125986, 1221435, 1322639, 1338418, 1372141, 1456800, 1573434, 1599593, 1713650, 1759654, 1697915, 1615847, 1491861, 1390681, 1282210, 1185412, 1125676, 1048124, 1012438, 1041038, 951692, 873418, 887572, 891032, 858952, 761744, 805441, 760671, 749929, 753964, 654028, 672516, 645889, 679749, 700907, 708594, 772781, 755228, 715168, 676767, 689378, 650483, 680634, 662430, 676321, 690869, 716547, 703340, 723835, 719709, 746941, 778325, 818057, 754391, 749976, 763961, 660963, 605505, 663156, 693693, 687854, 672426, 649070, 681993, 695095, 742553, 814848, 833720, 711837, 745921, 679776, 730041, 712943, 697491, 637362, 558495, 561124, 647065, 663658, 656322, 665401, 698019, 648802, 639868, 714189, 716609, 722620, 693732, 704607, 713319, 717569]
2868G17569M581L4699o0210r8295L484R125L9482L6074q2057n5485j200j3521
2856E34246n4551l2762K7455N9929N7129k9648o3772k8573K6307J2233k9648n812
2844D72533j9297N727m3928m2637j7972M3810m3810o669p907L6874l994l3376
2832C39354m924J8944n7008j1254l2042O869K6194j7020j4614o5344N0088N3755
2820B92998J8018K2707p769m0477o934r9654J07660J7975p89k8079j1283M1338
2808C05711p3879P620K8420J0188j8009l4229L3648J2309r235P000k8755k8731
2796B12058j2632K8693R0493k8931j36308L1698R555k1825j7102j924L1370j5552
2784A69593J0515j094O70K0056L084O9591p750p9894j1421L8684j0794o0480M0540
$$ y = [717569, 722150, 756849, 696639, 598344, 601828, 610953, 650435, 686509, 604452, 548967, 547767, 534246, 479695, 446933, 474388, 534317, 591446, 561798, 498026, 469453, 495760, 507993, 478345, 472533, 453236, 458963, 415035, 372398, 354426, 398236, 354426, 347757, 339850, 376724, 372730, 339354, 334430, 353374, 296366, 285112, 253070, 259939, 286133, 269113, 254499, 189155, 239243, 292998, 311016, 333723, 325954, 285477, 278543, 178889, 286549, 304524, 303735, 275656, 264373, 305711, 231832, 239452, 267872, 278060, 260051, 225822, 259470, 271779, 262544, 269544, 240789, 212058, 199426, 228119, 318612, 289681, 153373, 185071, 194626, 172801, 155699, 153775, 185145, 169593, 180108, 179014, 179684, 199740, 202824, 272415, 264665, 184771, 173350, 212034, 201240, 140760, 181300]
2771A81300k8213K1115J1857j6980l6403K524J4794n2969j3151k3884N589m3028
2759B2551O2030K1506O8890L5294o6272n7672p452P7174K622k3025o0152N5995
2747A31489j9924K3610M0134r8727O554K5014O4643l9439k3203q152k2737L95
2735G9657O0772l3050j2264K5069K6738Q3201r7031l4737O81J2987k2870m0907
2723D8246M558N9730M6613m6325q0019j2098N6694K5677n3595N4784N8431l9751
2711A22945r437j0541K4383L936l6537m6866J1504J9310p837J9800M7019L3041
2699A70720j5349o3921J6126J03426k1234q691O408j6909l8767k9555l1491j9833
2687E0930J6794k0592m1324k4554j3223J4184O1452Q4725m5092n0081N0024k6889
$$ y = [181300, 153087, 174202, 186059, 169079, 132676, 135200, 149994, 97025, 83874, 59990, 65579, 22551, 84581, 106087, 174977, 210271, 143999, 86327, 78875, 156049, 158671, 135646, 75494, 131489, 111565, 135175, 175309, 76582, 83136, 108150, 172793, 133354, 110151, 101999, 79262, 79657, 140429, 107379, 95115, 120184, 146922, 230123, 133092, 98355, 99036, 112023, 89153, 48246, 52804, 112534, 159147, 112822, 32803, 20705, 77399, 103076, 49481, 104265, 162696, 122945, 113508, 102967, 127350, 131286, 94749, 47883, 59387, 78697, 70860, 90660, 137679, 170720, 155371, 91450, 107576, 211002, 189768, 181077, 187485, 170576, 131809, 102254, 70763, 50930, 67724, 47132, 5808, -18746, -31969, -17785, 43667, 128392, 83300, 33219, 83243, 56354]
2675E6354j2960n9573L5726O0892l5177o802m9619N7874M2450K0720m7430q7887
2663b5432M6792J8511l6993K9170J8133N4214q710k3500L908o1249N1539J1280
2651G7663J6267m9526o1378M1650L3069R409N2686j9105n8362j1474N7516L3443
2639A21858k8547m7603O925n7018o9875R5506j6879j4697L3025p684K5113J7158
2627E7282m3962J5025j5285j9542K8767O2748L6218k1947o7261m6610Q6738n6705
2615A5466j1199r676M2965J9247M1542P2123l2056l4123m3249l3484j3862q127
2603E567O3442J7527j25059n271L9554L1379K1618q4160O5385k3772K5670J2442
2591D4322o9178N3146L291l6586N8745k5400K9927l9706l2948Q4513k5829j1341
$$ y = [56354, 43394, -16179, 19547, 80439, 45262, 38460, -11159, 46715, 89165, 109885, 62455, -25432, 21360, 39871, 2878, 32048, 50181, 104395, 95685, 72185, 76093, 14844, 66383, 77663, 93930, 44404, -16974, 24676, 57745, 67154, 119840, 100735, 42373, 30899, 88415, 121858, 93311, 45708, 52633, -4385, -74260, 21246, 4367, -10330, 22695, 15011, 40124, 57282, 13320, 28345, 13060, -6482, 22285, 85033, 121251, 99304, 32043, -14567, 72171, 15466, 4267, -5409, 37556, 56803, 98345, 170468, 138412, 104289, 61040, 27556, 13694, 5567, 69009, 86536, -38523, -43794, -4240, 27139, 48757, -35403, 29982, 6210, 31880, 44322, -24856, 28290, 31581, -5005, 53740, 28340, 58267, 18561, -14387, 70126, 44297, 32956]
2579C2956m7277M4602L4031K2345k8713p952M149J2357r0406l3801R868L8785
2567i056j9265J4759M666k590K3901k6150j1333P5157l1382l7757j2748K2550
2555i248N5297o982q5581j9704J26382j5162m4354N6502r229J0934j4766m2013
2543B076m5856Q349l836k1608N2126J5382j8243J103J5003M0662o672p6919P1831
2530C3398K6415j2725O2829p2119k3645Q0659K5492l7473j2469m2943n4898J26319
2518I8840k9288j4912j4312m0236j9918P977O8667K4067K6162K9635K7694j13186
2506E1190q548K0805o5568L8679l2087Q7708j6735k7333N4465m4988m3002j0698
2494C888o44M9676k9316M1527q271o0149P3178j4900r2647M6956j0171k9447L3138
$$ y = [32956, -14321, 30281, 64312, 86657, 57944, 49992, 54141, 66498, -23908, -57709, -47841, -9056, -28321, -13562, -8896, -11486, 12415, -13735, -25068, 50089, 18707, -19050, -31798, -9248, 46049, 39067, -46514, -66218, 60164, 45002, 648, 57150, 47921, 58855, 44089, 2076, -43780, -35431, -39267, -60875, -8749, 6633, -11610, -10507, 4496, 45158, 38486, -38433, 33398, 59813, 47088, 109917, 37798, 14153, 94812, 120304, 82831, 70362, 27419, -27479, 98840, 69552, 54640, 40328, 92, -19826, -11849, 56818, 80885, 107047, 136682, 164376, 51190, 42642, 63447, -2121, 36558, 4471, 92179, 75444, 48111, 102576, 57588, 14586, 3888, 3244, 52920, 23604, 65131, 56860, -3289, 69889, 54989, -37658, 9298, -873, -30320, 2818]
2481B818l612k1730M9449P7328p461j7065k2705m3659M2309L2410m3931M7394
2469I1545m4051K942o1885j3480j5323L0766N548M3415j8273l0814l7090N7243
2457A0543k4650q1949Q1482K3162L1887n9285R410j4708p116p068K6680l8056
2445d9668k849K0197J9223J2061K7307l0016l1994K1281M3043j4825n92k2M459
2432A7605k9046j3232M68K0754R3486l6556J992j5266J802P4109j00810q524n1
2419F731l2991J2158k4798J9272m78K6387K3919R650L2409j8936o9916j7059K2186
2406a1466L3933m2110O0959r2239K0057M1246o1150J4408N9494N0251K0250j19456
2394b5823k0214k7670M6599Q985n2453Q6264l9820m4736O8032O3600k7123n8717
$$ y = [2818, -794, -22524, 26925, 104253, 96792, 79727, 57022, 13363, 55672, 88082, 44151, 91545, 47494, 50436, -11449, -24929, -40252, -9486, -3938, 39477, 21204, -9610, -46700, 10543, -14107, -96056, -14574, 8588, 40475, -18810, -9400, -24108, -31224, -38292, -11612, -49668, -52517, -32320, -13097, -1036, 26271, -3745, -35739, -14458, 28585, 13760, 13168, 13146, 17605, -11441, -24673, -24205, -3451, 90035, 53479, 55471, 40205, 42007, 116116, 15306, 6782, 6731, -26260, -14102, -38900, -19628, -20106, 6281, 30200, 39850, 72259, 53323, -16593, -33652, -11466, 22467, -19643, 41316, -50923, -30866, 10380, -50770, -36362, 23132, 73383, 93633, -25823, -46037, -73707, -27108, -18123, -70576, 15688, -24132, -68868, -836, 62764, 35641, -23076]
2382b3076l4612L2081L9425J8296J908k0333K1403l4687m435N4073m8613K566
2370C996m0896M8454M9570J5101p1243k7969Q9530K4213l0593j2165l1125M1885
2358E8758j03397k8471O8365P1538N2132o8968m1374n511J0341k6857K5464o1733
2346d9713L1048L1692J430K502l0470l0743M2674k7730L7109K9609p0419L7025
2334D014M8706J7976J852K9766k0321o9847O2688O080m9201L3411o2191k7383
2322b4450k6396m120O1595m074k3739P4564L2990p2737k5738Q0723k9202j8549
2310B0867j5952M4940J7248L9848L163k7917m1513k5953M0181N7675M3660J4356
2298A70603j04454j3588M7773m5215P763J3847K830J067k9256q6507N5614L3204
$$ y = [-23076, -57688, -25607, 13818, 32114, 34022, 13689, 35092, 405, -4030, 50043, 1430, 3996, -36900, 11554, 61124, 76225, 4982, -22987, 66543, 90756, 60163, 47998, 16873, 58758, -44639, -73110, -4745, 66793, 118925, 49957, 8583, 3072, 13413, -13444, 12020, -49713, -18665, 13027, 14457, 16959, -13511, -44254, -1580, -29310, 7799, 37408, -33011, 4014, 52720, 70696, 72548, 102314, 81993, 12146, 74834, 80914, 31713, 65124, 2933, -24450, -50846, -54966, 6629, 2555, -21184, 53380, 86370, 13633, -12105, 68618, 39416, 20867, 4915, 49855, 67103, 106951, 110114, 82197, 40684, 14731, 54912, 112587, 156247, 170603, 66149, 52561, 100334, 55119, 62882, 76729, 79559, 80626, 51370, -35137, 20477, 53681]
2286E3681k4973m1157L6232K693p9367o0664J2069P8197M0201L3045k0669l6014
2274f726L6430K2206J6947k6418J5061m6684l496L2582j4211N1307K2857o8193
2262C1662n4985J2681Q1370O1053l0832q77m8585l8939J187K685o011j7972P884
2249C21L5574N4609M63k2927n6167K7353M2743p4489M643L5527K5779j1921l5438
2236B6070k2226J4477N4568L2682o6185N0735L3334l3062k8909Q333r339k1155
2224C9323m1914L0943K3694m4075R1297L8219n3170J9543N2541l4371n1995m3758
2212B6277l8271K3248M9360j295L8666m4537l7307L0214N467K7074N4654j0867
2200A22683m758m5682j7677M982P334m6828K3902k1068J2399K062L0465J01145
$$ y = [53681, 28708, -12449, 23783, 26476, -52891, -113555, -101486, -23289, 16912, 49957, 29288, -6726, 29704, 51910, 68857, 42439, 57500, 10816, 7320, 39902, 25691, 76998, 99855, 31662, -23323, -10642, 70728, 131781, 100949, 100072, 51487, 12548, 13735, 16420, 10409, -7563, 321, 35895, 90504, 90967, 68040, 11873, 39226, 81969, 7480, 12123, 47650, 73429, 61508, 26070, 3844, 18321, 72889, 105571, 39386, 90121, 123455, 90393, 61484, 69817, 60478, 39323, -2591, 28352, 52046, 7971, 99268, 137487, 84317, 103860, 156401, 122030, 70035, 26277, -11994, 11254, 60614, 59319, 97985, 53448, 16141, 46355, 51822, 78896, 133550, 122683, 117925, 72243, 54566, 59548, 66882, 20054, 43956, 22888, 35287, 37349, 67814, 168959]
2188A68959L0305N0517n7403o0667p7050M2567J08740p0948l7464M6039O10J8768
2176A62973L7105Q163K2035j2175k788N6721j7657o9708n1315M0947M8059K5252
2164B47612J8515p8185r625J6160J8641L0147k1161J940q333K2884M1827k4033
2152B56389J4569N4803R243j8085k0140M2734P0090m3213K566N2757L8215K8005
2140D87933k5060M0706J8282N8357n813J2056P7435M3214L2953N0895J3762O762
2128H11482N6630Q8111J3235j1109j5975K7038P3327K3709J53103N9629Q6288
2117A365468R7686J00317J00526R9544R2072J70791J73996K46449N2180O3516
2107B562545J61603J81128K71907K92796M07512N75460P79733J244254J687558
$$ y = [168959, 199264, 249781, 192378, 131711, 54661, 97228, 205968, 135020, 97556, 143595, 144205, 162973, 200078, 208241, 230276, 218101, 215313, 272034, 254377, 184669, 133354, 174301, 222360, 247612, 266127, 187942, 178317, 194477, 213118, 243265, 222104, 224044, 215711, 238595, 280422, 256389, 270958, 325761, 335004, 316919, 296779, 339513, 409603, 366390, 368956, 421713, 459928, 487933, 462873, 503579, 521861, 580218, 574405, 586461, 663896, 707110, 740063, 790958, 804720, 811482, 868112, 956223, 969458, 958349, 942374, 969412, 1042739, 1066448, 1219551, 1279180, 1365468, 1463154, 1563471, 1663997, 1763541, 1855613, 2026404, 2200400, 2446849, 2499029, 2562545, 2724148, 2905276, 3177183, 3469979, 3877491, 4452951, 5232684, 6476938, 8164496]
2098H164496K682074M057702N545458L628166l114139n697968m194044k705130
2090H366615j810533j221362r13105p22369n20400l97630k89939j37000J8900
2081B373177q9367q09j26136l40312j91592j76616j13785j61506j72239N894j9888
2070I86821m3048q4856k8477m7256m6428m6183p3961l5406l5304j4122l4929j5035
2058D81816l9662o3102K1107L5429j6810J7166Q476p510l9819P405n2436K1127
2046C73187K759j19111j3840k7403o7557L3266Q9636M3383K6143j3437j6177l550
2034C07299L0978N323l6124n7745r6763O1096J631p018K4810j0662p5222N579
2022A53182Q550n3867O7202m8041O2965K0908k4108n5033q529O282M733N685j8752
$$ y = [8164496, 10846570, 14904272, 20449730, 24077896, 20963757, 15265789, 11071745, 8366615, 6556082, 5334720, 4421615, 3699246, 3178846, 2781216, 2491277, 2354277, 2373177, 2283810, 2283001, 2156865, 1816553, 1624961, 1448345, 1334560, 1173054, 1000815, 1006709, 986821, 943773, 858917, 830440, 783184, 736756, 690573, 616612, 581206, 545902, 531780, 496851, 481816, 442154, 379052, 400159, 435588, 418778, 435944, 444420, 436910, 397091, 404496, 352060, 373187, 375946, 256835, 242995, 215592, 148035, 181301, 270937, 314320, 340463, 327026, 310849, 307299, 338277, 343600, 307476, 249731, 152968, 214064, 215695, 208677, 233487, 222825, 147603, 153182, 161732, 107865, 175067, 127026, 189991, 210899, 186791, 131758, 123229, 129511, 134244, 139929, 121177]
2009A21177k6234J460k0334M5819m9269j5629l2732J2194P7778k0633j4154L340
1997H2783L7214r001l7106n0506m4791k138M2317J6886k162M9972m2606j7989
1985B2873M1336L7782k7345k8925k8425N2230M960K2859j0923l3900M4539j9556
1973G7505l6391L960j1450k6796n3672K1248L5307K1682J4454n6910k9672J9086
1961b1649j8926M6035Q246J6677J3063o777l4184j6594N5071K848J9014k6577
1949C6247j8709J6482Q083o5606m063K3384q673k6527J07376j2463K2247l35o3713
1936A3730L9313K1655m0252M8726j9351n4676L7457L4191J916j14872M6992j8811
1924c982R812O7310m953k840J5772K0736q4101L031j2685J021j8171k8842L2486
$$ y = [121177, 94943, 96403, 76069, 121888, 72619, 56990, 24258, 36452, 114230, 93597, 79443, 82783, 119997, 110996, 73890, 23384, -21407, -23545, 18772, 35658, 33496, 83468, 40862, 22873, 64209, 101991, 74646, 45721, 17296, 69526, 74486, 97345, 86422, 52522, 97061, 77505, 41114, 45074, 33624, 6828, -46844, -25596, 9711, 31393, 45847, -11063, -40735, -21649, -40575, 5460, 13706, 30383, 43446, 36669, 2485, -14109, 40962, 43810, 62824, 36247, 17538, 34020, 42103, -23503, -27566, -4182, -12855, -39382, 67994, 55531, 77778, 77443, 13730, 53043, 74698, 34446, 83172, 63821, 9145, 46602, 80793, 82709, -32163, 14829, -3982, 5830, 73140, 68187, 65347, 81119, 101855, 17754, 20785, 8100, 9121, -9050, -37892, -5406]
1911e406O3387l7360j8303k0505N375k7518j8157K4879M2254M9616j2819k9110
1899A6333M984j3217n1130J9812L7539k6454L9672P6828n5305o9458R2666o079
1887F6191j5386n1410l9499N6824k409j0985j3197j4316K0470J6133M5195n8337
1875g26l1212L595o125r578O7455O0931n8351p773O731O1149o3997r64m7384p3145
1861i9394J0877N8683J1742l6062p890o4276M0557J13400N2047q3624j4923K2602
1849C739L409l0042J1672L0920k4935n9424L087J8004l397L3103O5197k404o384
1836D2545K189j6587K9818n9309L2978l9010M204L7587M7057M2251L8986j7271
1824A45438l9850l0522j7395p632k5472L2770j2006r3781K8101n3936Q8032P7271
$$ y = [-5406, 57981, 20621, 2318, -18187, -12812, -40330, -58487, -33608, 8646, 58262, 45443, 16333, 21317, 8100, -43030, -23218, 14321, -12133, 27539, 104367, 49062, -20396, 72270, 66191, 50805, -605, -40104, 16720, 14311, 3326, -9871, -24187, -3717, 12416, 57611, -726, -31938, -28343, -34468, -44046, 23409, 84340, 25989, 18216, 24947, 86096, 22099, 21135, -26249, -99394, -88517, -29834, -18092, -54154, -62044, -126320, -85763, 27637, 79684, -3940, -18863, 3739, 7148, -22894, -11222, 19698, -5237, -64661, -61574, -43570, -46967, -13864, 51333, 48929, 42545, 44734, 28147, 57965, -1344, 31634, -7376, -3172, 34415, 81472, 123723, 162709, 145438, 105588, 75066, 57671, 50039, 24567, 57337, 45331, -48450, -20349, -74285, 13747, 91018]
1812I1018j01832n401j4774L4637j5710o7951M7410M6367m6167J8026M6666K338
1800C4627k1488l9553K1792l3909O2045k266l9952N2644p2371K5284K4178M8161
1788E9192j192m9916J7854m2867k0848l7139j6703M2951j3080p181k142m0378
1776a11449J16228j8019q768k3567j2301Q0301k017k2896j7706m9372o686j4489
1764i0741K576O9655K3706M5799k2956k4195L585k1946J5517J2514q5031M2803
1752b8714O2340k4349q309K1496J3950j2443K1971J690k0595N581l1072J9176
1740B0722J309N156j7488q038M6090l1588m9750M9770j229l0802O4931k0353q3171
1727e4441k8864M7833o099j4816Q3171Q262J4460n5012j02930Q3759J1420m8018
$$ y = [91018, -10814, -16215, -30989, 3648, -12062, -80013, -32603, 13764, -32403, -14377, 32289, 34627, 13139, -26414, -4622, -38531, 23514, 21248, -18704, 33940, -38431, -13147, 11031, 59192, 58000, 8084, 25938, -16929, -37777, -74916, -91619, -48668, -61748, -68929, -71071, -111449, 4779, -13240, -22008, -45575, -57876, 22425, 20408, -2488, -20194, -69566, -76252, -90741, -88165, -18510, 5196, 50995, 28039, 3844, 7429, -14517, 1000, 13514, -71517, -28714, 33626, 9277, 968, 22464, 36414, 23971, 45942, 47632, 27037, 32618, 1546, 20722, 22031, 27187, 9699, 1661, 47751, 16163, -33587, 16183, 14954, -15848, 49083, 28730, -54441, -83305, -35472, -41571, -56387, 26784, 35046, 49506, -5506, -108436, -24677, -13257, -61275]
1715f1275j4681m0976K8537O6197L4316l9507M2139n943k9635m0323J5480J0301
1703c5370k8434P1998r797m7822L6081M7489k4959m0053n70J9299P2220o1861
1691a779L1992m1180l9712K4079J9895o181p5018J9553J0844P5400J6348m7741
1679a3500j8727J384n6403J1702R0558j1981J3109j5529l4816J324n269N9882
1667B1734K2584l2321p2633R2530k1804j2748q315K7164J240j7731l4981j4072
1655d9353J12390n4864m6251k4555j7099j8518L3611Q5967n809n7188p707M8608
1643g68L0097n8014j5865M1883J2651j510J7487k8206L5486j1685n8397J5535
1631b1306K8801l0374L2902o3535K6366M0978j6232l2472o6603M2391o5753j3786
$$ y = [-61275, -75956, -116932, -88395, -22198, 12118, -27389, 14750, 8807, -20828, -61151, -45671, -35370, -63804, 8194, -1603, -49425, -13344, 34145, 9186, -30867, -31437, -12138, 60082, -1779, 30213, -10967, -50679, -26600, -6705, -12886, -87904, -68351, -57507, 17893, 34241, -13500, -32227, -30843, -87246, -75544, 15014, 3033, 16142, 613, -34203, -32879, -38148, 21734, 44318, 11997, -60636, 31894, 10090, -2658, -10973, 16191, 17431, -300, -35281, -49353, 63037, 8173, -38078, -62633, -79732, -98250, -64639, 21328, 15519, -41669, -49376, -768, 29329, -28685, -44550, -2667, 9984, 8474, 25961, -2245, 33241, 21556, -36841, -21306, 7495, -22879, 10023, -53512, -27146, 13832, -2400, -34872, -101475, -59084, -124837, -138623]
1619a38623Q3084J3783P78J8575q7136K2939j167O2871L5594q7120J7773o250
1607f4899k0053P3509j848q588m8159l1148K9034j019P542K00K9809M3684l1944
1594b3880k9473L7050J3623P46n2720l100N3802J7807k2261O991l6044k7006j8317
1581h2782j8216L7343J2088m9207n270j0095O4920J4485j4995k2536k9391O5868
1569c7788M635j8479Q9631K2313o8851P1363l4072r1842J0288R428Q1443K3982
1557F2051o0775m1747k1095O1080k7006J0959l3262l633Q4879m063m0701K9511
1545A6198J2855l6619J2352J0406j3496p6066K0089J8098k2018P3652o626p812
1533A013J6855M6076m8440p4413L5047N9549j2377J1767o3055J4265l4263r0695
$$ y = [-138623, -55539, -41756, -40978, -22403, -109539, -86600, -87767, -24896, 10698, -76422, -58649, -64899, -84952, -11443, -13291, -21879, -70038, -101186, -72152, -73171, -65629, -65429, -35620, 8064, -23880, -53353, -16303, -2680, -1934, -54654, -57754, -3952, 13855, -8406, -1415, -37459, -64465, -82782, -100998, -63655, -51567, -100774, -106044, -116139, -51219, -36734, -51729, -74265, -103656, -37788, -33153, -51632, 37999, 60312, -8539, 62824, 28752, -63090, -52802, -43374, 38069, 62051, 1276, -40471, -61566, -486, -27492, -16533, -49795, -53428, 31451, 27388, -13313, 16198, 29053, -7566, 4786, 15192, 1696, -74370, -54281, -36183, -58201, 15451, 8825, 1013, 17868, 63944, 15504, -58909, -23862, 35687, 23310, 35077, -27978, -13713, -47976, -138671]
1521a38671O757J01066L8757R39M649l0928K3089N76J6604n3216J2085p932j08508
1508a34733O8735Q5871l6914j8375L370O8138Q51k2865m3284K3084N727l1324
1496c1719n6070k0880O0654O8139m9157l5748P3231J6352L0044L312p5744m9232
1484f6818J0743P4873j6552L3435n683m3762n158K2715m3550K8477K2469l6387
1472b5198l3753J1935k170L50J1660J2948M2272k2147m2315O947n8266K6284M7064
1459b4389J6603M9231r635l3750n2500m921j0395M3588M7339J507q1459j1450
1447g0231M5864M1601m4511k6212l3939O4454K8575o756m9333O6756J8351k872
1435C1747l7251j4183J8377J247J6351j5283k1398l729K1710k6481J8972j02323
$$ y = [-138671, -131914, -30848, 7909, 8848, 13497, -17431, 5658, 6234, 22838, -30378, -18293, -26225, -134733, -65998, 19873, -17041, -35416, -32046, 36092, 36943, 14078, -29206, -6122, -395, -31719, -87789, -108669, -48015, 20124, -29033, -64781, 8450, 24802, 54846, 58158, -17586, -66818, -56075, 18798, 2246, 35681, 29998, -13764, -18922, 3793, -39757, -11280, 11189, -25198, -58951, -47016, -49186, -48836, -37176, -24228, 18044, -4103, -46418, -39471, -97737, -71453, -24389, -7786, 41445, 31810, -1940, -54440, -59361, -69756, -26168, 21171, 22678, -58781, -70231, -24367, 17234, -27277, -53489, -87428, -22974, 5601, -1155, -50488, 16268, 34619, 31747, -5504, -19687, -1310, -63, 16288, 1005, -20393, -24122, -2412, -28893, -9921, -112244]
1423a12244J0911L3908O4879N8004K4624m0027m8091o3964l821N4796M059N5147
1411C8181L740p8096m5622M509P1734K7444n9189J9424p615K533r996p4536J7092
1398i0397R9139l3434j1626N0437K4317k4290l5721L2245J3814J4491l3007j7782
1386a1814l0525J6695L4546m5673J3341n5674M5455L6130K1142l7661m9459M3721
1374a9776j1240N455N0224J2131m2869k2839k9044j0767r177J4130R6847J7079
1362E0154o7418j2686l6232j4822L7426M9831j1404q47n6319M3625l4720o564
1350e9976m645J1400P2247l2282j0332J69l6349k0454R3148j9764n0274q145M0379
1337b4878R099j05579P0626M1316k7732L8450J0316k8970J22848J7506p2533l4745
$$ y = [-112244, -101333, -67425, -2546, 55458, 80082, 40055, -8036, -72000, -75821, -21025, -16966, 38181, 41921, -36175, -81797, -77288, -5554, 21890, -37299, -17875, -25490, -22957, -32953, -107489, -90397, 8742, -24692, -36318, 14119, 38436, 14146, -21575, 10670, 24484, 38975, 5968, -11814, -42339, -25644, 8902, -36771, -23430, -79104, -33649, 2481, 23623, -14038, -63497, -19776, -31016, -25561, 24663, 36794, -6075, -28914, -57958, -68725, -77902, -63772, 33075, 50154, -17264, -29950, -66182, -81004, -43578, 6253, -5151, -5998, -62317, -18692, -53412, -59976, -64621, -53221, 19026, -13256, -23588, -23419, -59768, -80222, 12926, -6838, -57112, -65257, -24878, -15779, -121358, -50732, -9416, -37148, 1302, 11618, -17352, 105496, 123002, 50469, 15724]
1325A5724o7270J7356o606Q326j5693M602N8615o2530J5557K1272n3611o977J6623
1312e4612M6080j9367K0082j04796M692N9626M5919j7971k1894L8825k0826L3516
1300I274o3667n475M0240m6739M2655K7471k8045N9187j9049l3063K7966j3383
1288b628j4833K2639l9922r977M9820l8338m743O0081l724L3213J5338l2432j0468
1275B4026q36k3084n9971L7489M5199l0339m6648L2587q956k5805r159p231O4210
1262h518L3787j141J0613p2720j7920j4792K1437J5057J01227K2198k5238m4832
1250A9158j5311j8789M0710n890o4020P4056n0453n8672N1168K8951l3286J9416
1238a2962j1784J0865M644j1376k409p1371K4850m6304l289p983k1140Q8063M4917
$$ y = [15724, -51546, -34190, -40796, -32470, -48163, -43561, 15054, -47476, -31919, -10647, -64258, -71235, -54612, -8532, -27899, -7817, -112613, -107921, -48295, -2376, -20347, -42241, -3416, -24242, 9274, -54393, -59868, -19628, -66367, -23712, 3759, -24286, 34901, 15852, -17211, 10755, -2628, -17461, 5178, -34744, -44721, 5099, -33239, -37982, 22099, 18375, 51588, 66926, 34494, 24026, 23190, 106, -59865, -22376, 22823, -7516, -54164, -21577, -30533, -56338, -65497, -72728, -8518, 25269, 24128, 34741, -37979, -55899, -70691, -49254, -34197, 67030, 89228, 63990, 19158, 3847, -14942, 25768, 19878, -44142, 29914, -20539, -79211, -28043, 908, -32378, -12962, -24746, -13881, -9237, -20613, -23022, -94393, -69543, -115847, -119136, -127119, -148259, -60196, -15279]
1225a5279L2333O5901o6390m7556J892k8255L8545l8828k7646N3204O2164l9333
1213i248R352J7276N5793J9457l5083p988o0019m2853K417j0191Q427k7131k2072
1200a01863K8053M7798j5538J7615m178J0794q26j0949N5428L0j6488O7125p2387
1187D614l8072Q758j8594K6816o4823P1901k4764p141M6635n8579O2963l903M8178
1174E3989J1150m0001n5503j7371K2831L8197q179m0926O59p741M8030l4649p7533
1161a07047Q966k8253O4167j0974L4727K7443Q193K3756J7567M8264l0281r2488
1149c5960O8055O7844j17982p6863N8248O2587N119m5780P478n7181M6078O9628
1137E1271j25530K4740N2888o8722n338N7540J1494K7927r0557o657L0617n1315
$$ y = [-15279, 17054, 82955, 16565, -30991, -29099, -57354, -18809, -57637, -85283, -32079, 30085, -9248, 104, 17380, 73173, 92630, 57547, 49559, -10460, -53313, -50896, -61087, -52660, -79791, -101863, -73810, -26012, -41550, -23935, -28113, -17319, -18145, -29094, 26334, 26364, 9876, 77001, 4614, -33458, -24700, -43294, -16478, -81301, -9400, -34164, -41305, 5330, -53249, 9714, 5811, 53989, 65139, 25138, -30365, -47736, -24905, 13292, 5113, -35813, -35154, -42895, 5135, -29514, -107047, -98081, -126334, -62167, -73141, -38414, -10971, -2778, 20978, 38545, 86809, 56528, -35960, 32095, 99939, -18043, -94906, -36658, 25929, 31048, -14732, -7254, -64435, -18357, 51271, -74259, -49519, 3369, -65353, -70691, -13151, -1657, 26270, -64287, -70944, -40327, -91642]
1125i1642K6430O0380R610M620J0451k3187k9145L2106j1399j9989L1154j6367
1113a6978J3269Q922j558j9862k8028J8283j0778K1716m9023O3079q221K0677
1101A1498R3543o4138l9332k6939m7006K3278L0413l0610m1683j3177l641n479
1089a13273P4360O7315k6292l325J8843L9110j5794M7571L8184k3121l723p0408
1077B9447r6037j1124P6101M0262q8232n3157J3833N7129o5249M6437J8389O0627
1065B8426Q064J1838J4341p4283k3024J4536l3878P2791k3710M3881M281m3941
1053f78J0703n1196J4743J4115O6885L0595k9295r143o9073o780M2531k5484l9485
1040e1562l0251K1120N1155M0747k4521K0058r6832j7349P818N2348L96k952R453
$$ y = [-91642, -65212, -4832, 4778, 9398, 19849, -3338, -32483, -377, -11776, -31765, -611, -16978, -3709, 5213, 3655, -16207, -44235, -25952, -36730, -15014, -64037, -958, -9179, 11498, 105041, 40903, 1571, -25368, -72374, -49096, -18683, -49293, -90976, -104153, -107794, -113273, -38913, 28402, 2110, -1215, 17628, 56738, 40944, 88515, 126699, 103578, 99855, 29447, -66590, -77714, -1613, 38649, -49583, -102740, -88907, -31778, -97027, -50590, -32201, 28426, 36490, 48328, 62669, -11614, -34638, -20102, -53980, 18811, -4899, 38982, 43263, -678, 10025, -41171, -26428, -12313, 54572, 85167, 55872, 46729, -22344, -29124, 13407, -12077, -51562, -81813, -60693, -9538, 31209, 6688, 26746, -70086, -87435, -79617, -27269, -26873, -29825, -20372]
1027b0372L702k3252J17291M728J6595k253j00004o0359l1176M9484M5018J2851
1015A2253m7520p961Q0167l985l9662m3394l9983M4259M2068n0420J4578k5214
1003f4814o3819P2193K5568o0674m5047Q0908O3327j2395J5091K3304j4611O432
991B5463J4524j630j5511l9291J0854L8456J9352l0770l1243n255J3334q663k527
978a2907Q7965j022j03454r56M0923J3853N992n6176m1652O1711N3370m382n5120
965a1855L9944N2368o535k0063N5976l7781q1717n97R1973K6752k828q8748k7013
952a0124J0511k8964l7102L2625J8925n5744P8149N7019o4580j4687J8581L2804
940C7413m3413O725J3439N4675N8986r1400P873j6757m2589j1350K1262k5564
$$ y = [-20372, -16670, -39922, 77369, 82097, 98692, 96439, -3565, -63924, -95100, -45616, -598, 12253, -35267, -43228, 36939, 32954, -6708, -50102, -90085, -45826, -3758, -54178, -39600, -64814, -128633, -56440, -30872, -91546, -136593, -55685, 7642, -4753, 10338, 33642, 19031, 25463, 39987, 38357, 22846, -16445, -5591, 32865, 52217, 21447, -9796, -15051, -1717, -10380, -12907, 75058, 74036, -29418, -30374, 10549, 24402, 30394, -25782, -67434, -5723, 47647, 43265, -11855, 28089, 80457, 73922, 53859, 109835, 72054, -9663, -10260, 81713, 108465, 105637, 16889, -10124, 387, -28577, -65679, -33054, -14129, -69873, 8276, 65295, 715, -13972, 4609, 37413, -6000, 725, 14164, 68839, 127825, 36425, 44298, 27541, -15048, -26398, -5136, -30700]
928c0700K4349J1591q4926j7233O3153J4911m2083P599k973k4308N7312j4018
916c7326Q124o800Q29o008J6938n964j8545k1973j7499R658R0889j7038N7672
903E2957j4970k8261K2424p4398j2859K9445O0472j139p8302J3154M5005m4391
891c0863l2126L6975j5934N321L9923K109K7529J3581J563j1741L3705m2352O238
878C3928J6881n8488m6626j3829Q1429j4759l1795n6340P2585N2568M032j8536
866B1050p0752J4642j2274O1286L2724o5935O402j0006K9492M05L4244Q4109k7107
853I8280p5426l7582O2634m217q5540L1551K2757k0594M375n749L3967o17p8109
840e4270O726M7133j5828j9259j945J9551m6738K6067J9160K6207k2691k2962
$$ y = [-30700, -6351, 5240, -79686, -96919, -33766, -18855, -60938, -53339, -56312, -80620, -23308, -37326, -29202, -36002, -35173, -41181, -24243, -30207, -48752, -70725, -88224, -78566, 12323, -4715, 52957, 37987, 9726, 32150, -42248, -55107, -25662, 34810, 33671, -44631, -31477, 13528, -30863, -62989, -26014, -41948, -36627, 3296, 5405, 32934, 46515, 48078, 36337, 70042, 27690, 33928, 50809, -7679, -54305, -68134, 13295, -1464, -33259, -89599, -17014, 35554, 39586, 21050, -49702, -35060, -47334, 13952, 46676, -19259, -12857, -22863, 6629, 7034, 41278, 125387, 98280, 22854, -14728, 47906, 43689, -41851, -10300, 12457, -8137, -3762, -9511, 24456, 23839, -54270, -47544, -411, -16239, -35498, -37443, -17892, -64630, -38563, -19403, 6804, -15887, -38849]
828c8849M1611L2425P786n88k2902k5261K2951l5236k493j0093M600o9544J0475
815h5118J9384P72Q767L0367k7571r505L7285K3836k9630l5937K3523k2722R274
802e7275Q5698l9317L4033J8941r593J4923m2623L2915q5651P9780j768n239k7044
789b220K0767m4698J8471r891J8277K3009K4878k7296J8801k2214J2605j8746
777A1743j1495J0147k6226m996M0190k0100l4665l947J1481K1827K1799J796j7199
764C55N519L4817M2375o8252R325r7241l7158o869O2914r709R269O3106L773k3843
750a1619m0251m1465Q076M3695l9650L8759P0059l629j5877J8994j421o4151r572
737d8052M6372L2999n6824m6799M1028m908M8494R1906q0296N918N3557N925o5840
$$ y = [-38849, 2762, 35187, 42973, 42385, 19483, -5778, 17173, -18063, -20556, -30649, -26049, -95593, -85118, -65734, -64962, -56195, -25828, -53399, -62904, -25619, -1783, -31413, -67350, -43827, -66549, -57275, 28423, -10894, 23139, 42080, 32487, 47410, 4787, 37702, -47949, 31831, 30063, 24824, -2220, 18547, -26151, -7680, -17571, 706, 23715, 48593, 21297, 40098, 17884, 30489, 11743, 248, 10395, -15831, -20827, 19363, -737, -35402, -39349, -27868, -6041, 15758, 17554, 355, 5874, 40691, 83066, 14814, 24139, -73102, -110260, -117129, -54215, -63924, -54655, 8451, 12224, -11619, -51870, -93335, -85259, -41564, -81214, -42455, 27604, 23975, 8098, 27092, 25671, -38480, -48052, -1680, 31319, -25505, -72304, -31276, -36184, 12310, 104216, 23920, 29838, 83395, 89320, 23480]
724B3480k4213k9648j5136l9876P2655K1153m2418J3844J6917K4720j2981k9833
712b1336J6844k5963P473J7404n4521J8815J2231N0147J2965j161m9583l8228
700e4913J9643K2172K1771l7248k1001M5585L8857J5668o2138j0489P5034M4316
688I7257j1702m5379k0972N297L1853q4121k5832K2459n2872Q7335O6885k5919
676D4289k4801K863J4689j9491p5787j2686L772Q1493K9489N6617j2431r4022
664f006o0363N0207R09k3986N1302k7411l861K881L1420O333j7842j7042M512
651h947M4412m7053o17M7695q262L6034o1794k4197l0284k1599P8754M2893j4436
638C2599m4472r633K0386l6927o8234J8104L4920K3555N938r3867O8172K0377
$$ y = [23480, -733, -30381, -45517, -85393, -12738, 8415, -34003, -20159, -3242, 21478, 8497, -21336, -4492, -30455, -22982, -5578, -60099, -41284, -29053, 21094, 34059, 32898, -16685, -54913, -35270, -13098, 8673, -28575, -49576, -3991, 34866, 50534, -11604, -22093, 52941, 97257, 85555, 40176, 19204, 24501, 56354, -27767, -53599, -31140, -84012, 3323, 70208, 44289, 19488, 22351, 37040, 17549, -58238, -70924, -67152, 14341, 43830, 100447, 88016, -6006, -66369, -16162, -15253, -39239, 12063, -15348, -19209, -16328, 15092, 21425, 3583, -13459, -8947, 35465, -11588, -12205, 35490, 27228, 63262, 1468, -22729, -53013, -74612, 4142, 47035, 32599, -11873, -21506, -1120, -38047, -106281, -88177, -53257, -29702, -23764, -117631, -49459, -29082]
626b9082k6115M4421j7876j5362p704J01725K1748p1172L8604j9319k4202k9474
614c3808o7995M1602P7248M6972J4900o4736k9338J5897P294j0530M6187K4706
602F8399o4371l3910K4272Q422K2314k3576O6395L6448l6967l3722P496J0262
590E1462L1564n5881m4538K5973J6464m7246N2611J8676r8884L509J3301Q0468
578D7479k6643l3921L9893O6872n4606m7426n2206r728J00826K3747l0829J8331
566D1789k7831m5795L9087M012j6186Q70j271j2250N1221L3152J7882k7887j3194
553D3599r468L026L2077k8672J7940J1696J8185P95J0094p110l9746m839l079
540D4498m2820k4089M2516J4256k9549M4320J4385k5454j7743j2990l5336O125
$$ y = [-29082, -55197, -10776, -28652, -44014, -51718, 50007, 71755, 583, 39187, 19868, -4334, -33808, -101803, -60201, 17047, 64019, 78919, 14183, -15155, 742, 8036, -2494, 43693, 68399, 4028, -29882, -5610, 2812, 25126, 1550, 67945, 104393, 67426, 33704, 41200, 51462, 83026, 27145, -17393, 8580, 25044, -22202, 30409, 49085, -49799, -46290, -32989, 47479, 20836, -13085, 26808, 93680, 39074, -8352, -60558, -70286, 30540, 54287, 23458, 41789, 13958, -31837, 7250, 11262, -4924, -4054, -5325, -17575, 33646, 66798, 84680, 56793, 43599, 34131, 37157, 69234, 40562, 58502, 70198, 88383, 89178, 99272, 92162, 52416, 47577, 44498, 1678, -22411, 20105, 34361, 4812, 49132, 63517, 38063, 20320, 7330, -28006, -21881]
528b1881n4527O4706j3591Q634M5818l1205J6087m9838k5615N6906N7428J6200
516F9122l7985k0542K5186M8810m1319K1813J2713m5481k4431l3658J5279L3052
504B2559K8233O2468p2246O587k0925M1078L5745L1154l5433q3323K447O4788
492H3132n9285q3754O1782k6397L5714P437P50k4985P6241k384q7972K1215K8352
479B9846K466j538j6304k8576N0870l0059o6125P539m7145J04793j4651l1735
467d0619L2370M5745m439Q447k7915j1362R241l1600k1386L1175J155R293M669
454D774K8334j0745k6469M09m2948L6196k7081j6562N686J5827M6511N347l7393
441a8114l8020L6745j1684J34123o6306J7273M1961o7142k3855m061P0919m282
$$ y = [-21881, -76408, -11702, -25293, -16659, 29159, -2046, 14041, -35797, -61412, -4506, 52922, 69122, 31137, 10595, 35781, 84591, 43272, 65085, 77798, 32317, 7886, -25772, -10493, 22559, 50792, 113260, 41014, 47601, 26676, 67754, 103499, 134653, 99220, 15897, 18344, 83132, 23847, -59907, 1875, -24522, 11192, 18629, 19379, -5606, 70635, 68251, -19721, 1494, 29846, 32312, 30774, 14470, -14106, 36764, 6705, -59420, -51881, -99026, 5767, -8884, -40619, -8249, 37496, 33057, 41504, 13589, 2227, 11468, -20132, -41518, -10343, -9188, 105, 4774, 33108, 22363, -4106, -3697, -46645, -10449, -37530, -54092, -48406, -32579, 13932, 19279, -18114, -56134, -19389, -31073, 103050, 36744, 54017, 95978, 28836, 4981, 920, 71839, 67557]
429F7557L5258m4813l0823O481m4840M2819J4694l6039K2769J6503n6244N8286
417E1608J7651o0216P961P1659k7886j01499N6101L3237m1288L4305L294l1164
405A3763P631N595K7574l4363j9793K5446M6744k6582j148K1832p9527m8659M2804
392a8683n5995k7526L1692N5650J8179M1337j8050n2760O7036L8400m8137m3405
380a2262j7746J3101j2938M994J3200j6920M4661O6895j1473J7774n32k585m9183
367C6986m8091Q0390K0788p2803j6902L0758P7671l487k3655m4243p2849j3652
355d9089P7845l7147q805J9440n6278N5048l139J308M0587K2253k0054o6523M4698
342B0144N3432o8150K0005P166J3447O1016j1962l9576K0526k8428L646K852m7203
$$ y = [67557, 102815, 58002, 27179, 33660, -11180, 31639, 46333, 10294, 33063, 49566, -6678, 51608, 69259, 9043, 17004, 88663, 60777, -40722, 15379, 48616, 7328, 41633, 44927, 13763, 21394, 26989, 54563, 20200, 407, 25853, 72597, 46015, 44867, 66699, -12828, -61487, -18683, -74678, -102204, -70512, -14862, 3317, 44654, 26604, -26156, 40880, 79280, 31143, -12262, -30008, -16907, -29845, -24851, -11651, -28571, 16090, 82985, 71512, 89286, 88754, 86169, 36986, -11105, 69285, 90073, 17270, 368, 31126, 108797, 105310, 81655, 37412, -35437, -49089, 28756, -8391, -17196, 2244, -54034, 1014, -2125, -817, 39770, 62023, 41969, -24554, 20144, 73576, 5426, 25431, 32597, 46044, 107060, 95098, 55522, 76048, 47620, 51266, 54118, 6915]
329F915J3307L6279M8890n7950l9157P8352q0485j0459L7145P2313n6056p8707
317b9613P6216m8365L1513j8084K9929k3719q0730N1967J2409j0870P1380L4086
305I6119k113p4889m3815M0827J7917J5067K0981J9614M1334k9982j05292m5944
293e0176N2857L2634J1855q064M2863Q446k4873o5206J9974K8474k274k7436m4889
280b5815M0280K1619K846m4137N5899k2285o7192M062P7797m2252M4818m928Q805
267D9517o2750l9189l9846k6804R8310L8490K7971O427k281m7072P3347K6768
255A02888r277L7153j20687m7433L2898n9700K1541M9225O998k7524M0575J53
243B6810L3551N574j8462p430j0529L1637k9120m484K3834n7471J7040J7486j8563
$$ y = [6915, 20222, 56501, 105391, 47441, 8284, 86636, 6151, -4308, 32837, 105150, 49094, -29613, 46603, -1762, 29751, 11667, 41596, 17877, -62853, -10886, 1523, -9347, 62033, 96119, 94006, 19117, -24698, 16129, 34046, 49113, 70094, 89708, 131042, 101060, -4232, -50176, 2681, 35315, 47170, 39106, 81969, 90415, 65542, 336, 20310, 48784, 46510, 19074, -25815, 14465, 36084, 38930, -5207, 50692, 28407, -38785, -34723, 43074, 822, 45640, 40712, 49517, -13233, -52422, -92268, -119072, -20762, 17728, 45699, 52126, 49845, 2773, 76120, 102888, 93611, 130764, 10077, -37356, -4458, -64158, -42617, 6608, 13606, -13918, 26657, 26810, 60361, 65935, 47473, 40043, 29514, 61151, 32031, 27547, 51381, -6090, 10950, 28436, 9873]
230I873k736J8806o2054J9846J3494L9060J3367M0074P7673q9154m6687j280M9803
217H0085j13597m535J2913j457P4030k2773m4239J5815K2305J6422M2297K149
205G9415p94J1237l4668M8707P189j6512m8796j3816J6418j1924J1905k0029m2804
192a4472l1172L1289M6635l5341J7447J6113N1038O857P281n3915K470J8175N243
179F7648j0509K7332O0198j8352m4792l4046K386K7508k3402l4617M8347L1634
167I9335n0227o7448l2309J228P4277J5469O529R547m4482p8417P2829n868P1056
154G1519k8670k4072n010N0309O797K1855k4007j5621O600J3438k2335n8307Q5041
141G7537M5533n7027l6932O9341K1010l4757k5555n0122K064r265K7671N4739
$$ y = [9873, 7137, 25943, -36111, -16265, -2771, 36289, 49656, 89730, 167403, 78249, 31562, 30282, 80085, -33512, -38047, -25134, -26591, 47439, 24666, -19573, -3758, 18547, 34969, 77266, 79415, 78621, 89858, 55190, 103897, 111086, 94574, 45778, 31962, 48380, 36456, 48361, 28332, -14472, -45644, -14355, 32280, -3061, 14386, 30499, 81537, 88394, 95675, 41760, 44230, 62405, 67648, 57139, 84471, 144669, 126317, 81525, 47479, 49865, 77373, 53971, 19354, 67701, 99335, 49108, -18340, -50649, -49421, 24856, 40325, 46854, 56401, 11919, -66498, 6331, 463, 71519, 42849, 18777, 13767, 64076, 70873, 92728, 68721, 53100, 59700, 73138, 50803, -7504, 77537, 123070, 66043, 29111, 98452, 119462, 84705, 59150, 9028, 11092, 1827, 29498, 84237]
129H4237J0921O78J5911j4440k0628m377j6251L0095k5187k7649l8897K9166L2582
116E6161L8038J1822j6635l9675L2588L9345n5633l4255L262j1985l4787K9970
104A8216j6647N3077N2679j6391q3289L1235M1700l7914J8170m7922N678M0325
92E8917N795k0249j7011K6916K4996n0968K6053l5807L5703L1079L327j11185
80b2434J9085L6594J1622j1139Q622k3619P273Q058k8186J9953J2533p159K6537
67E7740M4801j0171k2643o7473L903Q8381l9480J089J4419m4323L8582K1621j3044
54G3402k8654L3226j3526p106K9525K5575m0283q3680J9855O0132J2920m6701
42C4685R892L5700m8010m466l0244k253N0957O0713n9162K6113o6931l3169L7835
$$ y = [84237, 95158, 95836, 111747, 97307, 76679, 72302, 56051, 86146, 60959, 33310, -5587, 23579, 56161, 94199, 106021, 89386, 49711, 82299, 121644, 66011, 31756, 35018, 23033, -11754, 18216, 1569, 54646, 107325, 90934, 7645, 38880, 80580, 42666, 60836, 12914, 18592, 58917, 64712, 44463, 27452, 54368, 79364, 28396, 54449, 18642, 54345, 85424, 88751, -22434, -3349, 33245, 44867, 33728, 42350, 18731, 26004, 34062, 5876, 25829, 38362, 31203, 57740, 102541, 92370, 69727, 2254, 6157, 94538, 55058, 56147, 70566, 26243, 64825, 86446, 73402, 44748, 77974, 64448, 57342, 86867, 112442, 72159, -11521, 8334, 68466, 81386, 34685, 44577, 80277, 32267, 27801, -2443, -4696, 46261, 106974, 47812, 73925, 6994, -26175, 11660]
29A1660l199q601K9733J7429J994k6892l579L4451J8355L0160j4549o0733J8870
16D5099N858K1501j3825L2773j4821L361r008K1365M1511l9002l3870K1079j9252
3F2769k3166M9064J0415
0I9082
$$ y = [11660, 8461, -140, 29593, 47022, 49016, 22124, 18545, 52996, 71351, 101511, 86962, 26229, 45099, 50957, 72458, 58633, 91406, 76585, 79946, 70938, 92303, 133814, 94812, 60942, 82021, 62769, 39603, 88667, 99082]
$$ Imaginary data points
##PAGE= N=2
##DATA TABLE= (X++(I..I)), XYDATA
16383f80040M0673q902K993M9973R55k9391L5638J9482q789r585K7031R884J4607
16370e35471K8395L4824k0351l6154j4923L7267K9267K9131l6045j7028L1049
16359d70039O6602J8322N5964k7200k4888k091N3628L9132p433j404l4498j3674
16347c47579M9767L6761p82Q027O209M0445L6624L7768m3376N2204k350k0999
16335a47281J8492m909m955N7435M6891k4650m9541q224O9104M5956m0590O102
16323c6170j6533j2914Q1632j0396m2463N6543L9378K3441o0138k3247Q4762K4796
16311A08691j9206j7952L7493K3779L1108K592j3125k834J8018M123N112J1814
16299A89613j090n663k4968K0532L6133M5180l4455P919J1898L7726K4850K9093
$$ y = [-680040, -639367, -648269, -645276, -595303, -594348, -623739, -588101, -568619, -577408, -586993, -559962, -550078, -535471, -507076, -472252, -492603, -528757, -543680, -506413, -477146, -448015, -484060, -501088, -470039, -403437, -385115, -329151, -356351, -381239, -383330, -329702, -290570, -298003, -299407, -333905, -347579, -297812, -261051, -261833, -253806, -247597, -207152, -170528, -132760, -176136, -123932, -126282, -147281, -128789, -133698, -138653, -81218, -34327, -58977, -108518, -116742, -47638, -1682, -42272, -36170, -52703, -65617, 16015, 5619, -36844, 19699, 59077, 82518, 22380, -867, 83895, 108691, 89485, 71533, 109026, 132805, 163913, 166505, 153380, 150546, 168564, 172687, 177799, 189613, 188523, 182860, 157892, 178424, 214557, 259737, 225282, 233201, 245099, 282825, 307675, 336768]
16287C36768r876J780k2526J7033M5285M891M0349p3904m484M750M1517L4023
16275D15606n2314K1630J0046l8796J9794P2807o329k4774m2541L3772j4747M4658
16263D38812K8824K6946N4877l3556j6458M5199O164J0169p63j7827k1331j44
16251E20912M6856o382J2900O7030k1796j9939P819k7270J1391K1742L2780K6747
16239F72790l2214J0372J7184j077J0199m2110N3668Q981j2237l020k7016m712
16227F50808Q5302m7627n0476Q1106K1477m96J0584J3933l0876k8829L6138N0288
16215G91332l3113j2659K151l2378R963o0421R5563J6245k1289J4697K1571M6265
16203H37927m9805m9974M9986J7000j3109k535m558L7399J0235M0851l0459l0822
$$ y = [336768, 326892, 328672, 306146, 323179, 368464, 373355, 413704, 339800, 335316, 340066, 381583, 415606, 363292, 384922, 394968, 356172, 375966, 448773, 442444, 417670, 375129, 408901, 394154, 438812, 467636, 494582, 549459, 515903, 499445, 544644, 550808, 560977, 560214, 542387, 521056, 520912, 567768, 561386, 574286, 641316, 619520, 599581, 607400, 580130, 591521, 613263, 646043, 672790, 640576, 650948, 668132, 667055, 677254, 635144, 688812, 697793, 685556, 682536, 655520, 650808, 736110, 688483, 638007, 719113, 740590, 740094, 750678, 764611, 733735, 704906, 741044, 791332, 758219, 745560, 747711, 715333, 725296, 664875, 760438, 776683, 755394, 770091, 791662, 837927, 788122, 738148, 788134, 805134, 792025, 789490, 784932, 822331, 832566, 873417, 842958, 812136]
$$ [...]
##END NTUPLES=NMR SPECTRUM
##END=
