##TITLE=1H_EC-3296(XVI-2)
 CDCl3
 8 sc, 
 28.9.2023
##JCAMPDX= 6.0         $$ Bruker NMR JCAMP-DX V2.0
##DATA TYPE= NMR SPECTRUM
##DATA CLASS= NTUPLES
##ORIGIN= UXNMR, Bruker Analytische Messtechnik GmbH
##OWNER= root
$$ XWIN-NMR		Version 3.5
$$ Thu Sep 28 13:54:24 2023 Russian Standard Time (UT+4h)  she@DPX200
##.OBSERVE FREQUENCY= 200.13135
##.OBSERVE NUCLEUS= ^1H
##.ACQUISITION MODE= SIMULTANEOUS
##.ACQUISITION SCHEME= undefined
##.AVERAGES= 8
##.DIGITISER RES= 18
##SPECTROMETER/DATA SYSTEM= spect
##.PULSE SEQUENCE= zg30
##.SOLVENT NAME= CDCl3
##.SHIFT REFERENCE= (INTERNAL, CDCl3, 0, 15.7899)
##AUDIT TRAIL= $$ (NUMBER, WHEN, WHO, WHERE, WHAT)
$$ ##TITLE= Audit trail, XWIN-NMR		Version 3.5
$$ ##JCAMPDX= 5.01
$$ ##ORIGIN= Bruker BioSpin GmbH
$$ ##OWNER= she
$$ F:/spectra/data/she/nmr/H-F/1/pdata/1/auditp.txt
$$ ##AUDIT TRAIL=  $$ (NUMBER, WHEN, WHO, WHERE, WHAT)
(   1,<2023-09-28 13:52:47.75 +0400>,<she>,<DPX200>,
      <created by zg, POWCHK disabled, PULCHK disabled
       configuration hash MD5:
       00 E9 B6 7A A2 85 ED C7 34 08 36 98 17 FE 4E 26
       data hash MD5: 16K
       14 19 51 15 46 CF 57 FD 5D 4B 63 AE 9F C2 2D 62>)
(   2,<2023-09-28 13:52:55.17 +0400>,<she>,<DPX200>,
      <Start of raw data processing
       efp BC_mod = 2 LB = 0.24 FT_mod = 6 PKNL = 1 PHC0 = -21710.77 PHC1 = 12.85271 SI = 16K 
       data hash MD5: 16K
       CC BB AF 66 3F 52 FD AB 01 80 D5 92 37 82 5B F6>)
(   3,<2023-09-28 13:53:18.29 +0400>,<she>,<DPX200>,
      <pk PHC0 = -156.9338 PHC1 = -3 
       data hash MD5: 16K
       B4 8D 11 DC 87 D5 F0 F1 D7 6E C1 98 4B A0 DD F1>)
(   4,<2023-09-28 13:53:21.89 +0400>,<she>,<DPX200>,
      <abs ABSG = 5 
       data hash MD5: 16K
       5B 81 53 DE 30 C7 75 AB 59 4A 0E 31 99 9B C5 A3>)
$$ ##END=
$$ 
$$ hash MD5
$$ 41 60 C7 76 DB B3 3B 9E 95 D0 A2 6E DC 23 C2 4D
##$RELAX= 
##$RELAX= 
##$RELAX= 
##$RELAX= 
##$RELAX= 
##$RELAX= 
$$ Bruker specific parameters
$$ --------------------------
##$DU= <F:/spectra>
##$EXPNO= 1
##$NAME= <H-F>
##$PROCNO= 1
##$TYPE= <nmr>
##$USER= <she>
##$AMP= (0..31)
100 100 100 100 100 100 100 100 100 100 100 100 100 100 100 100 100 100 
100 100 100 100 100 100 100 100 100 100 100 100 100 100 
##$AQSEQ= 0
##$AQ_mod= 1
##$AUNM= <au_zg>
##$AUTOPOS= <>
##$BF1= 200.13
##$BF2= 200.13
##$BF3= 200.13
##$BF4= 200.13
##$BF5= 200.13
##$BF6= 200.13
##$BF7= 200.13
##$BF8= 200.13
##$BYTORDA= 1
##$CFDGTYP= 0
##$CFRGTYP= 5
##$CHEMSTR= <none>
##$CNST= (0..31)
1 1 145 1 1 1 1 1 1 1 1 1 1 1 1 1 1 1 1 1 1 1 1 1 1 1 1 1 1 1 1 1 
##$CPDPRG= <>
##$CPDPRG1= <>
##$CPDPRG2= <>
##$CPDPRG3= <>
##$CPDPRG4= <mlev>
##$CPDPRG5= <mlev>
##$CPDPRG6= <mlev>
##$CPDPRG7= <mlev>
##$CPDPRG8= <mlev>
##$CPDPRGB= <>
##$CPDPRGT= <>
##$D= (0..31)
0 1.2 0 0 0 0 0 0 0 0.06 0 0.03 0 0 0 0 0.0002 0 0 0 0 0 0 0 0 0 0 0 0 
0 0 0 
##$DATE= 1695894767
##$DBL= (0..7)
120 120 120 120 120 120 120 120 
##$DBP= (0..7)
150 150 150 150 150 150 150 150 
##$DBP07= 0
##$DBPNAM0= <>
##$DBPNAM1= <>
##$DBPNAM2= <>
##$DBPNAM3= <>
##$DBPNAM4= <>
$$ [...]
##$SUBNAM3= <"">
##$SUBNAM4= <"">
##$SUBNAM5= <"">
##$SUBNAM6= <"">
##$SUBNAM7= <"">
##$SUBNAM8= <"">
##$SUBNAM9= <"">
##$SW= 18.05172834244
##$SWIBOX= (0..15)
0 0 2 0 0 0 0 0 0 0 0 0 0 0 0 0 
##$SW_h= 3612.71676300578
##$TD= 16384
##$TD0= 1
##$TE= 0
##$TE2= 300
##$TE3= 300
##$TEG= 300
##$TL= (0..7)
0 120 120 120 120 120 120 120 
##$TP= (0..7)
150 150 150 150 150 150 150 150 
##$TP07= 0
##$TPNAME0= <>
##$TPNAME1= <>
##$TPNAME2= <>
##$TPNAME3= <>
##$TPNAME4= <>
##$TPNAME5= <>
##$TPNAME6= <>
##$TPNAME7= <>
##$TPOAL= (0..7)
0.5 0.5 0.5 0.5 0.5 0.5 0.5 0.5 
##$TPOFFS= (0..7)
0 0 0 0 0 0 0 0 
##$TUNHIN= 0
##$TUNHOUT= 0
##$TUNXOUT= 0
##$USERA1= <user>
##$USERA2= <user>
##$USERA3= <user>
##$USERA4= <user>
##$USERA5= <user>
##$V9= 5
##$VALIST= <valist>
##$VCLIST= <CCCCCCCCCCCCCCC>
##$VD= 0
##$VDLIST= <DDDDDDDDDDDDDDD>
##$VPLIST= <PPPPPPPPPPPPPPP>
##$VTLIST= <TTTTTTTTTTTTTTT>
##$WBST= 1024
##$WBSW= 4
##$XGAIN= (0..3)
0 0 0 0 
##$XL= 0
##$YL= 0
##$YMAX_a= 307577
##$YMIN_a= -354245
##$ZGOPTNS= <>
##$ZL1= 120
##$ZL2= 120
##$ZL3= 120
##$ZL4= 120
##$ABSF1= 17.31434
##$ABSF2= -0.7375374
##$ABSG= 5
##$ABSL= 3
##$ALPHA= 0
##$AQORDER= 0
##$ASSFAC= 0
##$ASSFACI= 0
##$ASSFACX= 0
##$ASSWID= 0
##$AUNMP= <proc_1d>
##$AZFE= 0.1
##$AZFW= 0.1
##$BCFW= 0
##$BC_mod= 2
##$BYTORDP= 0
##$COROFFS= 0
##$CY= -3
##$DATMOD= 1
##$DC= 0
##$DFILT= <>
##$DTYPP= 0
##$F1P= 0
##$F2P= 0
##$FCOR= 1
##$FTSIZE= 16384
##$FT_mod= 6
##$GAMMA= 0
##$GB= 0
##$INTBC= 1
##$INTSCL= 3.70164e-10
##$ISEN= 128
##$LB= 0.24
##$LEV0= 0
##$LPBIN= 0
##$MAXI= 10000
##$MC2= 0
##$MEAN= 0
##$ME_mod= 0
##$MI= 1.114404
##$NCOEF= 0
##$NC_proc= -5
##$NLEV= 6
##$NOISF1= 3.799351
##$NOISF2= 2.8
##$NSP= 0
##$NTH_PI= 0
##$NZP= 0
##$OFFSET= 15.78986
##$PC= 1
##$PHC0= -21867.7
##$PHC1= 9.85271
##$PH_mod= 1
##$PKNL= yes
##$PPARMOD= 0
##$PSCAL= 0
##$PSIGN= 0
##$REVERSE= no
##$SF= 200.129996333436
##$SI= 16384
##$SIGF1= 3
##$SIGF2= 2
##$SINO= 5.538805
##$SIOLD= 16384
##$SREGLST= <1H.CDCl3>
##$SSB= 0
##$STSI= 16384
##$STSR= 0
##$SW_p= 3612.71676300578
##$SYMM= 0
##$S_DEV= 0
##$TDeff= 16384
##$TDoff= 0
##$TI= <>
##$TILT= no
##$TM1= 0
##$TM2= 0
##$TOPLEV= 0
##$USERP1= <user>
##$USERP2= <user>
##$USERP3= <user>
##$USERP4= <user>
##$USERP5= <user>
##$WDW= 1
##$XDIM= 16384
##$YMAX_p= 333414485
##$YMIN_p= -73019
$$ End of Bruker specific parameters
$$ ---------------------------------
##NTUPLES= NMR SPECTRUM
##VAR_NAME=  FREQUENCY,     SPECTRUM/REAL,   SPECTRUM/IMAG
##SYMBOL=    X,             R,               I
##VAR_TYPE=  INDEPENDENT,   DEPENDENT,       DEPENDENT
##VAR_FORM=  AFFN,          ASDF,            ASDF
##VAR_DIM=   16384,         16384,           16384
##UNITS=     HZ,            ARBITRARY UNITS, ARBITRARY UNITS
##FACTOR=    0.220516191357247, 1,           1
##FIRST=     3160.0245782215, 0,             0
##LAST=      -452.692184784284, 0,           0
##MIN=       -452.692184784284, -73019,      0
##MAX=       3160.0245782215, 333414485,     0
$$ Real data points
##PAGE= N=1
##DATA TABLE= (X++(R..R)), XYDATA
$$ [...]
$$ plain form
6565 -25357 -10269 -7445 -14931 -23490 -15455 -20941 -24234 -24702 -29108 -23679 -37214 -43646 -27947 -18988
6551 -18988 -11738 -26005 -27226 -16763 -9733 3279 -5498 -25126 -17715 -11381 -17328 -5595 -4049
6538 -4049 -12091 -28923 -22627 -32212 -50330 -34133 -28430 -13177 -13283 -17757 -26050 -15443 -14071 -9980
6524 -9980 -7114 -26608 -29366 -50483 -38657 -24683 -29005 -28551 -40318 -38604 -27912 -28074 -24612 -26559
6510 -26559 -25294 -30640 -27946 -16587 -25685 -38568 -25868 -15998 -9527 -9510 -29374 -36697 -46389 -43611
6496 -43611 -30342 -35274 -35362 -25469 -23602 -25248 -23172 -17030 -25533 -30480 -24540 -26799 -22334 -17099 -13179
6481 -13179 -21456 -26824 -27215 -18111 -22355 -25436 -9579 -23776 -21061 -6599 -17905 -34546 -26851 -15916
6467 -15916 -10697 -9928 -9009 -10770 -9069 -15703 -3690 -5891 -14080 -12774 -18544 -29131 -18659 -16673
$$ packed form
6565b5357J5088K824p486q559Q035n486l293m68m406N429j3535o432J5699Q959
6551a8988P250j4267j221J0463P030J3012q777j9628P411O334n947J1733J546
6538d049q042j6832O296r585j8118J6197N703J5253j06m474q293J0607J372M091
6524i980K866j9494k758k1117J1826J3974m322M54j1767J714J0692j62L462j947
6510b6559J265n346K694J1359r098j2883J2700R870O471J7j9864p323r692K778
6496d3611J3269m932q8R893J867j646K076O142q503m947N940k259M465N235L920
6481a3179q277n368l91R104m244l081J5857j4197K715J4462j1306j6641P695J0935
6467a5916N219P69R19j761J701o634J2013k201q189J306n770j0587J0472J986
$$ plain form
6453 -16673 -21732 -21083 -14930 -20088 -15141 -20666 -18905 -23715 -30014 -16699 -6321 -17976 -25937 -14392
6439 -14392 -5059 -22340 -36549 -26487 -19863 -28490 -27839 -19220 -21640 -15480 -19362 -29921 -32055 -10154
6425 -10154 -27022 -15188 -21059 -3490 -9123 -16719 -21989 -23925 -5639 -3541 -1508 -7365 -22059
6412 -22059 -14637 -6604 -19990 -19708 -24969 -26021 -28724 -16910 -6927 -20497 -7232 -2336 -26852 -14142
6398 -14142 -16590 -20802 -10135 -10558 -14834 -8816 -12313 -13147 -11549 -21565 -14262 -14895 -24722 -29730 -25154
6383 -25154 -12025 -27229 -30955 -20146 -9223 -6103 -19720 -15654 -9071 -15481 -8728 -14770 -21105
6370 -21105 -13849 -10080 -15461 -9118 3958 3492 -7132 -10444 -13558 -13906 -14344 -23556 -17363 -15793 -15227
6355 -15227 -23536 -21613 -23036 -27569 -28444 -35008 -28308 -16630 -4612 -24143 -26105 -25312 -1982 -10513
$$ packed form
6453a6673n059O49O153n158M947n525J761m810o299J3315J0378j1655p961J1545
6439a4392R333j7281j4209J0062O624q627O51Q619k420O160l882j0559k134K1901
6425a0154j6868J1834n871J7569n633p596n270j936J8286K098K033n857j4694
6412b2059P422Q033j3386K82n261j052k703J1814R983j3570J3265M896k4516J2710
6398a4142k448m212J0667m23m276O018l497q34J598j0016P303o33r827n008M576
6383b5154J3129j5204l726J0809J0923L120j3617M066O583o410O753o042o335
6370b1105P256L769n381O343J3076m66j0624l312l114l48m38r212O193J570N66
6355a5227q309J923j423m533q75o564O700J1678J2018j9531j962P93K3330q531
$$ plain form
6341 -10513 -17429 -14170 -13243 372 -5271 -13453 -11848 -16634 -18294 -13871 -13521 -21390 -14293 -8088 -14468
6326 -14468 -12876 -15581 -3291 -18624 -23522 -23830 -15901 -10537 -9074 113 -11634 -26046 -8731 -19632
6312 -19632 -14203 -22173 -25310 -28977 -19874 -26868 -34353 -27438 -13921 -17262 -17385 -25432 -24339 -13243
6298 -13243 -18248 -23683 -13966 -12317 -11826 -1976 -17422 -15196 -21835 -19732 -2817 11467 -2172 -2103
6284 -2103 6171 10718 6253 -9802 -15142 -20494 -22906 -23329 -14193 -19531 -16255 -12146 -15875 -19226 -18332
6269 -18332 -16018 -18606 -25162 -11726 -13734 -28623 -7893 -26050 -32306 -24324 -10640 -8186 -5549
6256 -5549 -8229 2590 -3592 -1852 -10901 -10335 8879 11296 10065 -10776 -15234 -17823 -8931 -15106
6242 -15106 -22365 -15692 13150 23248 693 12698 17268 3983 -10382 4947 -11656 -6305 -13444
$$ packed form
6341a0513o916L259R27J3615n643q182J605m786j660M423L50p869P097O205o380
6326a4468J592k705J2290j5333m898l08P929N364J463R187j1747j4412J7315j0901
6312a9632N429p970l137l667R103o994p485O915J3517l341j23q047J093J1096
6298a3243n005n435R717J649M91R850j5446K226o639K103J6915J4284j3639O9
6284b103Q274M547m465j6055n340n352k412m23R136n338L276M109l729l351Q94
6269a8332K314k588o556J3436k008j4889K0730j8157o256P982J3684K454K637
6256e549k680J0819o182J740r049N66J9214K417j231k0841m458k589Q892o175
6242a5106p259O673K8842J0098k2555J2005M570j3285j4365J5329j6603N351p139
$$ plain form
6229 -13444 -13791 -10185 -7975 3592 2676 -807 -301 16168 18015 13959 13773 21184 5210 -17582 -11388
6214 -11388 -1477 9331 3497 7942 2908 4556 4843 3663 19773 25588 8455 -5967 2904 3227
6200 3227 -3329 3445 13417 8934 28200 24589 9900 3115 4887 5883 -2149 -5450 10799 5410
6186 5410 8956 6349 18129 9788 7240 6055 4063 14492 13888 -3332 -2056 -578 12156 7801
6172 7801 68 -7603 -1050 3499 2612 18961 8613 1764 -6700 1069 11681 15711 14410 795
6158 795 981 -1 19020 -2680 -11594 -11268 -4462 5742 621 3037 -11242 -17970 -12051 7754 -6007
6143 -6007 -11321 12436 10587 4939 9735 4274 3171 -470 -3343 -13537 -16618 -2355 11583 3261
6129 3261 4162 -14021 -3335 6557 16624 18937 6926 -6968 -15465 -4257 6328 9430 3690
$$ packed form
6229a3444l47L606K210J1567r16l483N06J6469J847m056j86P411j5974k2792O194
6214a1388R911J0808n834M445n034J648K87j180J6110N815j7133j4422Q871L23
6200C227o556O774R972m483J9266l611j4689o785J772R96q032l301J6249n389
6186E410L546k607J1780q341k548j185j992J0429o04j7220J276J478J2734m355
6172G801p733p671O553M549q87J6349j0348o849q464P769J0612M030j301j3615
6158G95J86r82J9021k1700q914L26O806J0204n121K416j4279o728N919J9805j3761
6143f007n314K3757j849n648M796n461j103l641k873j0194l081J4263J3938q322
6129C261R01j8183J0686R892J0067K313j2011j3894q497J1208J0585L102n740
$$ plain form
6116 3690 -7342 -9282 2627 -8584 -24045 -11961 2343 1321 -9702 -8292 5631 23708 16541
6103 16541 2617 11420 6756 1514 1706 -1590 2490 13864 12801 -922 -4350 -3225 -860 6173
6089 6173 8901 -3653 17594 22833 -1963 -10777 2727 13270 7802 -15011 -1814 20250 13704
6076 13704 -457 671 18387 16631 6406 -10062 -7638 2617 7400 11512 7494 16795 -3385
6063 -3385 -8428 2324 -1786 -12654 -2472 16524 6599 2587 9243 5721 633 14730 135
6050 135 10839 22113 8437 14195 24115 10012 4268 12232 17453 19689 25081 21375 21941 24592
6036 24592 27838 23776 17131 943 8315 -6910 1864 25673 23071 1405 12620 18641 1212
6023 1212 17361 10690 -1502 -17397 -14818 -474 6980 9742 17227 6340 23987 21580 11683
$$ packed form
6116C690j1032j940J1909j1211j5461J2084J4304j022j1023J410J3923J8077p167
6103A6541j3924Q803m664n242J92l296M080J1374j063j3723l428J125K365P033
6089F173K728j2554K1247N239k4796q814J3504J0543n468k2813J3197K2064o546
6076A3704j4161J128J7716j756j0225j6468K424J0255M783M112m018R301k0180
6063c385n043J0752m110j0868J0182J8996r925m012O656l522n088J4097j4595
6050A35J0704J1274j3676N758R920j4103n744P964N221K236N392l706N66K651
6036B4592L246m062o645j6188P372j5225Q774K3809k602k1666J1215O021j7429
6023A212J6149o671j2192j5895K579J4344P454K762P485j0887J7647k407r897
$$ plain form
6010 11683 8840 15231 15663 6795 3304 8203 16134 8888 16186 12185 13815 10589 16099 9671 28014
5995 28014 30703 7537 10723 23185 6600 11984 23096 6114 10347 15181 29301 26361 20740
5982 20740 14117 7512 21926 3870 5051 10530 7139 23095 14432 19777 19292 -960 4870 4172
5968 4172 29487 38768 28081 30405 25016 47120 30671 30816 39159 16648 25516 16094 302 14035
5954 14035 24538 20046 13662 12417 12926 10795 14104 15140 29665 38949 34215 34014 21201 28245
5940 28245 21341 7508 21571 37474 43809 28165 12041 20844 26395 40866 40061 33848 38825
5927 38825 57452 44326 50650 38662 39612 34832 34941 35675 36268 43082 32853 43391 33463 38753
5913 38753 35578 37912 24882 20677 26125 31338 35544 37518 40610 45443 37053 39999 34963 31435
$$ packed form
6010A1683k843O391M32q868l491M899P931p246P298m001J630l226N510o428J8343
5995B8014K689k3166L186J2462j6585N384J1112j6982M233M834J4120k940n621
5982B0740o623o605J4414j8056J181N479l391J5956q663N345m85k0252N830o98
5968D172K5315R281j0687K324n389K2104j6449J45Q343k2511Q868r422j5792J3733
5954A4035J0503m492o384j245N09k131L309J036J4525R284m734k01j2813P044
5940B8245o904j3833J4063J5903O335j5644j6124Q803N551J4471q05o213M977
5927C8825J8627j3126O324j1988R50m780J09P34N93O814j0229J0538r928N290
5913C8753l175K334j3030m205N448N213M206J974L092M833q390K946n036l528
$$ plain form
5899 31435 34917 25884 27282 25279 12049 14565 32196 29434 27881 34132 18104 23532 28243 26272
5885 26272 32837 27614 35855 20649 40726 40548 23810 18124 26100 30522 35966 31540 26244 19644
5871 19644 1419 17022 6776 14716 36115 40170 38206 38812 39978 49643 43768 34371 20471 24815
5857 24815 35880 38923 33711 51596 74099 71749 54792 46433 47540 55261 40537 53972 51368
5844 51368 33531 45995 54202 56328 53860 46661 46604 55787 59742 50369 51350 35272 22579 39104
5830 39104 41142 60290 56479 47902 43977 43343 40409 53257 63119 64518 63870 55275 62362 69814 48086
5815 48086 44206 48154 52848 34755 27939 45343 51152 52643 53159 48416 59875 71276 46723 54296
5801 54296 73299 69159 66638 51799 49775 45973 53513 44589 42154 45775 66072 64116 67762 75057
$$ packed form
5899C1435L482r033J398k003j3230K516J7631k762j553O251j6028N428M711j971
5885B6272O565n223Q241j5206K0077j78j6738n686P976M422N444m426n296o600
5871A9644j8225J5603j0246P940K1399M055j964O06J166R665n875r397j3900M344
5857B4815J1065L043n212J7885K2503k350j6957q359J107P721j4724J3435k604
5844E1368j7837J2464Q207K126k468p199n7R183L955r373R81j6078j2693J6525
5830C9104K038J9148l811q577l925o34k934J2848R862J399o48q595P087P452k1728
5815D8086l880L948M694j8093o816J7404N809J491N16m743J1459J1401k4553P573
5801E4296J9003m140k521j4839k024l802P540q924k435L621K0297j956L646P295
$$ plain form
5787 75057 82233 70329 64629 75401 84753 83624 75568 75244 68064 73561 70108 61249 68974 78487
5773 78487 71426 70475 73758 74841 68899 81984 90575 94364 84647 76377 72972 89655 97665 106851
5759 106851 101504 95816 92910 100490 95227 100493 95785 100690 114273 115035 103718 95440 111696 112974
5745 112974 118391 125955 124199 130026 119987 122721 154712 180992 191700 225198 243635 256160 284587
5732 284587 310495 341745 369222 354928 334045 295529 234615 185867 172945 170212 150771 142881
5720 142881 138650 130398 116201 120943 124995 115392 103882 121562 125102 114536 115307 112333 100983
5707 100983 93888 105209 111150 115674 113451 121509 128293 125179 122252 122317 134659 161580 168965 163366
5693 163366 151562 139756 136307 134035 125600 118121 109506 102024 106911 103098 98899 87931 82753 84269
$$ packed form
5787G5057P176j1904n700J0772R352j129q056l24p180N497l453q859P725R513
5773G8487p061r51L283J083n942J3085Q591L789r717q270l405J6683Q010R186
5759A06851n347n688k906P580n263N266m708M905J3583P62j1317q278J6256J278
5745A12974N417P564j756N827j0039K734L1991K6280J0708L3498J8437J2525K8427
5732B84587K5908L1250K7477j4294k0883l8516o0914m8748j2922k733j9441p890
5720A42881m231q252j4197M742M052r603j1510J7680L540j0566P71k974j1350
5707A00983p095J1321N941M524k223Q058O784l114k927O5J2342K6921P385n599
5693A63366j1804j1806l449k272q435p479q615p482M887l813m199j0968n178J516
$$ plain form
5679 84269 99197 104696 93410 99403 106353 119279 113391 107160 106146 79846 96102 96833 100725 95289
5665 95289 93124 101710 90603 91779 102999 101950 97573 100328 108002 85449 94740 112059 108337 99139
5651 99139 108066 95050 70212 87244 90420 72128 87055 96295 83932 87678 80544 81383 80481 70071
5637 70071 90935 79298 67931 77406 88640 81650 68474 81624 84420 79194 83789 86122 84609
5624 84609 87291 86015 77510 65981 87111 92460 85480 81322 75805 79460 74069 71432 72815 71293
5610 71293 76108 74148 67534 73060 85809 98541 90759 85786 90504 106184 96434 111160 99125
5597 99125 97715 97662 89869 96718 98444 96600 78789 92556 105765 96252 88239 100772 87459 90500
5583 90500 90271 92640 101295 95770 85855 98062 104744 86897 80414 80881 83679 88669 81934 87628 95291
$$ packed form
5679H4269J4928N499j1286N993O950J2926n888o231j014k6300J6256P31L892n436
5665I5289k165Q586j1107J176J1220j049m377K755P674k2553R291J7319l722r198
5651I9139Q927j3016k4838J7032L176j8292J4927R240j2363L746p134Q39r02j0410
5637G0071K0864j1637j1367R475J1234o990j3176J3150K796n226M595K333j513
5624H4609K682j276q505j1529K1130N349o980m158n517L655n391k637J383j522
5610G1293M815j960o614N526J2749J2732p782m973M718J5680r750J4726j2035
5597I9125j410n3p793O849J726j844j7811J3767J3209r513q013J2533j3313L041
5583I0500k29K369Q655n525r915J2207O682j7847o483M67K798M990o735N694P663
$$ plain form
5568 95291 114989 130853 118266 110442 116374 106047 120506 110018 116576 122041 125052 118823 122619
5555 122619 112523 112947 113111 129748 137875 135608 135870 132989 136214 132269 141436 134483 123532 124192 122420
5540 122420 124826 114164 118663 134723 138733 140368 142264 140518 140245 140689 130047 140198 151846 156354
5526 156354 173289 169612 170934 176321 179851 184688 179439 175355 192908 204443 200839 209632 197306
5513 197306 196042 203975 211395 209398 200558 196566 196189 197895 219878 217669 220071 214332 211533 215990
5499 215990 239104 243904 233613 246381 264562 248355 258038 246478 244529 260153 272676 274517
5487 274517 249857 250034 272360 294140 293598 286399 297475 312356 326307 335238 348472 376129 386446
5474 386446 407019 416992 437584 460021 482449 497854 535823 590992 645301 686410 710744 717090
$$ packed form
5568I5291J9698J5864j2587p824N932j0327J4459j0488O558N465L011o229L796
5555A22619j0096M24J64J6637Q127k267K62k881L225l945R167o953j0951O60j772
5540A22420K406j0662M499J6060M010J635J896j746k73M44j0642J0151J1648M508
5526A56354J6935l677J322N387L530M837n249m084J7553J1535l604Q793j2326
5513A97306j264P933P420j997q840l992l77J706K1983k209K402n739k799M457
5499B15990K3114M800j0291J2768J8181j6207R683j1560j949J5624J2523J841
5487B74517k4660J77K2326K1780n42p199J1076J4881J3951Q931J3234K7657J0317
5474C86446K0573R973K0592K2437K2428J5405L7969N5169N4309M1109K4334O346
$$ plain form
5462 717090 695451 628530 548214 502328 457430 422023 399078 408094 393719 386605 388725 399097
5450 399097 392766 380781 366273 377301 393106 398690 396425 399226 394657 386866 390496 396372 411943
5437 411943 399040 400729 397390 381335 387242 397933 412074 411237 408468 418694 435323 453203 443723
5424 443723 443935 455314 455664 463260 476507 489358 503724 530233 549074 564612 590139 605732 649800
5411 649800 694068 728725 773066 827211 892972 947941 1008961 1073626 1147913 1197776 1243605 1267625
5399 1267625 1233689 1148555 1042846 966913 905237 878816 868490 843711 833729 827280 833333 855339
5387 855339 877988 897009 924222 981927 1006322 1059911 1151388 1241395 1336999 1433537 1567931
5376 1567931 1695862 1816036 1979825 2151603 2340817 2565096 2727799 2803024 2794126 2635410
$$ packed form
5462G17090k1639o6921q0316m5886m4898l5407k2945R016j4375p114K120J0372
5450C99097o331j1985j4508J1028J5805N584k265K801m569p791L630N876J5571
5437D11943j2903J689l339j6055N907J0691J4141q37k769J0226J6629J7880r480
5424D43723K12J1379L50P596J3247J2851J4366K6509J8841J5538K5527J5593M4068
5411F49800M4268L4657M4341N4145O5761N4969O1020O4665P4287M9863M5829K4020
5399A267625l3936q5134j05709p5933o1676k6421j0326k4779r982o449O053K2006
5387H55339K2649J9021K7213N7705K4395N3589R1477R0007R5604R6538J34394
5376A567931J27931J20174J63789J71778J89214K24279J62703P5225q898j58716
$$ plain form
5366 2635410 2365499 2065453 1808255 1603492 1470718 1363149 1269315 1198484 1159906 1123275
5356 1123275 1111073 1096642 1077924 1092322 1131947 1152390 1196835 1258933 1333675 1426845 1526924
5345 1526924 1652943 1772491 1907734 2044247 2220667 2438861 2613922 2758923 2816365 2764779
5335 2764779 2584418 2286335 1950132 1681714 1470192 1314515 1199711 1106253 1007638 939066
5325 939066 898518 844685 827748 812370 777021 762464 749452 761343 774726 779414 803418 823693
5313 823693 860607 900549 937432 964687 1016217 1083081 1143460 1183225 1184348 1137063 1050327 948946
5301 948946 855175 754141 678756 621408 564462 526162 500001 468143 455837 439547 419820
5290 419820 387003 384826 364689 341395 322705 322430 334145 327590 321146 313424 290636 293594 291406
$$ packed form
5366B635410k69911l00046k57198k04763j32774j07569r3834p0831l8578l6631
5356A123275j2202j4431j8718J4398L9625K0443M4445O2098P4742R3170J00079
5345A526924J26019J19548J35243J36513J76420K18194J75061J45001N7442n1586
5335B764779j80361k98083l36203k68418k11522j55677j14804r3458r8615o8572
5325I39066m0548n3833j6937j5378l5349j4557j3012J1891J3383M688K4004K0275
5313H23693L6914L9942L6883K7255N1530O6864O0379L9765J123m7285q6736j01381
5301I48946r3771j01034p5385n7348n6946l8300k6161l1858j2306j6290j9727
5290D19820l2817k177k0137k3294j8690k75J1715o555o444p722k2788K958k188
$$ plain form
5277 291406 274508 278556 277400 257741 268327 260737 255370 246443 242958 247078 255370 262524 264258 256528
5263 256528 236431 229816 230087 214559 213724 221105 224712 248062 241903 244829 238237 237005 239448 248241
5249 248241 231717 242835 243052 218948 218364 219520 230891 230594 229043 229482 250351 238044 209756 205317
5235 205317 207398 209141 227847 240985 229667 237008 235161 226413 209809 217667 237100 237645 245373
5222 245373 248657 238009 237589 247342 259597 260800 253446 253083 248762 272960 272922 264295 256620 254939 258688
5207 258688 268729 255406 264000 276834 291781 291495 283144 293365 289721 289152 301160 306814 307649 313755
5193 313755 297405 300723 309448 314050 319125 334888 347061 357285 364617 373534 361751 377725 376842
5180 376842 368570 384326 398735 407017 431372 431432 446122 440782 440179 441949 462142 465341 473528 491726
$$ packed form
5277B91406j6898M048j156j9659J0586p590n367q927l485M120Q292P154J734p730
5263B56528k0097o615K71j5528q35P381L607K3350o159K926o592j232K443Q793
5249B48241j6524J1118K17k4104n84J156J1371k97j551M39K0869j2307k8288m439
5235B05317K081J743J8706J3138j1318P341j847q748j6604P858J9433N45P728
5222B45373L284j0648m20R753J2255J203p354l63m321K4198l8q627p675j681L749
5207B58688J0041j3323Q594J2834J4947k86q351J0221l644n69J2008N654Q35O106
5193C13755j6350L318Q725M602N075J5763J2173J0224P332Q917j1783J5974q83
5180C76842q272J5756J4409Q282K4355O0J4690n340o03J770K0193L199Q187J8198
$$ plain form
5166 491726 500646 508786 520812 525455 540140 563752 566732 580811 611425 620854 623408 645773 673068
5153 673068 695934 707774 739058 747493 753824 761611 765407 784077 801571 812330 838060 844337 850410
5140 850410 864114 909481 947347 969779 998060 1046815 1090660 1132787 1180107 1242878 1311380 1394178
5128 1394178 1487073 1574640 1658475 1777405 1911993 2056465 2218353 2397176 2606039 2814109
5118 2814109 3028824 3193396 3315169 3390932 3377991 3362331 3367681 3424290 3536369 3717064 3954700
5107 3954700 4183448 4431941 4700043 4950026 5158087 5324833 5369382 5318372 5156000 4883748
5097 4883748 4545895 4132949 3719914 3327534 2952170 2630037 2350894 2103363 1890711 1702627
5087 1702627 1563367 1455421 1343008 1251197 1156134 1083014 1028171 991552 941288 885223 841812
$$ packed form
5166D91726Q920Q140J2026M643J4685K3612K980J4079L0614R429K554K2365K7295
5153F73068K2866J1840L1284Q435O331P787L796J8670J7494J0759K5730O277O073
5140H50410J3704M5367L7866K2432K8281M8755M3845M2127M7320O2771O8502Q2798
5128A394178R2895Q7567Q3835J18930J34588J44472J61888J78823K08863K08070
5118B814109K14715J64572J21773P5763j2941j5660N350N6609J12079J80695K37636
5107C954700K28748K48493K68102K49983K08061J66746M4549n1010j62372k72252
5097D883748l37853m12946m13035l92380l75364l22133k79143k47531k12652j88084
5087A702627j39260j07946j12413r1811r5063p3120n4843l6619n0264n6065m3411
$$ plain form
5076 841812 809858 792255 762626 730962 702915 686706 674736 630040 610802 602923 580548 574644
5064 574644 545916 521478 514690 499572 490564 492845 473786 474847 468409 453604 448621 453410 440144
5051 440144 432467 433855 437278 444632 447045 432515 446391 443974 443195 429455 428878 456742 466215 466907
5037 466907 480453 485167 501912 518761 544612 558823 567430 570715 558397 563358 564643 568994 559364
5024 559364 556474 546851 539066 525257 519805 516218 519408 504260 497996 530599 566613 583899 581768
5011 581768 584912 592411 601668 602121 580890 585999 565873 539788 527619 527353 520386 513321 512248 518692
4997 518692 520657 518288 541873 559648 556050 580860 591915 576028 577216 572314 536010 533813 543304
4984 543304 525593 521586 516535 518238 519528 511671 510207 524643 531161 521685 525931 524257 527883 529735
$$ packed form
5076H41812l1954j7603k9629l1664k8047j6209j1970m4696j9238p879k2375n904
5064E74644k8728k4438o788j5118r008K281j9059J061o438j4805m983M789j3266
5051D40144p677J388L423P354K413j4530J3876k417p79j3740n77K7864R473O92
5037D66907J3546M714J6745J6849K5851J4211Q607L285j2318M961J285M351r630
5024E59364k890r623p785j3809n452l587L190j5148o264L2603L6014J7286k131
5011E81768L144P499R257M53k1231N109k0126k6085j2169k66o967p065j073O444
4997E18692J965k369K3585J7775l598K4810J1055j5887J188m902l6304k197R491
4984E43304j7711m007n051J703J290p857j464J4436O518r476M246j674L626J852
$$ plain form
4970 529735 510663 503555 483629 467256 421769 397953 378148 340376 327846 323589 306450 302151
4958 302151 294829 273510 260743 248446 243136 233087 224997 230410 229568 222620 221627 216481 222556 220829
4944 220829 213736 203554 197322 180399 175509 186326 195081 193426 189182 198844 200717 190880 185251 183013
4930 183013 188955 198361 192054 181144 183874 186600 189943 191900 189484 174383 165525 167179 167870 160584
4916 160584 160385 167366 153436 157902 147329 145537 151980 159547 153791 153815 164908 171498 157103 156991
4902 156991 153428 152382 154618 156860 154329 141941 148005 156733 124887 118173 140164 149326 165748
4889 165748 139307 133895 125126 140214 148247 139007 152905 160278 157177 156181 144830 140927 156023
4876 156023 146544 139466 148638 143443 127031 128879 148932 136475 133052 133202 135117 140665 133299 124880
$$ packed form
4970E29735j9072p108j9926j6373m5487k3816j9805l7772j2530m257j7139m299
4958C02151p322k1319j2767j2297n310j0049q090N413q42o948r93n146O075j727
4944B20829p093j0182o232j6923m890J0817Q755j655m244R662J873r837n629k238
4930A83013N942R406o307j0910K730K726L343J957k416j5101q858J654O91p286
4916A60584j99O981j3930M466j0573j792O443P567n756K4J1093O590j4395j12
4902A56991l563j046K236K242k531j2388O064Q728l1846o714K1991R162J6422
4889A65748k6441n412q769J5088Q033r240J3898P373l101r96j1351l903J5096
4876A56023r479p078R172n195j6412J848K0053j2457l423J50J915N548p366q419
$$ plain form
4862 124880 135089 138636 138554 132078 129889 118088 130349 138130 129006 134402 124788 130505 134360 121555
4848 121555 120477 126088 134026 125550 118529 125129 109909 119034 116249 116044 115004 120842 140855 135697
4834 135697 114144 110980 110864 115726 104836 110124 103613 119607 128840 122693 115502 116022 118825 115011
4820 115011 127059 129290 132339 118277 122571 138738 131359 112704 135112 132014 133659 133065 131115
4807 131115 135190 142013 143015 139918 148167 144640 133505 134567 140438 157667 163333 165436 160882 152895
4793 152895 155900 151645 167046 144998 140209 131507 125759 133203 128582 120682 122258 123892 115789 117748
4779 117748 119096 130436 128273 126699 123483 140438 142200 150031 160584 142564 145370 152366 138909
4766 138909 115233 118242 112364 106077 118491 127960 118373 129653 144088 141041 132253 136919 132729
$$ packed form
4862A24880J0209L547q2o476k189j1801J2261P781r124N396r614N717L855j2805
4848A21555j078N611P938q476p021O600j5220R125k785k05j040N838K0013n158
4834A35697k1553l164j16M862j0890N288o511J5994R233o147p191N20K803l814
4820A15011J2048K231L049j4062M294J6167p379j8655K2408l098J645n94j950
4807A31115M075O823J002l097Q249l527j1135J062N871J7229N666K103m554p987
4793A52895L005m255J5401k2048m789q702n748P444m621p900J576J634q103J959
4779A17748J348J1340k163j574l216J6955J762P831J0553j8020K806O996j3457
4766A38909k3676L009n878o287J2414R469r587J1280J4435l047q788M666m190
$$ plain form
4753 132729 132317 119918 110361 115548 131630 116915 114307 110079 116664 124649 122900 123939 115788 117999
4739 117999 132191 153148 158393 138663 124887 133090 119169 105949 123345 137520 122146 130653
4727 130653 131013 145607 146167 159738 135681 123645 137460 133361 136366 147426 145056 133239 136530
4714 136530 141808 147852 152203 154963 133259 129565 145993 141874 152465 152156 156806 155647 161404 153561
4700 153561 160418 160998 151714 160957 168861 178067 161139 156624 160332 171377 156100 152917 168125 185203
4686 185203 195757 186866 188239 197199 186658 180298 188175 191861 191427 190256 211399 210277 214742 209020
4672 209020 217283 229858 220150 234476 240942 236192 244890 242028 223812 226612 225327 226424 215731
4659 215731 219115 240303 238584 226093 239570 247523 252197 253827 257447 261115 267974 259889 250715 280169
$$ packed form
4753A32729m12j2399r557N187J6082j4715k608m228O585P985j749J039q151K211
4739A17999J4192K0957N245j9730j3776Q203j3921j3220J7396J4175j5374Q507
4727A30653L60J4594N60J3571k4057j2036J3815m099L005J1060k370j1817L291
4714A36530N278O044M351K760k1704l694J6428m119J0591l09M650j159N757p843
4700A53561O857N80r284R243P904R206j6928m515L708J1045j5277l183J5208J7078
4686A85203J0554q891J373Q960j0541o360P877L686m34j171K1143j122M465n722
4672B09020Q263J2575r708J4326O466m750Q698k862j8216K800j285J097j0693
4659B15731L384K1188j719j2491J3477P953M674J630L620L668O859q085r174K9454
$$ plain form
4645 280169 275178 279692 295698 289275 271297 267445 285229 291006 302631 298045 293520 305503 327864
4632 327864 341167 325074 329718 353468 367817 391839 402405 418580 403821 401816 411790 411609 406227
4619 406227 411382 422769 432069 448904 441995 435145 430963 441737 449192 447593 444537 445972 469698
4606 469698 487065 463884 461509 464927 487596 504134 507110 516173 510070 516626 520495 523183 548294
4593 548294 550400 539730 547314 535928 537168 520104 525516 522244 496809 509288 509515 498901 489651
4580 489651 496649 493457 500112 502898 522688 520595 519791 514892 521863 545232 558959 578440 574300 585572
4566 585572 577654 582219 593639 582389 595967 616933 606481 603874 595967 604325 602834 594215 594127 597203
4552 597203 589781 579313 569632 561459 561821 566410 564406 551820 548423 549161 574025 556917 563175 582124
$$ packed form
4645B80169m991M514J6006o423j7978l852J7784N777J1625m586m525J1983K2361
4632C27864J3303j6093M644K3750J4349K4022J0566J6175j4759k005R974j81n382
4619D06227N155J1387R300J6835o909o850m182J0774P455j599l056J435K3726
4606D69698J7367k3181k375L418K2669J6538K976R063o103O556L869K688K5111
4593E48294K106j0670P584j1386J240j7064N412l272k5435J2479K27j0614r250
4580D89651O998l192O655K786J9790k093q04m899O971K3369J3727J9481m140J1272
4566E85572p918M565J1420j1250J3578K0966j0452k607p907Q358j491q619q8L076
4552E97203p422j0468r681q173L62M589k004j2586l397P38K4864j7108O258J8949
$$ plain form
4538 582124 585375 589085 583251 610869 629159 638604 634521 635399 648369 651091 654936 636901 639021 650453
4524 650453 642377 634147 630716 612826 599134 592130 563732 550561 535218 541926 539859 514472 503253
4511 503253 516659 507378 496753 502921 505930 498437 498549 516003 516548 512638 512793 527023 551406 533812
4497 533812 524307 535280 542266 544612 542673 547174 557879 572583 582748 590430 588345 593054 581139
4484 581139 573718 564532 562894 569258 549107 548070 559974 546947 530183 537744 540598 549100 543464
4471 543464 541101 550889 545361 539639 541282 549088 538982 549790 556434 563395 552256 539980 543904
4458 543904 558836 581113 570646 565524 565220 573100 612467 620934 616643 607062 618163 620930 639239
4445 639239 654484 665405 658038 664764 675237 682146 688954 708084 719642 727805 745606 737574 752711
$$ packed form
4538E82124L251L710n834K7618J8290R445m083Q78J2970K722L845j8035K120J1432
4524F50453q076q230l431j7890j3692p004k8398j3171j5343O708k067k5387j1219
4511E03253J3406r281j0625O168L009p493J12J7454N45l910J55J4230K4383j7594
4497E33812r505J0973O986K346j939M501J0705J4704J0165P682k085M709j1915
4484E81139p421r186j638O364k0151j037J1904j3027j6764P561K854Q502n636
4471E43464k363R788n528n722J643P806j0106J0808O644O961j1139j2276L924
4458E43904J4932K2277j0467n122l04P880L9367Q467m291r581J1101K767J8309
4445F39239J5245J0921p367O726J0473O909O808J9130J1558Q163J7801q032J5137
$$ plain form
4432 752711 768856 782013 787180 800267 824777 834121 837695 862374 876830 916941 922921 904110
4420 904110 913305 956203 983948 999391 1011292 1041940 1080937 1095094 1122889 1146848 1151802 1177439
4408 1177439 1215184 1236926 1266742 1293313 1311867 1343596 1375257 1415744 1449495 1471547 1515035
4397 1515035 1539502 1577094 1599129 1638075 1672502 1692593 1744598 1790014 1831171 1865529 1920097
4386 1920097 1971652 2026967 2075015 2133691 2193535 2269775 2345179 2419753 2506659 2592592 2682157
4375 2682157 2773211 2904856 3008919 3147789 3301579 3436322 3586320 3737699 3931382 4114251
4365 4114251 4306823 4482970 4658800 4844939 5034756 5209295 5344319 5460695 5583990 5663487
4355 5663487 5752372 5849184 5917752 5985917 6070630 6163681 6262047 6354725 6480051 6644223 6822940
$$ packed form
4432G52711J6145J3157N167J3087K4510R344L574K4679J4456M0111N980j8811
4420I04110R195M2898K7745J5443J1901L0648L8997J4157K7795K3959M954K5637
4408A177439L7745K1742K9816K6571J8554L1729L1661M0487L3751K2052M3488
4397A515035K4467L7592K2035L8946L4427K0091N2005M5416M1157L4358N4568
4386A920097N1555N5315M8048N8676N9844P6240P5404P4574Q6906Q5933Q9565
4375B682157R1054J31645J04063J38870J53790J34743J49998J51379J93683J82869
4365D114251J92572J76147J75830J86139J89817J74539J35024J16376J23295P9497
4355E663487Q8885R6812O8568O8165Q4713R3051R8366R2678J25326J64172J78717
$$ plain form
4344 6822940 7021036 7216298 7456308 7695533 7950961 8189640 8426403 8636480 8804209 8928815
4334 8928815 9017029 9039714 9035126 9005753 8965686 8920031 8863773 8832632 8793149 8755934 8723697 8727559
4322 8727559 8736011 8783783 8841903 8902810 8935836 8946395 8923502 8890928 8825852 8761597 8717576 8694316
4310 8694316 8708361 8744939 8831938 8893058 8967674 9024626 9041420 8994556 8922511 8797701 8602816
4299 8602816 8372355 8091435 7784438 7453740 7118116 6767536 6423108 6089497 5785332 5524839
4289 5524839 5271885 5039805 4828574 4634278 4463463 4331641 4202807 4097578 4003995 3917914
4279 3917914 3841877 3785848 3730353 3682239 3644638 3613192 3575312 3556084 3550132 3551865 3574720 3570153
4267 3570153 3549980 3561660 3581234 3598816 3625853 3655274 3689379 3727919 3795732 3862565 3936076
$$ packed form
4344F822940J98096J95262K40010K39225K55428K38679K36763K10077J67729J24606
4334H928815Q8214K2685m588k9373m0067m5655n6258l1141l9483l7215l2237L862
4322H727559Q452M7772N8120O0907L3026J0559k2893l2574o5076o4255m4021k3260
4310H694316J4045L6578Q6999O1120P4616N6952J6794m6864p2045j24810j94885
4299H602816k30461k80920l06997l30698l35624l50580l44428l33611l04165k60493
4289E524839k52954k32080k11231j94296j70815j31822j28834j05229r3583q6081
4279C917914p6037n6029n5495m8114l7601l1446l7880j9228n952J733K2855m567
4267C570153k0173J1680J9574J7582K7037K9421L4105L8540O7813O6833P3511
$$ plain form
4256 3936076 3997489 4068006 4170319 4281459 4378907 4484726 4618119 4736483 4853375 4996724
4246 4996724 5148219 5292616 5467028 5644252 5830433 6043132 6269370 6491602 6746185 7001070
4236 7001070 7266634 7546827 7798083 8077817 8340580 8556544 8742455 8894281 9006039 9087080
4226 9087080 9123500 9126030 9100744 9058883 9012889 8952482 8885705 8832912 8768679 8742475 8708309 8687793
4214 8687793 8669277 8650318 8665584 8693622 8690295 8680119 8696442 8715196 8696778 8691706 8703008 8695142
4202 8695142 8714963 8745727 8775626 8794084 8794113 8828354 8843582 8821121 8754441 8675779 8566000 8421621
4190 8421621 8261576 8067483 7870163 7667978 7492706 7332590 7181766 7085206 6993328 6941018
4180 6941018 6901877 6859754 6815212 6725280 6641378 6494349 6336262 6161512 5973692 5801324
$$ packed form
4256C936076O1413P0517J02313J11140R7448J05819J33393J18364J16892J43349
4246D996724J51495J44397J74412J77224J86181K12699K26238K22232K54583K54885
4236G001070K65564K80193K51256K79734K62763K15964J85911J51826J11758Q1041
4226I087080L6420K530k5286m1861m5994o0407o6777n2793o4233k6204l4166k0516
4214H687793j8516j8959J5266K8038l327j0176J6323J8754j8418n072J1302p866
4202H695142J9821L0764K9899J8458K9L4241J5228k2461o6680p8662j09779j44379
4190H421621j60045j94093j97320k02185j75272j60116j50824r6560r1878n2310
4180F941018l9141m2123m4542q9932q3902j47029j58087j74750j87820j72368
$$ plain form
4170 5801324 5641597 5480222 5331308 5187441 5032036 4882411 4735999 4587492 4417857 4252520
4160 4252520 4108995 3963101 3833681 3707782 3578147 3472870 3381174 3299543 3249050 3181837
4150 3181837 3131157 3084653 3044448 3000104 2960922 2929962 2902140 2865293 2842133 2796121 2763164
4139 2763164 2741346 2712400 2679796 2658346 2643136 2632468 2614785 2606604 2605692 2604885 2608890 2608037 2624312
4126 2624312 2626308 2634398 2651900 2658551 2669104 2668561 2689188 2708006 2722389 2727553 2716850 2723411 2711672
4113 2711672 2703443 2699438 2695070 2720208 2747028 2757942 2769501 2771764 2796156 2812316 2834337 2855671
4101 2855671 2898876 2927572 2965579 3006363 3033188 3059614 3100732 3138558 3188577 3200920 3212373
4090 3212373 3210385 3220766 3259183 3286417 3300122 3311143 3337461 3369766 3420686 3458493 3488280 3525715
$$ packed form
4170E801324j59727j61375j48914j43867j55405j49625j46412j48507j69635j65337
4160D252520j43525j45894j29420j25899j29635j05277r1696q1631n0493o7213
4150C181837n0680m6504m0205m4344l9182l0960k7822l6847k3160m6012l2957
4139B763164k1818k8946l2604k1450j5210j0668j7683q181r12q07M005q53J6275
4126B624312J996Q090J7502O651J0553n43K0627J8818J4383N164j0703O561j1739
4113B711672q229m005m368K5138K6820J0914J1559K263K4392J6160K2021K1334
4101B855671M3205K8696L8007M0784K6825K6426M1118L7826N0019J2343J1453
4090C212373j988J0381L8417K7234J3705J1021K6318L2305N0920L7807K9787L7435
$$ plain form
4078 3525715 3570709 3606717 3653045 3705737 3769647 3831841 3877345 3926353 3958004 4003998 4058902
4067 4058902 4122768 4184105 4256480 4321384 4385100 4446997 4513518 4574166 4638661 4727318 4820825
4056 4820825 4922396 5020980 5124018 5210618 5281333 5332908 5384340 5421121 5482429 5535112 5584226
4045 5584226 5605061 5616420 5643866 5669753 5717049 5771563 5853021 5953609 6082319 6199591 6347152
4034 6347152 6492638 6645040 6827043 7013048 7219905 7453342 7689346 7927116 8193313 8466895
4024 8466895 8729447 9002347 9297192 9612417 9968871 10351107 10791919 11281923 11835858 12437928
4014 12437928 13120144 13898345 14715483 15571874 16495730 17379616 18143684 18690702 18981378
4005 18981378 18964571 18626449 18100663 17533656 17023393 16654343 16437181 16381962 16446541 16630448
$$ packed form
4078C525715M4994L6008M6328N2692O3910O2194M5504M9008L1651M5994N4904
4067D058902O3866O1337P2375O4904O3716O1897O6521O0648O4495Q8657R3507
4056D820825J01571R8584J03038Q6600P0715N1575N1432L6781O1308N2683M9114
4045E584226K0835J1359K7446K5887M7296N4514Q1458J00588J28710J17272J47561
4034F347152J45486J52402J82003J86005K06857K33437K36004K37770K66197K73582
4024H466895K62552K72900K94845L15225L56454L82236M40812M90004N53935O02070
4014A2437928O82216P78201Q17138Q56391R23856Q83886P64068N47018K90676
4005A8981378j6807l38122n25786n67007n10263l69050k17162n5219O4579J83907
$$ plain form
3995 16630448 16936307 17306251 17734582 18191569 18651589 19101499 19481014 19717823 19836283
3986 19836283 19893549 19936423 20027406 20193156 20503031 20985369 21635778 22432216 23390921 24508734
3976 24508734 25769918 27234723 28932037 30852690 32989078 35376367 38001785 40898826
3968 40898826 43953980 46959242 49759780 52188369 54033859 55205487 55604018 55042865
3960 55042865 53323621 50510824 47107949 43852620 41151894 39129417 37713388 36857856
3952 36857856 36542182 36694207 37294366 38307909 39665348 41375813 43446574 45824438 48390731
3943 48390731 51206391 54496329 58021079 61032631 62715251 62539015 59884327 54808620
3935 54808620 48758239 43365327 39097753 35785034 33133217 30950040 29114557 27565201
$$ packed form
3995A6630448L05859L69944M28331M56987M60020M49910L79515K36809J18460
3986A9836283N7266M2874R0983J65750L09875M82338O50409P96438R58705J117813
3976B4508734J261184J464805J697314J920653K136388K387289K625418K897041
3968D0898826L055154L005262K800538K428589J845490J171628L98531n61153
3960E5042865j719244k812797l402875l255329k700726k022477j416029q55532
3952C6857856l15674J52025O00159J013543J357439J710465K070761K377864K566293
3943D8390731K815660L289938L524750L011552J682620j76236k654688n075707
3935E4808620o050381n392912m267574l312719k651817k183177j835483j549356
$$ plain form
3927 27565201 26250090 25147558 24231189 23477168 22856733 22377314 22023007 21783260 21678224
3918 21678224 21648975 21712073 21829382 21968642 22099882 22226594 22325597 22405467 22467576 22535496
3908 22535496 22602371 22633023 22615846 22553843 22420309 22175639 21831497 21397128 20869401 20325292
3898 20325292 19772863 19249340 18821083 18463030 18155420 17949774 17836349 17808512 17826575 17889904
3888 17889904 17959042 18007595 18052087 18035657 17950184 17825661 17720999 17686259 17724592 17838295 18034283
3877 18034283 18318827 18655786 19069939 19520713 19983333 20411686 20797213 21097777 21298189
3868 21298189 21377536 21277731 21067547 20728214 20287441 19712969 19081743 18388073 17679033 17005981
3858 17005981 16386267 15848513 15422945 15133662 14938542 14860633 14866409 14894164 14976462 15067802
$$ packed form
3927B7565201j315111j102532r16369p54021o20435m79419l54307k39747j05036
3918B1678224k9249O3098J17309J39260J31240J26712R9003P9870O2109O7920
3908B2535496O6875L0652j7177o2003j33534k44670l44142m34369n27727n44109
3898B0325292n52429n23523m28257l58053l07610k05646j13425k7837J8063O3329
3888A7889904O9138M8553M4492j6430q5473j24523j04662l4740L8333J13703J95988
3877A8034283K84544L36959M14153M50774M62620M28353L85527L00564K00412
3868B1298189P9347r9805k10184l39333m40773n74472o31226o93670p09040o73052
3858A7005981o19714n37754m25568k89283j95120p7909N776K7755Q2298R1340
$$ plain form
3848 15067802 15097697 15021876 14815547 14451234 13947634 13328704 12672089 12012865 11417725 10879221
3838 10879221 10400797 9984171 9628078 9370901 9158576 9001530 8890189 8825387 8799290 8797153
3828 8797153 8813191 8868731 8889870 8852096 8741249 8536339 8253319 7955164 7674286 7443901
3818 7443901 7272764 7133035 7032726 6975017 6959388 6959565 6979127 7050012 7122313 7232414 7323510
3807 7323510 7428295 7551494 7665186 7774988 7837655 7866638 7894209 7940638 7970362 8004895 8048340
3796 8048340 8147025 8277720 8438767 8642603 8864692 9130929 9437800 9779238 10110299 10470104
3786 10470104 10800262 11108257 11370782 11532670 11582513 11493515 11296230 10997594 10627106 10256754
3776 10256754 9913950 9600781 9332773 9127478 8968185 8879279 8824801 8812146 8871976 8983115
$$ packed form
3848A5067802K9895p5821k06329l64313n03600o18930o56615o59224n95140n38504
3838A0879221m78424m16626l56093k57177k12325j57046j11341o4802k6097k137
3828H797153J6038N5540K1139l7774j10847k04910k83020k98155k80878k30385
3818G443901j71137j39729j00309n7709j5629J77J9562P0885P2301J10101R1096
3807G323510J04785J23199J13692J09802O2667K8983K7571M6429K9724L4533M3445
3796H048340R8685J30695J61047K03836K22089K66237L06871L41438L31061L59805
3786A0470104L30158L07995K62525J61888M9843q8998j97285k98636l70488l70352
3776A0256754l42804l13169k68008k05295j59293q8906n4478j2655N9830J11139
$$ plain form
3766 8983115 9147880 9358521 9627867 9923053 10257723 10640151 11072839 11502503 11922780 12255881
3756 12255881 12483653 12540679 12437621 12191146 11895962 11634432 11435086 11315634 11249856 11253187
3746 11253187 11318892 11378447 11460627 11547711 11620988 11635909 11612002 11564795 11512441 11495006 11500972
3735 11500972 11538395 11630196 11772755 11932297 12065307 12153104 12184721 12129629 11989868 11774264
3725 11774264 11503407 11198264 10899664 10638295 10441506 10254262 10106739 10013837 9942959 9891419
3715 9891419 9823664 9740371 9626860 9471416 9293805 9116502 8930233 8794284 8725870 8663661
3705 8663661 8660219 8705698 8787501 8950110 9161317 9418300 9747148 10098441 10504069 10923264
3695 10923264 11301460 11662039 11958962 12104758 12051750 11772982 11286347 10639098 9947153 9261307
$$ packed form
3766H983115J64765K10641K69346K95186L34670L82428M32688M29664M20277L33101
3756A2255881K27772N7026j03058k46475k95184k61530j99346j19452o5778L331
3746A1253187O5705N9555Q2180Q7084P3277J4921k3907m7207n2354j7435N966
3735A1500972L7423R1801J42559J59542J33010Q7797L1617n5092j39761k15604
3725A1774264k70857l05143k98600k61369j96789j87244j47523r2902p0878n1540
3715I891419o7755q3293j13511j55444j77611j77303j86269j35949o8414o2209
3705H663661l442M5479Q1803J62609K11207K56983L28848L51293M05628M19195
3695A0923264L78196L60579K96923J45796n3008k78768m86635o47249o91945o85846
$$ plain form
3685 9261307 8636544 8096739 7650776 7299316 7012309 6764689 6576350 6417642 6311787 6251980
3675 6251980 6207888 6193584 6209498 6246155 6312169 6387661 6478939 6562955 6634932 6678908 6682522 6675504
3663 6675504 6636064 6571299 6525029 6493778 6479439 6481651 6463846 6432969 6346136 6210587 6023705
3652 6023705 5793073 5548205 5289842 5033730 4814991 4620572 4474580 4349681 4239643 4150651
3642 4150651 4076693 4007195 3953335 3928243 3928743 3937018 3958246 3981585 3972588 3967775 3958093 3910386 3860262
3629 3860262 3839832 3827233 3831594 3835109 3865583 3898143 3890230 3833115 3710664 3525917 3294774
3618 3294774 3089632 2889097 2715663 2570616 2461886 2373761 2304298 2227937 2170090 2131530
3608 2131530 2084622 2060558 2024891 1999101 1986270 1995093 2010451 2007432 2000253 2023502 2048052 2098315
$$ packed form
3685I261307o24763n39805m45963l51460k87007k47620j88339j58708j05855n9807
3675F251980m4092j4304J5914L6657O6014P5492R1278Q4016P1977M3976L614p018
3663F675504l9440o4765m6270l1251j4339K212j7805l0877q6833j35549j86882
3652F023705k30632k44868k58363k56112k18739j94419j45992j24899j10038q8992
3642D150651p3958o9498n3860k5092N00Q275K1228K3339q997m813r682m7707n0124
3629C860262k0430j2599M361L515L0474L2560p913n7115j22451j84747k31143
3618C294774k05142k00535j73434j45047j08730q8125o9463p6361n7847l8560
3608B131530m6908k4064l5667k5790j2831Q823J5358l019p179K3249K4550N0263
$$ plain form
3596 2098315 2112966 2151605 2186870 2207457 2246505 2256442 2252191 2232638 2193892 2126169 2041382 1962565
3584 1962565 1878745 1809501 1732571 1682579 1634836 1565824 1542270 1519686 1490985 1449523 1444511 1442425
3572 1442425 1430756 1435040 1442108 1432364 1451425 1457501 1466744 1489072 1507098 1536387 1564462 1585920
3560 1585920 1602503 1625741 1623445 1609532 1585827 1544614 1499841 1448999 1374650 1312439 1265942 1235754
3548 1235754 1217713 1187555 1163837 1140604 1139582 1144286 1164730 1155683 1139251 1131946 1111330 1119028
3536 1119028 1134396 1126614 1131048 1156669 1171506 1172642 1200301 1216755 1219186 1228975 1239344 1253750
3524 1253750 1246135 1240947 1257443 1263872 1260026 1261462 1255842 1266664 1264475 1257526 1247939 1251708 1255232 1251324
3510 1251324 1248697 1258546 1269860 1285414 1300223 1306154 1337284 1359458 1388254 1415940 1457503 1492916
$$ packed form
3596B098315J4651L8639L5265K0587L9048R937m251j9553l8746o7723q4787p8817
3584A962565q3820o9244p6930m9992m7743o9012k3554k2584k8701m1462n012k086
3572A442425j1669M284P068r744J9061O076R243K2328J8026K9289K8075K1458
3560A585920J6583K3238k296j3913k3705m1213m4773n0842p4349o2211m6497l0188
3548A235754j8041l0158k3718k3233j022M704K0444r047j6432p305k0616P698
3536A119028J5368p782M434K5621J4837J136K7659J6454K431R789J0369J4406
3524A253750p615n188J6496O429l846J436n620J0822k189o949r587L769L524l908
3510A251324k627R849J1314J5554J4809N931L1130K2174K8796K7686M1563L5413
$$ plain form
3498 1492916 1521747 1544684 1593273 1637182 1660070 1704601 1758147 1805399 1850011 1905673 1945254
3487 1945254 1982680 2010509 2015715 2063591 2114817 2142711 2194089 2255770 2331610 2425646 2492816 2555931
3475 2555931 2598089 2598045 2560978 2490630 2390895 2268775 2126946 1998807 1904827 1809526 1754002
3464 1754002 1713859 1658570 1619430 1603710 1576645 1587378 1598217 1578411 1564179 1572347 1569232 1556229
3452 1556229 1547726 1556877 1552773 1556282 1557228 1547098 1543559 1534564 1536336 1545617 1565131 1588144 1572229
3439 1572229 1579650 1595882 1608438 1617669 1624406 1628663 1647988 1666440 1685937 1693660 1704741 1734764
3427 1734764 1743258 1750713 1763872 1772044 1817532 1851486 1877188 1919542 1939882 1968452 1996040 2015843
3415 2015843 2044669 2066931 2081057 2104660 2121134 2119295 2155039 2215839 2238031 2289246 2311548 2319907
$$ packed form
3498A492916K8831K2937M8589M3909K2888M4531N3546M7252M4612N5662L9581
3487A945254L7426K7829N206M7876N1226K7894N1378O1681P5840R4036O7170O3115
3475B555931M2158m4l7067p0348r9735j22120j41829j28139r3980r5301n5524
3464A754002m0143n5289l9140j5720k7065J0733J0839j9806j4232Q168l115j3003
3452A556229q503R151m104L509R46j0130l539q995J772R281J9514K3013j5915
3439A572229P421J6232J2556R231O737M257J9325J8452J9497P723J1081L0023
3427A734764Q494P455J3159Q172M5488L3954K5702M2354K0340K8570K7588J9803
3415B015843K8826K2262J4126K3603J6474j839L5744O0800K2192N1215K2302Q359
$$ plain form
3403 2319907 2310908 2333552 2359278 2372672 2412372 2443326 2477677 2517733 2547388 2579396 2606775 2652694
3391 2652694 2683159 2712769 2750752 2798054 2838642 2878840 2894555 2933953 2985330 3025282 3077437
3380 3077437 3108272 3157606 3200557 3238829 3286917 3342663 3401974 3485865 3555473 3628720 3701969
3369 3701969 3738815 3777180 3823328 3866319 3918923 3952273 4002287 4084195 4182571 4322238 4512117
3358 4512117 4679076 4819848 4951653 5072755 5205292 5351621 5474735 5588765 5696307 5830632
3348 5830632 5972375 6120079 6251647 6400672 6543874 6688856 6855924 7010281 7164130 7297044
3338 7297044 7442223 7586763 7753863 7927156 8111891 8308450 8511127 8717267 8931793 9144557
3328 9144557 9350997 9580465 9823416 10062341 10311883 10554355 10810843 11079291 11339514 11585379
$$ packed form
3403B319907q999K2644K5726J3394L9700L0954L4351M0056K9655L2008K7379M5919
3391B652694L0465K9610L7983M7302M0588M0198J5715L9398N1377L9952N2155
3380C077437L0835M9334M2951L8272M8088N5746N9311Q3891O9608P3247P3249
3369C701969L6846L8365M6148M2991N2604L3350N0014Q1908R8376J39667J89879
3358D512117J66959J40772J31805J21102J32537J46329J23114J14030J07542J34325
3348E830632J41743J47704J31568J49025J43202J44982J67068J54357J53849J32914
3338G297044J45179J44540J67100J73293J84735J96559K02677K06140K14526K12764
3328I144557K06440K29468K42951K38925K49542K42472K56488K68448K60223K45865
$$ plain form
3318 11585379 11867658 12162837 12450298 12757647 13090974 13431566 13783128 14102179 14442350
3309 14442350 14800501 15187987 15601811 16043276 16522191 17009809 17487270 17991234 18534107
3300 18534107 19094770 19714071 20368565 21080288 21869757 22701412 23595348 24596964 25739191
3291 25739191 26991657 28326318 29768731 31406135 33252312 35407429 38026579 41179085
3283 41179085 44792674 48795280 53093381 57926884 63628459 70036221 76788400 84146627
3275 84146627 93271924 104035434 114120147 120890638 122366006 115417027 100283027 83699629
3267 83699629 70909370 62083308 55907601 51374247 47909881 45158291 43018583 41340818
3259 41340818 40065419 39104617 38436876 37991801 37751975 37718551 37896353 38344094 39045396
$$ packed form
3318A1585379K82279K95179K87461L07349L33327L40592L51562L19051L40171
3309A4442350L58151L87486M13824M41465M78915M87618M77461N03964N42873
3300A8534107N60663O19301O54494P11723P89469Q31655Q93936J001616J142227
3291B5739191J252466J334661J442413J637404J846177K155117K619150L152506
3283D1179085L613589M002606M298101M833503N701575O407762O752179P358227
3275H4146627R125297J0763510J0084713O770491J475368o948979j5134000j6583398
3267H3699629j2790259q826062o175707m533354l464366k751590k139708j677765
3259D1340818j275399r60802o67741m45075k39826l3424J77802M47741P01302
$$ plain form
3250 39045396 39986891 41117891 42440774 43907627 45541447 47336252 49306767 51497561
3242 51497561 53940292 56655761 59536446 62310492 64537759 65634563 65117295 63050442
3234 63050442 60206051 57600555 55766399 54704169 54228474 54171579 54407761 54879400 55576381
3225 55576381 56483017 57677988 59126810 60882933 62957525 65310247 67919217 70845189
3217 70845189 74134189 77870919 82105597 86895245 92276318 98313865 104992356 112368235
3209 112368235 120492768 129338464 138847307 148941677 159443880 169874544 179469272 187413996
3201 187413996 193110822 196433931 198220060 200082928 203568674 209880180 219721730 232828180
3193 232828180 248431388 266722971 288191534 310598398 328123393 333414485 319394984
$$ packed form
3250C9045396R41495J131000J322883J466853J633820J794805J970515K190794
3242E1497561K442731K715469K880685K774046K227267J096804n17268k066853
3234F3050442k844391k605496j834156j062230m75695n6895K36182M71639O96981
3225E5576381R06636J194971J448822J756123K074592K352722K608970K925972
3217G0845189L289000L736730M234678M789648N381073O037547O678491P375879
3209A12368235Q124533Q845696R508843J0094370J0502203J0430664R594728P944724
3201A87413996N696826L323109J786129J862868L485746O311506R841550J3106450
3193B32828180J5603208J8291583K1468563K2406864J7524995N291092j4019501
$$ plain form
3186 319394984 285994234 244640926 207074059 177184801 154089754 135918728 121240712
3179 121240712 109081891 98860896 90180137 82685538 76187714 70499438 65418251 60869835
3171 60869835 56815103 53246694 50176902 47545370 45219311 43103913 41143126 39301414
3163 39301414 37582648 35968447 34502533 33142515 31901296 30801579 29812836 28934607
3155 28934607 28137131 27350335 26523238 25590356 24511363 23301101 22107495 21042833 20122496
3146 20122496 19342424 18633767 18008845 17469827 16942287 16399321 15884401 15410606 14978637
3137 14978637 14600014 14264039 13977617 13739514 13541845 13373870 13254668 13178060 13125473 13126929
3127 13126929 13142005 13190678 13301739 13519621 13773513 13943295 13957903 13709175 13010477 12039391
$$ packed form
3186C19394984l3400750m1353308l7566867k9889258k3095047j8171026j4678016
3179A21240712j2158821j0220995q680759p494599o497824n688276n081187m548416
3171F0869835m054732l568409l069792k631532k326059k115398j960787j841712
3163C9301414j718766j614201j465914j360018j241219j099717r88743q78229
3155B8934607p97476p86796q27097r32882j078993j210262j193606j064662r20337
3146B0122496p80072p08657o24922n39018n27540n42966n14920m73795m31969
3137A4978637l78623l35975k86422k38103j97669j67975j19202p6608n2587J456
3127A3126929J5076M8673J11061K17882K53892J69782J4608k48728o98698r71086
$$ plain form
3117 12039391 11145940 10421773 9820750 9352583 8991865 8689751 8422996 8202299 7984098
3108 7984098 7805964 7621530 7463005 7371768 7284208 7204149 7150033 7130360 7102551 7065365 7032528
3097 7032528 7010869 6983211 6950689 6966562 7031145 7140624 7253659 7299349 7262200 7075203 6710669
3086 6710669 6238605 5817729 5465716 5188435 4949781 4730724 4542039 4391367 4263816 4157672
3076 4157672 4084299 3995882 3896232 3818255 3757688 3688479 3647834 3597851 3567569 3534119 3500100
3065 3500100 3456883 3422318 3403672 3384055 3368848 3316046 3296256 3280368 3275965 3259571 3247460 3243343
3053 3243343 3246090 3227688 3198235 3146247 3071095 2996472 2917742 2851697 2789352 2734509 2707753 2679632
3041 2679632 2652472 2641939 2611239 2598187 2592293 2579118 2573935 2570934 2555688 2527344 2516932 2514790
$$ packed form
3117A2039391q93451p24167o01023m68167l60718l02114k66755k20697k18201
3108G984098j78134j84434j58525r1237q7560q0059n4116j9673k7809l7186l2837
3097G032528k1659k7658l2522J5873O4583J09479J13035M5690l7149j86997l64534
3086F710669m72064m20876l52013k77281k38654k19057j88685j50672j27551j06144
3076D157672p3373q8417r9650p7977o0567o9209m0645m9983l0282l3450l4019
3065C500100m3217l4565j8646j9617j5207n2802j9790j5888m403j6394j2111m117
3053C243343K747j8402k9453n1988p5152p4623p8730o6045o2345n4843k6756k8121
3041B679632k7160j0533l0700j3052n894j3175n183l001j5246k8344j0412k142
$$ plain form
3029 2514790 2476333 2463983 2443378 2403860 2367841 2329999 2314949 2282456 2261227 2256916 2244679 2251890
3017 2251890 2251952 2265427 2279066 2280117 2216620 2129810 2053847 1997935 1956606 1921672 1907353 1886968
3005 1886968 1858737 1829555 1840916 1842896 1834497 1817068 1827602 1816321 1800053 1794632 1802597 1810672
2993 1810672 1801916 1805720 1802789 1810519 1796405 1797428 1795310 1816657 1824507 1811631 1814776 1794053 1753962
2980 1753962 1698963 1649535 1601336 1574883 1548589 1511857 1484126 1441284 1403218 1379433 1345474
2969 1345474 1332430 1316547 1297490 1270620 1253652 1221801 1203914 1200330 1176625 1171192 1186797 1177890
2957 1177890 1171190 1166765 1182844 1184132 1183993 1185541 1167723 1175760 1174316 1170214 1154725 1124475 1096260
2944 1096260 1075807 1064449 1066066 1057066 1062151 1070693 1061547 1063884 1053243 1057099 1053578 1052324 1062359
$$ packed form
3029B514790l8457j2350k0605l9518l6019l7842j5050l2493k1229m311j2237P211
3017B251890O2J3475J3639J051o3497q6810p5963n5912m1329l4934j4319k0385
3005A886968k8231k9182J1361J980q399j7429J0534j1281j6268n421P965Q075
2993A810672q756L804k931P730j4114J023k118K1347P850j2876L145k0723m0091
2980A753962n4999m9428m8199k6453k6294l6732k7731m2842l8066k3785l3959
2969A345474j3044j5883j9057k6870j6968l1851j7887l584k3705n433J5605q907
2957A177890o700m425J6079J288j39J548j7818Q037j444m102j5489l0250k8215
2944A096260k0453j1358J617r000N085Q542r146K337j0641L856l521j254J0035
$$ plain form
2931 1062359 1068672 1074803 1089004 1112391 1145067 1174850 1200834 1222435 1254427 1303158 1337019 1382992
2919 1382992 1411325 1469406 1514163 1562339 1621215 1669125 1693777 1719510 1743296 1758025 1791894
2908 1791894 1834100 1876246 1926470 1969754 2030890 2095060 2132793 2158661 2157399 2096097 1980640
2897 1980640 1864665 1735080 1593364 1455937 1341194 1250283 1162670 1079022 1027213 996238
2887 996238 948036 905823 869703 836060 802980 775606 743019 719261 697005 675525 650804 631287
2875 631287 643155 630299 609857 593993 582736 573495 553141 545311 541768 540518 527935 524258 545422
2862 545422 515713 505731 511550 491014 497758 497670 478982 495250 504124 493884 501916 506970 493896
2849 493896 492158 490813 484515 474571 462222 456471 455551 440193 429571 421454 418162 409830 385000 405876
$$ packed form
2931A062359O313O131J4201K3387L2676K9783K5984K1601L1992M8731L3861M5973
2919A382992K8333N8081M4757M8176N8876M7910K4652K5733K3786J4729L3869
2908A791894M2206M2146N0224M3284O1136O4170L7733K5868j262o1302j15457
2897A980640j15975j29585j41716j37427j14743r0911q7613q3648n1809l0975
2887I96238m8202m2213l6120l3643l3080k7374l2587k3758k2256k1480k4721j9517
2875F31287J1868j2856k0442j5864j1257r241k0354p830l543j250j2583l677K1164
2862E45422k9709r982N819k0536O744q8j8688J6268Q874j0240Q032N054j3074
2849D93896j738j345o298r944j2349n751r20j5358j0622q117l292q332k4830K0876
$$ plain form
2835 405876 398046 379659 381791 386668 374181 355671 354141 355704 331948 334844 339744 340086 319376
2822 319376 297139 291731 286608 300025 304522 289424 284411 280582 256088 248378 268582 259747 242498
2809 242498 253009 250466 260524 266208 259662 263389 267732 260341 264717 248809 250919 245390 243983 231554
2795 231554 226008 226357 214394 223321 225728 232980 209329 216615 226304 223943 230791 220320 202036 207301
2781 207301 218295 219184 201893 198696 216459 224301 215111 196675 195783 185855 172442 165124 173017 183440
2767 183440 179929 177877 182977 183933 204668 194332 177255 180332 188516 186913 198143 194287 191616 185925
2753 185925 196412 191178 181101 183698 189336 185129 186134 189945 177520 165870 165760 170407 182233
2740 182233 184186 200762 209432 198413 205117 209029 196974 177703 167266 168181 173908 160846 155599
$$ packed form
2835D05876p830j8387K132M877j2487j8510j530J563k3756K896M900L42k0710
2822C19376k2237n408n123J3417M497j5098n013l829k4494p710K0204q835j7249
2809B42498J0511k543J0058N684o546L727M343p391M376j5908K110n529j407j2429
2795B31554n546L49j1963Q927K407P252k3651P286R689k361O848j0471j8284N265
2781B07301J0994Q89j7291l197J7763P842r190j8436q92r928j3413p318P893J0423
2767A83440l511k052N100R56K0735j0336j7077L077Q184j603J1230l856k671n691
2753A85925J0487n234j0077K597N638m207J005L811j2425j1650j10M647J1826
2740A82233J953J6576Q670j1019O704L912j2055j9271j0437R15N727j3062n247
$$ plain form
2727 155599 145260 150247 156735 172042 177643 178267 158765 147105 151804 137228 120462 125828 123506
2714 123506 131404 126206 102801 95075 105352 109538 112140 111890 116187 113889 112149 104599 93775 100986
2700 100986 96702 93489 81701 103168 114958 102289 89398 94845 91616 91421 98797 91932 99931
2687 99931 86359 88957 71892 59804 82185 85624 94923 106121 85321 87631 79845 67486 79815
2674 79815 80824 91422 97737 97794 91628 106498 97608 75526 80091 81532 81704 85059 108670 115824
2660 115824 99251 106956 102247 94403 86434 71513 75039 55369 67910 71771 67365 73641 70573
2647 70573 79946 54921 33333 28318 47780 67140 70926 55964 51176 42248 44934 48686 28266
2634 28266 35356 42427 38767 34534 48448 44901 41195 51839 61524 52979 62132 77858 84746 65485
$$ packed form
2727A55599j0339M987O488J5307N601O24j9502j1660M699j4576j6766N366k322
2714A23506P898n198k3405p726J0277M186K602k50M297k298j740p550j0824P211
2700A00986m284l213j1788K1467J1790j2669j2891N447l229j95P376o865P999
2687I9931j3572K598j7065j2088K2381L439R299J1198k0800K310p786j2359J2329
2674G9815J009J0598O315N7o166J4870q890k2082M565J441J72L355K3611P154
2660A15824j6573P705m709p844p969j4921L526j9670J2541L861m406O276l068
2647G0573R373k5025k1588n015J9462J9360L786j4962m788q928K686L752k0420
2634B8266P090P071l660m233J3914l547l706J0644R685q545R153J5726O888j9261
$$ plain form
2620 65485 69634 69412 66819 49805 38702 54218 54680 55287 36892 33834 39905 51726 47314 31820
2606 31820 39532 33818 37265 33386 29173 32245 29724 35246 44066 29091 22088 27062 34618 36612
2592 36612 30729 33872 42937 55753 65972 59895 50222 54590 34021 35818 39987 47618 52365 58480
2578 58480 39573 27345 28006 22499 28069 25033 22002 25598 23939 19583 19232 27183 34685 23524
2564 23524 3078 22779 19482 28296 28244 21719 12495 2560 7083 11159 13058 16793 23570 30108 40450
2549 40450 27092 20906 29569 27439 30455 36209 36677 24694 33127 27610 21318 28083 31360 47013
2535 47013 50175 45013 32667 15471 14591 22407 25077 31450 32735 32670 26654 30506 28151 20369 23165
2520 23165 18872 14639 7038 5615 13785 7958 6478 32263 15267 -15630 5228 -573 6236 11634
$$ packed form
2620F5485M149k22k593j7014j1103J5516M62O07j8395l058O071J1821m412j5494
2606C1820P712n714L447l879m213L072k521N522Q820j4975p003M974P556J994
2592C6612n883L143R065J2816J0219o077r673M368k0569J797M169P631M747O115
2578E8480j8907j2228O61n507N570l036l031L596j659m356l51P951P502j1161
2564B3524k0446J9701l297Q814n2o525r224r935M523M076J899L735O777O538J0342
2549D0450j3358o186Q663k130L016N754M68j1983Q433n517o292O765L277J5653
2535D7013L162n162j2346j7196q80P816K670O373J285o5o016L852k355p782K796
2520B3165m293m233p601j423Q170n827j480K5785j6996l0897K0858n801O809N398
$$ plain form
2506 11634 -5909 -747 1981 1995 22979 23781 22406 20126 18508 15043 13207 17382 128 15875
2492 15875 8692 -11125 -3950 -1092 -26410 -10022 12535 8810 8886 1253 -2225 2685 -1315 -10984
2478 -10984 27521 21049 6675 16636 3050 -8559 666 3771 5459 8538 7722 7643 -1774 -4274
2464 -4274 7735 -2273 7558 18739 2947 13752 21381 6262 6567 18398 14580 17989 16326
2451 16326 10433 5669 -5744 -10020 -12979 -304 -5273 753 3006 9239 -5784 -6258 9300 6364
2437 6364 -19609 -21801 -10172 4289 11018 2347 -6718 -2786 -12212 -21205 -27862 -18870 -7245 -20034
2423 -20034 -22525 -24261 -2117 11327 11806 5964 19679 22635 14590 21043 16340 6087 -1036 -17626
2409 -17626 -9697 7702 4124 -266 -5359 -7512 -7352 -6799 -5405 -10748 -21563 -24111 -11706 -5937
$$ packed form
2506A1634j7543N162K728J4K0984Q02j375k280j618l465j836M175j7254J5747
2492A5875p183j9817P175K858k5318J6388K2557l725P6p633l478M910m000r669
2478a0984L8505o472j4374R961j3586j1609R225L105J688L079q16p9r417k500
2464d274J2009j0008R831J1181j5792J0805P629j5119L05J1831l818L409j663
2451A6326n893m764j1413m276k959J2675m969O026K253O233j5023m74J5558k936
2437F364k5973k192J1629J4461O729q671r065L932r426q993o657Q992J1625j2789
2423b0034k491j736K2144J3444M79n842J3715K956q045O453m703j0253p123j6590
2409a7626P929J7399l578m390n093k153J60N53J394n343j0815k548J2405N769
$$ plain form
2395 -5937 13136 -7122 -4388 10150 818 -16785 -28960 -2480 -3659 -10884 8413 -5391 -11364
2382 -11364 -9379 -8315 -10417 -6429 2467 -21590 -21327 -12239 10263 -957 -1732 -1739 5330 -2746 -19156
2367 -19156 5040 2636 -2856 -1697 -11504 -4799 2900 -17753 -5148 -13345 -11743 -1980 -7371 -20125
2353 -20125 -13090 -31630 -37358 -31537 -31294 -26622 -24942 -10070 2539 11010 7439 12045 5858 -1449
2339 -1449 -5345 701 7359 -10715 -21722 -1301 3103 -10174 213 -9602 -3314 -11843 -5104 9444
2325 9444 6024 9010 21378 32758 26247 17387 13370 5106 9018 121 2070 6249 9652 16695
2311 16695 12150 17822 -6968 -5959 3428 -5338 -13257 -16803 -13647 -4941 13742 216 -24448 -18247
2297 -18247 -4509 -7320 -12003 -22481 -28830 -23938 -28940 -23220 -22453 -18283 -25313 -35272 -43372 -29918
$$ packed form
2395e937J9073k0258K734J4538r332j7603j2175K6480j179p225J9297j3804n973
2382a1364J985J064k102L988Q896k4057K63R088K2502j1220p75pP069q076j6410
2367a9156K4196k404n492J159r807O705P699k0653J2605q197J602R763n391j2754
2353b0125P035j8540n728N821K43M672J680J4872J2609Q471l571M606o187p307
2339a449l896O046O658j8074j1007K0421M404j3277J0387r815O288q529O739J4548
2325I444l420K986J2368J1380o511q860m017q264L912q897J949M179L403P043
2311A6695m545N672k4790J009R387q766p919l546L156Q706J8683j3526k4664O201
2297a8247J3738k811m683j0478o349M892n002N720P67M170p030r959q100J3454
$$ plain form
2283 -29918 -21477 -33183 -24145 -11031 -12122 -18760 -25192 -5885 -7285 -15635 -23083 -18917 -21151 -11333
2269 -11333 -19790 -16511 -482 -13493 -27706 -28132 -21980 6496 6992 -1176 -4462 -1637 7422 11084
2255 11084 -4969 -15936 -12050 -13468 -10360 -26836 -11671 -6047 7029 4551 9762 17420 7590
2242 7590 -3355 -10193 -10174 -3949 -24320 -20843 -12654 -2863 -7634 -10892 -14544 -34300 -13750 -8545
2228 -8545 -5296 -4015 -14700 -22342 -28744 -26283 -9625 -19425 -12150 -18235 -26417 -17638 -14893 -16883
2214 -16883 2017 1737 -9970 -10503 -2116 -9072 -7092 14162 -360 2102 17544 -1667 -2154 9709
2200 9709 -5097 -6711 -1945 9260 5342 10034 27692 18820 11230 -363 -17072 9428 6801
2187 6801 6922 22011 1716 2268 12080 14240 14578 4386 4117 20733 33631 26217 32468 16445
$$ packed form
2283b9918Q441j1706R038J3114j091o638o432J9307j400q350p448M166k234R818
2269a1333q457L279J6029j3011j4213m26O152K8476M96q168l286K825R059L662
2255A1084j6053j0967L886j418L108j6476J5165N624J3076k478N211P658r830
2242G590j0945o838J9O225k0371L477Q189R791m771l258l652j9756K0550N205
2228h545L249J281j0685p642o402K461J6658r800P275o085q182Q779K745j990
2214a6883J8900k80j1707n33Q387o956J980K1254j4522K462J5442j9211m87J1863
2200I709j4806j614M766J1205l918M692J7658q872p590j1593j6709K6500k627
2187F801J21J5089k0295N52R812K160L38j0192k69J6616J2898p414O251j6023
$$ plain form
2173 16445 21284 26961 15386 30509 38655 39859 38310 37170 24133 27921 40520 37944 14211
2160 14211 19777 18687 34371 39456 38152 37442 35459 20903 18182 32971 45058 50400 43916 47903
2146 47903 59849 46705 50233 56805 47058 58630 62041 76713 67412 64959 69658 78872 92341
2133 92341 95361 66816 66202 62520 70704 66005 66866 73030 92580 96594 71724 83107 93840 94722
2119 94722 90339 93892 111754 116128 118268 111755 135096 130294 137333 126410 116896 134920 156152
2106 156152 178358 162144 163283 186931 203170 195641 196082 190746 200972 218860 233205 235305 250504
2093 250504 266891 275135 282553 294768 291884 286449 287974 298222 318198 326351 345686 375290 397981
2080 397981 404450 407968 428432 448618 477144 506461 539839 568576 612794 669154 728851 784888
$$ packed form
2173A6445M839N677j1575J5123Q146J204j549j140j3037L788J2599k576k3733
2160A4211N566j090J5684N085j304p10j983j4556k721J4789J2087N342o484L987
2146D7903J1946j3144L528O572r747J1572L411J4672r301k453M699R214J3469
2133I2341L020k8545o14l682Q184m699Q61O164J9550M014k4870J1383J0733Q82
2119I4722m383L553J7862M374K140o513K3341m802P039j0923r514J8024K1232
2106A56152K2206j6214J139K3648J6239p529M41n336J0226J7888J4345K100J5199
2093B50504J6387Q244P418J2215k884n435J525J0248J9976Q153J9335K9604K2691
2080C97981O469L518K0464K0186K8526K9317L3378K8737M4218N6360N9697N6037
$$ plain form
2068 784888 845580 910201 961198 1026090 1127299 1258232 1408085 1609823 1821304 2136435
2058 2136435 2535206 2909591 3292800 3897591 4574893 5135398 4913394 3717773 2628850
2049 2628850 1997491 1646008 1385118 1169036 1019331 892539 777126 722762 681894 640226
2039 640226 596142 578257 557044 494260 440474 396942 358142 347362 326038 304897 290669 274683
2027 274683 257524 240275 227076 216094 210215 202633 190654 190848 169071 168864 167749 143164 132792
2014 132792 122267 99953 99922 109280 94315 102529 115757 106531 90156 79392 70046 79953 75777
2001 75777 60431 71795 77945 73535 59412 61046 82635 72365 59466 63241 49107 41937 49521
1988 49521 63055 61542 47172 36252 29246 38526 34074 30231 34551 27799 15939 23432 19271 34114
$$ packed form
2068G84888O0692O4621N0997O4892J01209J30933J49853K01738K11481L15131
2058B136435L98771L74385L83209O04791O77302N60505k22004j195621j088923
2049B628850o31359l51483k60890k16082j49705j26792j15413n4364m0868m1668
2039F40226m4084j7885k1213o2784n3786m3532l8800j0780k1324k1141j4228j5986
2027B74683j7159j7249j3199j0982n879p582j1979J94k1777k07j115k4585j0372
2014A32792j0525k2314l1R358j4965Q214J3228r226j6375j0764r346R907m176
2001G5777j5346J1364O150m410j4123J634K1589j0270j2899L775j4134p170P584
1988D9521J3534j513j4370j0920p006R280m452l843M320o752j1860P493m161J4843
$$ plain form
1974 34114 42372 24429 25111 30570 40660 29745 19549 22253 33444 20578 15530 9206 3743
1961 3743 10703 2527 13265 23617 39602 29483 33847 29881 11750 6060 10560 25318 24335 22290
1947 22290 21812 9629 3225 4365 -11543 -13204 -7703 -5163 -6843 -12366 -3392 7424 1084 9170
1933 9170 -6474 -13914 -1919 -10041 -12302 -13807 -468 -12611 -13289 -2000 -21294 -36232 -30633
1920 -30633 -27085 -24290 -15318 -7463 -21445 -33159 -18912 1533 7035 5749 3116 7534 10049 1348
1906 1348 -20081 -13314 -7901 -10054 -13850 -22715 -27594 -15587 -17255 -14248 -5727 1343 -9432 -24430
1892 -24430 -11429 -13862 -20559 -29483 -29673 -32306 -25034 -10465 5189 16995 1221 -4127 -8362 -8590
1878 -8590 -16661 -21635 -8561 -12586 -18444 -416 1981 194 6994 -6294 -3516 -5003 -23807 -11485
$$ packed form
1974C4114Q258j7943O82N459J0090j0915j0196K704J1191j2866n048o324n463
1961C743O960q176J0738J0352J5985j0119M364l966j8131n690M500J4758r83k045
1947B2290m78j2183o404J140j5908j661N501K540j680n523Q974J0816o340Q086
1933I170j5644p440J1995q122k261j505J3339j2143o78J1289j9294j4938N599
1920c0633L548K795Q972P855j3982j1714J4247K0445N502j286k633M418K515q701
1906A348k1429O767N413k153l796q865m879J2007j668L007Q521P070j0775j4998
1892b4430J3001k433o697q924j90k633P272J4569J5654J1806j5774n348m235k28
1878h590q071m974J3074m025n858J8028K397j787O800j3288K778j487j8804J2322
$$ plain form
1864 -11485 -5723 -440 -1994 -7985 -11602 -26455 -21797 -21885 -26468 -33197 -21430 -16665 -14761 -9577 -10975
1849 -10975 -8082 -29410 -21129 -14701 -12577 -17233 -29049 -17926 -14710 -21188 -14378 -12745 -20672 -12651
1835 -12651 -17452 -6823 -4371 420 -6516 -4275 -8158 240 -12952 -17991 -7948 -27365 -25729 -20157
1821 -20157 -19744 -21517 -19120 -29160 -19404 -10360 -16004 -5058 -23092 -9575 -1199 -5043 -19738 -11283
1807 -11283 -4860 -6021 -8675 -25855 -22955 -10711 -9502 -6911 -20365 -21065 -19805 -12675 -4230 -8515
1793 -8515 -4369 -18658 -4346 -11440 -4058 6470 -2322 -4980 1913 10800 12961 7967 -10282 -1568
1779 -1568 8196 -139 636 -23616 -32009 -17035 -15840 -26622 -20386 -21337 -27188 -23421 -13410 -7907
1765 -7907 -32385 -29103 -29538 -15303 -27834 -11522 -4481 -19947 -21269 -10138 -14181 -15426 -971
$$ packed form
1864a1485N762N283j554n991l617j4853M658q8m583o729J1767M765J904N184j398
1849a0975K893k1328Q281O428K124m656j1816J1123L216o478O810J633p927Q021
1835a2651m801J0629K452M791o936K241l883Q398j3192n039J0043j9417J636N572
1821b0157M13j773K397j0040R756R044n644J0946j8034J3517Q376l844j4695Q455
1807a1283O423j161k654j7180K900J2244J209K591j3454p00J260P130Q445m285
1793h515M146j4289J4312p094P382J0528q792k658O893Q887K161m994j8249Q714
1779a568R764q335P75k4252q393J4974J195j0782O236r51n851L767J0011N503
1765g907k4478L282m35J4235j2531J6312P041j5466j322J1131m043j245J4455
$$ plain form
1752 -971 -16843 -9350 -11071 -16214 -8779 -16188 -13366 -8228 -11964 8679 -249 3200 -2967 -7926 943
1737 943 -11149 -29583 -29860 -21109 -12960 -14836 -10656 -20177 -30851 -25226 -16083 -16668 -29815 -23292 -20333
1722 -20333 -26614 -27949 -31207 -23484 -26634 -26470 -7247 2904 -3308 -31055 -48464 -31667 -28788 -24072
1708 -24072 -26470 -26598 -18731 -29179 -37560 -35108 -31639 -24184 -25478 -27246 -26041 -33767 -26923 -17057 -18580
1693 -18580 -16151 -6997 -15313 -20576 -31182 -37120 -21077 -28356 -46464 -36579 -27176 -43694 -26258
1680 -26258 -26358 -31997 -33856 -16107 -7391 -13884 -30195 -26180 -38117 -27574 -23884 -25640 -23354 -31192
1666 -31192 -13982 -24083 -20763 -20658 -22812 -24798 -29556 -19457 -19623 -25717 -29423 -12668 -11780 -24813
1652 -24813 -37829 -11366 445 -4413 -4388 -12340 6160 629 8309 -14027 -9770 -13442 -5105 -8929
$$ packed form
1752i71j5872P493j721n143P435p409K822N138l736K0643q928L449o167m959Q869
1737I43j2092j8434k77Q751Q149j876M180r521j0674N625R143n85j3147O523K959
1722b0333o281j335l258P723l150J64J9223J0151o212k7747j7409J6797K879M716
1708b4072k398j28P867j0448q381K452L469P455j294j768J205p726O844R866j523
1693a8580K429R154q316n263j0606n938J6043p279j8108R885R403j6518J7436
1680b6258j00n639j859J7749Q716o493j6311M015j1937J0543L690j756K286p838
1666c1192J7210j0101L320J05k154j986m758J0099j66o094l706J6755Q88j3033
1652b4813j3016K6463J1811m858K5p952J8500n531P680k2336M257l672Q337l824
$$ plain form
1638 -8929 -9096 1562 -12693 -11022 -14533 -27878 -26407 -23685 -21728 -13185 -16048 -26202 -19231 -21522
1624 -21522 -12198 -15390 -15159 -17701 -10292 -30097 -46828 -50192 -38198 -39977 -41777 -35129 -36918 -17773
1610 -17773 -4561 -14903 -51532 -46840 -18318 -13492 -25318 -39047 -28472 -10644 -12173 -18646 -22797
1597 -22797 -16191 -11678 -16676 -26126 -29016 -10665 -11487 -1596 14067 -3798 -14999 -15050 -21267 -25266
1583 -25266 -25626 -15691 -20373 -34904 -23568 -30300 -25821 -24507 -34124 -27680 -28502 -31433 -33268 -33543 -27363
1568 -27363 -23806 5867 11148 -12024 -10974 -11114 -23474 -19551 -21266 -17585 -18491 -7709 -11544 -20125
1554 -20125 -19449 -28538 -17665 -18492 -13584 -5189 -11286 -10755 -18011 -14768 -20027 -17584 126 -7315 -16789
1539 -16789 -12969 -26456 -22732 -16224 -11017 -29541 -22799 -15574 -14106 -15550 -14313 -13375 -8415 -14147
$$ packed form
1638h929j67J0658j4255J671l511j3345J471K722J957Q543k863j0154O971k291
1624b1522R324l192K31k542P409j9805j6731l364J1994j779j800O648j789J9145
1610a7773J3212j0342l6629M692K8522M826j1826j3729J0575J7828j529o473m151
1597b2797O606M513m998r450k890J8351q22R891J5663j7865j1201n1o217l999
1583b5266l60R935m682j4531J1336o732M479J314r617O444q22k931j835k75O180
1568b7363L557K9673N281k3172J050j40j2360L923j715L681r06J0782l835q581
1554b0125O76r089J0873q27M908Q395o097N31p256L243n259K443J7710p441r474
1539a6789L820j3487L724O508N207j8524O742P225J468j444J237R38M960n732
$$ plain form
1525 -14147 -33454 -33994 -36046 -21741 -29793 -21745 -18845 -18606 -17251 -4871 -11675 -25638 -13667 -17179
1511 -17179 -27272 -19816 -14756 -17867 -9892 -11759 -15166 -13282 -1272 -12758 -21720 -25862 -24718 -5574
1497 -5574 8252 4093 -9894 2761 -3069 -4712 1826 3788 2760 3809 -13633 -9535 -20632 -5016
1483 -5016 -10299 -18478 -12579 -15922 -19961 -4840 3462 -8680 -11101 -5845 -32893 -47933 -20856 -13137
1469 -13137 -1268 -644 -7049 -29319 -39282 -34320 -44079 -20625 -5085 -27956 -31628 -44469 -33439
1456 -33439 -32657 -30343 -22844 -15011 -8307 -18306 -19969 -5542 -5269 -7438 -13455 -5936 -19763 -22684 -8292
1441 -8292 -2484 -5600 -5669 -24361 -28465 -27957 -33457 -20240 -17041 -17844 -9514 -17173 -26912 -14026 -30705
1426 -30705 -21410 -14872 -28766 -16177 -10616 -10883 -28585 -31944 -13384 -1327 -14006 -16015 -6046
$$ packed form
1525a4147j9307n40k052J4305q052Q048K900K39J355J2380o804j3963J1971l512
1511a7179j0093P456N060l111P975j867l407J884J2010j1486q962m142J144J9144
1497e574J3826m159j3987J2655n830j643O538J962j028J049j7442M098j1097J5616
1483e016n283q179N899l343m039J5121Q302j2142k421N256k7048j5040K7077P719
1469a3137J1869O24o405k2270r963M962r759K3454J5540k2871l672j2841J1030
1456c3439P82K314P499P833O704r999j663J4427K73k169o017P519j3827k921J4392
1441h292N808l116o9j8692m104N08n500J3217L199q03Q330p659r739J2886j6679
1426c0705R295O538j3894J2589N561k67j7702l359J8560J2057j2679k009R969
$$ plain form
1413 -6046 -318 -8571 3470 8211 -9670 -2551 -11544 -1957 -9571 -28742 -19743 -12655 -7409 -21512
1399 -21512 -22819 -18394 -13705 -13904 -19275 -31888 -21044 -17185 -15896 8101 15859 8738 -9812 10218
1385 10218 -657 -18904 -31459 -16284 -21054 -28361 -24523 -37045 -45224 -29422 -23346 -11878 9675
1372 9675 262 -19735 -24987 -14530 -6931 -10923 -13171 -14063 -22579 -21161 -17297 -3702 -115 -17245
1358 -17245 -8759 1996 -10203 -21552 -18640 -5890 -21170 -15189 -13117 -12532 2776 -460 -3002
1345 -3002 -5216 -17148 -16620 -13933 -9250 -386 8975 712 -16384 -10440 -8462 -20672 -17333 -19618
1331 -19618 -28267 -17160 -14156 -17746 -17047 -9728 -14100 -17932 -24932 -20108 -24738 -12441 -13894 -11603
1317 -11603 -9953 -4525 -10671 -13 -1294 -8892 -15050 -18442 -4867 -16297 -19803 -17653 -8040 -21268
$$ packed form
1413f046N728q253J2041M741j7881P119q993R587p614j9171Q999P088N246j4103
1399b1512j307M425M689j99n371j2613J0844L859J289K3997P758p121j8550K0030
1385A0218j0875j8247j2555J5175m770p307L838j2522q179J5802O076J1468K1553
1372I675r413j9997n252J0457P599l992k248q92q516J418L864J3595L587j7130
1358a7245Q486J0755j2199j1349K912J2750j5280N981K072N85J5308l236k542
1345c002k214j1932N28K687M683Q864R361q263j7096N944J978j2210L339k285
1331a9618q649J1107L004l590O99P319m372l832p000M824m630J2297j453K291
1317a1603J650N428o146J0658j281p598o158l392J3575j1430l506K150R613j3228
$$ plain form
1303 -21268 -32398 -21080 -32814 -15469 -3475 -23061 -22884 -15319 -10536 -18898 -14762 -7511 -9303
1290 -9303 -27752 -20162 -22110 -26708 -10513 -13900 -12333 -10318 -3572 632 -10242 -4145 -7645 -3760
1276 -3760 3293 -2919 -11893 -7443 -3260 -9227 -5008 -4370 -840 57 -21170 -11822 -8992 -21944 -17372
1261 -17372 -9130 -9054 -2234 810 -3208 -568 7434 8478 -4378 -14424 -27861 -14279 -1629 -13890
1247 -13890 -16562 -17263 -11709 -6046 -4976 -15992 -727 -6869 -21098 -35231 -18929 -10473 -10621 -24574
1233 -24574 -31649 -18400 -8619 -1832 4226 -12902 -33367 -23051 -20073 4325 1516 -9843 -23119
1220 -23119 -14916 -640 5281 3301 -20189 -23156 -8124 -636 -3787 -1446 3751 -8259 -18641
1207 -18641 -6483 -7565 -23012 -33802 -21456 -4050 -9070 -10541 -15486 -20147 -22179 -13416 -6272
$$ packed form
1303b1268j1130J1318j1734J7345J1994j9586J77P565M783q362M136P251j792
1290i303j8449P590j948m598J6195l387J567K015O746M204j0874O097l500L885
1276c760P053o212q974M450M183n967M219O38L530Q97k1227R348K830j2952M572
1261a7372Q242P6O820L044m018K640Q002J044j2856j0046j3437J3582J2650j2261
1247a3890k672p01N554N663J070j1016J5265o142j4229j4133J6302Q456j48j3953
1233b4574p075J3249R781O787O058j7128k0465J0316K978K4398k809j1359j3276
1220b3119Q203J4276N921j980k3490k967J5032P488l151K341N197j2010j0382
1207a8641J2158j082j5447j0790J2346J7406n020j471m945m661k032Q763P144
$$ plain form
1194 -6272 -20912 -4121 4206 -8049 -11679 -2413 -1716 13002 5427 4622 7858 -23161 -10873 3625
1180 3625 2810 -11784 -22535 -22433 -22397 -7766 3042 -11720 -8294 -17840 -8654 -14356 -15285 -26148 -29519
1165 -29519 -33077 -22838 -4737 -17332 -3129 -23905 -32049 -25110 -8910 -9644 -16215 -28886 -16949
1152 -16949 1185 6309 -1884 -5259 -15675 -28602 -19636 -16213 -8555 -17249 -1620 2661 -523 -10367
1138 -10367 1099 -6549 -9066 -1991 962 2497 -8981 -11365 -1401 -3192 -4260 -8446 -14597 -23594
1124 -23594 -20400 -10308 -329 -2039 -19616 -24196 -15517 -7569 4647 11068 -7062 -24147 -9869
1111 -9869 2112 7367 20118 24569 17565 16349 8922 -2158 -11128 -24926 -13210 -8258 -9956 -14249
1097 -14249 -16013 -30758 -36425 -22145 -4474 -274 3522 -2921 -18371 -15681 -5471 -578 1845
$$ packed form
1194f272j4640J6791Q327j2255l630R266O97J4718p575q05L236l1019J2288J4498
1180C625q15j4594j0751J02L6J4631J0808j4762L426r546R186n702r29j0863l371
1165b9519l558J0239J8101j2595J4203k0776q144O939J6200p34o571j2671J1937
1152a6949J8134N124q193l375j0416j2927Q966L423P658q694J5629M281l184r844
1138a0367J1466p648k517P075K953J535j1478k384R964j791j068m186o151q997
1124b3594L194J0092R979j710j7577m580Q679P948J2216O421j8130j7085J4278
1111i869J1981N255J2751M451p004j216p427j1080q970j3798J1716M952j698m293
1097a4249j764j4745n667J4280J7671M200L796o443j5450K690J0210M893K423
$$ plain form
1084 1845 1796 -11237 -16871 -18498 -9627 -3624 7779 -2313 3788 -6271 -6525 -847 2801 -6453 -11501
1069 -11501 4802 11662 7547 -3973 -5931 -5206 4159 490 7978 10940 1493 9433 4455 -517
1055 -517 -4000 1440 14165 327 8276 -707 9302 -4717 2963 -3306 -6976 -11459 -5238 -5633
1041 -5633 -7926 -527 -9166 -838 3763 -5944 -11419 227 9041 -1929 -603 893 1123 7083 8214
1026 8214 15706 -2453 -565 -24406 -31149 -17624 -18132 -29665 -13313 -3955 -15757 7124 13685
1013 13685 5352 -13245 -13340 -6965 -8547 -1682 -1720 -6532 3091 -4753 -8635 -23724 -22575 -12551 3375
998 3375 -10261 -10242 -8332 5720 2965 5783 -12582 -23508 -22698 -3938 9159 963 8478 -1417
984 -1417 8534 2292 -15047 -8812 11658 2779 7162 12510 -4106 -15286 -12309 -3118 8695 -2491
$$ packed form
1084A845m9j3033n634j627Q871O003J1403j0092O101j0059k54N678L648r254n048
1069a1501J6303O860m115j1520j958P25R365l669P488K962r447P940m978m972
1055e17l483N440J2725j3838P949q983J0009j4019P680o269l670m483O221l95
1041e633k293P399q639Q328M601r707n475J1646Q814j0970J326J496K30N960J131
1026H214P492j8159J888k3841o743J3525n08j1533J6352R358j1802K2881O561
1013A3685q333j8597r5O375j582O865l8m812R623p844l882j5089J149J0024J5926
998C375j3636J9J910J4052k755K818j8365j0926Q10J8760J3097q196P515r895
984a417R951o242j7339O235K0470q879M383N348j6616j1180K977R191J1813j1186
$$ plain form
970 -2491 -9032 -12299 -5646 -29178 -17411 -6320 -9923 -4627 -5754 3356 9312 11682 6542 -6940
956 -6940 -949 7703 5757 8652 -16297 -21122 -2964 -2714 -6507 -12558 -13389 -17018 -1780 129 -6153
941 -6153 -6921 -2464 -1263 -138 -8419 -6020 -8277 -4474 -5923 -932 -4111 538 6424 -6025 2461
926 2461 -2239 1991 -1126 5572 11502 -9756 -9325 5939 1634 6423 2463 -16963 -15059 5258
912 5258 7754 -16228 -13409 1062 5821 -18368 -2000 996 4984 3717 -12988 -6710 -3380 2577
898 2577 4993 13792 23126 5416 7264 7666 -1998 12103 12245 -3688 7512 -4051 -7844 -3837
884 -3837 -1625 -1140 3489 16597 19945 2809 -4939 13445 16274 8851 4044 10023 649 -6566 810
869 810 2876 27507 29502 10442 17711 3040 -4049 -10583 -7394 -7362 -744 -10183 11480 24656 1196
$$ packed form
970b491o541l267O653k3532J1767J1091l603N296j127R110N956K370n140j3482
956f940N991Q652j946K895k4949m825J8158K50l793o051q31l629J5238J909o282
941f153p68M457J201J125q281K399k257L803j449M991l179M649N886j2449Q486
926B461m700M230l117O698N930k1258M31J5264m305M789l960j9426J904K0317
912E258K496k3982K819J4471M759k4189J6368K996L988j267j6705O278L330N957
898B577K416Q799R334j7710J848M02r664J4101J42j5933J1200j1563l793M007
884c837K212M85M629J3108L348j7136p748J8384K829p423m807N979r374p215P376
869H10K066K4631J995j9060P269j4671p089o534L189L2O618r439K1663J3176k3460
$$ plain form
854 1196 9785 22118 2489 -2140 15692 32532 12310 -3241 -6004 1615 13061 12722 -6600
841 -6600 -12736 -1125 -5949 -10393 -5825 177 6656 706 -1345 -17674 -16498 -9423 3357 24751
827 24751 20729 4358 10168 6511 14819 20814 18020 7724 -4426 -7171 -10966 -2501 -10098 -11399
813 -11399 -16453 -5029 1559 -47 -1401 -10413 -403 3327 16037 21255 20524 19818 7943 5194
799 5194 6626 5325 -1555 -1596 -3476 -7757 15419 752 12667 3381 4355 9527 11371 5887 4022
784 4022 6566 12287 14429 15997 11206 8690 10460 3303 9418 2735 -7575 -20167 5016 10249
770 10249 77 2214 7419 -8855 3471 11573 7511 -5181 1605 1325 -5899 -5521 6264 465
756 465 648 7760 4840 -5223 6215 15713 12391 16248 16028 13415 17480 17037 10169 9321 13341 -1431
$$ packed form
854A196Q589J2333j9629m629J7832J6840k0222j5551k763P619J1446l39j9322
841f600o136J1611m824m444M568O002O479n950k051j6329J176P075J2780K1394
827B4751m022j6371N810l657Q308N995k794j0296j2150k745l795Q465p597j301
813a1399n054J1424O588j606j354r012J0010L730J2710N218p31p06j1875k749
799E194J432j301o880m1j880m281K3176j4667J1915r286R74N172J844n484j865
784D022K544N721K142J568m791k516J770p157O115o683j0310j2592K5183N233
770A0249j0172K137N205j6274J2326Q102m062j2692O786k80p224L78J1785n799
756D65J83P112k920j0063J1438R498l322L857k20k613M065m43o868q48M020j4772
$$ plain form
740 -1431 -12049 -5410 368 -10704 -1638 1408 -1490 8579 14778 18810 8665 91 -422 -7890
726 -7890 -11310 -7828 -3934 -3522 5223 -5736 14215 11983 -6314 -12193 -12403 -7678 -4728 15124 22390
711 22390 13318 7226 -842 -5750 -6204 -6007 -756 2850 -2168 135 -4283 -5132 6864 3742 4316 7937
695 7937 9208 9904 12595 9465 -16306 -3954 7131 15165 17541 1540 13207 12159 20356 13098
681 13098 8468 15232 11829 5469 25773 18720 13861 34574 21030 -1569 3976 2794 7861 -7653
667 -7653 6266 13975 5856 22733 23360 34791 32760 20195 15732 13062 28646 19774 20849 6231
653 6231 3433 14140 17687 33047 11288 8647 11726 13957 3126 20927 27230 14670 15202 17813
639 17813 20972 17996 19202 22165 18544 8418 9521 16712 23060 10998 5842 -10731 -4077 18962
$$ packed form
740a431j0618O639N778j1072R066L046k898J0069O199M032j0145q574n13p468
726g890l420L482L894M12Q745j0959J9951k232j8297n879k10M725K950J9852P266
711B2390r072o092q068m908m54J97N251L606n018K303m418q49J1996l122N74L621
695G937J271O96K691l130k5771J2352J1085Q034K376j6001J1667j048Q197p258
681A3098m630O764l403o360K0304p053m859K0713j3544k2599N545j182N067j5514
667g653J3919P709q119J6877O27J1431k031j2565m463k670J5584q872J075j4618
653F231k798J0707L547J5360k1759k641L079K231j0831J7801O303j2560N32K611
639A7813L159k976J206K963l621j0126J103P191O348j2062n156j6573O654K3039
$$ plain form
625 18962 4929 -2476 9183 675 -4914 10674 25434 11321 10801 2682 -2826 -13671 -2603
612 -2603 -12345 -19494 4338 18571 3989 -7224 2022 13153 17674 9435 4045 4963 3267 2562
598 2562 7056 5978 13240 1944 -288 7229 8530 3576 5840 11260 16269 11413 18740 19413 7937
583 7937 2641 4397 26899 10839 1742 18230 12094 15503 17136 -6763 10917 20134 4349 12849
569 12849 17611 31628 19634 24700 31843 17401 12217 5527 5909 302 -4393 4497 13751 14572 10894
554 10894 -739 9892 16966 16659 19947 27915 12229 -5718 16001 17432 14072 10557 10458 10787 7866
539 7866 8524 17852 6913 18176 23836 16475 25752 19955 21998 26343 18580 32984 27210 17020
525 17020 18277 29880 19456 10835 6667 10615 15738 11307 1515 -1812 2834 6012 7587 11450
$$ packed form
625A8962j4033p405J1659q508n589J5588J4760j4113n20q119n508j0845J1068
612b603r742p149K3832J4233j4582j1213R246J1131M521q239n390R18j696p05
598B562M494j078P262j1296k232P517J301m954K264N420N009m856P327O73j1476
583G937n296J756K2502j6060r097J6488o136L409J633k3899J7680R217j5785Q500
569A2849M762J4017j1994N066P143j4442n184o690L82n607m695Q890R254Q21l678
554A0894j1633J0631P074l07L288P968j5686j7947K1719J431l360l515r9L29k921
539G866O58R328j0939J1263N660p361R277n797K043M345p763J4404n774j0190
525A7020J257J1603j0424q621m168L948N123m431r792l327M646L178J575L863
$$ plain form
511 11450 3853 1926 1496 10319 18178 11048 12718 21096 11153 11954 27909 28507 25595 7907 5832
496 5832 6004 3744 5177 3012 4781 20418 19530 12323 17619 16833 13894 20111 25446 25886 9737 9086
480 9086 14984 30387 26477 37962 30656 28186 15729 -4448 -2465 7846 17652 17576 11337 15539
466 15539 25002 25680 16434 12676 14660 -961 11575 28246 41300 35986 25613 31865 12551 19648
452 19648 8566 -3662 19726 13293 23728 6436 21647 18888 21885 9097 15798 29385 7055
439 7055 3532 17003 1892 4001 8533 4075 26163 23106 22119 21465 25770 5833 19352 11261
425 11261 12406 37182 18324 19470 10202 7114 20923 31666 28023 7042 7938 18574 20082 17106
411 17106 22216 17442 20565 6727 17151 2725 -2405 9545 8677 24721 36352 31298 22173 635
$$ packed form
511A1450p597j927m30Q823P859p130J670Q378r943Q01J5955N98k912j7688k075
496E832J72k260J433k165J769J5637q88p207N296p86k939O217N335M40j6149o51
480I086N898J5403l910J1485p306k470j2457k0177J983J0311R806p6o239M202
466A5539R463O78r246l758J984j5621J2536J6671J3054n314j0373O252j9314P097
452A9648j1082j2228K3388o433J0435j7292J5211k759K997j2788O701J3587k2330
439G055l523J3471j5111K109M532m458K2088l057r87o54M305j9937J3519q091
425A1261J145K4776j8858J146r268l088J3809J0743l643k0981Q96J0636J508k976
411A7106N110m774L123j3838J0424j4426n130J1950q68J6044J1631n054r125k1538
$$ plain form
397 635 17555 30005 27243 18076 10097 30560 23766 35172 26039 20671 22834 21234 38804 36710
383 36710 32250 19051 33210 34953 15312 11321 21055 33416 28459 19334 17313 19214 18252 33622
369 33622 23131 26118 50211 46906 50043 43304 34638 13998 5585 32697 43669 36544 22906
356 22906 11408 7398 431 17393 17100 19864 12753 9835 7292 1473 21913 29453 31262 27449
342 27449 25785 30559 34052 9309 6408 26695 16153 19418 22970 17618 20364 27544 33389 33079
328 33079 27868 18534 30249 39011 31891 11051 20530 23296 30229 27114 39422 29985 25906 16953
314 16953 4665 7848 19351 7726 17140 26212 24021 31211 29069 21688 5035 390 9872 31277
300 31277 39730 23605 29937 34785 33815 30634 35095 34165 18510 22152 19979 9592 33559 40038
$$ packed form
397F35J6920J2450k762r167p979K0463o794J1406r133n368K163j600J7570k094
383C6710m460j3199J4159J743j9641l991R734J2361m957r125k021J901r62J5370
369C3622j0491K987K4093l305L137o739q666k0640q413K7112J0972p125j3638
356B2906j1498m010o967J6962k93K764p111k918k543n819K0440P540J809l813
342B7449j664M774L493k4743k901K0287j0542L265L552n352K746P180N845l10
328C3079n211r334J1715Q762p120k0840R479K766O933l115J2308r437m079q953
314A6953j2288L183J1503j1625R414R072k191P190k142p381j6653m645R482K1405
300C1277Q453j6125O332M848r70l181M461r30j5655L642k173j0387K3967O479
$$ plain form
286 40038 39566 49288 45431 44396 23148 14435 13680 2228 13705 20953 9656 20591 13279 31300
272 31300 37735 33289 23538 23629 34320 24798 30331 33099 37540 22810 28356 39602 19856 29462
258 29462 32937 37988 20050 29425 28302 36590 20727 27876 20948 17927 21685 31086 34907 30952
244 30952 18681 25427 21726 17115 32959 25291 28276 35944 26186 7798 22971 15547 18755 15251
230 15251 29372 30654 16223 28589 28812 25422 29127 35252 35801 17709 34689 45067 30281 31675
216 31675 41737 36780 34891 33229 42671 33461 30095 21332 20894 27890 37469 16780 11732 30595
202 30595 17893 17380 24553 44245 34527 30296 24013 29859 33149 25099 29312 31974 39200 21804
188 21804 16322 4084 15744 30412 37681 35051 26892 29895 16525 31334 34002 28274 34900 32275
$$ packed form
286D0038m72R722l857j035k1248q713p55j1452J1477P248j1297J0935p312J8021
272C1300O435m446r751R1J0691r522N533K768M441j4730N546J1246j9746R606
258B9462L475N051j7938R375j123Q288j5863P149o928l021L758R401L821l955
244C0952j2271O746l701m611J5844p668K985P668r758j8388J5173p424L208l504
230A5251J4121J282j4431J2366K23l390L705O125N49j8092J6980J0378j4786J394
216C1675J0062m957j889j662R442r210l366q763m38O996R579k0689n048J8863
202C0595j2702n13P173J9692r718m231o283N846L290q050M213K662P226j7396
188B1804n482j2238J1660J4668P269k630q159L003j3370J4809K668n728O626k625
$$ plain form
174 32275 20536 30280 39256 28113 34494 34031 42974 30499 25586 36981 45022 34741 40410 39352
160 39352 29969 27728 33765 47989 46430 48479 40733 40644 31324 33535 41721 30225 35690 32979 22139
145 22139 22295 40339 44066 41561 20646 23739 20851 27568 32684 29719 30855 34301 25389 22992 31844
130 31844 30977 37617 40453 43279 38786 45435 30582 41521 25066 32079 29529 14120 24167 39329
116 39329 27884 25316 27223 38550 40068 44710 47715 38355 33850 36577 30484 37701 26317 7500
102 7500 16550 37808 39620 35951 32458 31734 23746 25697 36279 33865 29365 22157 23396 28711 25775
87 25775 16852 27045 34525 33894 36215 24935 23188 26148 38749 34721 37650 38327 30922 36776 33832
72 33832 33606 41122 40059 41476 45228 45094 36657 47881 51677 37291 34721 29212 37246 32701 36452
$$ packed form
174C2275j1739R744Q976j1143O381m63Q943j2475m913J1395Q041j0281N669j058
160C9352r383k241O037J4224j559K049p746q9r320K211Q186j1496N465k711j0840
145B2139J56J8044L727k505k0915L093k888O717N116k965J136L446q912k397Q852
130C1844q67O640K836K826m493O649j4853J0939j6455P013k550j5409J0047J5162
116C9329j1445k568J907J1327J518M642L005r360m505K727o093P217j1384j8817
102G500R050K1258J812l669l493p24p988J951J0582k414m500p208J239N315k936
87B5775q923J0193P480o31K321j1280j747K960J2601m028K929O77p405N854k944
72C3832k26P516j063J417L752j34q437J1224L796j4386k570n509Q034m545L751
$$ plain form
57 36452 35587 31128 29671 41005 32196 25752 31415 24149 16852 20882 27214 39137 29974 34511 32925
42 32925 40046 41933 42530 31450 42329 45081 30940 32027 35410 29098 36745 29242 22443 40044
28 40044 53683 45581 51291 45138 39314 40275 37379 37019 40384 41931 42036 47612 35328 32467 33161 30475
12 30475 39439 47218 43509 36995 43582 37676 22107 30450 34090 41867 28819 34041
0 34041
$$ packed form
57C6452q65m459j457J1334q809o444N663p266p297M030O332J1923r163M537j586
42C2925P121J887N97j1080J0879K752j4141J087L383o312P647p503o799J7601
28D0044J3639q102N710o153n824R61k896l60L365J547J05N576j2284k861O94k686
12C0475Q964P779l709o514O587n906j5569Q343L640P777j3048N222
0C4041
$$ Imaginary data points
##PAGE= N=2
##DATA TABLE= (X++(I..I)), XYDATA
$$ plain form
16383 -750773 -723180 -724236 -713076 -699387 -687526 -674875 -668268 -649716 -624248 -617778 -624732 -620323
16371 -620323 -611205 -593915 -578314 -567394 -554141 -538553 -533113 -523421 -508279 -483453 -467484 -470121
16359 -470121 -462606 -450283 -430833 -416263 -410193 -405702 -408049 -383849 -364361 -352152 -340316 -336913
16347 -336913 -329406 -316188 -305776 -299492 -286862 -277093 -271380 -262757 -253679 -234486 -219124 -210346 -197068
16334 -197068 -174007 -171689 -170526 -159487 -149605 -139686 -124783 -112053 -112361 -93411 -85925 -75099 -66499
16321 -66499 -61107 -56013 -47744 -25634 -16814 -11507 3517 21677 34440 45615 50550 55642 48791
16308 48791 66166 78966 89589 106123 117688 118335 125023 136280 141299 158953 162252 168661 186958
16295 186958 185884 178075 200208 220053 240102 245160 243734 252235 266262 281958 280736 289063 294460
$$ packed form
16383g50773K7593j056J1160J3689J1861J2651O607J8552K5468O470o954M409
16371f20323R118J7290J5601J0920J3253J5588N440R692J5142K4826J5969k637
16359d70121P515J2323J9450J4570O070M491k347K4200J9488J2209J1836L403
16347c36913P507J3218J0412O284J2630R769N713Q623R078J9193J5362Q778J3278
16334a97068K3061K318J163J1039R882R919J4903J2730l08J8950P486J0826Q600
16321f6499N392N094Q269K2110Q820N307J5024J8160J2763J1175M935N092o851
16308D8791J7375J2800J0623J6534J1565O47O688J1257N019J7654L299O409J8297
16295A86958j074p809K2133J9845K0049N058j426Q501J4027J5696j222Q327N397
$$ plain form
16282 294460 300300 313302 323126 331513 345530 359249 357317 341900 365474 385809 383370 397502
16270 397502 392665 396422 404197 416758 434142 449448 451180 445767 459496 475576 474919 484252 485147
16257 485147 509384 525642 524283 526077 541188 534286 546370 563049 558014 552483 564399 581426
16245 581426 573777 574742 588612 605456 612991 612326 611261 620983 622460 635050 646270 635444 630377
16232 630377 639140 660525 671163 681557 689457 668889 678371 683647 687585 692202 696923 717947 724678
16219 724678 728087 729714 739310 737305 738747 743179 751576 748765 761949 775742 786994 764782 783600
16206 783600 788541 784801 790351 794400 800177 792210 810762 809352 831483 836378 826156 825638 831251 845993
16192 845993 832412 847380 860507 862739 857900 850198 848737 853877 869282 867120 875012 873086 882141
$$ packed form
16282B94460N840J3002R824Q387J4017J3719j932j5417K3574K0335k439J4132
16270C97502m837L757P775J2561J7384J5306J732n413J3729J6080o57R333Q95
16257D85147K4237J6258j359J794J5111o902J2084J6679n035n531J1916J7027
16245E81426p649R65J3870J6844P535o65j065R722J477J2590J1220j0826n067
16232F30377Q763K1385J0638J0394P900k0568R482N276L938M617M721K1024O731
16219G24678L409J627R596k005J442M432Q397k811J3184J3793J1252k2212J8818
16206G83600M941l740N550M049N777p967J8552j410K2131M895j0222n18N613J4742
16192H45993j3581J4968J3127K232m839p702j461N140J5405k162P892j926R055
$$ plain form
16179 882141 878427 907216 914628 913604 901143 889910 891793 901596 892846 894744 905876 913610 909438
16166 909438 917362 942442 925858 929272 947863 942535 931607 946571 963230 975110 946857 932534
16154 932534 958434 953853 949755 964909 961203 969946 977341 955806 943116 964675 992594 976285
16142 976285 986354 987507 976540 976752 982151 989210 1006052 1013987 1003141 995935 1003731 998972 995987
16129 995987 1013638 1003982 994482 1002103 1007087 1015135 1020260 1006074 1017570 1009047 1002792 997665 1007143
16116 1007143 1015799 1008170 1019899 1038531 1038496 1028740 1045268 1033191 1032327 1040679 1040792 1047902 1045207 1027277
16102 1027277 1031910 1038558 1044188 1038078 1047092 1053646 1045613 1027996 1031782 1045897 1055706 1049967 1047451
16089 1047451 1058694 1066757 1068348 1054318 1045394 1036265 1035327 1052997 1059349 1061532 1060619 1045537 1042875
$$ packed form
16179H82141l714K8789P412j024j2461j1233J883R803q750J898J1132P734m172
16166I09438P924K5080j6584L414J8591n328j0928J4964J6659J1880k8253j4323
16154I32534K5900m581m098J5154l706Q743P395k1535j2690K1559K7919j6309
16142I76285J0069J153j0967K12N399P059J6842P935j0846p206P796m759k985
16129I95987J7651r656r500P621M984Q048N125j4186J1496q523o255n127R478
16116A007143Q656p629J1729J8632l5r756J6528j2077q64Q352J13P110k695j7930
16102A027277M633O648N630o110R014O554q033j7617L786J4115R809n739k516
16089A047451J1243Q063J591j4030q924r129r38J7670O352K183r13j5082k662
$$ plain form
16076 1042875 1034070 1039902 1037112 1050062 1049689 1056986 1039256 1048923 1071229 1060907 1066751 1064467 1063848
16063 1063848 1068209 1062570 1052630 1069104 1052684 1056090 1071423 1053482 1065715 1067904 1063842 1058382 1070832
16050 1070832 1062021 1047812 1057628 1060632 1070064 1067655 1065912 1054067 1052961 1088111 1095023 1075556 1069127
16037 1069127 1084173 1089957 1080514 1064038 1073945 1067269 1079637 1069380 1068068 1081609 1083297 1074004 1066472
16024 1066472 1072058 1063172 1063175 1063345 1079638 1080382 1092333 1087497 1065669 1063807 1063128 1072347 1086286 1069837
16010 1069837 1076136 1067741 1050650 1057893 1069845 1079442 1087680 1084769 1074251 1075057 1068097 1065940 1073164
15997 1073164 1076331 1086715 1088640 1085270 1085398 1073018 1081872 1080109 1088912 1079489 1072928 1065124 1076410
15984 1076410 1070876 1081369 1083634 1066519 1085368 1085732 1074827 1076355 1088551 1070619 1069632 1091551 1094170
$$ packed form
16076A042875q805N832k790J2950l73P297j7730R667K2306j0322N844k284o19
16063A063848M361n639r940J6474j6420L406J5333j7941J2233K189m062n460J2450
16050A070832q811j4209R816L004R432k409j743j1845j106L5150O912j9467o429
16037A069127J5046N784r443j6476R907o676J2368j0257j312J3541J688r293p532
16024A066472N586q886LJ70J6293P44J1951m836k1828j862o79R219J3939j6449
16010A069837O299q395j7091P243J1952R597Q238k911j0518Q06o960k157P224
15997A073164L167J0384J925l370J28j2380Q854j763Q803r423o561p804J1286
15984A076410n534J0493K265j7115J8849L64j0905J528J2196j7932r87K1919K619
$$ plain form
15971 1094170 1087889 1084719 1082060 1091719 1090706 1077532 1082188 1072759 1061492 1082220 1073208 1077605 1061148
15958 1061148 1059549 1063883 1068687 1070029 1057902 1063246 1081984 1076638 1067071 1071434 1081440 1072906 1066720
15945 1066720 1083915 1097310 1076255 1067325 1074045 1082496 1092356 1085698 1069930 1074831 1081693 1072037 1075141
15932 1075141 1071956 1063701 1067764 1068228 1076282 1085042 1082474 1077391 1065703 1066193 1059327 1080133 1100803 1091261
15918 1091261 1094923 1096861 1096148 1100138 1114844 1084504 1074721 1084570 1074823 1074615 1086556 1101239 1084903
15905 1084903 1087834 1083834 1079248 1080578 1096718 1093974 1095507 1086947 1088536 1090960 1089920 1101648 1088699
15892 1088699 1083707 1082745 1089142 1092661 1086840 1083920 1090740 1092733 1082546 1082753 1074442 1082995 1121363 1123321
15878 1123321 1108964 1113501 1099617 1081264 1084731 1096841 1095732 1087053 1078982 1086590 1106319 1106873 1098586
$$ packed form
15971A094170o281l170k659R659j013j3174M656r429j1267K0728r012M397j6457
15958A061148j599M334M804J342j2127N344J8738n346r567M363J0006q534o186
15945A066720J7195J3395k1055q930O720Q451R860o658j5768M901O862r656L104
15932A075141l185q255M063M64Q054Q760k568n083j1688M90o866K0806K0670r542
15918A091261L662J938p13L990J4706l0340r783R849r747k08J1941J4683j6336
15905A084903K931m000m586J330J6140k744J533q560J589K424j040J1728j2949
15892A088699m992r62O397L519n821k920O820J993j0187K07q311Q553L8368J958
15878A123321j4357M537j3884j8353L467J2110j109q679q071P608J9729N54q287
$$ plain form
15865 1098586 1080413 1069228 1088045 1098398 1119740 1106673 1082980 1101206 1089197 1089406 1076478 1072707
$$ packed form
15865A098586j8173j1185J8817J0353K1342j3067k3693J8226j2009K09j2928l771
$$ [...]
##END NTUPLES=NMR SPECTRUM
##END=
