##TITLE=1H_EC-3296(XV-3)
 CDCl3
 8 sc, 
 26.9.2023
##JCAMPDX= 6.0         $$ Bruker NMR JCAMP-DX V2.0
##DATA TYPE= NMR SPECTRUM
##DATA CLASS= NTUPLES
##ORIGIN= UXNMR, Bruker Analytische Messtechnik GmbH
##OWNER= root
$$ XWIN-NMR		Version 3.5
$$ Tue Sep 26 14:07:12 2023 Russian Standard Time (UT+4h)  she@DPX200
##.OBSERVE FREQUENCY= 200.13135
##.OBSERVE NUCLEUS= ^1H
##.ACQUISITION MODE= SIMULTANEOUS
##.ACQUISITION SCHEME= undefined
##.AVERAGES= 8
##.DIGITISER RES= 18
##SPECTROMETER/DATA SYSTEM= spect
##.PULSE SEQUENCE= zg30
##.SOLVENT NAME= CDCl3
##.SHIFT REFERENCE= (INTERNAL, CDCl3, 0, 15.7513)
##AUDIT TRAIL= $$ (NUMBER, WHEN, WHO, WHERE, WHAT)
$$ ##TITLE= Audit trail, XWIN-NMR		Version 3.5
$$ ##JCAMPDX= 5.01
$$ ##ORIGIN= Bruker BioSpin GmbH
$$ ##OWNER= she
$$ F:/spectra/data/she/nmr/H-F/1/pdata/1/auditp.txt
$$ ##AUDIT TRAIL=  $$ (NUMBER, WHEN, WHO, WHERE, WHAT)
(   1,<2023-09-26 14:05:51.79 +0400>,<she>,<DPX200>,
      <created by zg, POWCHK disabled, PULCHK disabled
       configuration hash MD5:
       00 E9 B6 7A A2 85 ED C7 34 08 36 98 17 FE 4E 26
       data hash MD5: 16K
       D9 37 C3 1A E1 D0 60 AF 69 40 95 DF 9A 36 07 FE>)
(   2,<2023-09-26 14:05:54.23 +0400>,<she>,<DPX200>,
      <Start of raw data processing
       efp BC_mod = 2 LB = 0.24 FT_mod = 6 PKNL = 1 PHC0 = -21712.6 PHC1 = 12.25271 SI = 16K 
       data hash MD5: 16K
       F6 F1 F2 AC B3 F9 B8 44 1A 1B 90 9E 6D 0A 1D 5A>)
(   3,<2023-09-26 14:05:57.98 +0400>,<she>,<DPX200>,
      <abs ABSG = 5 
       data hash MD5: 16K
       63 2C A5 D0 80 96 F4 A6 37 5A 54 A4 68 95 75 88>)
(   4,<2023-09-26 14:06:12.82 +0400>,<she>,<DPX200>,
      <pk PHC0 = 0.301811 PHC1 = -0.6000001 
       data hash MD5: 16K
       8E F6 23 C6 4E 0B 93 44 30 0B 44 A1 5D 06 F3 E9>)
(   5,<2023-09-26 14:06:16.64 +0400>,<she>,<DPX200>,
      <abs ABSG = 5 
       data hash MD5: 16K
       9A 53 C1 BA 3C 29 75 FF 33 86 A4 39 05 94 16 B2>)
$$ ##END=
$$ 
$$ hash MD5
$$ 92 E6 AF EA 86 C7 C2 AF 5C DE 0F C4 5C 1E D2 88
##$RELAX= 
##$RELAX= 
##$RELAX= 
##$RELAX= 
##$RELAX= 
##$RELAX= 
$$ Bruker specific parameters
$$ --------------------------
##$DU= <F:/spectra>
##$EXPNO= 1
##$NAME= <H-F>
##$PROCNO= 1
##$TYPE= <nmr>
##$USER= <she>
##$AMP= (0..31)
100 100 100 100 100 100 100 100 100 100 100 100 100 100 100 100 100 100 
100 100 100 100 100 100 100 100 100 100 100 100 100 100 
##$AQSEQ= 0
##$AQ_mod= 1
##$AUNM= <au_zg>
##$AUTOPOS= <>
##$BF1= 200.13
##$BF2= 200.13
##$BF3= 200.13
##$BF4= 200.13
##$BF5= 200.13
##$BF6= 200.13
##$BF7= 200.13
##$BF8= 200.13
##$BYTORDA= 1
##$CFDGTYP= 0
##$CFRGTYP= 5
##$CHEMSTR= <none>
##$CNST= (0..31)
1 1 145 1 1 1 1 1 1 1 1 1 1 1 1 1 1 1 1 1 1 1 1 1 1 1 1 1 1 1 1 1 
##$CPDPRG= <>
##$CPDPRG1= <>
##$CPDPRG2= <>
##$CPDPRG3= <>
##$CPDPRG4= <mlev>
##$CPDPRG5= <mlev>
##$CPDPRG6= <mlev>
##$CPDPRG7= <mlev>
##$CPDPRG8= <mlev>
##$CPDPRGB= <>
##$CPDPRGT= <>
##$D= (0..31)
0 1.2 0 0 0 0 0 0 0 0.06 0 0.03 0 0 0 0 0.0002 0 0 0 0 0 0 0 0 0 0 0 0 
0 0 0 
##$DATE= 1695722751
##$DBL= (0..7)
$$ [...]
##$SUBNAM3= <"">
##$SUBNAM4= <"">
##$SUBNAM5= <"">
##$SUBNAM6= <"">
##$SUBNAM7= <"">
##$SUBNAM8= <"">
##$SUBNAM9= <"">
##$SW= 18.05172834244
##$SWIBOX= (0..15)
0 0 2 0 0 0 0 0 0 0 0 0 0 0 0 0 
##$SW_h= 3612.71676300578
##$TD= 16384
##$TD0= 1
##$TE= 0
##$TE2= 300
##$TE3= 300
##$TEG= 300
##$TL= (0..7)
0 120 120 120 120 120 120 120 
##$TP= (0..7)
150 150 150 150 150 150 150 150 
##$TP07= 0
##$TPNAME0= <>
##$TPNAME1= <>
##$TPNAME2= <>
##$TPNAME3= <>
##$TPNAME4= <>
##$TPNAME5= <>
##$TPNAME6= <>
##$TPNAME7= <>
##$TPOAL= (0..7)
0.5 0.5 0.5 0.5 0.5 0.5 0.5 0.5 
##$TPOFFS= (0..7)
0 0 0 0 0 0 0 0 
##$TUNHIN= 0
##$TUNHOUT= 0
##$TUNXOUT= 0
##$USERA1= <user>
##$USERA2= <user>
##$USERA3= <user>
##$USERA4= <user>
##$USERA5= <user>
##$V9= 5
##$VALIST= <valist>
##$VCLIST= <CCCCCCCCCCCCCCC>
##$VD= 0
##$VDLIST= <DDDDDDDDDDDDDDD>
##$VPLIST= <PPPPPPPPPPPPPPP>
##$VTLIST= <TTTTTTTTTTTTTTT>
##$WBST= 1024
##$WBSW= 4
##$XGAIN= (0..3)
0 0 0 0 
##$XL= 0
##$YL= 0
##$YMAX_a= 266666
##$YMIN_a= -336266
##$ZGOPTNS= <>
##$ZL1= 120
##$ZL2= 120
##$ZL3= 120
##$ZL4= 120
##$ABSF1= 15.78104
##$ABSF2= -2.270809
##$ABSG= 5
##$ABSL= 3
##$ALPHA= 0
##$AQORDER= 0
##$ASSFAC= 0
##$ASSFACI= 0
##$ASSFACX= 0
##$ASSWID= 0
##$AUNMP= <proc_1d>
##$AZFE= 0.1
##$AZFW= 0.1
##$BCFW= 0
##$BC_mod= 2
##$BYTORDP= 0
##$COROFFS= 0
##$CY= -3
##$DATMOD= 1
##$DC= 0
##$DFILT= <>
##$DTYPP= 0
##$F1P= 0
##$F2P= 0
##$FCOR= 1
##$FTSIZE= 16384
##$FT_mod= 6
##$GAMMA= 0
##$GB= 0
##$INTBC= 1
##$INTSCL= 3.70164e-10
##$ISEN= 128
##$LB= 0.24
##$LEV0= 0
##$LPBIN= 0
##$MAXI= 10000
##$MC2= 0
##$MEAN= 0
##$ME_mod= 0
##$MI= 1.114404
##$NCOEF= 0
##$NC_proc= -5
##$NLEV= 6
##$NOISF1= 3.799351
##$NOISF2= 2.8
##$NSP= 0
##$NTH_PI= 0
##$NZP= 0
##$OFFSET= 15.7513
##$PC= 1
##$PHC0= -21712.3
##$PHC1= 11.65271
##$PH_mod= 1
##$PKNL= yes
##$PPARMOD= 0
##$PSCAL= 0
##$PSIGN= 0
##$REVERSE= no
##$SF= 200.130004050996
##$SI= 16384
##$SIGF1= 3
##$SIGF2= 2
##$SINO= 5.538805
##$SIOLD= 16384
##$SREGLST= <1H.CDCl3>
##$SSB= 0
##$STSI= 16384
##$STSR= 0
##$SW_p= 3612.71676300578
##$SYMM= 0
##$S_DEV= 0
##$TDeff= 16384
##$TDoff= 0
##$TI= <>
##$TILT= no
##$TM1= 0
##$TM2= 0
##$TOPLEV= 0
##$USERP1= <user>
##$USERP2= <user>
##$USERP3= <user>
##$USERP4= <user>
##$USERP5= <user>
##$WDW= 1
##$XDIM= 16384
##$YMAX_p= 448399410
##$YMIN_p= -206710
$$ End of Bruker specific parameters
$$ ---------------------------------
##NTUPLES= NMR SPECTRUM
##VAR_NAME=  FREQUENCY,     SPECTRUM/REAL,   SPECTRUM/IMAG
##SYMBOL=    X,             R,               I
##VAR_TYPE=  INDEPENDENT,   DEPENDENT,       DEPENDENT
##VAR_FORM=  AFFN,          ASDF,            ASDF
##VAR_DIM=   16384,         16384,           16384
##UNITS=     HZ,            ARBITRARY UNITS, ARBITRARY UNITS
##FACTOR=    0.220516191357247, 1,           1
##FIRST=     3152.30770440866, 0,            0
##LAST=      -460.409058597123, 0,           0
##MIN=       -460.409058597123, -206710,     0
##MAX=       3152.30770440866, 448399410,    0
$$ Real data points
##PAGE= N=1
##DATA TABLE= (X++(R..R)), XYDATA
$$ [...]
$$ plain form
6586 12567 54652 -50370 -65373 -46661 -58468 -58887 4728 5881 30212 74386 4627 -12785
6574 -12785 -7029 28270 32307 19943 -1768 52707 98802 71283 62286 4972 -8120 42902
6562 42902 12237 1461 12848 -19414 699 67712 18414 6013 15640 -770 46437 5770
6550 5770 3928 26500 12881 19418 -9687 -963 -5895 -20181 -48096 -26791 -4951 41933 4620
6537 4620 -39362 -48560 -47583 -64255 -17170 36502 -12220 -12769 -36891 -21730 -35992 2511 -7019
6524 -7019 -1739 37951 20105 11128 -5981 12393 -1313 -77671 -91241 7995 67363 -1671
6512 -1671 -29952 -41167 -23733 -27944 -19708 -52410 -8952 -16445 -15969 -15120 -42755 -45227 -5845 -13535
6498 -13535 -48705 -3278 13520 -13596 -17417 18573 -11550 -22641 -57257 -44101 -54150 -47147
$$ packed form
6586A2567M2085j05022j5003J8712j1807m19O3615J153K4331M4174o9759j7412
6574a2785N756L5299M037j2364k1711N4475M6095k7519q997n7314j3092N1022
6562D2902l0665j0776J1387l2262K0113O7013m9298j2401R627j6410M7207m0667
6550E770j842K2572j3619O537k9105Q724m932j4286k7915K1305K1840M6884l7313
6537D620m3982r198R77j6672M7085N3672m8722n49k4122J5161j4262L8503r530
6524g019N280L9690j7846q977j7109J8374j3706p6358j3570R9236N9368o9034
6512a671k8281j1215J7434m211Q236l2702M3458p493M76Q49k7635k472L9382p690
6498a3535l5170M5427J6798k7116l821L5990l0123j1091l4616J3156j0049P003
$$ plain form
6486 -47147 -13859 -30308 -10342 -48496 -12788 -10413 -59372 4331 17947 -38004 -16605 46348
6474 46348 -11279 4349 25605 -32014 -22920 2838 31610 -8695 -17806 -12573 -3936 37513 12557
6461 12557 -19688 -23460 -8355 -873 17973 31633 3177 -55271 -3539 -32057 -55709 -37406
6449 -37406 -17424 -50188 -23456 -43114 -73431 -104884 -88922 -38981 -13158 -38748 -65917 -40887
6437 -40887 -14053 -51734 -41880 -5909 -11345 -26494 -1269 1644 -17067 -17313 -10668 -15759 -31634
6424 -31634 -40510 12534 -14028 -37903 -26993 -5149 -1460 -54864 -26578 17061 5139 11698
6412 11698 -29092 -63540 9807 13469 -45739 -49484 -6151 -12278 -32510 -64973 -8598 21939
6400 21939 -48319 -60650 -63632 -94090 -38776 -56250 -51030 -38725 -23769 -29606 -13757 -23098 -19235
$$ packed form
6486d7147L3288j6449J9966l8154L5708K375m8959O3703J3616n5951K1399O2953
6474D6348n7627J5628K1256n7619R094K5758K8772m0305r111N233Q637M1449k4956
6461A2557l2245l772J5105P482J8846J3660k8456n8448N1732k8518k3652J8303
6449c7406J9982l2764K6732j9658l0317l1453J5962M9941K5823k5590k7169K5030
6437d0887K6834l7681R854L5971n436j5149K5225K913j8711k46O645n091j5875
6424c1634q876N3044k6562k3875J0910K1844L689n3404K8286M3639j1922O559
6412A1698m0790l4448P3347L662n9208l745M3333o127k0232l2463N6375L0537
6400B1939p0258j2331k982l0458N5314j7474N220J2305J4956n837J5849r341L863
$$ plain form
6387 -19235 -25266 -53355 -43891 -12108 -27182 -23625 -12448 -19214 -16287 -21859 -45631 6864 -11833
6374 -11833 -1181 -8465 14677 16063 31121 56311 46243 -11476 4974 24344 -7398 -22352
6362 -22352 -24346 -23761 1662 -51720 -68593 28201 12804 -46448 10748 20990 16650 -9406 -20269
6349 -20269 -65456 -80582 -23374 4865 -18129 -38858 22939 10628 -2328 33868 -9459 -48965
6337 -48965 -38781 -77063 -83249 -97865 -87352 -54186 6352 16187 -25791 -52143 -17846 -21944
6325 -21944 -70747 -25362 -21440 -19733 -48746 -61771 -4786 -36583 -35865 -70909 -83899 -51523 -70312
6312 -70312 -87449 -69541 -75139 -37949 -28802 -29018 210 -28081 -32422 -22882 -37130 -62792 -90225
6299 -90225 -29072 -19103 42462 -5280 -47551 -30784 10852 -21167 -37956 -20831 767 -29241
$$ packed form
6387a9235o031k8089R464L1783j5074L557J1177o766K927n572k3772N2495j8697
6374a1833J0652p284K3142J386J5058K5190j0068n7719J6450J9370l1742j4954
6362b2352j994N85K5423n3382j6873R6794j5397n9252N7196J0242m340k6056j0863
6349b0269m5187j5126N7208K8239k2994k0729O1797j2311j2956L6196m3327l9506
6337d8965J0184l8282o186j4616J0513L3166O0538R835m1978k6352L4297m098
6325b1944m8803M5385L922J707k9013j3025N6985l1797P18l5044j2990L2376j8789
6312g0312j7137J7908n598L7190R147k16K9228k8291m341R540j4248k5662k7433
6299i0225O1153R969O1565m7742m2271J6767M1636l2019j6789J7125K1598l0008
$$ plain form
6287 -29241 -32410 -19448 -17537 -26340 -26097 -46009 -28793 -13166 -12106 -47851 -36416 -9795 36015
6274 36015 -1018 -17746 -14181 -62691 -87985 -103631 -58389 -80029 -75864 -66911 -43297 -39731 -63791
6261 -63791 -7215 -21401 15492 27594 726 -64915 -98641 -71696 -63889 -29220 10614 -10356
6249 -10356 -68071 -73480 -29068 -16886 -19991 2449 3878 -10456 -3300 5218 1461 -15054 6509
6236 6509 -26294 -87873 -61272 -43339 -27256 -27826 33861 8556 19265 -32737 -24117 -13761 -47546
6223 -47546 -8589 6502 -51534 -53268 -89983 -55453 -77334 -89052 -84710 -28839 -51219 -58713
6211 -58713 -34328 -56310 -83279 -89069 -75294 -91512 -80909 -71860 -79956 -71565 -60457 -28135 -3750
6198 -3750 -1581 -16175 -26599 -58123 -64611 -74892 -55240 -60128 -55313 -55790 -66815 -77319 -42288
$$ packed form
6287b9241l169J2962J911q803K43j9912J7216J5627J060l5745J1435K6621M5810
6274C6015l7033j6728L565m8510k5294j5646M5242k1640M165Q953K3614L566k4060
6261f3791N6576j4186L6893J2102k6868o5641l3726K6945P807L4669L9834k0970
6249a0356n7715n409M4412J2182l105K2440J429j4334P156Q518l757j6515K1563
6236F509l2803o1579K6601J7933J6083n70O1687k5305J0709n2002Q620J0356l3785
6223d7546L8957J5091n8036j734l6715L4530k1881j1718M342N5871k2380p494
6211e8713K4385k1982k6969n790J3775j6218J0603R049q096Q391J1108L2322K4385
6198c750K169j4594j0424l1524o488j0281J9652m888M815m77j1025j0504L5031
$$ plain form
6185 -42288 -23193 31060 11349 -34955 -30517 -11889 2829 -31442 -9223 -55164 -43014 -30054
6173 -30054 14247 -13440 -51916 -95786 -49306 9291 -6635 -38341 -49499 -48047 -47507 -40537 -48617
6160 -48617 -53889 -112391 -86125 -35377 -66869 -94192 -68038 -53724 -57742 31958 30059 -41634
6148 -41634 -71150 -74279 -99157 -90495 -61471 -23686 -15305 -53491 -82063 -86575 -34217 -32191 -107088
6135 -107088 -65660 -92648 -60564 -119217 -110210 -74228 -79322 -2158 -47366 17138 35298 28432
6123 28432 24313 -16139 -69066 -65048 -42300 -70836 -43704 -53249 -85977 -52027 -53523 -3272 -43790
6110 -43790 -64809 -57327 -35172 -29966 -82059 -23791 -39828 -46697 -64616 -73678 -14608 44953 42754
6097 42754 14384 31380 6809 -7617 -33450 -43470 -35879 -16929 15425 17946 -10307 -78528
$$ packed form
6185d2288J9095N4253j9711m6304M438J8628J4718l4271K2219m5941J2150J2960
6173c0054M4301k7687l8476m3870M6480N8597j5926l1706j1158J452N40O970q080
6160d8617n272n8502K6266N0748l1492k7323K6154J4314m018Q9700j899p1693
6148d1634k9516l129k4878Q662K9024L7785Q381l8186k8572m512N2358K026p4897
6135a07088M1428k6988L2084n8653R007L5982n094P7164m5208O4504J8160o866
6123B8432m119m0452n2927M018K2748k8536K7132r545l2728L3950j496N0251m0518
6110d3790k1019P482K2155N206n2093N8268j6037o869j7919r062N9070N9561k199
6097D2754k8370J6996k4571j4426k5833j0020P591J8950L2354K521k8253o8221
$$ plain form
6085 -78528 -83518 -4817 12303 -6083 -13387 -60991 -56257 -88725 -66108 -81156 -74272 -35409 -19858
6072 -19858 -3647 -16975 -19438 4559 -26476 -59110 -29203 5979 33113 -26782 -37596 -39532
6060 -39532 -46840 -58124 -64595 -46434 -22045 -26926 -54942 -43871 -70777 -49206 9316 7213 -52949
6047 -52949 -46950 -46087 -25072 39799 12268 -53603 -53097 -10131 47851 -33333 -71056 -52182 -78115
6034 -78115 -32019 -41153 -41274 6901 16697 -36052 -10811 3677 -31232 -25735 -49435 -64440 -42191
6021 -42191 -9991 2246 -14641 -16772 -49261 -72218 -51435 -58016 -10898 -24800 -49660 -40212
6009 -40212 -45372 -42366 -62556 -47719 -34004 -2259 -70066 -49779 -22556 -35477 -34813 -20271 -55055
5996 -55055 -29812 -21167 -23715 -33704 -43433 11581 -25750 -49169 19623 45398 27021 -34780 -85769
$$ packed form
6085g8528m990P8701J7120j8386p304m7604M734l2468K2617j5048O884L8863J5551
6072a9858J6211j3328k463K3997l1035l2634K9907L5182K7134n9895j0814j936
6060c9532p308j1284o471J8161K4389m881k8016J1071k6906K1571N8522k103o0162
6047e2949N999Q63K1015O4871k7531o5871N06M2966N7982q1184l7723J8874k5933
6034g8115M6096r134j21M8175R796n2749K5241J4488l4909N497k3700j5005K2249
6021d2191L2200J2237j6887k131l2489k2957K0783o581M7118j3902k4860R448
6009d0212n160L006k0190J4837J3715L1745o7807K0287K7223j2921O64J4542l4784
5996e5055K5243Q645k548r989r729N5014l7331k3419O8792K5775j8377o1801n0989
$$ plain form
5983 -85769 -53724 -26622 -4363 -52342 -58409 -74616 -95184 -40921 -23629 -22448 -16736 -47438
5971 -47438 -50991 14710 3134 -14190 -21006 -21794 -16999 -54064 -38012 -49481 -29998 -11691 -25033
5958 -25033 -44974 -52924 -51285 -9626 31224 -24748 -27597 -6108 7534 -21288 -36102 -44157 -1899
5945 -1899 -26535 -28301 -15418 -74276 -37013 -12746 -17870 -10539 341 -29682 8107 -51710 -45775
5932 -45775 -19248 -51429 -99493 -95767 -31495 17561 -12762 -60536 -30531 -10062 -33883 -43175
5920 -43175 -42884 -25354 -13247 -48021 -48518 -21570 -39027 -48817 -4882 -7272 18179 7197 -6471
5907 -6471 -45590 -57671 -43760 -5297 69800 35016 -46869 -5267 -4271 12369 -14933 -1830
5895 -1830 -30560 -33059 -13848 -34208 -42543 -71270 -71721 -75372 -19067 -30938 -20084 28831 1861
$$ packed form
5983h5769L2045K7102K2259m7979o067j6207k0568N4263J7292J181N712l0702
5971d7438l553O5701j1576j7324o816p88M795l7065J6052j1469J9483J8307j3342
5958b5033j9941p950J639M1659M0850n5972k849K1489J3642k8822j4814q055M2258
5945a899k4636j766J2883n8858L7263K4267n124P331J0880l0023L7789n9817N935
5932d5775K6527l2181m8064L726O4272M9056l0323m7774L0005K0469k3821r292
5920d3175K91J7530J2107l4774m97K6948j7457r790M3935k390K5451j0982j3668
5907f471l9119j2081J3911L8463P5097l4784q1885M1602R96J6640k7302J3103
5895a830k8730k499J9211k0360q335k8727m51l651N6305j1871J0854M8915k6970
$$ plain form
5882 1861 -36764 -5991 26613 56609 20356 1373 45235 26815 1245 -929 8137 35981
5870 35981 15115 580 -13360 -25678 -29273 19518 16563 41115 5418 -63768 -47711 16769
5858 16769 26990 -4341 16366 22628 -23336 39300 48744 -2216 -42671 -48148 -28955 -68973
5846 -68973 -19050 -4406 -9384 4904 -17262 11052 -36299 -34354 -17832 -31659 -25060 12552
5834 12552 35605 12051 -1728 26017 -15062 -98580 -46117 -12049 -6993 -831 -18095 -70091
5822 -70091 -60479 -86818 -127031 -53692 6069 -26326 52254 65545 42387 8043 20598 30899
5810 30899 -29672 -35930 -30266 -54258 -55446 -55345 -2753 -9762 -8011 17233 20853 44975 48106 38372
5796 38372 40787 63934 72214 72701 69698 106314 119167 123018 184688 214431 178205 158344 90656
$$ packed form
5882A861l8625L0773L2604K9996l6253j8983M3862j8420k5570k174R066K7844
5870C5981k0866j4535j3940j2318l595M8791k955K4552l5697o9186J6057O4480
5858A6769J0221l1331K0707O262m5964O2636R444n0960m0455n477J9193m0018
5846f8973M9923J4644m978J4288k2166K8314m7351J945J6522j3827O599L7612
5834A2552K3053k3554j3779K7745m1079q3518N2463L4068N056O162j7264n1996
5822g0091R612k6339m0213P3339N9761l2395P8580J3291k3158l4344J2555J0301
5810C0899o0571o258N664k3992j188J01N2592p009J751K5244L620K4122L131r734
5796C8372K415K3147Q280M87l003L6616J2853L851O1670K9743l6226j9861o7688
$$ plain form
5783 90656 37693 32572 74345 72337 24012 27275 26460 31764 5218 244 -33064 -28631 36981
5770 36981 3123 305 -18746 21668 37228 5614 19420 25411 19636 52248 49721 51357 46004
5757 46004 27700 4780 1349 13315 -26509 -7000 17122 23665 25547 43868 61617 41734
5745 41734 13275 -46498 -55130 -28202 8592 47473 70789 10907 -47671 -28086 -39349 -40051
5733 -40051 -17060 46803 32276 -27356 -6090 -12070 -68115 3831 30123 23991 7746 -22455
5721 -22455 -37552 -20882 1547 -49217 -43690 -29692 18514 6732 -25221 -19708 -19272 -4894 -12290
5708 -12290 -216 -10836 -48255 -12939 13214 1445 -7658 -10860 2987 15336 7980 9160 9952
5695 9952 -1247 2445 -28879 -55136 -5835 -16968 -28562 -61187 -38042 -20474 41200 40369 4588
$$ packed form
5783I0656n2963n121M1773k008m8325L263q15N304k6546m974l3308M433O5612
5770C6981l3858k818j9051M0414J5560l1614J3806N991n775L2612k527J636n353
5757D6004j8304k2920l431J1966l9824J9509K4122O543J882J8321J7749j9883
5745D1734k8459n9773q632K6928L6794L8881K3316n9882n8578J9585j1263p02
5733d0051K2991O3863j4527n9632K1266n980n6045P1946K6292o132j6245l0201
5721b2455j5097J6670K2429n0764N527J3998M8206j1782l1953N513M36J4378p396
5708a2290J2074j0620l7419L5316K6153j1769r103l202J3847J2349p356J180P92
5695I952j1199L692l1324k6257M9301j1133j1594l2625K3145J7568O1674q31l5781
$$ plain form
5682 4588 6540 -17226 -55105 -95469 -42259 -39712 -21033 -55642 -3433 -8142 13126 12227 18296
5669 18296 -5037 -8392 -14437 24180 -2533 26814 41644 12068 -32000 -59834 7194 21440
5657 21440 7734 -21639 -6673 -12518 12295 13039 -11027 30636 49908 28811 48654 33171
5645 33171 -8099 6044 15993 34164 75694 80688 32122 -5227 53404 13679 15356 -20949
5633 -20949 -8098 3826 33018 19030 60707 55351 36512 8804 -3315 3893 -36208 -14743
5621 -14743 20329 34039 38282 1407 35911 35839 -250 27774 -9574 372 42519 22472 13939
5608 13939 -4683 61612 33183 8967 19780 11884 8309 -11377 -7252 34722 32027 13899 59674
5595 59674 37989 36172 75427 109039 90007 58628 30411 68609 39180 91996 78118 84487
$$ packed form
5682D588J952k3766l7879m0364N3210K547J8679l4609N2209m709K1268q99O069
5669A8296k3333l355o045L8617k6713K9347J4830k9576m4068k7834O7028J4246
5657B1440j3706k9373J4966n845K4813P44k4066M1663J9272k1097J9843j5483
5645C3171m1270J4143R949J8171M1530M994m8566l7349N8631l9725J677l6305
5633b0949J2851J1924K9192j3988M1677n356j8839k7708j2119P208m0101K1465
5621a4743L5072J3710M243l6875L4504p2l6089K8024l7348R946M2147k0047q533
5608A3939j8622O6295k8429k4216J0813p896l575j9686M125M1974k695j8128M5775
5595E9674k1685j817L9255L3612j9032l1379k8217L8198k9429N2816j3878O369
$$ plain form
5583 84487 47103 30414 15672 21810 57937 51569 136670 92087 82343 55539 -3345 30724
5571 30724 65458 41414 10778 23761 -14357 38298 61612 75037 72783 109280 111620 77280
5559 77280 25437 23575 69735 56372 49904 48645 56133 62297 45828 51603 79388 87538 152081
5546 152081 130660 100652 134279 124957 174942 190638 183550 223179 310122 323218 395774 421969
5534 421969 311588 268115 202735 182298 152350 107295 74981 54553 46714 84417 102181 88521
5522 88521 69044 109073 116560 169730 194534 174999 119518 90807 74254 44047 44403 119740
5510 119740 169600 157914 183300 184746 217704 208919 223777 227154 213602 201907 178991 171930
5498 171930 227812 287847 290761 257322 263302 253117 221642 204944 163594 147572 158135 159496
$$ packed form
5583H4487l7384j6689j4742O138L6127o368Q5101m4583r744k6804n8884L4069
5571C0724L4734k4044l0636J2983l8118N2655K3314J3425k254L6497K340l4340
5559G7280n1843j862M6160j3363o468j259P488O164j6469N775K7785Q150O4543
5546A52081k1421l0008L3627r322M9985J5696p088L9629Q6943J3096P2556K6195
5534D21969j10381m3473o5380k0437k9948m5055l2314k0428p839L7703J7764j3660
5522H8521j9477M0029P487N3170K4804j9535n5481k8711j6553l0207L56P5337
5510A19740M9860j1686K5386J446L2958q785J4858L377j3552j1695k2916p061
5498A71930N5882O0035K914l3439N980j0185l1475j6698m1350j6022J0563J361
$$ plain form
5486 159496 171809 192955 202222 203053 158581 184730 213334 251557 222009 191073 191407 159354 182714
5473 182714 254142 318735 302763 321673 290741 323975 384209 396716 464846 468811 514094 465402
5461 465402 441241 418450 401139 391724 341221 324204 284828 251939 244626 254705 229816 227050
5449 227050 205039 210254 276703 288205 246199 265809 300135 287090 230887 256503 309835 361939
5437 361939 401809 430307 478428 479686 466431 541138 505835 459614 447564 405994 325749 340830
5425 340830 346017 229428 226758 222815 224598 168648 153168 118552 155772 132412 178108 209624
5413 209624 192081 200469 160509 141295 143429 137742 168671 193566 187265 260288 257378 241859 217951
5400 217951 212130 227991 214328 166712 197676 199600 148074 163204 206001 130495 165332 157490
$$ packed form
5486A59496J2313K1146R267Q31m4472K6149K8604L8223k9548l0936L34l2053K3360
5473A82714P1428O4593j5972J8910l0932L3234O0234J2507O8130L965M5283m8692
5461D65402k4161k2791j7311r415n0503j7017l9376l2889p313J0079k4889k766
5449B27050k2011N215O6449J1502m2006J9610L4326j3045n6203K5616N3332N2104
5437C61939L9870K8498M8121J258j3255P4707l5303m6221j2050m1570q0245J5081
5425C40830N187j16589k670l943J783n5950j5480l4616L7220k3360M5696L1516
5413B09624j7543Q388l9960j9214K134n687L0929K4895o301P3023k910j5519k3908
5400B17951n821J5861j3663m7616L0964J924n1526J5130M2797p5506L4837p842
$$ plain form
5388 157490 141577 188338 150230 74657 73068 68994 77664 110271 97158 115294 106118 119995
5376 119995 111607 39543 60102 73968 40758 66323 123002 68138 20000 71687 72663 62100
5364 62100 54965 65676 112342 72166 12682 57005 71310 83507 50680 59103 58344 36600 58671
5351 58671 89834 101884 102458 93332 107341 93528 57889 75162 80079 74324 59451 28784 46453
5338 46453 41171 76108 70741 37756 22012 58591 86962 77151 122516 66804 82486 149031
5326 149031 178319 117882 94293 35481 66406 113852 82926 133348 108109 72363 64153 77112
5314 77112 91577 112389 120662 128487 156695 166655 123617 153832 179665 117551 144745 138217 97030
5301 97030 33486 64492 98979 110867 117400 69366 149917 147394 109721 111992 139732 165355
$$ packed form
5388A57490j5913M6761l8108p5573j589m074Q670L2607j3113J8136r176J3877
5376A19995q388p2064K0559J3866l3210K5565N6679n4864m8138N1687R76j0563
5364F2100p135J0711M6666m0176n9484M4323J4305J2197l2827Q423p59k1744K2071
5351E8671L1163J2050N74r126J4009j3813l5639J7273M917n755j4873l0667J7669
5338D6453n282L4937n367l2985j5744L6579K8371r811M5365n5712J5682O6545
5326A49031K9288o0437k3589n8812L0925M7446l0926N0422k5239l5746q210J2959
5314G7112J4465K0812Q273P825K8208R960m3038L0215K5833o2114K7194o528m1187
5301I7030o3544L1006L4487J1888O533m8034Q0551k523l7673K271K7740K5623
$$ plain form
5289 165355 177228 177811 195697 176040 178508 159372 141908 163463 120995 123154 167835 176246 214095
5276 214095 181683 118399 181266 197542 214411 238741 237129 276949 260978 229650 224164 251094
5264 251094 241181 252652 290548 288451 289145 294474 264006 261457 297741 325607 290013 319735 340186
5251 340186 310166 342715 342224 336920 350210 357168 351120 358255 410532 401804 389543 431771 442680
5238 442680 439714 460366 480544 498983 578336 554083 569010 571909 533139 576113 578996 616230
5226 616230 735574 701197 684727 688537 711527 749798 790561 851470 903077 983117 984361 998640
5214 998640 1061709 1105826 1220810 1350720 1445222 1533342 1691281 1899159 2089427 2351020
5204 2351020 2642602 3010309 3487505 3953877 4524188 5086559 5630800 6040601 6031356 5894528
$$ packed form
5289A65355J1873N83J7886j9657K468j9136j7464K1555m2468K159M4681Q411L7849
5276B14095l2412o3284O2867J6276J6869K4330j612L9820j5971l1328n486K6930
5264B51094r913J1471L7896k097O94N329l0468k549L6284K7866l5594K9722K0451
5251C40186l0020L2549m91n304J3290O958o048P135N2277q728j2261M2228J0909
5238D42680k966K0652K0178J8439P9353k4253J4927K899l8770M2974K883L7234
5226F16230J19344l4377j6470L810K2990L8271M0763O0909N1607Q0040J244J4279
5214I98640O3069M4117J14984J29910R4502Q8120J57939K07878J90268K61593
5204B351020K91582L67707M77196M66372N70311N62371N44241M09801r245j36828
$$ plain form
5194 5894528 5722737 5306389 4572163 3906862 3327890 2808940 2300552 1971751 1753636 1519969
5184 1519969 1331517 1201229 1062369 914108 836747 839169 830078 755846 612343 563427 605419
5173 605419 625571 577783 482462 484754 469998 464866 449668 439229 369430 343066 345967 363590
5161 363590 352063 349714 318193 314092 340468 325488 315201 292635 247825 284462 293298 259043
5149 259043 227168 192389 135181 199812 219980 205190 188837 159443 125764 124023 135621 168126
5137 168126 162354 147600 120304 107112 169348 180670 155515 137713 106762 129052 174200 173905
5125 173905 158867 130221 131327 162282 194634 196829 183708 159743 203225 165326 163529 126140
5113 126140 95686 112560 213339 128200 148981 218258 191953 161437 118130 131810 169600
$$ packed form
5194E894528j71791m16348p34226o65301n78972n18950n08388l28801k18115k33667
5184A519969j88452j30288j38860j48261p7361K422r091p4232j43503m8916M1992
5173F05419K0152m7788r5321K292j4756n132j5198j0439o9799k6364K901J7623
5161C63590j1527k349l1521m101K6376j4980j0287k2566m4810L6637Q836l4255
5149B59043l1875l4779n7208O4631K0168j4790j6353k9394l3679j741J1598L2505
5137A68126n772j4754k7296j3192O2236J1322k5155j7802l0951K2290M5148k95
5125A73905j5038k8646J106L0955L2352K195j3121k3965M3482l7899j797l7389
5113A26140l0454J6874J00779q5139K0781O9277k6305l0516m3307J3680L7790
$$ plain form
5102 169600 186105 182904 197752 164428 166028 196694 160132 139135 132973 148030 191159 151828
5090 151828 108541 109861 138518 127375 106054 134941 160655 114784 98335 150803 179695 157556
5078 157556 101484 120035 144295 133005 157013 136595 131840 98554 136711 151190 103002 144953
5066 144953 138832 169089 190068 203433 167384 133412 134270 135515 127842 83440 71999 117927 88239
5053 88239 64252 92895 78850 80097 111230 122596 92076 140330 137846 132113 97347 77127
5041 77127 87169 159597 149698 127803 107845 121063 114287 78673 103269 126946 126263 106282 52776
5028 52776 36347 51528 104816 126903 41392 50591 40981 71463 112066 90616 47967 32402
5016 32402 68416 64187 40097 18336 18284 43624 48399 62404 84818 93436 75222 53808 14298
$$ packed form
5102A69600J6505l201J4848l3324J600L0666l6562k0997o162J5057M3129l9331
5090A51828m3287J320K8657j1143k1321K8887K5714m5871j6449N2468K8892k2139
5078A57556n6072J8551K4260j1290K4008k0418m755l3286L8157J4479m8188M1951
5066A44953o121L0257K0979J3365l6049l3972Q58J245p673m4402j1441M5928k9688
5053H8239k3987K8643j4045J247L1133J1366l0520M8254k484n733l4766k0220
5041G7127J0042P2428r899k1895j9958J3218o776l5614K4596K3677o83j9981n3506
5028E2776j6429J5181N3288K2087q5511R199r610L0482M0603k1450m2649j5565
5016C2402L6014m229k4090k1761n2K5340M775J4005K2414Q618j8214k1414l9510
$$ plain form
5003 14298 -453 31597 76155 53279 92393 61275 17604 26090 58409 78354 93211 61244
4991 61244 41687 -12073 -10879 -12904 34241 106556 109977 75054 46126 54857 57388 83082 69385
4978 69385 39138 59720 132416 117295 72059 87121 37303 9072 47610 89764 104185 92516
4966 92516 104201 130753 118958 17471 73736 128437 132017 130527 120468 94629 114024 112316
4954 112316 143819 142109 204315 223868 224367 241147 256117 287417 252757 186351 187430 209969
4942 209969 226732 196397 225864 271553 203575 173811 188219 179558 163070 196679 203535 156519
4930 156519 164453 227143 206458 209901 214091 213599 235711 239473 246851 240746 296442 328145 358362
4917 358362 364874 352100 319086 308137 269318 270555 205611 176827 175808 171409 198262 266718
$$ packed form
5003A4298j4751L2050M4558k2876L9114l1118m3671Q486L2319J9945J4857l1967
4991F1244j9557n3760J194k025M7145P2315L421l4923k8928Q731K531K5694j3697
4978F9385l0247K0582P2696j5121m5236J5062m9818k8231L8538M2154J4421j1669
4966I2516J1685K6552j1795j01487N6265N4701L580j490j0059k5839J9395j708
4954A12316L1503j710O2206J9553M99J6780J4970L1300l4660o6406J079K2539
4942B09969J6763l0335K9467M5689o7978k9764J4408q661j6488L3609O856m7016
4930A56519P934O2690k0685L443M190m92K2112L762P378o105N5696L1703L0217
4917C58362O512j2774l3014j0949l8819J237o4944k8784j019m399K6853O8456
$$ plain form
4905 266718 331182 284249 288932 306600 328012 329666 306616 342607 399287 396243 396840 350489 340107
4892 340107 335162 342498 371017 365621 357677 309011 290599 308756 295882 326667 315985 304101
4880 304101 367781 359603 398677 421547 390728 430939 343454 339477 349485 327249 351202 349253
4868 349253 344161 380738 403817 390742 365259 358475 351636 420106 392903 308923 241923 273804
4856 273804 290131 298001 307937 329604 357221 307838 322274 304462 339305 334964 320767 319617
4844 319617 300848 313301 263785 270197 226351 200522 221547 234029 263432 265419 200100 193805
4832 193805 186787 221194 252597 245148 207113 245844 302776 309667 271207 246305 278017 323341
4820 323341 336713 285443 340258 377765 339932 318958 287199 273819 339712 377839 379476 362409
$$ packed form
4905B66718O4464m6933M683J7668K1412J654k3050L5991N6680l044N97m6351j0382
4892C40107m945P336K8519n396p944m8666j8412J8157j2874L0785j0682j1884
4880C04101O3680q178L9074K2870l0819M0211q7485l977J0008k2236K3953j949
4868C49253n092L6577K3079j3075k5483o784o839O8470k7203q3980o7000L1881
4856B73804J6327P870R936K1667K7617m9383J4436j7812L4843m341j4197j150
4844C19617j8769J2453m9516O412m3846k5829K1025J2482K9403J987o5319o295
4832A93805p018L4407L1403p449l8035L8731N6932O891l8460k4902L1712M5324
4820C23341J3372n1270N4815L7507l7833k0974l1759j3380O5893L8127J637j7067
$$ plain form
4808 362409 334562 311394 340830 345729 336808 310523 273361 252469 238752 238014 200643 169597
4796 169597 199381 201297 138451 145117 170808 160167 139022 119268 140575 171620 188434 150978
4784 150978 157110 128500 106618 161759 145529 111032 107237 96839 119488 125479 128881 126780 112897
4771 112897 120308 126399 103357 150528 178560 158518 147441 92604 93025 82477 71390 135069
4759 135069 148722 185034 217035 279226 285827 270468 249356 233132 198557 177647 120469 152956
4747 152956 224783 169216 130849 163019 100978 80712 98398 98081 131059 126482 103659 103793 86987
4734 86987 85057 119853 101860 37610 77573 108908 107976 72940 92607 98235 134977 171256 118848
4721 118848 85231 66130 49133 64526 60469 14754 44267 88478 84171 62314 123651 120803
$$ packed form
4808C62409k7847k3168K9436M899q921k6285l7162k0892j3717p38l7371l1046
4796A69597K9784J916o2846O666K5691j0641k1145j9754K1307L1045J6814l7456
4784A50978O132k8610k1882N5141j6230l4497l795j0398K2649N991L402k101j3883
4771A12897P411O091k3042M7171K8032k0042j1077n4837M21j0548j1087O3679
4759A35069J3653L6312L2001O2191O601j5359k1112j6224l4575k0910n7178L2487
4747A52956P1827n5567l8367L2170o2041k0266J7686l17L2978m577k2823J34j6806
4734H6987j930L4796j7993o4250L9963L1335r32l5036J9667N628L6742L6279n2408
4721A18848l3617j9101j6997J5393m057m5715K9513M4211m307k1857O1337k848
$$ plain form
4709 120803 91138 96945 72331 54595 61582 74505 113767 129912 56384 74929 100779 70533
4697 70533 118328 98402 109850 86255 85100 90677 132122 158387 181177 153510 153713 215016 250147
4684 250147 188263 165320 131077 117383 57236 95309 114409 93608 121315 121132 96023 102734
4672 102734 139563 108657 132569 129758 121392 119171 115560 117344 115891 69539 83874 82464 19871
4659 19871 43657 74057 44899 53565 96189 123368 98928 120266 103551 80088 74159 71387
4647 71387 85950 79937 102069 51369 68190 83379 38291 52169 79249 90900 76720 76847
4635 76847 66434 59051 19034 -4118 62874 44528 61877 98187 79110 111013 114207 89383
4623 89383 26378 78462 44434 44591 103971 76704 89876 120512 100633 88941 141875 132811
$$ packed form
4709A20803k9665N807k4614j7736O987J2923L9262J6145p3528J8545K5850l0246
4697G0533M7795j9926J1448k3595j155N577M1445K6265K2790k7667K03O1303L5131
4684B50147o1884k2943l4243j3694o0147L8073J9100k0801K7707j83k5109O711
4672A02734L6829l0906K3912k811q366k221l611J784j453m6352J4335j410o2593
4659A9871K3786L0400k9158Q666M2624K7179k4440K1338j6715k3463n929k772
4647G1387J4563o013K2132n0700J6821J5189m5088J3878K7080J1651j4180J27
4635G6847j0413p383m0017k3152O6992j8346J7349L6310j9077L1903L194k4824
4623H9383o3005N2084l4028J57N9380k7267J3172L0636j9879j1692N2934r064
$$ plain form
4611 132811 100188 95587 46058 44151 70516 91790 93280 46139 35200 58165 69237 35119
4599 35119 53494 56263 87604 54785 40482 102940 101618 73564 95449 70171 78249 84739 69162
4586 69162 39637 73851 60149 93099 77490 92181 109519 127068 105109 38230 84165 98321
4574 98321 115357 83167 93973 85672 88495 72472 59838 102862 134637 113177 125059 119581
4562 119581 136192 123095 125011 148765 144550 120004 92970 54843 84362 128824 116993 87480
4550 87480 118224 147527 148151 124173 115057 110346 131990 160711 131958 121281 139997 150429 189144
4537 189144 123960 118457 157514 157833 160181 188716 185863 183218 214553 183610 195882 181023 160947
4524 160947 179704 185584 198207 185543 204115 185601 181362 178941 155270 161834 143409 151040 212217
$$ packed form
4611A32811l2623m601m9529j907K6365K1274J490m7141j0939K2965J1072l4118
4599C5119J8375K769L1341l2819j4303O2458j322k8054K1885k5278Q078O490j5577
4586F9162k9525L4214j3702L2950j5609J4691J7338J7549k1959o6879M5935J4156
4574I8321J7036l2190J0806q301K823j6023j2634M3024L1775k1460J1882n478
4562A19581J6611j3097J916K3754m215k4546k7034l8127K9519M4462j1831k9513
4550H7480L0744K9303O24k3978r116m711K1644K8721k8753j0677J8716J0432L8715
4537A89144o5184n503L9057L19K348K8535k853k645L1335l0943J2272j4859k0076
4524A60947J8757N880J2623j2664J8572j8514m239k421k3671O564j8425P631O1177
$$ plain form
4511 212217 200820 167109 187542 230099 202936 172146 241878 215650 217975 240724 258876 264291
4499 264291 252536 206995 218388 241111 235313 231319 227906 227439 274518 250250 250083 296766 276546
4486 276546 283858 265042 286457 293976 330019 308718 294926 395738 371452 331225 345926 354452
4474 354452 418785 430814 392448 396440 471761 480874 471304 543436 579730 614695 663160 686338
4462 686338 711489 756500 801292 795335 813450 810607 773525 732419 727889 768815 742702 769306
4450 769306 797009 813510 897690 922831 937543 944157 929839 929586 919796 1022308 1032709 1018224
4438 1018224 1015170 977113 981970 968858 957348 984227 1002306 967077 958591 980816 936596 940416
4426 940416 927741 942880 948410 979169 1035893 1064933 1090182 1107976 1090942 1102954 1129204 1196033
$$ packed form
4511B12217j1397l3711K0433M2557k7163l0790O9732k6228K325K2749J8152N415
4499B64291j1755m5541J1393K2723n798l994l413m67M7079k4268j67M6683k0220
4486B76546P312j8816K1415P519L6043k1301j3792J00812k4286m0227J4701Q526
4474C54452O4333J2029l8366L992P5321R113r570P2132L6294L4965M8465K3178
4462F86338K5151M5011M4792n957J8115k843l7082m1106m530M0926k6113K6604
4450G69306K7703J6501Q4180K5141J4712O614j4318k53r790J02512J0401j4485
4438A018224l054l8057M857j3112j1510K6879J8079l5229q486K2225m4220L820
4426I40416j2675J5139N530L0759N6724K9040K5249J7794j7034J2012K6250O6829
$$ plain form
4414 1196033 1166803 1121702 1138442 1159062 1228511 1243566 1263572 1211297 1241943 1214607 1158507
4403 1158507 1151765 1115362 1071031 942861 897612 811704 740832 757102 670828 619563 606522
4392 606522 605388 556787 605251 662128 624969 589594 556298 565044 560294 526728 546116 494536
4380 494536 518744 568478 556027 579805 623178 594463 586126 601332 625441 607021 591238 584126
4368 584126 560971 558919 592023 577969 583260 579616 545843 516560 575591 620043 609667 658421
4356 658421 651864 720612 688125 649635 686782 699922 736654 736147 701605 732905 729972 791433
4344 791433 785495 805774 843512 901762 909766 921779 914005 992400 1051419 1085927 1108680 1118811
4332 1118811 1204156 1255663 1302321 1252120 1247618 1303714 1357247 1415225 1394077 1397806 1390090 1380052
$$ packed form
4414A196033k9230m5101J6740K0620O9449J5055K0006n2275L0646k7336n6100
4403A158507o742l6403m4331j28170m5249q5908p0872J6270q6274n1265j3041
4392F06522j134m8601M8464N6877l7159l5375l3296Q746m750l3566J9388n1580
4380D94536K4208M9734j2451K3778M3373k8715q337J5206K4109j8420j5783p112
4368E84126k3155k052L3104j4054N291l644l3773k9283N9031M4452j0376M8754
4356F58421o557O8748l2487l8490L7147J3140L6732n07l4542L1300k933O1461
4344G91433n938K0279L7738N8250Q004J2013p774P8395N9019L4508K2753J0131
4332A118811Q5345N1507M6658n0201m502N6096N3533N7978k1148L729p716j0038
$$ plain form
4320 1380052 1372324 1349227 1336959 1362444 1396991 1388121 1424924 1401997 1378613 1448261 1472462 1545048
4308 1545048 1628671 1638095 1612567 1566334 1468631 1457788 1452429 1405914 1409505 1366218 1405478 1414944
4296 1414944 1405566 1398010 1402093 1398196 1400534 1391841 1434860 1433236 1387287 1324252 1324681 1339848 1368590
4283 1368590 1381264 1319394 1283515 1308561 1325963 1333800 1331963 1327147 1289824 1285880 1221779 1220173
4271 1220173 1261000 1277647 1239333 1214975 1192883 1130265 1118501 1144032 1175552 1130317 1083882
4260 1083882 1086814 1047342 1013309 996409 962826 985817 1016097 1041881 1038919 1076796 1071234 1012593
4248 1012593 1024125 1017552 1048976 1045581 1055343 1035856 1067044 1102133 1131491 1114830 1108129 1131914
4236 1131914 1161438 1163351 1211120 1282884 1208721 1259883 1311840 1368510 1453832 1526615 1529970 1565590
$$ packed form
4320A380052p728k3097j2268K5485L4547q870L6803k2927k3384O9648K4201P2586
4308A545048Q3623R424k5528m6233r7703j0843n359m6515L591m3287L9260R466
4296A414944r378p556M083l897K338q693M3019j624m5949o3035M29J5167K8742
4283A368590J2674o1870l5879K5046J7402P837j837m816l7323l944o4101j606
4271A220173M0827J6647l8314k4358k2092o2618j1764K5531L1520m5235m6435
4260A083882K932l9472l4033j6900l3583K2991L0280K5784k962L7877n562n8641
4248A012593J1532o573L1424l395R762j9487L1188L5089K9358j6661o701K3785
4236A131914K9524J913M7769P1764p4163N1162N1957N6670Q5322P2783L355L5620
$$ plain form
4224 1565590 1564960 1514410 1468605 1460239 1463334 1449085 1416338 1409286 1442146 1437517 1464989 1436084 1422934
4211 1422934 1426819 1389939 1401351 1372192 1401929 1423820 1435888 1453831 1478631 1509723 1499433 1549155
4199 1549155 1592896 1578689 1617931 1627947 1602805 1615429 1593241 1556130 1569788 1575824 1586880 1574168
4187 1574168 1561029 1561075 1555227 1614668 1643210 1694310 1728665 1762004 1815777 1869419 1940551 1932083
4175 1932083 1981688 2065950 2071187 2035679 2086958 2121987 2169940 2216518 2266240 2284613 2364634 2433258
4163 2433258 2496680 2554633 2572032 2628056 2704841 2730243 2807462 2860649 2826334 2805066 2847504
4152 2847504 2860954 2835216 2876709 2894175 2950911 3008253 3038888 3033956 3099634 3183090 3257598 3276596
4140 3276596 3281068 3310881 3308921 3299355 3355370 3435959 3529927 3641428 3727668 3802902 3807513 3786663
$$ packed form
4224A565590o30n0550m5805q366L095j4249l2747p052L2860m629K7472k8905j3150
4211A422934L885l6880J1412k9159K9737K1891J2068J7943K4800L1092j0290M9722
4199A549155M3741j4207L9242J0016k5142J2624k2188l7111J3658O036J1056j2712
4187A574168j3139M6n848N9441K8542N1100L4355L3339N3773N3642P1132q468
4175A932083M9605Q4262N237l5508N1279L5029M7953M6578M9722J8373Q0021O8624
4163B433258O3422N7953J7399N6024P6785K5402P7219N3187l4315k1268M2438
4152B847504J3450k5738M1493J7466N6736N7342L0635m932O5678Q3456P4508J8998
4140C276596M472K9813j960r566N6015Q0589R3968J11501Q6240P5234M611k0850
$$ plain form
4128 3786663 3789691 3784625 3746933 3779759 3860234 3917474 3991237 4026825 4053625 4080851 4178870 4255094
4116 4255094 4290661 4435772 4599155 4724100 4846572 5019616 5176065 5399621 5595340 5820482
4106 5820482 6014885 6252201 6521415 6793852 7099465 7404581 7689446 7862819 7972249 8078769
4096 8078769 8214423 8418833 8726696 9063502 9578576 10243660 11088275 12132672 13360928
4087 13360928 14708186 15811390 16612468 17420690 17489126 16690903 15900870 15155993 14292649
4078 14292649 13584998 13170092 12874812 12677938 12493901 12441178 12581199 12855366 13247657 13730193
4068 13730193 14306048 14864171 15556496 16454786 17491073 18759720 20075503 21056295 21568583
4059 21568583 21787158 21153684 19468525 17861820 16761446 16037959 15491724 15066894 14849474
$$ packed form
4128C786663L028n066l7692L2826Q0475N7240P3763L5588K6800K7226R8019P6224
4116D255094L5567J45111J63383J24945J22472J73044J56449K23556J95719K25142
4106E820482J94403K37316K69214K72437L05613L05116K84865J73373J09430J06520
4096H078769J35654K04410L07863L36806N15074O65084Q44615J044397J228256
4087A3360928J347258J103204Q01078Q08222O8436p98223p90033p44877q63344
4078A4292649p07651m14906k95280j96874j84037n2723J40021K74167L92291M82536
4068A3730193N75855N58123O92325Q98290J036287J268647J315783R80792N12288
4059B1568583K18575o33474j685159j606705j100374p23487n46235m24830k17420
$$ plain form
4050 14849474 14616718 14485986 14525429 14647727 14961185 15355642 15839483 16426985 17034069 17705768
4040 17705768 18454939 19188674 19876252 20406249 20876621 21140063 21349716 21653475 22152312
4031 22152312 22794409 23639699 24679740 25923399 27423284 29277771 31432936 34085662
4023 34085662 37433518 41692033 47016363 53818320 62271651 72224495 82026947 88947406
4015 88947406 86379995 74651604 62639434 53592099 47377619 43054710 40100197 37848791
4007 37848791 35938235 34083107 32214895 30402639 28702154 27299718 26322300 25611507
3999 25611507 25296087 25210247 25136814 25076899 24924608 24655065 24194941 23517408 22764418 22101660
3989 22101660 21609091 21330524 21221279 21275078 21422531 21679681 21956520 22087599 22005708 21626915
$$ packed form
4050A4849474k32756j30732L9443J22298L13458L94457M83841N87502O07084O71699
4040A7705768P49171P33735O87578N29997M70372K63442K09653L03759M98837
4031B2152312O42097Q45290J040041J243659J499885J854487K155165K652726
4023C4085662L347856M258515N324330O801957Q453331R952844R802452O920459
4015H8947406k567411j1728391j2012170r047335o214480m322909k954513k251406
4007C7848791j910556j855128j868212j812256j700485j402436r77418p10793
3999B5611507l15420q5840p3433n9915j52291k69543m60124o77533p52990o62758
3989B2101660m92569k78567j09245N3799J47453K57150K76839J31079q1891l78793
$$ plain form
3979 21626915 21063800 20354581 19681217 19139383 18756845 18538311 18541681 18642882 18897162 19265573
3969 19265573 19872952 20677245 21673656 22872321 24174370 25435842 26361288 26663821 26122930
3960 26122930 24893487 23263587 21574761 20056616 18694832 17611972 16776200 16095775
3952 16095775 15591151 15244490 15052569 14900124 14892188 15068240 15291749 15609157 16033755 16526443
3942 16526443 16996736 17423381 17725827 17677385 17216637 16453687 15418328 14342779 13429327
3933 13429327 12593657 11900196 11294782 10779971 10340551 9998121 9709265 9481309 9287524
3924 9287524 9162963 9022717 8900618 8858932 8859367 8804029 8719234 8770368 8930092 9125355 9331689
3913 9331689 9549626 9969707 10450153 10901926 11413790 11913927 12188280 12135564 11906071 11507345
$$ packed form
3979B1626915n63115p09219o73364n41834l82538k18534L370J01201K54280L68411
3969A9265573O07379Q04293R96411J198665J302049J261472R25446L02533n40891
3960B6122930j229443j629900j688826j518145j361784j082860q35772o80425
3952A6095775n04624l46661j91921j52445p936J76052K23509L17408M24598M92688
3942A6526443M70293M26645L02446m8442m60748p62950j035359j075549r13452
3933A3429327q35670o93461o05414n14811m39420l42430k88856k27956j93785
3924I287524j24561j40246j22099m1686M35n5338q4795N1134J59724J95263K06334
3913I331689K17937M20081M80446M51773N11864N00137K74353n2716k29493l98726
$$ plain form
3903 11507345 11085033 10632196 10241564 9835961 9509486 9067210 8668625 8342131 8082271
3894 8082271 7910439 7867151 7877583 7963192 8091580 8293265 8572205 8863227 9212297 9430794
3884 9430794 9472949 9374861 9242290 9151957 9130093 9059897 8912634 8603196 8220379 7820811
3874 7820811 7492514 7184931 6985681 6806094 6614639 6582483 6576909 6543220 6546892 6568846 6661289
3863 6661289 6744716 6805143 6863949 6846378 6856004 6919949 7013112 7122641 7302541 7511736 7741388
3852 7741388 8119315 8507395 8954458 9537708 10211627 10944368 11841584 12746652 13553182 14215287
3842 14215287 14535280 14293374 13708807 12928410 12093793 11274010 10565218 10027356 9649840
3833 9649840 9363002 9182369 9071866 9018054 9004633 9047875 9109311 9252945 9491251 9857854
$$ packed form
3903A1507345m22312m52837l90632m05603l26475m42276l98585l26494k59860
3894H082271j71832m3288J0432Q5609J28388K01685K78940K91022L49070K18497
3884I430794M2155r8088j32571r0333k1864p0196j47263l09438l82817l99568
3874G820811l28297l07583j99250j79587j91455l2156n574l3689L672K1954R2443
3863F661289Q3427O0427N8806j7571R626O3945R3163J09529J79900K09195K29652
3852G741388L77927L88080M47063N83250O73919P32741Q97216R05068Q06530O62105
3842A4215287L19993k41906n84567p80397q34617q19783p08792n37862l77516
3833I649840k86838j80633j10503n3812j3421M3242O1436J43634K38306L66603
$$ plain form
3823 9857854 10300947 10875340 11575910 12385037 13175522 13677860 13753013 13335689 12519970 11651284
3813 11651284 11023358 10472038 10165056 10000390 9967170 10050923 10230917 10526866 10914525 11468738
3803 11468738 12122372 12853055 13552532 14040657 14329468 14341852 14140438 13945785 13756364 13829158
3793 13829158 14028778 14389192 14922562 15438833 15795823 15948985 15786503 15261778 14496104
3784 14496104 13690998 12879337 12268242 11794215 11415445 11251078 11187884 11233551 11400199 11567134
3774 11567134 11596233 11611500 11457811 11118165 10732926 10335824 10002272 9757496 9573199 9529777
3764 9529777 9573133 9667711 9874751 10246041 10693643 11220736 11774525 12365361 12743060 12893501
3754 12893501 12790849 12563825 12301112 12082433 11989820 12102200 12286627 12468098 12612242 12382162
$$ packed form
3823I857854M43093N74393P00570Q09127P90485N02338P5153m17324q15719q68686
3813A1651284o27926n51320l06982j64666l3220Q3753J79994K95949L87659N54213
3803A1468738O53634P30683O99477M88125K88811J2384k01414j94653j89421P2794
3793A3829158J99620L60414N33370N16271L56990J53162j62482n24725p65674
3784A4496104q05106q11661o11095m74027l78770j64367o3194M5667J66648J66935
3774A1567134K9099J5267j53689l39646l85239l97102l33552k44776j84297m3422
3764I529777M3356R4578K07040L71290M47602N27093N53789N90836L77699J50441
3754A2893501j02652k27024k62713k18679r2613J12380J84427J81471J44144k30080
$$ plain form
3744 12382162 11701953 10842019 9895326 8952574 8254317 7704233 7304129 6968638 6769209
3735 6769209 6606167 6454133 6439030 6429793 6483472 6585526 6721200 6977309 7287441 7600182
3725 7600182 7929293 8155659 8323937 8291524 8137589 8017219 7985870 7964843 8086387 8294961
3715 8294961 8539511 8661298 8579777 8269063 7778412 7169636 6628632 6154902 5692842 5340159
3705 5340159 5117350 4918202 4677830 4586075 4464936 4289525 4263490 4262380 4340670 4421824 4521199
3694 4521199 4682168 4734552 4731510 4604684 4412076 4230859 4086178 3919904 3830549 3824459 3826585
3683 3826585 3914407 4021489 4247124 4477270 4654416 4733906 4542962 4205202 3758657 3362779
3673 3362779 3075733 2882097 2718516 2551858 2479184 2382805 2296186 2205000 2203973 2110311 2082121
$$ packed form
3744A2382162o80209q59934r46693r42752o98257n50084m00104l35491j99429
3735F769209j63042j52034j5103r237N3679J02054J35674K56109L10132L12741
3725G600182L29111K26366J68278l2413j53935j20370l1349k1027J21544K08574
3715H294961K44550J21787q1521l10714m90651o08776n41004m73730m62060l52683
3705E340159k22809j99148k40372r1755j21139j75411k6035j110P8290Q1154R9375
3694D521199J60969N2384l042j26826j92608j81217j44681j66274q9355o090K126
3683C826585Q7822J07082K25635K30146J77146P9490j90944l37760m46545l95878
3673C362779k87046j93636j63581j66658p2674r6379q6619r1186j027r3662k8190
$$ plain form
3662 2082121 2118711 2110554 2094643 2061571 2068045 2126077 2199323 2266641 2340662 2401490 2520601 2655209
3650 2655209 2809897 2850073 2875938 2886966 2821388 2668715 2501727 2367236 2260849 2142864
3640 2142864 2119402 2090582 2089644 2113250 2175893 2209052 2280151 2341946 2392343 2399405 2301843 2193704
3628 2193704 2116607 1996256 1859554 1753412 1697898 1608169 1512442 1450246 1426297 1384343 1322946
3617 1322946 1281144 1285593 1305199 1313668 1347690 1360247 1227368 1215770 1219512 1289352 1246500 1214631
3605 1214631 1223885 1240822 1268947 1313219 1310821 1247622 1212700 1176649 1250517 1226101 1221248 1162515
3593 1162515 1121203 1127444 1118644 1098679 1103651 1102810 1168285 1210714 1179461 1171788 1179306 1235637 1202911
3580 1202911 1181777 1246816 1253760 1228729 1237904 1267557 1288819 1224534 1208411 1253545 1241329 1219357
$$ packed form
3662B082121L6590q157j5911l3072O474N8032P3246O7318P4021O0828J19111J34608
3650B655209J54688M0176K5865J1028o5578j52673j66988j34491j06387j17985
3640B142864k3462k8820r38K3606O2643L3159P1099O1795N0397P062r7562j08139
3628B193704p7097j20351j36702j06142n5514q9729r5727o2196k3949m1954o1397
3617A322946m1802M449J9606Q469L4022J2557j32879j1598L742O9840m2852l1869
3605A214631R254J6937K8125M4272k398o3199l4922l6051P3868k4416m853n8733
3593A162515m1312O241q800j9965M972q41O5475M2429l1253p673P518N6331l2726
3580A202911k1134O5039O944k5031R175K9653K1262o4285j6123M5134j2216k1972
$$ plain form
3568 1219357 1173638 1215448 1279268 1286660 1286060 1298349 1318439 1350345 1360867 1365262 1409649 1439420
3556 1439420 1448227 1484005 1488344 1466743 1513251 1515666 1479917 1487537 1560056 1624731 1641468 1660764
3544 1660764 1681419 1713999 1758184 1774257 1801863 1862856 1885577 2011987 2125654 2177647 2289217
3533 2289217 2466386 2695025 2882301 3056261 3222809 3309248 3328988 3284174 3181455 2977557
3523 2977557 2788916 2602903 2439105 2297791 2140719 1990724 1908417 1889965 1838034 1803751
3513 1803751 1770310 1837884 1885213 1877134 1894936 1940768 1945648 1948439 1953200 1950863 1959566 2021464 1987118
3500 1987118 1971149 1951280 1961222 1992579 1993268 2018320 2041419 2087050 2114481 2184488 2186590 2208633
3488 2208633 2225171 2250169 2289749 2348755 2329207 2349538 2359329 2374199 2316989 2314288 2372913 2477352
$$ packed form
3568A219357m5719M1810O3820P392o00J2289K0090L1906J0522M395M4387K9771
3556A439420Q807L5778M339k1601M6508K415l5749P620P2519O4675J6737J9296
3544A660764K0655L2580M4185J6073K7606O0993K2721J26410J13667N1993J11570
3533B289217J77169K28639J87276J73960J66548Q6439J9740m4814j02719k03898
3523B977557j88641j86013j63798j41314j57072j49995q2307j8452n1931l4283
3513A803751l3441O7574M7329q079J7802M5832M880K791M761k337Q703O1898l4346
3500A987118j5969j9869R942L1357O89K5052K3099M5631K7431P0007K102K2043
3488B208633J6538K4998L9580N9006j9548K0331R791J4870n7210k701N8625J04439
$$ plain form
3476 2477352 2525862 2635638 2682844 2762029 2806381 2853687 2893214 2914731 2969509 3037258 3040178
3465 3040178 3062553 3077648 3124688 3237599 3350765 3338823 3401088 3366179 3398704 3441245 3447533
3454 3447533 3482302 3536677 3639374 3703151 3748590 3795246 3882277 3945935 4015714 4067546 4099898
3443 4099898 4188911 4277065 4407914 4467020 4551246 4628024 4735012 4854616 4976649 5093653
3433 5093653 5170794 5373417 5409357 5489609 5652456 5728722 5836272 5907044 6034832 6209376
3423 6209376 6368088 6462217 6579417 6722599 6927497 7072213 7143315 7253520 7254935 7272998
3413 7272998 7386912 7612652 7825378 8105244 8368287 8646349 8860022 9034255 9230204 9423868
3403 9423868 9567801 9807134 10054573 10284556 10529370 10776275 11144279 11605046 11964659 12338039
$$ packed form
3476B477352M8510J09776M7206P9185M4352M7306L9527K1517N4778O7749K920
3465C040178K2375J5095M7040J12911J13166j1942O2265l4909L2525M2541O288
3454C447533L4769N4375J02697O3777M5439M6656Q7031O3658O9779N1832L2352
3443D099898Q9013Q8154J30849N9106Q4226P6778J06988J19604J22033J17004
3433E093653P7141K02623L5940Q0252J62847P6266J07550P0772J27788J74544
3423F209376J58712R4129J17200J43182K04898J44716P1102J10205J415J8063
3413G272998J13914K25740K12726K79866K63043K78062K13673J74233J95949J93664
3403I423868J43933K39333K47439K29983K44814K46905L68004M60767L59613L73380
$$ plain form
3393 12338039 12651320 13104827 13511883 13892754 14298410 14783909 15238251 15742759 16233469
3384 16233469 16740348 17212968 17675708 18123400 18543418 18907481 19329795 19784620 20427268
3375 20427268 21156158 22015685 23012273 24058245 24999207 26060090 27052559 28182868 29443953
3366 29443953 30922987 32274975 33961311 36033606 38791205 41857162 45433029 49253065
3358 49253065 53577318 58239977 63547533 69224719 76068991 84345754 95958583 111284080
3350 111284080 132270724 159721172 195261148 232908407 267165797 264863284 214925569
3343 214925569 164145299 128700670 104918784 88084997 76343260 67437406 60588932
3336 60588932 54800913 49982866 45788950 42491360 39995577 38378096 37123658 36363388
$$ packed form
3393A2338039L13281M53507M07056L80871M05656M85499M54342N04508M90710
3384A6233469N06879M72620M62740M47692M20018L64063M22314M54825O42648
3375B0427268P28890Q59527R96588J045972R40962J060883R92469J130309J261085
3366B9443953J479034J351988J686336K072295K757599L065957L575867L820036
3358D9253065M324253M662659N307556N677186O844272Q276763J1612829J5325497
3350A11284080K0986644K7450448L5539976L7647259L4257390k302513m9937715
3343B14925569n0780270l5444629k3781886j6833787j1741737q905854o848474
3336F0588932n788019m818047m193916l297590k495783j617481j254438p60270
$$ plain form
3328 36363388 35764465 35298864 34881957 34758962 35059554 35986331 37396826 39388461 41719109
3319 41719109 44060432 45194490 43819374 40443958 37062015 34424156 32455958 30905353
3311 30905353 29668380 28763712 28122149 27658343 27368631 27216870 27154507 27237206 27410392 27689724
3301 27689724 27977553 28353447 28845185 29473449 30128193 30925147 31871963 33046794 34234778
3292 34234778 35178607 35573544 35517751 35343807 35188419 35043514 34924127 34776878 34748087 34831368
3282 34831368 35024785 35371690 35763204 36178121 36574403 36919999 37440991 37967207 38571750
3273 38571750 39268324 40171404 41321072 42795394 44374793 46015472 47703179 49521348
3265 49521348 51434883 53484946 55787620 58423816 61348085 64828924 69105616 74255822
$$ packed form
3328C6363388n98923m65601m16907j22995L00592R26777J410495J991635K330648
3319D1719109K341323J134058j375116l375416l381943k637859j968198j550605
3311C0905353j236973r04668o41563m63806k89712j51761o2363Q2699J73186K79332
3301B7689724K87829L75894M91738O28264O54744P96954R46816J174831J187984
3292C4234778R43829L94937n5793j73944j55388j44905j19387j47249k8791Q3281
3282C4831368J93417L46905L91514M14917L96282L45596N20992N26216O04543
3273C8571750O96574R03080J149668J474322J579399J640679J687707J818169
3265D9521348J913535K050063K302674K636196K924269L480839M276692N150206
$$ plain form
3257 74255822 80148005 86879731 94334645 102621748 111854242 122324654 134181509 148446978
3249 148446978 166260261 189698708 220147569 259283274 307924296 363948467 417561687
3242 417561687 448399410 425922965 359357686 289668516 234532598 193597032 162965179
3235 162965179 140021058 121941649 107271440 95008374 84570899 75647286 68328078
3228 68328078 62421048 57679022 53687479 50346934 47437430 44653739 41968610 39501944
3220 39501944 37340948 35397133 33578345 32031004 30766104 29632621 28663198 27879490
3212 27879490 27013200 26007994 24975944 23986485 22934914 21983869 21154442 20395171 19718283
3203 19718283 19001323 18061118 17053553 16239161 15555085 14888590 14324120 13744153 13230012
$$ packed form
3257G4255822N892183O731726P454914Q287103R232494J0470412J1856855J4265469
3249A48446978J7813283K3438447L0448861L9135705M8641022N6024171N3613220
3242D17561687L0837723k2476445o6565279o9689170n5135918m0935566l0631853
3235A62965179k2944121j8079409j4670209j2263066j0437475q923613p319208
3228F8328078n907030m742026l991543l340545k909504k783691k685129k466666
3220C9501944k160996j943815j818788j547341j264900j133483r69423p83708
3212B7879490q66290j005206j032050r89459j051571r51045q29427p59271o76888
3203A9718283p16960r40205j007565q14392o84076o66495n64470n79967n14141
$$ plain form
3194 13230012 12752458 12373799 12034730 11725456 11405690 11092263 10769688 10491667 10169143
3185 10169143 9844184 9545223 9232966 8951169 8611242 8397913 8207202 8085778 7985396
3176 7985396 7884116 7802183 7642643 7452524 7227229 6951948 6695738 6408963 6154924 5932244
3166 5932244 5750771 5626766 5492803 5387062 5279018 5255151 5139782 5002826 4925369 4859064
3156 4859064 4825681 4786065 4697826 4638041 4616336 4528094 4413342 4276313 4205931 4147805 3964190
3145 3964190 3848547 3795492 3751230 3668930 3595274 3518343 3439239 3339632 3220565 3141381 3081011
3134 3081011 2918264 2746656 2701281 2620848 2546967 2545697 2486406 2407473 2361033 2389975 2320619
3123 2320619 2311599 2326472 2291082 2294088 2259154 2192686 2167589 2164549 2211557 2216084 2168531 2188335
$$ packed form
3194A3230012m77554l78659l39069l09274l19766l13427l22575k78021l22524
3185A0169143l24959k98961l12257k81797l39927k13329j90711j21424j00382
3176G985396j01280q1933j59540j90119k25295k75281k56210k86775k54039k22680
3166E932244j81473j24005j33963j05741j08044k3867j15369j36956p7457o6305
3156D859064l3383l9616q8239n9785k1705q8242j14752j37029p0382n8126j83615
3145C964190j15643n3055m4262q2300p3656p6931p9104r9607j19067p9184o0370
3134C081011j62747j71608m5375q0433p3881j270n9291p8933m6440K8942o9356
3123B320619r020J4873l5390L006l4934o6468k5097l040M7008M527m7553J9804
$$ plain form
3111 2188335 2217522 2189830 2207536 2170032 2110587 2007968 1956207 1917359 1838350 1790655 1801383
3100 1801383 1793172 1784012 1804413 1757033 1797923 1800989 1793728 1795046 1805790 1791732 1784755 1766544 1689250
3087 1689250 1671622 1654885 1578490 1588110 1595830 1549692 1584549 1608914 1621144 1619448 1632601 1709496
3075 1709496 1739767 1767041 1825012 1852231 1811912 1761240 1691775 1636020 1557304 1497923 1525366
3064 1525366 1554948 1675866 1774382 1824411 1943505 2050409 2139430 2154946 2085176 1919332 1835286
3053 1835286 1732101 1640540 1444399 1321742 1277657 1150703 1110378 1044246 953932 926684 882202
3042 882202 823392 827361 789054 715348 697982 744273 760358 768382 774529 815010 789544 760294
3030 760294 806014 810724 820110 842756 823740 818458 826013 780290 742797 733906 723683 760967 754940
$$ packed form
3111B188335K9187k7692J7706l7504n9445j02619n1761l8848p9009m7695J0728
3100A801383q211r160K0401m7380M0890L066p261J318J0744j4058o977j8211p7294
3087A689250j7628j6737p6395R620P720m6138L4857K4365J2230j696J3153P6895
3075A709496L0271K7274N7971K7219m0319n0672o9465n5755p8716n9381K7443
3064A525366K9582J20918R8516N0029J19094J06904Q9021J5516o9770j65844q4046
3053A835286j03185r1561j96141j22657m4085j26954m0325o6132r0314k7248m4482
3042H82202n8810L969l8307p3706j7366M6291J6085Q024O147M0481k5466k9250
3030G60294M5720M710R386K2646j9016n282P555m5723l7493q891j0223L7284o027
$$ plain form
3017 754940 753463 743371 696319 669989 680199 715902 691435 700150 691171 712021 719198 682044
3005 682044 659129 680061 696332 696869 698227 669489 680979 684674 690231 654090 670712 669885 628359
2992 628359 654273 664585 673154 694896 690637 703208 722691 681855 652681 666817 637168 661942
2980 661942 688658 659682 663556 659643 728050 719236 672948 691779 742779 756803 798114 791776
2968 791776 820205 822853 829680 890757 943730 986550 1068584 1225833 1304934 1469121 1648948
2957 1648948 1796849 2022829 2156597 2252093 2273687 2161670 1979625 1830339 1688295 1451074
2947 1451074 1245393 1158735 1043816 975753 910632 812212 787000 700846 638543 624187 645396
2936 645396 629374 600153 562395 501698 493415 481622 515612 495093 499074 542280 455684 480051
$$ packed form
3017G54940j477j0092m7052k6330J0210L5703k4467Q715q979K0850P177l7154
3005F82044k2915K0932J6271N37J358k8738J1490L695N557l6141J6622q27m1526
2992F28359K5914J0312Q569K1742m259J2571J9483m0836k9174J4136k9649K4774
2980F61942K6716k8976L874l913O8407q814m6288J8831N1000J4024M1311o338
2968G91776K8429K648O827O1077N2973M2820Q2034J57249P9101J64187J79827
2957A648948J47901K25980J33768R5496K1594j12017j82045j49286j42044k37221
2947A451074k05681q6658j14919o8063o5121r8420k5212q6154o2303j4356K1209
2936F45396j6022k9221l7758o0697q283j1793L3990k0519L981M3206q6596K4367
$$ plain form
2924 480051 470009 441542 445296 386486 388374 429958 438189 472361 470313 431940 435383 421855 398672
2911 398672 415206 380003 363356 333473 363416 394733 350418 346956 361137 396730 393976 382363
2899 382363 327594 342248 335899 353444 349060 325473 319308 288271 270719 224210 242727 332791
2887 332791 319423 207821 192573 221126 240738 218625 183427 208564 178425 127829 166533
2876 166533 163993 169355 191247 160848 135552 182229 200969 202468 228536 251477 206390 185637
2864 185637 182933 170394 134365 136705 164073 184764 174144 186014 173267 174482 187754 182980
2852 182980 183726 136137 138252 165520 264839 235565 220041 216857 171585 190218 217249 174156
2840 174156 100582 84157 65807 87190 127020 144316 166197 178321 155243 126116 119708 158794
$$ packed form
2924D80051j0042k8467L754n8810J888M1584Q231L4172k048l8373L443j3528k3183
2911C98672J6534l5203j6647k9883K9943L1317m4315l462J4181L5593k754j1613
2899C82363n4769J4654o349J7545m384k3587o165l1037j7552m6509J8517R0064
2887C32791j3368j11602j5248K8553J9612k2113l5198K5137l0139n0596L8704
2876A66533k540N362K1892l0399k5296M6677J8740J499K6068K2941m5087k0753
2864A85637k704j2539l6029K340K7368K0691j0620J1870j2747J215J3272m774
2852A82980P46m7589K115K7268R9319k9274j5524l184m5272J8633K7031m3093
2840A74156p3574j6425j8350K1383L9830J7296K1881J2124k3078k9127o408L9086
$$ plain form
2828 158794 174947 197960 245053 230946 160276 138986 166278 145419 107789 166903 192317 147312
2816 147312 123922 125564 146330 170745 144059 211238 239765 168436 132331 107698 132579 168314
2804 168314 167087 186492 127989 134732 138222 155970 111749 85389 92177 61866 56800 33548 98067
2791 98067 105950 92526 82322 89866 120847 104040 120434 146228 128827 116180 47846 61064
2779 61064 27097 31703 26377 50079 55852 48602 97204 99040 51632 43473 70751 68317 66980
2766 66980 34842 71937 72618 108816 123995 97832 90997 95404 62520 56616 69685 57419 41040
2753 41040 64995 86568 72690 114788 46633 57617 115969 126614 93355 56658 23755 22042
2741 22042 77439 87839 91860 102937 57520 58576 92785 13672 5492 83367 53885 69636
$$ packed form
2828A58794J6153K3013M7093j4107p0670k1290K7292k0859l7630N9114K5414m5005
2816A47312k3390J642K0766K4415k6686O7179K8527p1329l6105k4633K4881L5735
2804A68314j227J9405n8503O743L490J7748m4221k6360O788l0311n066k3252O4519
2791I8067P883j3424j0204P544L0981j6807J6394K5794j7401j2647o8334J3218
2779F1064l3967M606n326K3702N773p250M8602J836m7408q159K7278k434j337
2766F6980l2138L7095O81L6198J5179k6163o835M407l2884n904J3069j2266j6379
2753D1040K3955K1573j3878M2098o8155J0984N8352J0645l3259l6697l2903j713
2741B2042N5397J0400M021J1077m5417J056L4209p9113q180P7875k9482J5751
$$ plain form
2729 69636 70802 74774 39770 58836 74426 27501 18365 52467 67760 92088 78863 42332
2717 42332 39636 49845 -8102 -44631 -15004 882 -14012 -27540 -48804 -53969 25697 -36917
2705 -36917 -64527 -63780 -59933 -2176 -15316 10104 -8481 21250 -16696 -27129 10330 24448
2693 24448 30749 13505 -41986 -17544 -29243 -43084 8154 5599 14615 -2079 22631 -18920
2681 -18920 39977 44942 11322 34563 71104 51205 13900 -6751 -85239 -55460 12985 -23601
2669 -23601 -2908 -23485 -9975 19748 27808 15615 69832 77559 54802 19650 32417 40263
2657 40263 30471 -4853 -1028 50033 28191 20047 -18133 -13990 -33911 -18731 -17974 -67955 -7048
2644 -7048 -1381 -12330 -28590 -4605 52349 25861 14460 36424 21302 28576 -620 3801 23792
$$ packed form
2729F9636J166L972l5004J9066J5590m6925r136L4102J5293K4328j3225l6531
2717D2332k696J0209n7947l6529K9627J5886j4894j3528k1264n165P9666o2614
2705c6917k7610P47L847N7757j3140K5420j8585K9731l7946j0433L7459J4118
2693B4448O301j7244n5491K4442j1699j3841N1238k555R016j6694K4710m1551
2681a8920N8897M965l3620K3241L6541j9899l7305k0651p8488K9779O8445l6586
2669b3601K0693k0577J3510K9723Q060j2193N4217P727k2757l5152J2767P846
2657D0263r792l5324L825N1061k1842q144l8180M143j9921J5180P57m9981O0907
2644g048N667j0949j6260K3985N6954k6488j1401K1964j5122P274k9196M421J9991
$$ plain form
2631 23792 31574 4760 -48435 -59294 -63968 -9378 19539 16801 12419 -36069 -40403 -38741 -63387
2618 -63387 411 5917 21576 3869 -31554 -15776 -24071 -41423 -21169 -66894 -51843 -59696
2606 -59696 -52832 -15038 -29809 -24356 -81579 -79028 -79539 -69216 -45989 -11148 -79103 -47457 -33629
2593 -33629 -39088 -26785 -35000 -35190 -16025 25479 -2707 -31446 -22266 3563 34234 35262 -56815
2580 -56815 -45610 20426 -25384 -63970 -18489 -14301 -49441 -75000 -65954 -23965 -31229 -15833
2568 -15833 35763 -31198 -65625 -40850 -62888 -74521 -24414 -53615 -76666 -50577 -13239 -36677
2556 -36677 -27424 -40324 -94141 -86540 -66676 -82008 -43723 -22424 -25376 -68262 -27574 -12501
2544 -12501 -27136 -48372 -25243 -40535 -75205 -10135 29976 -8062 -9310 -34632 -46306 -55893
$$ packed form
2631B3792P782k6814n3195j0859m674N4590K8917k738m382m8488m334J662k4646
2618f3387O3798N506J5659j7707l5423J5778q295j7352K0254m5725J5051p853
2606e9696O864L7794j4771N453n7223K551n11J0323K3227L4841o7955L1646J3828
2593c3629n459J2303q215j90J9165M1504k8186k8739R180K5829L0671J028r2077
2580e6815J1205O6036m5810l8586M5481M188l5140k5559R046M1989p264J5396
2568a5833N1596o6961l4427K4775k2038j1633N0107k9201k3051K6089L7338k3438
2556c6677R253j2900n3817P601J9864j5332L8285K1299k952m2886M0688J5073
2544a2501j4635k1236K3129j5292l4670O5070M0111l8038j248k5322j1674r587
$$ plain form
2532 -55893 -38138 -12756 -20706 -15629 -44101 -57995 -58519 -64783 -75970 -64868 -101240 -109418 -87380
2519 -87380 -104159 -39044 28466 -6896 -33121 -74352 -50313 -60182 -29894 -95064 -67586 -17547
2507 -17547 -12022 -18014 -13704 -9668 350 8265 -36381 -29641 -43466 -50034 7044 -30769 -75810
2494 -75810 -21570 -17060 -36414 14136 -10201 -60623 -29521 -9440 -36738 -50055 -74471 -43459
2482 -43459 -56756 -68919 -25929 1512 -13344 -10348 -10788 -22676 15598 13703 -23273 -3806 28496
2469 28496 -26820 -36141 -48128 -56416 -36672 -23084 -41102 -66107 -82860 -40625 -4647 14109
2457 14109 22326 -24643 -27772 -52570 -65070 -32002 4607 -16665 -4786 10414 -38879 -43793
2445 -43793 -19645 50405 63752 63167 39456 42241 46238 40503 -34544 -56789 -25024 -29359 -25855
$$ packed form
2532e5893J7755K5382p950N077k8472j3894n24o264j1187J1102l6372q178K2038
2519h7380j6779O5115O7510l5362k6225m1231K4039r869L0288o5170K7478N0039
2507a7547N525n992M310M036J0018P915m4646O740j3825o568N7078l7813m5041
2494g5810N4240M510j9354N0550k4337n0422L1102K0081k7298j3317k4416L1012
2482d3459j3297j2163M2990K7441j4856K996m40j1888L8274j895l6976J9467L2302
2469B8496n5316r321j1987q288J9744J3588j8018k5005j6753M2235L5978J8756
2457A4109Q217m6969l129k4798j2500L3068L6609k1272J1879J5200m9293m914
2445d3793K4148P0050J3347n85k3711K785L997n735p5047k2245L1765m335L504
$$ plain form
2432 -25855 -51873 -80053 -79117 -70229 -43747 -50806 -37588 -29913 10919 3820 -36864 -32496 -7823
2419 -7823 14800 -4274 -25287 -11918 27090 13898 -43317 -66160 -38218 -41424 -54172 -13204
2407 -13204 -45247 -66858 -89767 -66501 -21707 -22389 -32109 -12940 -5069 3825 -48140 -60602 14149
2394 14149 -22670 -29463 -38157 -49525 -52133 -107715 -83064 -45483 -20607 -2497 -21528 -10976
2382 -10976 -22901 -22354 -8371 -27962 -56304 -14136 -7254 -22333 -18713 -17689 -29257 -5777 -1485
2369 -1485 -1031 16333 44003 64306 -7144 -68014 -28723 -15573 15074 29532 25345 61339 49303
2356 49303 61412 119746 111377 91343 39781 -1653 -29157 50393 26569 -4538 -47351 -71469
2344 -71469 -9507 20269 -26120 -56023 -26795 -5925 15065 -14449 2072 34925 22747 9090
$$ packed form
2432b5855k6018k8180R36Q888K6482p059J3218P675M0832p099m0684M368K4673
2419g823K2623j9074k1013J3369L9008j3192n7215k2843K7942l206j2748M0968
2407a3204l2043k1611k2909K3266M4794o82r720J9169P871Q894n1965j2462P4751
2394A4149l6819o793q694j1368k608n5582K4651L7581K4876J8110j9031J0552
2382a0976j1925N47J3983j9591k8342M2168O882j5079L620J024j1568K3480M292
2369a485M54J7364K7670K0303p1450o0870L9291J3150L0647J4458m187L5994j2036
2356D9303J2109N8334q369k0034n1562m1434k7504P9550k3824l1107m2813k4118
2344g1469O1962K9776m6389k9903K9228K0870K0990k9514J6521L2853j2178j3657
$$ plain form
2332 9090 25002 22523 15191 4889 3423 45799 -3864 -11473 -23613 -35738 -10914 18293 3019
2319 3019 -36488 -14134 -21269 -25935 -13110 -47771 -36070 -13609 8518 -8847 -34221 7798
2307 7798 -9224 2156 27725 30367 27074 59255 20620 6653 2413 -51649 7387 29615 -14804
2294 -14804 -67653 -68075 -73045 -21907 8276 62142 56658 -17816 -7680 2213 8900 30179 75055
2281 75055 84751 11852 -4916 17885 31074 10468 13971 41955 -1188 -45996 -38680 19606
2269 19606 1848 -33871 -32021 -16649 -6477 18212 34413 46270 18956 42328 7270 42763
2257 42763 54946 44249 5705 65298 49234 39141 -16018 -30080 2159 17357 52671 74685
2245 74685 67634 70829 47102 38330 21077 58255 73108 49397 79448 57600 25946 74965
$$ packed form
2332I090J5912k479p332j0302j466M2376m9663p609j2140j2125K4824K9207j5274
2319C019l9507K2354p135m666J2825l4661J1701K2461K2127j7365k5374M2019
2307G798j7022J1380K5569K642l293L2181l8635j3967m240n4062N9036K2228m4419
2294a4804n2849m22m970N1138L0183N3866n484p4474J0136R893O687K1279M4876
2281G5055R696p2899j6768K2801J3189k0606L503K7984m3143m4808P316N8286
2269A9606j7758l5719J850J5372J0172K4689J6201J1857k7314K3372l5058L5493
2257D2763J2183j0697l8544N9593j6064j0093n5159j4062L2239J5198L5314K2014
2245G4685p051L195k3727q772j7253L7178J4853k3711L0051k1848l1654M9019
$$ plain form
2233 74965 62400 91250 105681 74273 56808 -2884 58814 61221 25963 33937 51227 109346
2221 109346 134090 130687 78809 64287 121060 151830 112948 84252 137756 171283 135728 130878
2209 130878 122111 83457 87803 98950 107988 194619 186461 159371 167279 127987 163009 247147 207688
2196 207688 139334 167146 157908 134734 144393 150661 170454 183873 169719 200817 219590 242075
2184 242075 223774 194542 219577 245254 221098 223531 222797 278328 236218 233359 245317 241754 268865
2171 268865 310450 366904 384923 328791 321326 353275 389709 374429 365112 373179 416837 436130
2159 436130 472944 460105 457753 433976 397329 441535 506884 467972 507446 504557 537291 557139
2147 557139 544884 540731 582964 565106 616297 662522 683369 735503 749641 792548 797847 829818
$$ packed form
2233G4965j2565K8850J4431l1408j7465n9692O1698K407l5258P974J7290N8119
2221A09346K4744l403n1878j4522N6773L0770l8882k8696N3504L3527l5555m850
2209A30878q767l8654M346J1147R038Q6631q158k7090P908l9292L5022Q4138l9459
2196B07688o8354K7812r238k3174R659O268J9793J3419j4154L1098J8773K2485
2184B42075j8301k9232K5035K5677k4156K433p34N5531m2110k859J1958l563K7111
2171B68865M1585N6454J8019n6132p465L1949L6434j5280r317Q067M3658J9293
2159D36130L6814j2839k352k3777l6647M4206O5349l8912L9474k889L2734J9848
2147E57139j2255m153M2233j7858N1191M6225K0847N2134J4138M2907N299L1971
$$ plain form
2135 829818 827397 837819 882847 902196 969020 948447 1038046 1109857 1134749 1195185 1179214 1220795
2123 1220795 1315407 1369636 1376420 1340630 1413106 1440650 1498810 1554196 1643800 1732985 1827223 1885216
2111 1885216 2002430 2122186 2225440 2343921 2538441 2735280 3031338 3358048 3687193 3869135
2101 3869135 4040933 4261603 4561289 4936235 5421729 6055790 6869362 8111651 9733477
2092 9733477 11947991 14907489 18801402 23090783 25937372 21920543 15718254 11724778
2084 11724778 9161794 7502304 6193042 5288904 4500551 3930344 3429277 3129202 2877916
2075 2877916 2744861 2632758 2589709 2408106 2165470 1997951 1857122 1699501 1603132 1492944
2065 1492944 1420514 1307540 1227449 1173143 1104054 1052893 1053782 1099266 1037678 997868 921449 845455
$$ packed form
2135H29818k421J0422M5028J9349O6824k0573Q9599P1811K4892O0436j5971M1581
2123A220795R4612N4229O784l5790P2476K7544N8160N5386Q9604Q9185R4238N7993
2111A885216J17214J19756J03254J18481J94520J96839K96058L26710L29145J81942
2101C869135J71798K20670K99686L74946M85494O34061Q13572J242289J621826
2092I733477K214514K959498L893913M289381K846589m016829o202289l993476
2084A1724778k562984j659490j309262r04138p88353n70207n01067l00075k51286
2075B877916j33055j12103m3049j81603k42636j67519j40829j57621r6369j10188
2065A492944p2430j12974q0091n4306o9089n1161Q89M5484o1588l9810p6419p5994
$$ plain form
2053 845455 835170 788685 751636 696400 641009 611501 649811 635173 577668 562839 488121 481223
2041 481223 490319 495903 440321 355092 402789 390082 400514 384678 387134 348137 320775 296292
2029 296292 344413 339023 288268 284686 300405 295851 328311 343226 300110 268118 235191 206231
2017 206231 175520 206969 255503 202260 193396 200850 192955 206912 156587 146329 128703 126898
2005 126898 168174 160879 133625 116270 150201 141937 159411 205943 146371 157339 176312 156468
1993 156468 99249 82876 115864 116118 96331 76578 101030 79955 137724 135916 105483 107816
1981 107816 129340 78255 58233 98867 111094 80388 48970 11973 15475 3550 7882 41031
1969 41031 75902 53349 69775 19860 46459 17699 817 49204 18867 38609 -7911 25709
$$ packed form
2053H45455j0285m6485l7049n5236n5391k9508L8310j4638n7505j4829p4718o898
2041D81223R096N584n5582q5229M7697j2707J0432j5836K456l8997k7362k4483
2029B96292M8121n390n0755l582J5719m554L2460J4915m3116l1992l2927k8960
2017B06231l0711L1449M8534n3243q864P454p895J3957n0325j0258j7626j805
2005A26898M1276p295k7254j7355L3931q264J7474M6532n9572J0968J8973j9844
1993A56468n7219j6373L2988K54j9787j9753K4452k1075N7769j808l0433K333
1981A07816K1524n1085k0022M0634J2227l0706l1418l6997L502j1925M332L3149
1969D1031L4871k2553J6426m9915K6599k8760j6882M8387l0337J9742m6520L3620
$$ plain form
1957 25709 70893 43600 5634 47824 57470 73395 35902 -24287 32479 68123 20507 3776
1945 3776 17530 26279 10070 40844 44369 17314 14195 11019 10288 28791 49085 37229 2598
1932 2598 -12590 23856 11054 66330 29038 -14516 23026 13876 -19609 -16665 4738 30268
1920 30268 50071 57081 20546 46002 58506 68009 23684 14884 53248 34441 30415 9803 2641
1907 2641 -32080 -12121 -12392 -26100 -27705 -20406 13598 39028 17751 2296 -6806 6534 -14263
1894 -14263 -2831 -6443 -22273 37197 39012 -13367 23720 23856 -23186 -25792 -24242 11344 22952
1881 22952 10683 -3565 -26637 -20187 -34760 -17189 -35715 -31838 -11671 24372 -33652 -59230
1869 -59230 -81201 7475 14220 -20381 -22496 -16186 9475 36355 30579 25288 -22124 -33604 -23288
$$ packed form
1957B5709M5184k7293l7966M2190R646J5925l7493o0189N6766L5644m7616j6731
1945C776J3754Q749j6209L0774L525k7055l119l176p31J8503K0294j1856l4631
1932B598j5188L6446j2802N5276l7292m3554L7542r150l3485K944K1403K5530
1920C0268J9803P010l6535K5456J2504R503m4325q800L8364j8807m026k0612p162
1907B641l4721J9959k71j3708j605P299L4004K5430k1277j5455r102J3340k0797
1894a4263J1432l612j5830N9470J815n2379L7087J36m7042k606J550L5586J1608
1881B2952j2269j4248k3072O450j4573J7571j8526L877K0167L6043n8024k5578
1869e9230k1971Q8676O745l4601k115O310K5661K6880n776n291m7412j1480J0316
$$ plain form
1856 -23288 -70638 -81165 -33068 -38326 -10721 19879 23041 14573 -14654 -18774 -45438 -22007 -16553
1843 -16553 -1852 -9964 -20148 -2451 -26285 -52442 -52236 -44161 -25085 -41965 -33 -23517 -19624
1830 -19624 -3242 40553 -9194 -8327 -12103 1897 18327 34020 21452 35953 57699 81182
1818 81182 96236 72690 71072 84905 61252 34712 17589 -3908 -40872 -55295 -17046 20384
1806 20384 41828 2115 -14257 7424 18127 36822 19283 -14879 -13159 29843 25697 -29704
1794 -29704 23458 60493 60301 59507 25765 -46484 -10639 -14042 -3114 37621 -24783 -40688 -19921
1781 -19921 -23689 18662 2871 -34235 -40507 -42757 -34888 -49283 -14718 31439 43457 21390 6264
1768 6264 18289 -25190 -33845 -31305 -24605 -12493 -7740 -17861 31287 -16065 -23104 -1596 -53761
$$ packed form
1856b3288m7350j0527M8097n258K7605L0600L162q468k9227m120k6664K3431N454
1843a6553J4701q112j0184J7697k3834k6157K06Q075J9076j6880M1932k3484L893
1830a9624J6382M3795m9747Q67l776J4000J6430J5693j2568J4501K1746K3483
1818H1182J5054k3546j618J3833k3653k6540j7123k1497l6964j4423L8249L7430
1806B0384K1444l9713j6372K1681J0703J8695j7539l4162J720M3002m146n5401
1794b9704N3162L7035j92p94l3742p2249L5845l403J0928M0735o2404j5905K0767
1781a9921l768M2351j5791l7106o272k250P869j4395L4565M6157J2018k2067j5126
1768F264J2025m3479q655K540O700J2112M753j0121M9148m7352p039K1508n2165
$$ plain form
1755 -53761 -34075 -47767 -57030 -92538 -69702 -48422 -7472 14840 -31462 -12278 -28153 -35359
1743 -35359 -21586 -11587 -23602 228 -12738 -11850 1288 -10444 9182 -892 -31567 -6992
1731 -6992 7078 -11298 -15334 -47701 -63346 -45646 -36098 -26752 2723 -21340 5590 -15305 -50563
1718 -50563 -30843 5093 -31317 -38703 2759 11273 -39475 -26582 7162 58196 -10154 -14709
1706 -14709 -17261 18439 37528 -8608 -6692 -30421 -36867 -57086 -34367 -31053 -4646 -56300 -45220
1693 -45220 -16639 -39490 -48145 -85706 -12262 -15831 -59874 -52182 -78992 -69312 -77543 -71352 -42822
1680 -42822 -60097 -60140 -52741 -47334 -43481 -23628 -25842 -48319 -20722 -13214 -28076 -17010 -63620
1667 -63620 -67615 -14192 9785 35583 -51570 -68976 -89763 -61996 6652 45174 40692 12905
$$ packed form
1755e3761J9686j3692r263l5508K2836K1280M0950K2312m6302J9184j5875p206
1743c5359J3773R999j2015K3830j2966Q88J3138j1732J9626j0074l0675K4575
1731f992J4070j8376m036l2367j5645J7700R548R346K9475k4063K6930k0895l5258
1718e0563J9720L5936l6410p386M1462Q514n0748J2893L3744N1034o8350m555
1706a4709k552L5700J9089m6136J916k3729o446k0219K2719L314K6407n1654J1080
1693d5220K8581k2851q655l7561P3444l569m4043P692k6810R680q231O191K8530
1680d2822j7275m3P399N407L853J9853k214k2477K7597P508j4862J1066m6610
1667f3620l995N3423K3977K5798q7153j7406k0787K7767O8648L8522m482k7787
$$ plain form
1655 12905 -238 -27839 -19622 -19729 -24757 -12142 2477 14855 -13093 -38217 -34646 -21236 -13991
1642 -13991 -26495 7155 12956 -8663 -3025 -32354 -42909 -6117 -23928 -33295 -23726 -12816 -4040
1629 -4040 -3354 -9060 33067 68898 22434 -8587 -7879 -4172 -28419 -26104 12226 -4906 35451
1616 35451 -13963 -58345 -8537 -32859 -82431 -70896 -24528 -28686 608 22712 43141 -7720
1604 -7720 -15330 31424 67019 -7299 -9445 10815 769 -72877 -78448 -12289 15576 12170 -44652
1591 -44652 -27966 -37834 -61086 -30413 -8340 -22281 -470 55313 7804 2322 24359 -2467
1579 -2467 -26912 -19885 -13228 10183 -23633 -99693 -70721 -29446 18502 20269 23794 -6842 7682
1566 7682 -60956 -123572 -45405 -29221 2251 -34813 -14040 16656 -7344 -4682 -16433 -29644
$$ packed form
1655A2905j3143k7601Q217j07n028J2615J4619J2378k7948k5124L571J3410P245
1642a3991j2504L3650N801k1619N638k9329j0555L6792j7811r367R569J0910Q776
1629d040O86n706M2127L5831m6464l1021P08L707k4247K315L8330j7132M0357
1616C5451m9414m4382M9808k4322m9572J1535M6368m158K9294K2104K0429n0861
1604g720p610M6754L5595p4318k146K0260j0046p3646n571O6159K7865l406n6822
1591d4652J6686r868k3252L0673K2073j3941K1811N5783m7509n482K2037k6826
1579b467k4445P027O657K3411l3816p6060K8972M1275M7948J767L525l0636J4524
1566G682o8638o2616P8167J6184L1472l7064K0773L0696k4000K662j1751j3211
$$ plain form
1554 -29644 -1107 -20228 -75135 -95470 -103270 -68182 -51385 -40259 -83156 -57843 25849 5100
1542 5100 -25726 -30346 -31120 23261 50589 27745 32854 -28536 -31995 -26706 -58276 19577 -3774
1529 -3774 -13595 -44785 -35682 -20860 -57684 -36902 16613 23089 -22580 -37578 -54600 -15681 24468
1516 24468 1994 -35628 -31411 -14191 -33446 -7735 -34287 -38166 -57471 -47110 -22647 -6239
1504 -6239 -22851 -6631 -42357 -64779 -15953 -18671 -67791 -23359 -15391 -46396 -4095 36657
1492 36657 22773 -2803 -54069 -41145 -13259 -12657 12174 4750 -13528 -38842 -19718 -4130
1480 -4130 27259 1958 -18743 -14198 7214 -21033 -13706 -64893 -66351 -49503 -44489 -51421 -71908
1467 -71908 -20071 -6744 -2740 26754 14772 -9329 10555 16719 3318 124 -16175 -5843
$$ packed form
1554b9644K8537j9121n4907k0335p800L5088J6797J1126m2897K5313Q3692k0749
1542E100l0826m620p74N4381K7328k2844N109o1390l459N289l1570P7853k3351
1529c774r821l1190R103J4822l6824K0782N3515O476m5669j4998j7022L8919M0149
1516B4468k2474l7622M217J7220j9255K5711k6552l879j9305J0361K4463J6408
1504f239j6612J6220l5726k2422M8826k718m9120M4432P968l1005M2301M0752
1492C6657j3884k5576n1266J2924K7886O02K4831p424j8278k5314J9124J5588
1480d130L1389k5301k0701M545K1412k8247P327n1187j458J6848N014o932k0487
1467g1908N1837J3327M004K9494j1982k4101J9884O164j3401l194j6299J0332
$$ plain form
1455 -5843 -14779 -20519 -35747 -28250 -21795 -40425 -48553 -45479 -18080 -75740 -58312 -9095 -14636
1442 -14636 4741 -21783 -41087 -4061 14222 1745 -28386 -49811 -54401 -79802 -102004 -67315
1430 -67315 12562 37384 30698 37411 52344 53304 -50647 -13866 -5773 -12782 -2493 -18538 -34478
1417 -34478 -8213 -7233 -17345 -10973 9974 23371 -5302 31540 10597 -1699 9530 3442 1573
1404 1573 -35760 -58229 6225 -7266 -32883 -64755 -85779 -22623 -12542 -80650 -43772 -49694
1392 -49694 -16342 -42975 -85713 -45104 -38166 2442 -11088 -2005 -25622 -58416 1318 -39018
1380 -39018 -13192 23332 15098 1995 29903 22787 48197 49684 86272 16442 -50993 -26806
1368 -26806 -3157 18156 55492 20950 -19709 22271 32994 -23664 -31685 -38612 -76888 3170
$$ packed form
1455e843q936n740j5228P497O455j8630q128L074K7399n7660J7428M9217n541
1442a4636J9377k6524j9304L7026J8283j2477l0131k1425m590k5401k2202L4689
1430f7315P9877K4822o686O713J4933R60j03951L6781Q093p009J0289j6045j5940
1417c4478K6265R80j0112O372K0947J3397k8673L6842k0943j2296J1229o088j869
1404A573l7333k2469O4454j3491k5617l1872k1024O3156J0081o8108L6878n922
1392d9694L3352k6633m2738M0609O938M0608j3530R083k3617l2794N9734m0336
1380c9018K5826L6524q234j3103K7908p116K5410J487L6588o9830o7435K4187
1368b6806K3649K1313L7336l4542m0659M1980J0723n6658q021o927l8276Q0058
$$ plain form
1356 3170 14997 22769 40858 -20846 -44365 -17704 24988 38995 -6529 -24867 -20803 15199
1344 15199 23095 -31792 -36283 13993 -16174 7239 5239 18899 -30544 -62430 -63861 -27757 -32232
1331 -32232 -20655 -27764 -1973 -3299 -23642 -58265 -92359 -38396 -17041 -60358 -50178 -37051
1319 -37051 -27274 -66176 -56619 -50721 -57261 -53641 -77613 -25937 -30617 -35413 -861 -21868 -13442
1306 -13442 -24808 -46160 -81007 -104519 -21467 7054 -35844 -53211 30 -14048 23188 2822
1294 2822 7792 16034 -13194 7625 -12470 -10936 -37707 -22585 13136 15047 -27901 -26286 -38026
1281 -38026 -45314 -49923 -13949 -36824 -13145 35496 36932 22763 4542 8873 40410 24163 9976
1268 9976 14972 1699 -24524 -61177 -25796 -43582 1392 -14675 29254 31673 -1554 -8162 19905
$$ packed form
1356C170J1827P772J8089o1704k3519K6661M2692J4007m5524j8338M064L6002
1344A5199P896n4887m491N0276l0167K3413k000J3660m9443l1886j431L6104m475
1331c2232J1577p109K5791j326k0343l4623l4094N3963K1355m3317J0180J3127
1319c7051R777l8902R557N898o540L620k3972N1676m680m796L4552k1007Q426
1306a3442j1366k1352l4847k3512Q3052K8521m2898j7367N3241j4078L7236k0366
1294B822M970Q242k9228K0819k0095J534k6771J5122L5721J911m2948J615j1740
1281c8026p288m609L5974k2875K3679M8641J436j4169j8221M331L1537j6247j4187
1268I976M996j3273k6223l6653L5381j7786M4974j6067M3929K419l3227o608K8067
$$ plain form
1255 19905 -4740 -48934 -47961 -44157 -61980 -38508 -11124 -11203 32880 46135 22390 -29262 -47037
1242 -47037 -20543 15053 18371 26224 47507 4920 17819 -14489 -23663 26870 66762 -10925
1230 -10925 14315 3201 -34079 -27500 -9893 -19938 -69663 -34474 -13164 73066 14939 -1121
1218 -1121 -26370 -37500 1218 15805 22690 18616 26347 -21144 -38104 -21095 -7710 -15716 -39726
1205 -39726 17421 -18616 -35805 -741 26736 -8388 -618 49406 -23013 8409 -24814 -14198
1193 -14198 52014 -821 -38747 -70961 -28964 -14997 -51793 -68494 -56218 -49171 -23340 -3671
1181 -3671 8890 -13316 -22967 -21367 -1362 48752 32292 -3071 -44633 -28300 -27950 -45151 -5686
1168 -5686 -3083 -9256 -34434 -11769 3416 -35310 6626 19089 -42783 -22848 28570 -15798
$$ packed form
1255A9905k4645m4194R73L804j7823K3472K7384p9M4083J3255k3745n1652j7775
1242d7037K6494L5596L318P853K1283m2587J2899l2308r174N0533L9892p7687
1230a0925K5240j1114l7280O579J7607j0045m9725L5189K1310Q6230n8127j6060
1218a121k5249j1130L8718J4587O885m074P731m7491j6960J7009J3385q006k4010
1205c9726N7147l6037j7189L5064K7477l5124P770N0024p2419L1422l3223J0616
1193a4198O6212n2835l7926l2214M1997J3967l6796j6701J2276P047K5831J9669
1181c671J2561k2206r651J600K0005N0114j6460l5363m1562J6333L50j7201L9465
1168e686K603o173k5178K2665J5185l8726M1936J2463o1872J9935N1418m4368
$$ plain form
1156 -15798 9210 -47764 -24046 26446 -19889 32251 44635 24659 -14574 -39121 -14281 -41451
1144 -41451 -18253 4695 -6878 -23273 -10125 31700 18269 -24797 -43017 -29352 -40865 -49982
1132 -49982 -22109 -17249 -39268 -2904 -16883 -52281 -66178 -47941 -25827 35790 65214 -4090
1120 -4090 6262 13321 45964 58552 29547 39439 5601 -15612 -2876 27315 5472 37760
1108 37760 61499 38572 15653 -29512 -27398 -6332 -43334 2282 9953 -44643 -40630 -25338
1096 -25338 11943 18732 -14275 -7386 -18190 -47364 -32917 -41338 -49442 -31037 -19330 10418 20392
1083 20392 -12306 53835 58973 26595 14152 11017 116 4637 -42230 -41065 -19497 -31540 -8774
1070 -8774 56993 34526 7800 23880 16734 34391 33331 60068 45088 27546 24724 410 19993
$$ packed form
1156a5798K5008n6974K3718N0492m6335N2140J2384j9976l9233k4547K4840k7170
1144d1451K3198K2948j1573j6395J3148M1825j3431m3066j8220J3665j1513r117
1132d9982K7873M860k2019L6364j3979l5398j3897J8237K2114O1617K9424o9304
1120d090J0352P059L2643J2588k9005R892l3838k1213J2736L0191k1843L2288
1108C7760K3739k2927k2919m5165K114K1066l7002M5616P671n4596M013J5292
1096b5338L7281O789l3007O889j0804k9174J4447q421q104J8405J1707K9748R974
1083B0392l2698O6141N138l2378j2443l135j0901M521m6867J165K1568j2043K2766
1070h774O5767k2467k6726J6080p146J7657j060K6737j4980j7542k822k4314J9583
$$ plain form
1057 19993 -4900 7412 20271 -32694 -70380 -56960 -7939 14436 28737 30713 40094 21146
1045 21146 12013 1130 -740 43056 41006 32626 28978 14776 17834 8721 41718 -1050 44403
1032 44403 25528 -37217 -48096 -4410 -20606 2201 32231 32937 16585 25171 56583 8524
1020 8524 24731 28656 19789 -4601 8849 26035 37314 47717 17476 29608 7554 -33888
1008 -33888 -16739 13930 -9410 -43735 -36934 -19251 -31348 -31045 26994 7873 26867 54609
996 54609 41780 59218 40364 39980 9442 27463 12955 3559 32500 29884 27505 -35211 -41657
983 -41657 -9430 23162 -32608 -40413 -44027 -8646 -16657 -30180 -12989 19645 64048 63473 -2402
970 -2402 24350 23297 13067 -9355 -43 45197 39858 2805 -10998 10380 -18600 20898 37523
$$ packed form
1057A9993k4893J2312J2859n2965l7686J3420M9021K2375J4301J976R381j8948
1045B1146r133j0883j870M3796k050q380l648j4202L058r113L2997m2768M5453
1032D4403j8875o2745j0879M3686j6196K2807L0030P06j6352Q586L1412m8059
1020H524J6207L925q867k4390J3450J7186J1279J0403l0241J2132k2054m1442
1008c3888J7149L0669k3340l4325O801J7683j2097L03N8039j9121J8994K7742
996E4609j2829J7438j8854l84l0538J8021j4508r396K8941k616k379o2716o446
983d1657L2227L2592n5770p805l614L5381q011j3523J7191L2634M4403n75o5875
970b402K6752j053j0230k2422R312M5240n339l7053j3803K1378k8980L9498J6625
$$ plain form
957 37523 21511 60062 80762 23697 10208 -34322 -30693 -1617 19011 7826 -3722 -18402
945 -18402 -20039 47392 49067 32785 -31663 -33443 -25488 15412 2444 -22228 -16480 3278 37901
932 37901 -29342 -34555 -18500 62419 49402 18999 29246 -4945 -19011 -27682 6249 29266
920 29266 44517 42228 10380 11268 20481 29160 -3236 -46035 -59381 -2989 24675 25824 63991
907 63991 68165 35759 59023 53358 73696 31998 -7572 -26593 -18360 53898 52143 5701 6182
894 6182 11318 -15555 -322 17943 -34113 -55289 -40880 7674 -13677 -10416 -8150 -17020 6614
881 6614 94 40041 25146 -10577 -31062 1688 -6834 31593 -7997 -64499 -32649 6107 16537
868 16537 14082 20798 528 10410 40324 41112 8224 -3372 38260 45223 39302 39792 34017 8873
$$ packed form
957C7523j6012L8551K0700n7065j3489m4530L629K9076K0628j1185j1548j4680
945a8402j637O7431J675j6282o4448j780P955M0900j2968k4672N748J9758L4623
932C7901o7243n213J6055Q0919j3017l0403J0247l4191j4066q671L3931K3017
920B9266J5251k289l1848Q88R213Q679l2396m2799j3346N6392K7664J149L8167
907F3991M174l2406K3264n665K0338m1698l9570j9021Q233P2258j755m6442M81
894F182N136k6873J5233J8265n2056k1176J4409M8554k1351L261K266q870K3634
881F614o520L9947j4895l5723k0485L2750q522L8427l9590n6502L1850L8756J0430
868A6537k455O716k0270R882K9914P88l2888j1596M1632O963n921M90n775k5144
$$ plain form
854 8873 -22169 -23267 -23593 -19746 9688 39405 49139 82937 72546 57843 35622 35859 70790 48074
840 48074 -11898 -41591 -20600 22715 27203 25421 38476 -6624 -24303 -68062 -79287 -29375
828 -29375 36737 27758 24509 32057 4816 41577 26447 -6879 -24224 -36842 -49566 -43282 9016
815 9016 21414 9048 382 2756 -9245 35538 23593 2672 31324 13367 15338 62122 53806
802 53806 22224 84475 53428 -4006 4984 49845 27103 9865 -20526 -35298 -5405 -22640
790 -22640 16286 5882 12066 13191 33823 48193 27230 49809 27584 22665 -521 -12322 -10922
777 -10922 -25262 -51341 -64115 -54983 -50272 12448 22960 -50184 -70998 -10098 -27652 -40252
765 -40252 -10001 -32176 -56732 -8330 -12347 -55652 -76775 -65098 4914 38558 12707 57659
$$ packed form
854H873l1042j098l26L847K9434K9717R734L3798j0391j4703k2221K37L4931k2716
840D8074n9972k9693K0991M3315M488j782J3055m5100j7679m3759j1225M9912
828b9375O6112q979l249P548k7241L6761j5130l3326j7345j2618j2724O284N2298
815I016J2398j2366q666K374j2001M4783j1945k0921K8652j7957J971M6784q316
802E3806l1582O2251l1047n7434Q990M4861k2742j7238l0391j4772K9893j7235
790b2640L8926j0404O184J125K0632J4370k0963K2579k2225m919k3186j1801J400
777a0922j4340k6079j2774R132M711O2720J0512p3144k0814O0900j7554j2600
765d0252L0251k2175k4556M8402m017m3305k1123J1677P0012L3644k5851M4952
$$ plain form
753 57659 78613 295 -8131 23841 -22157 1836 -20126 4243 -10357 1307 37783 967
741 967 66223 16727 16856 -36778 -31838 -11801 -61649 -66584 -32442 14309 3970 13694 36548
728 36548 -8548 -26833 -25437 -14652 -1527 66037 67472 41024 -5623 -14763 2681 28624 19090
715 19090 -6806 -12650 2961 -1145 -49528 1280 10966 -11541 10723 5605 1640 10995 -43333
702 -43333 -21957 14360 5420 -434 36676 54132 17380 3704 31674 30573 -28829 11391 23313
689 23313 -9216 20870 33453 19525 71805 40791 20128 15665 47863 33407 3939 -8489
677 -8489 -28726 -20113 27617 -10667 -9544 -20194 -68424 -45880 -43515 -10622 -48498 -35537 -11985
664 -11985 -21597 -30222 -22144 -1750 8329 -12487 7519 -1734 -251 19777 42453 32565 33824
$$ packed form
753E7659K0954p8318q426L1972m5998K3993k1962K4369j4600J1664L6476l6816
741I67O5256m9496J29n3634M940K0037m9848m935L4142M6751j0339R724K2854
728C6548m5096j8285J396J0785J3125O7564J435k6448m6647r140J7444K5943r534
715A9090k5896n844J5611m106m8383N0808R686k2507K2264n118l965R355n4328
702d3333K1376L6317q940n854L7110J7456l6752j3676K7970j101n9402M0220J1922
689B3313l2529L0086J2583j3928N2280l1014k0663m463L2198j4456k9468j2428
677h489k0237Q613M7730l8284J123j0650m8230K2544K365L2893l7876J2961K3552
664a1985r612q625Q078K0394J0079k0816K0006r253J483K0028K2676r888J259
$$ plain form
651 33824 -6431 -29447 4211 14123 6425 28870 24470 999 34626 26896 5159 -1809 27647
638 27647 63313 14934 -2624 -26074 22871 30199 63434 32495 57583 31444 5939 47268
626 47268 47461 28717 28327 19978 -12229 19136 47343 66680 36238 18070 25442 -47143 -49748
613 -49748 -41505 -56245 -17810 24259 -9250 37923 25281 -15328 14724 -751 16493 -6156
601 -6156 -17619 -5316 -14748 -66715 -13986 27443 12212 -4695 -2407 14636 159 21545 -7338
588 -7338 13901 35458 20771 90531 103233 83193 31872 15811 28369 31173 47956 91994
576 91994 16153 -10409 -30325 9365 6854 -12972 5372 27551 3212 -43566 -5424 12561
564 12561 -9952 -16906 -47070 -637 -47793 8550 16842 -1688 30345 33876 -2040 40227 -11317
$$ packed form
651C3824m0255k3016L3658R912p698K2445m400k3471L3627p730k1737o968K9456
638B7647L5666m8379j7558k3450M8945P328L3235l0939K5088k6139k5505M1329
626D7268J93j8744l90q349l2207L1365K8207J9337l0442j8168P372p2585k605
613d9748Q243j4740L8435M2069l3509M7173j2642m0609L0052j5475J7244k2649
601f156j1463J2303r432n1967N2729M1429j5231j6907K288J7043j4477K1386k8883
588g338K1239K1557j4687O9760J2702k0040n1321j6061J2558K804J6783M4038
576I1994p5841k6562j9916L9690k511j9826J8344K2179k4339m6778L8142J7985
564A2561k2513o954l0164M6433m7156N6343Q292j8530L2033L531l5916M2267n1544
$$ plain form
551 -11317 -39679 17807 34203 60348 49876 -18403 -70252 -27557 -10856 -3246 -25121 -9443
539 -9443 -8781 31158 -5233 68505 76104 56012 31676 2856 40204 25184 -13099 -17032 -43411
526 -43411 -54229 -3617 -20969 -47705 19830 -10695 -26130 7660 12637 14959 21116 3175 37458
513 37458 45713 60216 28978 40591 47489 -6412 -12833 -37675 -19795 -26002 31889 77529 21896
500 21896 72408 54722 49151 67704 25011 24243 11888 22777 10527 9023 49787 50738 38987
487 38987 48890 24048 -3041 15805 46771 24553 33458 49882 59825 27539 9628 35294 23909
474 23909 -6031 3917 214 141 -20122 -2992 -3243 20519 -21586 -43606 -70480 -33441 19292
461 19292 13532 19266 -1579 46154 53515 32169 39947 91571 55025 14961 -24753 -31947 -1562
$$ packed form
551a1317k8362N7486J6396K6145j0472o8279n1849M2695J6701P610k1875J5678
539i443O62L9939l6391P3738P599k0092k4336k8820L7348j5020l8283l933k6379
526d3411j0818N0612j7352k6736O7535l0525j5435L3790M977K322O157j7941L4283
513C7458Q255J4503l1238J1613O898n3901o421k4842J7880o207N7891M5640n5633
500B1896N0512j7686n571J8553m2693p68j2355J0889j2250j504M0764R51j1751
487C8987R903k4842k7089J8846L0966k2218Q905J6424R943l2286j7911K5666j1385
474B3909k9940R948l703p3k0263J7130k51K3762m2105k2020k6874L7039N2733
461A9292n760N734k0845M7733P361k1346P778N1624l6546m0064l9714p194L0385
$$ plain form
448 -1562 43548 12957 -4967 43632 39949 31016 36617 41574 31873 6356 -21667 13593 64250
435 64250 59528 28592 54148 55713 65027 67650 55751 27338 50559 63413 78782 67905 34855
422 34855 25306 41110 38719 12019 25106 4669 -237 -40658 -8586 41350 50633 78696 87301
409 87301 21650 1242 33652 43141 24534 44255 48060 54684 73297 73550 81696 106313 39240
396 39240 15839 36023 38337 -34011 29960 56805 67629 46980 30358 12004 -27628 16357
384 16357 757 9083 -39352 -19697 4352 7684 -19070 23359 31209 29515 -5896 -42442 -40388
371 -40388 -7530 22799 5497 24821 32053 -6611 -10430 20077 -6152 -18554 -12158 -517 43499
358 43499 29700 16005 39873 592 662 6252 -5282 11558 34474 3883 43256 39955 3401
$$ packed form
448a562M5110l0591j7924M8599l683q933N601M957r701k5517k8023L5260N0657
435F4250m722l0936K5556J565R314K623j1899k8413K3221J2854J5369j0877l3050
422C4855r549J5804k391k6700J3087k0437m906m0421L2072M9936R283K8063Q605
409H7301o5651k0408L2410R489j8607J9721L805O624J8613K53Q146K4617o7073
396C9240k3401K0184K314p2348O3971K6845J0824k0649j6622j8354l9632M3985
384A6357j5600Q326m8435J9655K4049L332k6754M2429P850j694l5411l6546K054
371d0388L2858L0329j7302J9324P232l8664l819L0507k6229j2402O396J1641M4016
358D3499j3799j3695K3868l9281P0N590j1534J6840K2916l0591L9373l301l6554
$$ plain form
345 3401 25419 20780 76433 89670 54697 83552 104963 63751 13136 27486 -13100 -28096
333 -28096 -1893 11851 34225 -892 17723 51083 41405 16938 12164 -6123 -48434 -18411
321 -18411 9093 34709 44566 15238 18125 64573 61954 43108 45311 61839 44374 36416 9949
308 9949 18516 14123 -44435 31931 1112 -33031 -51701 -16311 -9003 -14511 -9075 33287 44875
295 44875 36656 -38729 1902 12219 49663 24559 15232 -1058 -24190 14242 -2591 -6251 17138
282 17138 10881 -4941 -2439 8957 23482 739 24886 20824 17655 2594 11302 27035 48312
269 48312 15254 -16523 32742 24893 21483 15707 51995 23831 -7398 25112 40927 54290 30836
256 30836 15496 50656 47307 -20725 -38340 -21680 19959 -3290 44454 45019 39208 31625 7603
$$ packed form
345C401K2018m639N5653J3237l4973K8855K1411m1212n0615J4350m0586j4996
333b8096K6203J3744K2374l5117J8615L3360r678k4467m774j8287m2311L0023
321a8411K7504K5616R857k9328K887M6448k619j8846K203J6528j7465p958k6467
308I949Q567m393n8558P6366l0819l4143j8670L5390P308n508N436M2362J1588
295D4875q219p5385M0631J0317L7444k5104r327j6290k3132L8432j6833l660K3389
282A7138o257j5822K502J1396J4525k2743K4147m062l169j5061Q708J5733K1277
269D8312l3058l1777M9265p849l410n776L6288k8164l1229L2510J5815J3363k3454
256C0836j5340L5160l349o8032j7615J6660M1639k3249M7744N65n811p583k4022
$$ plain form
243 7603 51742 65278 20427 2752 -24633 -11324 -2576 4042 -11892 33544 56845 72858 89738
230 89738 38369 -11958 -16775 -55611 -16191 -19053 -18129 -49114 -24718 33329 35005 -19263 -39197
217 -39197 -20852 -19927 -51952 -9070 62664 76524 57975 34587 -25475 -47133 -14601 1871
205 1871 27073 -6150 -17365 -24841 -3533 10377 -5255 -53511 -51236 24911 6226 19757 36220
192 36220 34702 27684 33106 35547 20975 28085 12482 3837 50257 51739 44880 45942 19038 -15508
178 -15508 4625 20731 -25488 -41524 -13585 -12526 -34291 2523 -561 12885 8355 -4985 41088
165 41088 42586 49657 36703 40241 43682 -25766 14328 -40581 -15069 -5009 38393 58316 31127
152 31127 19555 31688 9940 83104 94914 41930 2136 -2031 1841 -4747 -19869 -22957 -3528
$$ packed form
243G603M4139J3536m4851j7675k7385J3309Q748O618j5934M5436K3301J6013J6880
230H9738n1369n0327m817l8836L9420k862R24l0985K4396N8047J676n4268j9934
217c9197J8345R25l2025M2882P1734J3860j8549k3388o0062k1658L2532J6472
205A871K5202l3223j1215p476K1308J3910j5632m8256K275P6147j8685J3531J6463
192C6220j518p018N422K441j4572P110j5603q645M6420J482o859J062k6904l4546
178a5508K0133J6106m6219j6036K7939J059k1765L6814l084J3446m530j3340M6073
165D1088J498P071j2954L538L441o9448M0094n4909K5512J0060M3402J9923k7189
152C1127j1572J2133k1748P3164J1810n2984l9794m167L872o588j5122l088J9429
$$ plain form
139 -3528 -14781 -17951 -24778 -12647 3495 -2511 28406 2382 -11599 5014 18824 13236 -33016
126 -33016 -22768 -59416 -78628 -50263 -16633 326 -15379 -28555 -30309 5467 26059 -11367
114 -11367 -42214 7370 13608 -14754 -57913 -64073 -32129 -26564 -33110 -47442 -52344 -43148 -32073
101 -32073 -28950 6861 -9248 -21482 -9649 -24051 -16790 -38431 -45238 -24590 -43856 -47978 -27132
88 -27132 -18747 -31463 -43148 -78107 -89216 -72406 -47570 -56481 -51783 -13415 -25881 -23094 -20282
75 -20282 -23616 -56830 -60886 -67084 -57534 -43380 -61319 -21022 -30417 -13003 -13186 555 -14294 -50725
61 -50725 -55405 -24259 -18081 6571 -2770 -42261 -43986 -33473 -52314 -25458 -35188 -34909 -34210 -61224
47 -61224 -79488 -62123 -26477 -33967 -66637 -62856 -78483 -60954 -66438 -62555 -44323 -28175 -28456
$$ packed form
139c528j1253l170o827J2131J6142o006L0917k6024j3981J6613J3810n588m6252
126c3016J0248l6648j9212K8365L3630J6959j5705j3176j754L5776K0592l7426
114a1367l0847M9584O238k8362m3159o160L1944N565o546j4332m902R196J1075
101c2073L123L5811j6109j2234J1833j4402P261k1641o807K0648j9266m122K0846
88b7132Q385j2716j1685l4959j1109J6810K4836q911M698L8368j2466K787K812
75b0282l334l3214m056o198R550J4154j7939M0297r395J7414j83J3741j4849l6431
61e0725m680L1146O178K4652r341l9491j725J0513j8841K6856r730K79O99k7014
47f1224j8264J7365L5646p490l2670L781j5627J7529n484L883J8232J6148k81
$$ plain form
34 -28456 -55578 -53148 -57478 -51325 -24360 -50735 -53182 -103231 -116280 -91984 -101202 -107768 -123965
21 -123965 -87211 -58155 -44740 -49435 -72297 -72780 -54886 -34726 -92199 -107625 -81939 -87471 -66344
8 -66344 -75994 -88905 -83468 -115429 -96035 -120714 -129025 -118923
0 -118923
$$ packed form
34b8456k7122K430m330O153K6965k6375k447n0049j3049K4296r218o566j6197
21a23965L6754K9056J3415m695k2862m83J7894K0160n7473j5426K5686n532K1127
8f6344r650j2911N437l1961J9394k4679q311J0102
0a18923
$$ Imaginary data points
##PAGE= N=2
##DATA TABLE= (X++(I..I)), XYDATA
$$ plain form
16383 -648543 -656135 -641864 -666692 -669384 -681399 -620243 -629350 -620892 -581890 -593323 -613830 -594453
16371 -594453 -583963 -554857 -571840 -536913 -537610 -556487 -541618 -523791 -484947 -499465 -474465 -474381
16359 -474381 -472213 -474533 -447121 -371586 -391668 -392556 -355996 -365758 -381654 -390575 -340793 -368259 -352156
16346 -352156 -301962 -293922 -271129 -252466 -258200 -248013 -222196 -240595 -248438 -228836 -255856 -244463
16334 -244463 -208682 -187006 -180075 -141516 -143922 -155482 -149204 -138190 -180209 -171854 -130525 -121928
16322 -121928 -123043 -83187 -43923 -50352 -11783 -55081 -47073 -17432 -25648 1074 -9341 -12699
16310 -12699 12269 12101 19887 794 -38219 5710 65003 86675 55695 93062 133097 103001
16298 103001 126146 147849 138656 132985 166465 158064 145448 177243 189277 198317 145237 170376
$$ packed form
16383f48543p592J4271k4828k692j2015O1156r107Q458L9002j1433k0507J9377
16371e94453J0490K9106j6983L4927o97j8877J4869J7827L8844j4518K5000Q4
16359d74381K168k320K7412P5535k0082q88L6560r762j5896q921M9782k7466J6103
16346c52156N0194Q040K2793J8663n734J0187K5817j8399p843J9602k7020J1393
16334b44463L5781K1676O931L8559k406j1560O278J1014m2019Q355M1329Q597
16322a21928j115L9856L9264o429L8569m3298Q008K9641q216K6722j0415l358
16310a2699K4968j68P786j9093l9013M3929N9293K1672l0980L7367M0035l0096
16298A03001K3145K1703r193n671L3480q401j2616L1795J2034R040n3080K5139
$$ plain form
16286 170376 211211 228742 219481 244684 241070 212646 236688 256023 226150 245716 245594 226025
16274 226025 259998 314479 320432 299837 346839 364410 325027 355377 385780 360800 361407 363848
16262 363848 396854 437610 400863 412772 404266 429096 405895 407068 379422 379815 470824 460017
16250 460017 461388 446020 447332 448163 469702 488837 483505 495165 477520 476090 466223 462716 452795
16237 452795 464415 516247 499085 492139 476781 524407 503499 516488 523220 461021 479870 540274
16225 540274 602881 596510 566663 564053 586962 620667 617997 616525 632934 637676 610894 591026
16213 591026 592886 623025 657534 640687 693821 731984 698942 677391 645439 654013 640094 676946
16201 676946 664924 664302 684129 737818 708024 651938 655639 728569 766658 719864 696340 706182
$$ packed form
16286A70376M0835J7531r261K5203l614k8424K4042J9335k9873J9566j22j9569
16274B26025L3973N4481N953k0595M7002J7571l9383L0350L0403k4980O07K441
16262C63848L3006M0756l6747J1909q506K4830k3201J173k7646L93R1009j0807
16250D60017J371j5368J312Q31K1539J9135n332J1660j7645j430r867l507r921
16237D52795J1620N1832j7162o946j5358M7626k0908J2989O732o2199J8849O0404
16225E40274O2607o371k9847k610K2909L3705k670j472J6409M742k6782j9868
16213E91026J860L0139L4509j6847N3134L8163l3042k1551l1952Q574j3919L6852
16201F76946j2022o22J9827N3689k9794n6086L701P2930L8089m6794k3524R842
$$ plain form
16189 706182 713677 718434 708487 636689 709812 748066 740957 729071 757725 757559 726508 714922 694207
16176 694207 692663 736408 755576 750544 772580 746337 772954 774522 743445 786156 799026 747254
16164 747254 748481 763045 757368 742262 762792 750264 749708 761365 788094 801027 798748 752719
16152 752719 757534 789424 847803 835144 820981 841310 834967 835755 810197 783507 831962 861814
16140 861814 831239 821658 844193 826989 807504 831459 831969 856166 835419 840000 829244 794295
16128 794295 863354 862638 816060 812117 799013 837882 840647 821336 820860 830305 892497 911590 902650
$$ packed form
16189G06182P495M757r947p1798P3123L8254p109j1886K8654j66l1051j1586k0715
16176F94207j544M3745J9168n032K2036k6243K6617J568l1077M2711J2870n1772
16164G47254J227J4564n677j5106K0530j2528n56J1657K6729J2933k279m6029
16152G52719M815L1890N8379j2659j4163K0329o343P88k5558k6690M8455K9852
16140H61814l0575r581K2535j7204j9485K3955N10K4197k0747M581j0756l4949
16128G94295O9059p16m6578l943j3104L8869K765j9311m76R445O2192J9093q940
$$ [...]
##END NTUPLES=NMR SPECTRUM
##END=
