##TITLE=1H_EC-3296(XII-2)
 CDCl3
 8 sc, 
 10.7.2023
##JCAMPDX= 6.0         $$ Bruker NMR JCAMP-DX V2.0
##DATA TYPE= NMR SPECTRUM
##DATA CLASS= NTUPLES
##ORIGIN= UXNMR, Bruker Analytische Messtechnik GmbH
##OWNER= root
$$ XWIN-NMR		Version 3.5
$$ Mon Jul 10 14:02:10 2023 Russian Standard Time (UT+4h)  she@DPX200
##.OBSERVE FREQUENCY= 200.13135
##.OBSERVE NUCLEUS= ^1H
##.ACQUISITION MODE= SIMULTANEOUS
##.ACQUISITION SCHEME= undefined
##.AVERAGES= 8
##.DIGITISER RES= 18
##SPECTROMETER/DATA SYSTEM= spect
##.PULSE SEQUENCE= zg30
##.SOLVENT NAME= CDCl3
##.SHIFT REFERENCE= (INTERNAL, CDCl3, 0, 15.7359)
##AUDIT TRAIL= $$ (NUMBER, WHEN, WHO, WHERE, WHAT)
$$ ##TITLE= Audit trail, XWIN-NMR		Version 3.5
$$ ##JCAMPDX= 5.01
$$ ##ORIGIN= Bruker BioSpin GmbH
$$ ##OWNER= she
$$ F:/spectra/data/she/nmr/H-F/1/pdata/1/auditp.txt
$$ ##AUDIT TRAIL=  $$ (NUMBER, WHEN, WHO, WHERE, WHAT)
(   1,<2023-07-10 14:00:22.46 +0400>,<she>,<DPX200>,
      <created by zg, POWCHK disabled, PULCHK disabled
       configuration hash MD5:
       00 E9 B6 7A A2 85 ED C7 34 08 36 98 17 FE 4E 26
       data hash MD5: 16K
       7E 83 95 84 61 75 1C 1A A1 57 93 45 AD F0 17 B8>)
(   2,<2023-07-10 14:00:24.75 +0400>,<she>,<DPX200>,
      <Start of raw data processing
       efp BC_mod = 2 LB = 0.24 FT_mod = 6 PKNL = 1 PHC0 = -20990.69 PHC1 = 8.052721 SI = 16K 
       data hash MD5: 16K
       5F D6 25 41 E6 D0 F5 37 A7 D7 AF 0F EC 0F B3 4C>)
(   3,<2023-07-10 14:00:42.85 +0400>,<she>,<DPX200>,
      <pk PHC0 = -1.733183 PHC1 = 7 
       data hash MD5: 16K
       6C DA D0 AD D9 21 D8 0F 0C 8A 9B FE 14 30 51 17>)
(   4,<2023-07-10 14:00:46.29 +0400>,<she>,<DPX200>,
      <abs ABSG = 5 
       data hash MD5: 16K
       C6 B7 98 34 DB 21 76 A6 90 8F 36 F6 A6 2D 8C 4D>)
$$ ##END=
$$ 
$$ hash MD5
$$ CB 76 31 40 5B EE E6 6B 5F 8B AD F1 66 9D 13 85
##$RELAX= 
##$RELAX= 
##$RELAX= 
##$RELAX= 
##$RELAX= 
##$RELAX= 
$$ Bruker specific parameters
$$ --------------------------
##$DU= <F:/spectra>
##$EXPNO= 1
##$NAME= <H-F>
##$PROCNO= 1
##$TYPE= <nmr>
##$USER= <she>
##$AMP= (0..31)
100 100 100 100 100 100 100 100 100 100 100 100 100 100 100 100 100 100 
100 100 100 100 100 100 100 100 100 100 100 100 100 100 
##$AQSEQ= 0
##$AQ_mod= 1
##$AUNM= <au_zg>
##$AUTOPOS= <>
##$BF1= 200.13
##$BF2= 200.13
##$BF3= 200.13
##$BF4= 200.13
##$BF5= 200.13
##$BF6= 200.13
##$BF7= 200.13
##$BF8= 200.13
##$BYTORDA= 1
##$CFDGTYP= 0
##$CFRGTYP= 5
##$CHEMSTR= <none>
##$CNST= (0..31)
1 1 145 1 1 1 1 1 1 1 1 1 1 1 1 1 1 1 1 1 1 1 1 1 1 1 1 1 1 1 1 1 
##$CPDPRG= <>
##$CPDPRG1= <>
##$CPDPRG2= <>
##$CPDPRG3= <>
##$CPDPRG4= <mlev>
##$CPDPRG5= <mlev>
##$CPDPRG6= <mlev>
##$CPDPRG7= <mlev>
##$CPDPRG8= <mlev>
##$CPDPRGB= <>
##$CPDPRGT= <>
##$D= (0..31)
0 1.2 0 0 0 0 0 0 0 0.06 0 0.03 0 0 0 0 0.0002 0 0 0 0 0 0 0 0 0 0 0 0 
0 0 0 
##$DATE= 1688983221
##$DBL= (0..7)
120 120 120 120 120 120 120 120 
##$DBP= (0..7)
150 150 150 150 150 150 150 150 
##$DBP07= 0
##$DBPNAM0= <>
##$DBPNAM1= <>
##$DBPNAM2= <>
##$DBPNAM3= <>
##$DBPNAM4= <>
$$ [...]
##$SUBNAM3= <"">
##$SUBNAM4= <"">
##$SUBNAM5= <"">
##$SUBNAM6= <"">
##$SUBNAM7= <"">
##$SUBNAM8= <"">
##$SUBNAM9= <"">
##$SW= 18.05172834244
##$SWIBOX= (0..15)
0 0 2 0 0 0 0 0 0 0 0 0 0 0 0 0 
##$SW_h= 3612.71676300578
##$TD= 16384
##$TD0= 1
##$TE= 0
##$TE2= 300
##$TE3= 300
##$TEG= 300
##$TL= (0..7)
0 120 120 120 120 120 120 120 
##$TP= (0..7)
150 150 150 150 150 150 150 150 
##$TP07= 0
##$TPNAME0= <>
##$TPNAME1= <>
##$TPNAME2= <>
##$TPNAME3= <>
##$TPNAME4= <>
##$TPNAME5= <>
##$TPNAME6= <>
##$TPNAME7= <>
##$TPOAL= (0..7)
0.5 0.5 0.5 0.5 0.5 0.5 0.5 0.5 
##$TPOFFS= (0..7)
0 0 0 0 0 0 0 0 
##$TUNHIN= 0
##$TUNHOUT= 0
##$TUNXOUT= 0
##$USERA1= <user>
##$USERA2= <user>
##$USERA3= <user>
##$USERA4= <user>
##$USERA5= <user>
##$V9= 5
##$VALIST= <valist>
##$VCLIST= <CCCCCCCCCCCCCCC>
##$VD= 0
##$VDLIST= <DDDDDDDDDDDDDDD>
##$VPLIST= <PPPPPPPPPPPPPPP>
##$VTLIST= <TTTTTTTTTTTTTTT>
##$WBST= 1024
##$WBSW= 4
##$XGAIN= (0..3)
0 0 0 0 
##$XL= 0
##$YL= 0
##$YMAX_a= 246354
##$YMIN_a= -338032
##$ZGOPTNS= <>
##$ZL1= 120
##$ZL2= 120
##$ZL3= 120
##$ZL4= 120
##$ABSF1= 15.77664
##$ABSF2= -2.275209
##$ABSG= 5
##$ABSL= 3
##$ALPHA= 0
##$AQORDER= 0
##$ASSFAC= 0
##$ASSFACI= 0
##$ASSFACX= 0
##$ASSWID= 0
##$AUNMP= <proc_1d>
##$AZFE= 0.1
##$AZFW= 0.1
##$BCFW= 0
##$BC_mod= 2
##$BYTORDP= 0
##$COROFFS= 0
##$CY= -3
##$DATMOD= 1
##$DC= 0
##$DFILT= <>
##$DTYPP= 0
##$F1P= 0
##$F2P= 0
##$FCOR= 1
##$FTSIZE= 16384
##$FT_mod= 6
##$GAMMA= 0
##$GB= 0
##$INTBC= 1
##$INTSCL= 3.70164e-10
##$ISEN= 128
##$LB= 0.24
##$LEV0= 0
##$LPBIN= 0
##$MAXI= 10000
##$MC2= 0
##$MEAN= 0
##$ME_mod= 0
##$MI= 1.114404
##$NCOEF= 0
##$NC_proc= -6
##$NLEV= 6
##$NOISF1= 3.799351
##$NOISF2= 2.8
##$NSP= 0
##$NTH_PI= 0
##$NZP= 0
##$OFFSET= 15.73587
##$PC= 1
##$PHC0= -20992.42
##$PHC1= 15.05272
##$PH_mod= 1
##$PKNL= yes
##$PPARMOD= 0
##$PSCAL= 0
##$PSIGN= 0
##$REVERSE= no
##$SF= 200.130007138337
##$SI= 16384
##$SIGF1= 3
##$SIGF2= 2
##$SINO= 5.538805
##$SIOLD= 16384
##$SREGLST= <1H.CDCl3>
##$SSB= 0
##$STSI= 16384
##$STSR= 0
##$SW_p= 3612.71676300578
##$SYMM= 0
##$S_DEV= 0
##$TDeff= 16384
##$TDoff= 0
##$TI= <>
##$TILT= no
##$TM1= 0
##$TM2= 0
##$TOPLEV= 0
##$USERP1= <user>
##$USERP2= <user>
##$USERP3= <user>
##$USERP4= <user>
##$USERP5= <user>
##$WDW= 1
##$XDIM= 16384
##$YMAX_p= 448070712
##$YMIN_p= -282005
$$ End of Bruker specific parameters
$$ ---------------------------------
##NTUPLES= NMR SPECTRUM
##VAR_NAME=  FREQUENCY,     SPECTRUM/REAL,   SPECTRUM/IMAG
##SYMBOL=    X,             R,               I
##VAR_TYPE=  INDEPENDENT,   DEPENDENT,       DEPENDENT
##VAR_FORM=  AFFN,          ASDF,            ASDF
##VAR_DIM=   16384,         16384,           16384
##UNITS=     HZ,            ARBITRARY UNITS, ARBITRARY UNITS
##FACTOR=    0.220516191357247, 1,           1
##FIRST=     3149.21984774054, 0,            0
##LAST=      -463.496915265237, 0,           0
##MIN=       -463.496915265237, -282005,     0
##MAX=       3149.21984774054, 448070712,    0
$$ Real data points
##PAGE= N=1
##DATA TABLE= (X++(R..R)), XYDATA
$$ [...]
6469h8177L312j14748R8905M8599r2337n415J36297l9351j00545m221Q2463M4362
6457c0856o0671R362L7339k1315J2509J018O1175l8573L2196O8381O9147k5215
6445A14497j77594j3983M0534J14794j28762M9618P3554l8106j12548p99o7792
6434a46587L8475K9493K8620n937k9858L1655J26277n2961k4263k0257j23375
6423a48718J58427J00180n4393p2742l3166m1065J08510K2592L2092m2912j54524
6412a25719L0705o5404N2186K2456P2460P1679K7823o7321N6040O4585j51370
6401a1880n265j5171J34368K9434j47261N076J6593L9148l6548o3275P4069j26570
6389a07282k4674q8255m242Q2510M1328R987M6510n9613K5431L6782N8363o1054
$$ y = [-88177, -84865, -199613, -100708, -52109, -144446, -149861, -13564, -52915, -153460, -157681, -75218, -30856, -91527, -82165, -44826, -66141, -53632, -52614, 8561, -30012, 2184, 70565, 139712, 114497, -63097, -77080, -36546, 78248, -50514, -896, 72658, 34552, -77996, -78795, -146587, -108112, -78619, -49999, -55936, -85794, -54139, 72138, 19177, -5086, -25343, -148718, 9709, 109889, 55496, -17246, -50412, -91477, 17033, 39625, 71717, 28805, -125719, -95014, -160418, -108232, -85776, -13316, 58363, 86186, 18865, 74905, 139490, -11880, -17145, -32316, 102052, 131486, -15775, -10699, 5894, 45042, 8494, -54781, 19288, -107282, -131956, -220211, -224453, -141943, -100615, -90628, -44118, -103731, -78300, -41518, 16845, -44209]
6377d4209r0787P1428n266K1284j40464q0612N0513J44048J73473n8642J761o0329
6365a7802J3895o6363j6680M9661J23532l2261r7393J22563L9466M78n3557K1054
6353H6593l4237J34614J71936j22225K335k6297R914j44966j8304N1960o4556
6342D6767K1840r690l0995j4203l2204N092J03203k9712q5753M2718N9215L604
6330G9882n0645L5142j387n1891n2112M8557P7433p6365m7157j16371n9552K7577
6318a86889l203J71277o383j6538p1546P6958L1755o8539J8063L910P997L5287
6306g851L9428q3910j1877m279K9623L0930P6538l7631m6146j89055Q4962K8018
6294i1250J29001K6466j4535q1611r3202K8769J19988Q926l8649j24377R8602
$$ y = [-44209, -134996, -63568, -68834, -47550, -188014, -268626, -218113, -74065, 99408, 40766, 42527, -17802, -3907, -70270, -86950, -37289, 86243, 53982, -43411, 79152, 118618, 119096, 65539, 86593, 52356, 186970, 358906, 236681, 239016, 212719, 222633, 77667, 59363, 111323, 46767, 68607, 58917, 27922, 13719, -18485, -13393, 89810, 60098, -25655, 17063, 76278, 79882, 29237, 64379, 62992, 11101, -41011, 7546, 84979, 8614, -38543, -154914, -214466, -186889, -190092, -18815, -25198, -41736, -113282, -36324, -4569, -73108, -55045, -51135, -43138, -7851, 31577, -52333, -64210, -68489, -38866, -7936, 68602, 30971, -15175, -204230, -119268, -91250, 37751, 64217, 49682, -31929, -125131, -96362, 23626, 32552, -6097, -130474, -31872]
6283c1872o3419n7276O6006K5846p5594q306p485J7926j5970j8759J6610n4364
6271b06657Q7280m1915j0732m3943k8614J29604L1306o5735J8318K0379N2849
6260e7860K4195K8771o192K8199p0903m1858j4024l4323O0379k7218M0028Q9243
6248A8437m5677q7263K3170K0033l9468L0956k5584m6740J0660k1034L4302J13818
6236a4390R903k4092J7511n9644m7302R1927m3187o0468M8368K880m0352M293
6224a14553m7223K3113L0761J4858k1821Q9328Q725Q1113k8026l5095R3653j4167
6212H0666p4768j2628j1616J38974l8376j8802K9832k19710L5046L3048J1681
6201d6653O1875n7400m5670M6382l0660P698J8708k5998L4722L7831n0469l433
$$ y = [-31872, -95291, -152567, -86561, -60715, -136309, -144615, -152100, -134174, -150144, -168903, -152293, -206657, -119377, -161292, -172024, -215967, -244581, -114977, -83671, -149406, -131088, -110709, -57860, -33665, -4894, -11086, 17113, -53790, -95648, -109672, -143995, -83616, -110834, -70806, 18437, -27240, -114503, -91333, -71300, -110768, -79812, -105396, -152136, -141476, -162510, -128208, -14390, -4487, -28579, -11068, -70712, -118014, -26087, -69274, -129742, -81374, -78494, -118846, -114553, -161776, -138663, -107902, -93044, -114865, -25537, -16812, 64301, 36275, 1180, 94833, 80666, 5898, -6730, -18346, 120628, 82252, 63450, 93282, -126428, -91382, -58334, -46653, 15222, -42178, -87848, -41466, -72126, -64428, -45720, -71718, -36996, 835, -49634, -53067]
6189e3067k6141J8712j930J6975Q536R434m1268J1259p014m8410L8432j3480R3866
6176E904k5199P7502N3912q1495M9044L5777k4019l0991J3691q4394o6845N2872
6164b4241K4694n3682M0980R5972k2949N7345K2919o4999l9250J1429j1655K0218
6152E6781p7329L4278K6852J8038m7490M5761j1830O1243o0798n7313J00400P4522
6140A63115n5845k0180k4446o6172J2908J01643J49070j76821o3778K4899l0368
6129A4025R8249l7345q3123J05587Q704p6546P8393J1208n5656L6933m120k4249
6117G2060q9782M3501N2785l6235p5552J4062P0068R296k4975N8061k2132k7430
6105D3727l5308J7101M1059j7048j03208J15291j16733L8504K8013l7758r970
$$ y = [-53067, -79208, -60496, -62426, -45451, -36915, -27481, -68749, -57490, -64504, -112914, -74482, -87962, 5904, -19295, 58207, 112119, 30624, 79668, 115445, 91426, 60435, 74126, -10268, -77113, -24241, 453, -53229, -12249, 83723, 60774, 118119, 141038, 76039, 36789, 48218, 36563, 56781, -20548, 13730, 40582, 58620, 11130, 56891, 45061, 106304, 45506, -11807, 88593, 163115, 107270, 87090, 62644, -3528, 9380, 111023, 260093, 83272, 19494, 44393, 14025, 112274, 74929, -8194, 97393, 106097, 29551, 107944, 119152, 63496, 100429, 96309, 72060, -17722, 25779, 78564, 42329, -33223, -19161, 50907, 60203, 35228, 93289, 71157, 43727, 8419, 25520, 66579, 49531, -53677, 61614, -55119, -16615, 11398, -26360, -36330]
6094c6330N4408P002J2356J18725j16285O8218k4426l7143L4500K7134N2490j08097
6082E2552o3555l2334P026P1310j7659k2190o1250K5206J12173R27q6293j6967
6070c1054M6538q027k8866J15603l480j32183l8943Q4293m5306L091M4177j3210
6058g367m0845L4157K5769J37396o5628j54670K4459O5227L553q6859K1510O6110
6046B2812O2923l9156j4671p0184K9842J307m1125l2290k2748R1255j8138j31251
6034a61424p670J36138L1512p4868r6989Q4822J8908o250J0685o5420R5410p1861
6022a07007J37669Q8261r3528j9838J01353k6084m0271Q379J2393q8299J9413
6011g559K7341j0584K885o1885N6525L8891R0303L7867L5064j23775p4765O4400
$$ y = [-36330, 18078, 25080, 37436, 156161, 39876, 108094, 83668, 46525, 81025, 108159, 160649, 52552, -11003, -43337, -36311, 34999, 17340, -4850, -66100, -40894, 71279, 72206, -14087, -31054, 15484, 7457, -21409, 94194, 90714, -41469, -80412, 3881, -41425, -38334, 5843, -7367, -48212, -14055, 11714, 149110, 83482, -71188, -46729, 18498, 22051, -64808, -43298, 22812, 85735, 46579, 31908, -38276, -8434, -7127, -48252, -80542, -103290, -12035, -30173, -161424, -169094, -32956, -1444, -76312, -173301, -88479, -69571, -75821, -65136, -130556, -35146, -107007, 30662, 118923, 25395, 5557, 106910, 80826, 40555, 48934, 61327, -26972, -7559, 19782, 9198, 12083, -49802, 6723, 45614, 135917, 173784, 208848, 85073, 10308, 74708]
5999G4708K528K0516n1919L7502N6624k7542j6148o0974l5542M3465M7345k3535
5987F7028l386l8800k8194J3611K1433P1506J8327l9306j3915k6320M4023P9340
5975A65347L0643q2897k0539j15329M7199J10468r1478j7941J18410l2194n4054
5964E7635J6655M0085k3791o750l1J473P4432J4798r0242n2927l442L7122K1623
5951H6640L8531M2248j56920k6345J68208j9244j16828o6404L3534M8913O927
5940C9260M8493J49728m0859o9952K2133k7007K5097N2867j4170j21072m4536
5929A9982m1821l652P0398J42713r925j4190N9993q9023j6301M3131o3375J3677
5917A11607K7970j1212o5438L9159K502L8725M5224r0398k8170M4086N8257k9432
$$ y = [74708, 77236, 97752, 45833, 83335, 139959, 112417, 96269, 35295, -247, 43218, 90563, 67028, 63642, 24842, -3352, 10259, 31692, 103198, 121525, 82219, 68304, 41984, 86007, 165347, 195990, 113093, 92554, -22775, 24424, 134892, 43414, 25473, 143883, 111689, 57635, 74290, 114375, 90584, 83834, 83803, 85276, 159708, 174506, 84264, 31337, 27895, 65017, 86640, 125171, 167419, 10499, -15846, 152362, 133118, 16290, -50114, -16580, 32333, 39260, 87753, 237481, 196622, 126670, 148803, 121796, 146893, 199760, 185590, 64518, 19982, -21839, -25491, 44907, 187620, 177695, 163505, 223498, 134475, 118174, 161305, 97930, 111607, 139577, 128365, 62927, 102086, 104588, 143313, 188537, 98139, 69969, 114055, 172312, 142880]
5905A42880K7439p6615l3528L9586O3819l3774n7898m0953J78809M3636j2336
5894B41065k6946L8539N0926j46649J8007j8206J34455m5400P5785M9569j26295
5883B44850L3567q009J7954l6185m7940n9057J4588J08862j924m8734l7065L0128
5871B11035n3981n833L6019j0033m5107J29384O4294N427l768n8633n3129N6985
5859B72660J2269O997o3722L3642N9282l7568N0791M4479J5414m480K0951j8735
5847C91980l1192p4066J08071o2279J6167K8006o3871L7964j0408J3299J0536
5836C64207J0001J8896j06128k406m7860N3419p280J8012N7517p293r292l5487
5824C06306L5499N553m0763K9439M6151m3958N1673q6534o6829Q5273J09708m3948
$$ y = [142880, 170319, 93704, 60176, 99762, 163581, 129807, 71909, 30956, 209765, 253401, 241065, 214119, 252658, 303584, 156935, 174942, 156736, 291191, 245791, 321576, 371145, 244850, 278417, 270408, 288362, 252177, 204237, 145180, 159768, 268630, 266706, 217972, 180907, 211035, 157054, 151221, 187240, 177207, 132100, 261484, 325778, 331205, 327437, 268804, 215675, 272660, 284929, 291926, 228204, 261846, 321128, 283560, 334351, 378830, 394244, 389764, 410715, 391980, 360788, 286722, 394793, 332514, 348681, 376687, 312816, 350780, 340372, 353671, 364207, 374208, 393104, 286976, 284570, 236710, 290129, 282849, 300861, 358378, 351085, 341793, 306306, 341805, 347358, 306595, 336034, 382185, 338227, 389900, 303366, 236537, 321810, 431518, 387570]
5812C87570q253j5815L526R713L4326k4875l5632j1791o3620l763j7042j7573
5800B36771K6719M3257o6579l6905O3953K0566m4481N5452m844j37297J26535
5789B83147M9309Q2733k5300j1318j00332j08298r1337P4437M2924J1588J01814
5778C09367k6586n3192K8850k4026Q2405L2042j39923l7759N8599N0656j04589
5767A75844p3472J12772J36184j37435k1114n0232O9080j7668q1634J45264R828
5756B67417p7622K1506j8031K1200j1358o3132K24L9084R2132J04525j08j26185
5744B49652l8687J24656q9156o220j3874L7147j6334O9083L54p6230k025J7722
5732B56088M6225Q70J0541O3859l7607l1388o9700K8343J3381p6767k0914Q2656
$$ y = [387570, 379317, 363502, 367028, 376741, 411067, 386192, 350560, 338769, 275149, 271386, 254344, 236771, 263490, 306747, 240168, 203263, 267216, 287782, 243301, 298753, 293909, 156612, 283147, 332456, 415189, 389889, 378571, 278239, 169941, 78604, 153041, 195965, 207553, 309367, 282781, 229589, 258439, 234413, 316818, 348860, 208937, 171178, 229777, 280433, 175844, 102372, 215144, 351328, 213893, 192779, 142547, 211627, 193959, 112325, 257589, 267417, 189795, 211301, 193270, 214470, 203112, 139980, 140204, 179288, 271420, 375945, 375837, 249652, 210965, 335621, 246465, 240245, 226371, 263518, 247184, 316267, 316621, 240391, 238366, 256088, 302313, 303183, 313724, 377583, 339976, 308588, 238888, 267231, 280612, 203845, 182931, 265587]
5720B65587O7513J12596R8112j02652j41334O6086J15056m3754k0491n6265M4468
5709D04922k8224p5634N2647o0786k6613p3908l0031P5034J05821O7109m6014
5698C64323n3733r9271M733Q9132l6819R607M4930n026n0865L6033M4928q0462
5686B67510M6236k5650j18730j6428O7053m5078M8659L8048P1417o5360K5575
5675B93252p2102n357Q0392M3670j16136n5567j1686m6139L488J15137r775k4829
5663A94348j08409L9828R0226N1893J2533K1644K0970j53448l4603k0117j2341
5652A02524L0555J13674K5679Q5097q9334l6556P3289j6778j77534N8942j0747
5641A58811J09574R8598p985l1971j49134J2810q8015L2576P7622O4486j23876
$$ y = [265587, 333100, 445696, 543808, 441156, 299822, 365908, 480964, 437210, 416719, 360454, 404922, 376698, 301064, 353711, 292925, 266312, 192404, 162373, 237407, 343228, 410337, 364323, 310590, 211319, 216052, 305184, 268365, 277972, 322902, 317876, 267011, 303044, 347972, 267510, 313746, 288096, 169366, 152938, 219991, 174913, 223572, 261620, 333037, 267677, 293252, 221150, 215793, 296185, 339855, 223719, 168152, 156466, 110327, 113815, 228952, 219177, 194348, 85939, 125767, 215993, 267886, 280419, 302063, 323033, 169585, 134982, 114865, 102524, 133079, 246753, 272432, 357529, 268195, 231639, 304928, 288150, 110616, 169558, 158811, 268385, 366983, 358998, 327027, 177893, 190703, 102688, 135264, 212886, 277372, 153496]
5630A53496k6520J30567J7505N5207r3841R3851j0541J5235q9012n9682N0372
5619B36637l7216K9397J47432j0005L3189M1530j61246o321n9696J52467P1427
5608D37595K045o8425j8427M9899n1605R6986n7666j48116p9477M6681J76405
5597C85895l8781P3178M2387j20980R6081p0035o372j8471k0572J21062m3292
5586D00100p847P7245m8006o4671J16318L2780j13514j00317P3014j6528P7166
5575D25740P739Q571m3153Q1188N1103o3430L0272n5755l2476P1347m1581K0676
5563D60241k1625N5616r3993K403J04279k406J37885r0670j2921P33K8315L064
5551E70921o803Q892L952o939K2815l5897P6997N1387n3692j16077P6969J32457
$$ y = [153496, 126976, 257543, 275048, 330255, 236414, 330265, 319724, 334959, 245947, 186265, 236637, 199421, 228818, 376250, 366245, 399434, 440964, 279718, 273397, 213701, 366168, 437595, 439640, 371215, 352788, 402687, 351082, 448068, 390402, 242286, 162809, 209490, 385895, 347114, 420292, 462679, 341699, 437780, 367745, 361373, 342902, 322330, 443392, 400100, 392253, 469498, 421492, 356821, 473139, 505919, 392405, 292088, 365102, 348574, 425740, 433479, 442050, 398897, 480085, 531188, 467758, 498030, 442275, 409799, 481146, 439565, 460241, 438616, 494232, 400239, 402642, 506921, 504515, 642400, 551730, 538809, 539542, 567857, 570921, 564118, 573010, 576962, 570023, 592838, 556941, 633938, 685325, 631633, 515556, 592525, 724982]
5539G24982J9914n8350q4472N7010Q3518P2531m4391r8571O093l3158m1755M5554
5527F48905O552M299J05173O5948M75J17872o1052j8430m875O8127l3785J16150
5515A015359J4871M5130k1841q0317M7093K7418J15026k8767N7119O532J08799
5504A306422M2705M7190P0133j05080l8782R0202J05441N7245L1293J02171l735
5493A705205R1946l4150L411j16279Q4090J00617J63584j6370J4727J01567R452
5482B107800k2669l2963O0694N5084r928J01853M9866M925J03841P311R0938Q4901
5470B601653J2213J58880Q7067J40029O9930P8168J7434l6899Q6124M2225l4654
5459C222170J8775n7899R3201P3551j54864M5429j08910o5999L9613O5683p0623
$$ y = [724982, 744896, 686546, 602074, 659084, 742602, 815133, 770742, 672171, 678264, 645106, 603351, 648905, 655457, 659756, 764929, 830877, 831352, 949224, 888172, 869742, 864867, 932994, 899209, 1015359, 1030230, 1075360, 1053519, 973202, 1020295, 1047713, 1162739, 1133972, 1191091, 1197623, 1306422, 1349127, 1396317, 1466450, 1361370, 1322588, 1412790, 1518231, 1575476, 1606769, 1708940, 1705205, 1797151, 1763001, 1766412, 1650133, 1734223, 1834840, 1998424, 1982054, 1996781, 2098348, 2107800, 2085131, 2052168, 2112862, 2167946, 2158018, 2259871, 2309737, 2314662, 2418503, 2425814, 2516752, 2601653, 2613866, 2772746, 2859813, 2999842, 3069772, 3147940, 3165374, 3128475, 3214599, 3256824, 3222170, 3240945, 3183046, 3276247, 3349798, 3194934, 3240363, 3131453, 3065454, 3105067, 3170750, 3100127]
5448C100127k6871o1890Q6171o1050n0323O7433Q5330l7931K5126J18131J45445
5437C389698n1088p3143P3926K8322J90778o3352l7840N7240j13891k3507Q520
5426C385663n3840j25793l6658j24874K3246j09964j26299o5606o7644k7419k4207
5415B646605r4409R446o7578J10931n6422k3480j85311N946P7784l36J24447j69794
5403B377829p2489q2294O8651j09049N9809R5802j48145j1939o4800j60718P3917
5392B026574o6323j09276j3325l4223O0142J1218n0723o0586l7289p8119j8363
5381A629707M7023K2800j4155o9790k38j30472o4662j8941l7214p536q448m917
5369A343157k3985o8649O3824K0297m6674q8490l1888j5504k6193J3057K6699
$$ y = [3100127, 3073256, 3011366, 3097537, 3036487, 2986164, 3053597, 3138927, 3100996, 3126122, 3244253, 3389698, 3338610, 3265467, 3339393, 3367715, 3558493, 3495141, 3457301, 3514541, 3400650, 3377143, 3385663, 3331823, 3206030, 3169372, 3044498, 3067744, 2957780, 2831481, 2765875, 2698231, 2670812, 2646605, 2552196, 2561642, 2494064, 2604995, 2548573, 2525093, 2339782, 2345728, 2423512, 2423176, 2547623, 2377829, 2305340, 2223046, 2291697, 2182648, 2242457, 2338259, 2190114, 2178175, 2113375, 1952657, 2026574, 1960251, 1850975, 1837650, 1803427, 1863569, 1874787, 1824064, 1763478, 1726189, 1648070, 1629707, 1676730, 1699530, 1685375, 1615585, 1615347, 1484875, 1420213, 1401272, 1364058, 1356522, 1348074, 1343157, 1319172, 1250523, 1314347, 1334644, 1287970, 1199480, 1167592, 1152088, 1125895, 1138952, 1165651]
5358A165651j42934j276k6458N3469j50574l1416O1550r653K5945o8552q566J6245
5346H83431J07878n0076O111p2467J06870Q661j40301p1475J20467J42623l0702
5335A011020n3525J5494p1573J0307k5554k1659J3858j38739j970L3944N054O1639
5323H38296k9967k5147N0498j30145J690m1781J87235L4371m3679Q373o8746k8421
5311G52577M9174L6999R4767K3513j12543K262p7726O9294K2176n8487N8998l540
5299H57464q0790O0533q539n4562l8816N6191R049n2462k2472J37645J7852k977
5287H78116l268j171l2302p65k6638m5794N7570J59955j49476m4830J28032n5538
5275H63891j1056p2629m674L8267O8703l6662J7203J7972j0903p9075k3695m3853
$$ y = [1165651, 1022717, 1021441, 994983, 1048452, 897878, 866462, 928012, 918359, 944304, 875752, 867186, 883431, 991309, 941233, 947344, 874877, 981747, 990408, 850107, 778632, 899099, 1041722, 1011020, 957495, 972989, 901416, 911723, 886169, 864510, 878368, 739629, 737659, 771603, 776657, 838296, 808329, 783182, 833680, 703535, 705225, 663444, 850679, 885050, 841371, 849744, 780998, 752577, 801751, 838750, 933517, 957030, 844487, 846749, 769023, 838317, 860493, 802006, 861004, 857464, 776674, 837207, 828668, 774106, 735290, 791481, 800530, 748068, 725596, 863241, 881093, 878116, 874848, 873677, 841375, 840610, 813972, 768178, 825748, 985703, 836227, 791397, 919429, 863891, 852835, 780206, 775532, 813799, 882502, 845840, 863043, 881015, 870112, 791037, 767342, 723489]
5263G23489J46172j9782j7852P7798j64402R473J33239J2375m4334j15176K0372
5252G61372P5252n3322j2765J07709n1724L8287j1843K0062p4992L4011J38603
5241I70650m7431n6423R259Q5830L3470R4185j8474p484m6986O6791L8199j154
5229A120432l3350o9601L4011J64587O618N6232O542M5195k4981q3517J6247J41386
5217A379801K1890L0461j33791p4359J66330J8075o5144j331L1547m4362m1483
5206A287634r678O596l3007m3083k8769M723l3049k5524j30547k3438r11k8357
5194I42590q8657O5133R32r3902N002j0981L1191P524m4897o514R6219R3054j08555
5181H88139p3255o7521J43216m8641M079M656j07553R023K0869k5451n1946n1967
$$ y = [723489, 869661, 849879, 832027, 909825, 745423, 754896, 888135, 900510, 856176, 741000, 761372, 836624, 783302, 770537, 878246, 826522, 864809, 852966, 873028, 798036, 832047, 970650, 923219, 866796, 876055, 961885, 995355, 1089540, 1071066, 1063582, 1016596, 1083387, 1121586, 1120432, 1087082, 1017481, 1051492, 1216079, 1222697, 1278929, 1285471, 1330666, 1305685, 1222168, 1238415, 1379801, 1401691, 1432152, 1298361, 1224002, 1390332, 1408407, 1343263, 1341932, 1373479, 1329117, 1287634, 1277956, 1284552, 1251545, 1208462, 1179693, 1184416, 1151367, 1125843, 995296, 971858, 970947, 942590, 853933, 919066, 919998, 826096, 831098, 820117, 851308, 858832, 813935, 807421, 903640, 996694, 888139, 814884, 747363, 890579, 841938, 846017, 850673, 743120, 752143, 773012, 747561, 695615, 643648]
5169F43648o5161N8506K7474N4333k5458L3720P4886J9696j36924M8120K5932
5158G58772k301r3984K6637j31534J19895J07472j2682J761j19401j2219M6873
5147F89289Q3318o7759K4112J23224j15126m5934J0400L3809M4000o5392j74417
5136E39524l4943J51412J27019Q8490p7863o5469k3103Q1260N6382q5087J9819
5125G77441J1976k2811N7262m967q185k7104R3220j0883j15835j34086J68899
5114G84927J08584M6830j55084p6381J07254M3381K0525J21011j9655M2841J9645
5103A043878J1609J236l8822q0278r294P6021m523K9589m248k2125j9936m534
5091I78573j4931P0039j5849j9329Q4287K4401m9346k3427M2954L4899L1006Q1710
$$ y = [643648, 578487, 636993, 664467, 718800, 693342, 727062, 801948, 821644, 684720, 732840, 758772, 756471, 662487, 689124, 557590, 677485, 784957, 772275, 774036, 654635, 642416, 689289, 772607, 704848, 728960, 852184, 737058, 691124, 701524, 735333, 779333, 713941, 539524, 504581, 655993, 783012, 871502, 793639, 728170, 705067, 786327, 842709, 757622, 777441, 789417, 766606, 823868, 818901, 810716, 783612, 876832, 865949, 750114, 616028, 784927, 893511, 940341, 785257, 708876, 816130, 859511, 880036, 1001047, 981392, 1024233, 1043878, 1055487, 1056723, 1017901, 937623, 928329, 1004350, 999827, 1029416, 1025168, 1003043, 983107, 978573, 963642, 1033681, 1017832, 998503, 1082790, 1107191, 1057845, 1034418, 1077372, 1112271, 1143277, 1224987]
5079A224987N3250l963K4115N842K8401L1865l1464n0394K1655P1294l3685m2802
5067A299101P827K9137J53233m5579j00207p2846r546K4627m089J39583M4300
5056A465541r5669o4953j22144j12087Q4090n8338J5027m8578M1729k4022k9141
5045A051455p4002l0770M0682l3717R879M469k4755o2449n3892m8604q6445J35121
5033H26972o9451r309J5007M2798M6047o3451o9264j114J482N3758r912K1558
5021G85121l7993j12037q8189J90333J01164p6538L2680k3355j1682o7119m9813
5010F42572k8679Q0357L3938J41669k6138k6525P6066q4740J0603J0086j1150
4999H18059P5576J1707L2913q4305o4849j7276P6866L5578k4550o9390J9301j9792
$$ y = [1224987, 1278237, 1274274, 1298389, 1304231, 1332632, 1364497, 1333033, 1282639, 1304294, 1375588, 1341903, 1299101, 1306928, 1336065, 1489298, 1443719, 1343512, 1270666, 1261120, 1285747, 1281658, 1421241, 1465541, 1369872, 1304919, 1182775, 1070688, 1154778, 1096440, 1111467, 1062889, 1104618, 1080596, 1051455, 977453, 946683, 987365, 953648, 963527, 967996, 943241, 880792, 826900, 778296, 691851, 826972, 757521, 748212, 763219, 806017, 852064, 788613, 719349, 718235, 719717, 773475, 763563, 785121, 747128, 635091, 546902, 737235, 838399, 761861, 794541, 771186, 759504, 692385, 642572, 613893, 694250, 728188, 869857, 843719, 817194, 893260, 808520, 819123, 829209, 818059, 893635, 905342, 938255, 853950, 789101, 771825, 848691, 884269, 859719, 790329, 809630, 789838]
4987G89838n5780k9890J05509J57905l3435m9572Q4669J3127p3318m9252l507
4976H56294m4085N2124J15873J2572m5339j3448N6197j32514K6759P4513p5208
4965H83738N5513l4697J1273p5429O9453r423N2213O1350L2470n9180P7510M1070
4953A105861j06900Q2381k8503j582q825l8631M0962Q4239L0035l6073m4036p0425
4941A008503J06783L8609o4704O3310L161j9931m9661O2637R1664m5319m9008
4930A146044k4646K5297N3514j48314p2099k3103M2751P3116L0413M3380M706
4919A151059o681L1703O131k7809M5849l3950k0620J7948K6496j2049L4469P0568
4907A283114M649k833j14591Q1370M1295j7560R607M9487j12953j7481l2782l9798
$$ y = [789838, 734058, 704168, 809677, 967582, 934147, 884575, 969244, 982371, 909053, 859801, 856294, 812209, 864333, 980206, 992778, 947439, 933991, 990188, 857674, 884433, 958946, 883738, 939251, 904554, 915827, 840398, 909851, 900428, 952641, 1013991, 1046461, 987281, 1064791, 1105861, 998961, 1081342, 1052839, 1051257, 1042432, 1003801, 1044763, 1129002, 1159037, 1122964, 1078928, 1008503, 1115286, 1153895, 1089191, 1152501, 1155662, 1135731, 1086070, 1148707, 1240371, 1195052, 1146044, 1121398, 1146695, 1200209, 1051895, 979796, 956693, 999444, 1072560, 1102973, 1146353, 1151059, 1144378, 1176081, 1182212, 1154403, 1200252, 1166302, 1145682, 1163630, 1190126, 1178077, 1212546, 1283114, 1287763, 1284930, 1170339, 1251709, 1293004, 1275444, 1285051, 1334538, 1221585, 1204104, 1171322, 1131524]
4895A131524Q1708N4528k6424q6053l1387l668j5606J11238J00341j8998O1082
4884A358285J5378m9148J6874N6036r4148j04322J61262p2307p3062N8386K5927
4873A299161J04070N4614P2748k1545O7434m2266q7983L2844J42645j06450p9460
4862A435812J73189M1599J6387k2870j6675M8086J21150j1144K8452m6560J5936
4851A783362q3643O1458J65267l7747j4540M3655J5279k415J68091M61N8031N3885
4839B211144m8012j1667J8343K2086j2897O5258K00969L5030k300J15206k4670
4828B568490p9477j06848r659K55388N7974j48048M7815J25392m5724j07753O4318
4817B621868Q5203o2251m9939M7213L8306J21598O9776R0571N7984l3990K6845
$$ y = [1131524, 1213232, 1267760, 1241336, 1155283, 1123896, 1120228, 1104622, 1215860, 1316201, 1297203, 1358285, 1373663, 1324515, 1341389, 1397425, 1303277, 1198955, 1360217, 1287910, 1214848, 1273234, 1299161, 1403231, 1457845, 1530593, 1509048, 1576482, 1534216, 1446233, 1479077, 1621722, 1515272, 1435812, 1609001, 1650600, 1666987, 1644117, 1627442, 1675528, 1796678, 1785534, 1813986, 1767426, 1783362, 1699719, 1761177, 1926444, 1888697, 1874157, 1917812, 1933091, 1930676, 2098767, 2099228, 2157259, 2211144, 2163132, 2151465, 2169808, 2191894, 2178997, 2244255, 2445224, 2480254, 2477954, 2593160, 2568490, 2489013, 2382165, 2372506, 2627894, 2685868, 2537820, 2585635, 2711027, 2665303, 2557550, 2621868, 2707071, 2644820, 2594881, 2642094, 2680400, 2801998, 2871774, 2962345, 3020329, 2986339, 3013184]
4806C013184O7746J38237M8021K9843k1378K2710R1009j6101J56880J04423J4990
4795C649564P7619J3037J08472R2371R3140N3062Q9146N3511R4957J77785L5951
4784D538615J54463J22744J09894K12485J57591J85525J84915P6829J03345K29194
4774F075600R5667L38827K48387K98008K35363K45933L77935M89966K52183L67239
4764I025108N27525N63274N86902O04265O32962P26030Q64744Q66720R11885J044899
4754A6354314J295372J284762J281288J296550J184836J018906P10313K69221
4746B4695562p3559n15942p70839j110759j219529j317989j359581j316516j160262
4737A5850586j209887j058155r62802p02075n77613o81784n15994n22726l52097
$$ y = [3013184, 3080930, 3219167, 3267188, 3297031, 3275653, 3298363, 3389372, 3373271, 3530151, 3634574, 3649564, 3727183, 3740220, 3848692, 3941063, 4034203, 4087265, 4176411, 4229922, 4324879, 4502664, 4538615, 4693078, 4815822, 4925716, 5138201, 5295792, 5481317, 5666232, 5743061, 5846406, 6075600, 6171267, 6510094, 6758481, 7056489, 7291852, 7537785, 7915720, 8405686, 8657869, 9025108, 9552633, 10115907, 10702809, 11307074, 11940036, 12666066, 13530810, 14397530, 15309415, 16354314, 17649686, 18934448, 20215736, 21512286, 22697122, 23716028, 24426341, 24695562, 24622003, 24106061, 23335222, 22224463, 21004934, 19686945, 18327364, 17010848, 15850586, 14640699, 13582544, 12619742, 11917667, 11340054, 10658270, 10142276, 9619550, 9267453]
4728I267453l43780m63474l27210j34939k40701k29018j48696k39948j02943l3376
4718G003368l1568j20388k6815p0928k5066J9394K5458j05265K878J1956n4J01383
4706F784353L7932m476J17760J09574J39485J82717l5292N6372K05614J67484
4696G761523J84892J70329J24172J71391K82929L44000L11909L82373L36983L97032
4686A0467533N07040N54958O35501O02509N82387P77809R43073R14157P93872
4677A6778839Q70178J020397Q90505P17920P09437N81212J44123j07182l87833
4668B1217596o05023p33398q22546j051282j155363j040569r05404r36393j004624
4659A2962994p63736p23853o70210o76829o14449n22203m41284m62313m38785
$$ y = [9267453, 8923673, 8460199, 8132989, 7998050, 7757349, 7528331, 7379635, 7139687, 7036744, 7003368, 6971800, 6851412, 6824597, 6753669, 6728603, 6747997, 6773455, 6668190, 6671068, 6683024, 6682970, 6784353, 6822285, 6817809, 6935569, 7045143, 7184628, 7367345, 7332053, 7388425, 7594039, 7761523, 7946415, 8116744, 8240916, 8412307, 8695236, 9039236, 9351145, 9733518, 10070501, 10467533, 10974573, 11529531, 12165032, 12767541, 13349928, 14127737, 15070810, 15984967, 16778839, 17649017, 18669414, 19559919, 20277839, 20987276, 21568488, 21712611, 21605429, 21217596, 20612573, 19879175, 19056629, 18005347, 16849984, 15809415, 14904011, 13967618, 12962994, 12199258, 11475405, 10805195, 10128366, 9513917, 8991714, 8550430, 8088117, 7649332]
4650G649332l57126k77152k81281k89852k73954q6755k83300l00762j49300k57826
4640E092024j72029r0429j19316r3340j71177o8134p8635j50087p1461j46645
4630C930771j30501j1422m630j47522q0445p5536m6233n0450l0223j8164k00634
4619C135011P1668o0619j30236n273j81603M50l7742q3479r9087k5148p4902m1417
4607B467623R2792n2264o7319j3453j0688n063m1396N582m9041l0291o8196J583
4595B229869j2272L2285m7937j3389J4959m9872J2894N69k6105r4382j14M4483
4583B090988L7128o5530K6340n2546n810M2491L6485l0375j8603l4562m3613J43089
4571B125482N1379j46774l3323j10265m1486j3725p379o066k3972N9367k4982
$$ y = [7649332, 7292206, 7015054, 6733773, 6443921, 6169967, 6083212, 5799912, 5499150, 5349850, 5092024, 4919995, 4829566, 4710250, 4616910, 4445733, 4377599, 4298964, 4148877, 4077416, 3930771, 3800270, 3788848, 3784218, 3636696, 3556251, 3480715, 3434482, 3384032, 3353809, 3335645, 3135011, 3206679, 3146060, 3015824, 3010551, 2828948, 2829398, 2791656, 2708177, 2609090, 2583942, 2509040, 2467623, 2560415, 2508151, 2440832, 2427379, 2416691, 2411628, 2370232, 2375814, 2326773, 2296482, 2228286, 2229869, 2217597, 2249882, 2201945, 2188556, 2203515, 2153643, 2166537, 2167106, 2141001, 2046619, 2046505, 2090988, 2128116, 2062586, 2088926, 2036380, 2030570, 2073061, 2109546, 2079171, 2060568, 2026006, 1982393, 2125482, 2176861, 2030087, 1996764, 1886499, 1845013, 1831288, 1823909, 1817843, 1793871, 1853238, 1828256]
4560A828256O2341n4999K5692M2817k7526q4054k033j6300l096N0238m6075j5859
4548A759402N002O0319O1297k0210r736q5321l6252k1361m4405J67925r261J2219
4536A839618r3884k3571R090j2588j518O580N2910j24807O5096R337j09001P0135
4524A687397P4351M7229o5566k0983J0235l246k8868N3002n3855K9291J3928l2847
4512A710068L3932j8847o7480m6196J20194p3357o7068p548L9497P7203k1396
4501A679002J911O2844J3963k3676p1740R9101J13312j2764L1775k4376L568J0216
4489A883136K8605j05836j8847J27051o2715M8342q0530m7233P932R863Q7157
4478A876925P7405p6125l7029N0980N5554K54J00355K5951q9729K0813O5645n5111
$$ y = [1828256, 1890597, 1835598, 1861290, 1904107, 1876581, 1792527, 1790494, 1774194, 1771098, 1821336, 1775261, 1759402, 1764404, 1824723, 1886020, 1865810, 1856074, 1770753, 1734501, 1713140, 1668735, 1836660, 1827399, 1839618, 1745734, 1722163, 1731253, 1718665, 1717147, 1723727, 1776637, 1651830, 1716926, 1726263, 1617262, 1687397, 1761748, 1808977, 1743411, 1722428, 1732663, 1729417, 1700549, 1753551, 1699696, 1728987, 1742915, 1710068, 1744000, 1725153, 1657673, 1611477, 1731671, 1658314, 1591246, 1583698, 1623195, 1700398, 1679002, 1680913, 1743757, 1757720, 1734044, 1662304, 1761405, 1874717, 1861953, 1893728, 1869352, 1872920, 1883136, 1911741, 1805905, 1787058, 1914109, 1851394, 1899736, 1819206, 1771973, 1779905, 1789768, 1876925, 1954330, 1878205, 1841176, 1892156, 1947710, 1947964, 2048319, 2074270, 1984541, 2005354, 2070999, 2015888]
4466B015888j4100M6451K6683K0084k4604L5865j0910m4554J9526K4613M3686
4455B138628k1396R439j12303M7890J21850O4449M3333K8822M41o0446O6771J02269
4443B429747K7917R97O3313Q0869q026M2279J6837n2930O3893J3201j05852L2245
4431B604490R8329J52705m2852K5225L4980k2005J84860P0189M4748L8156m5239
4420C143586p8682k0285j8308Q3384P4003N7988m7059L1512m024j1941J6672J5959
4408C242805n846j5149m2092K8024M0706M346j61011j612o9511K0344J38681L110
4396C182795K5451Q5040j9340l5335O185J34894L5296m9368n961Q3999N2692O8885
4384C565233L8128r215J03210N597J38691Q5485L5669R4253Q0557R7181J61430
$$ y = [2015888, 2001788, 2048239, 2074922, 2095006, 2070402, 2106267, 2095357, 2050803, 2070329, 2094942, 2138628, 2117232, 2126671, 2014368, 2062258, 2184108, 2248557, 2291890, 2320712, 2321153, 2260707, 2327478, 2429747, 2457664, 2458661, 2521974, 2602843, 2594817, 2637096, 2653933, 2601003, 2664896, 2678097, 2572245, 2604490, 2702819, 2855524, 2812672, 2837897, 2872877, 2850872, 3035732, 3105921, 3150669, 3188825, 3143586, 3064904, 3044619, 3026311, 3109695, 3183698, 3241686, 3194627, 3226139, 3222115, 3210174, 3226846, 3242805, 3236959, 3221810, 3179718, 3207742, 3248448, 3252794, 3091783, 3090171, 3020660, 3041004, 3179685, 3182795, 3208246, 3293286, 3273946, 3238611, 3244796, 3379690, 3414986, 3365618, 3359657, 3443656, 3496348, 3565233, 3603361, 3594146, 3697356, 3702953, 3841644, 3927129, 3962798, 4057051, 4137608, 4234789, 4396219]
4373D396219L9596j1300J12309J9158o4399L179J37486K12942J8136j9184P3811
4362D917953P9516L7695N27k2556l0699J16132M13j19486n2950k3146k020j27136
4350D774243n5998o230j47692l9668o2647k7846K1239m6408o3699p0877j56661
4339D117756J5957P3874j11970m645M1141o7300j12581N4319M6147l3997m981
4328D013720R5010p9499l6009O222o665M2804K612J35259r137K6306R5849l8298
4316D248174M6218O4934M7419M6542M8041J8335J9380J04702J92248N8342K36357
4305E130692R1593L302n907P303j08575j6387q2576r0669J45357l0303k9685J31937
4293E146082R9230k9405M0756K8248J8803j7317o8097k450N2587K9790P620N542
$$ y = [4396219, 4435815, 4424515, 4536824, 4555982, 4491583, 4494762, 4632248, 4845190, 4863326, 4844142, 4917953, 4997469, 5035164, 5035691, 5013135, 4982436, 5098568, 5098981, 4979495, 4926545, 4903399, 4901379, 4774243, 4718245, 4712015, 4564323, 4524655, 4462008, 4434162, 4455401, 4408993, 4345294, 4274417, 4117756, 4133713, 4207587, 4095617, 4090972, 4132113, 4064813, 3952232, 4006551, 4052698, 4018701, 4013720, 4108730, 4029231, 3993222, 3999444, 3992779, 4035583, 4038195, 4173454, 4164317, 4190623, 4286472, 4248174, 4294392, 4359326, 4406745, 4453287, 4501328, 4519663, 4539043, 4643745, 4835993, 4894335, 5130692, 5222285, 5225587, 5219680, 5226983, 5118408, 5102021, 5019445, 4928776, 5074133, 5043830, 5014145, 5146082, 5245312, 5215907, 5256663, 5284911, 5303714, 5286397, 5218300, 5215850, 5268437, 5298227, 5305847, 5311389]
4281E311389R9366Q9548O5312N0197J3569M0340P1204Q2861Q5599J77271J76684
4270F263340J22517J3344J24190K48023J70500L10263K22669K25214L83095K87904
4260H371059L29611J09613o1469q2276j48855J67640J70491j4376J52933R6282
4250I090653J64774J18540K83020J96848J89624K46525l7260J44316J17806J81888
4240A0696734K52756K62502J84604L53381M24591L62359M42393N41876O21759
4231A4142955P38019N13945L71320L98195J72925j91703m44108m48311m47987
4222A4805250n20065k53724j65729k52821j47223N788j30325j73265o3443k1560
4212A3082883J39928K1276L9691J66767J49124R8302P6980J74437K9725O1841
$$ y = [5311389, 5410755, 5500303, 5565615, 5615812, 5629381, 5669721, 5740925, 5823786, 5909385, 6086656, 6263340, 6385857, 6399201, 6523391, 6771414, 6941914, 7252177, 7474846, 7700060, 8083155, 8371059, 8700670, 8810283, 8748814, 8666538, 8517683, 8685323, 8855814, 8841438, 8994371, 9090653, 9255427, 9373967, 9656987, 9853835, 10043459, 10289984, 10252724, 10397040, 10514846, 10696734, 10949490, 11211992, 11396596, 11749977, 12174568, 12536927, 12979320, 13521196, 14142955, 14880974, 15394919, 15766239, 16164434, 16337359, 16145656, 15701548, 15253237, 14805250, 14285185, 14031461, 13865732, 13612911, 13465688, 13471476, 13341151, 13167886, 13104443, 13082883, 13222811, 13244087, 13283778, 13450545, 13599669, 13697971, 13774951, 13949388, 13979113, 14040954]
4202A4040954J14710K66903J75094J03939J07473K12625J43423K41978K3097N9085
4192A5489281K83875K13523K41115J46594J63664L9231J70459J69687J15070P2804
4182A7105303R8885k9216m6700O3742r541q9018l1680j5390L5373n9655p0689
4171A6951414m3261m9791j07401j50832n3230l8750j71701n2561j38270k08519
4161A5937098r4925j09950n1772r9267p2943q8341o8726j38072n5291k8002m5855
4150A5083954j93377k38483J5744j92759m1234M1462K9707j40807j6651j75670
4140A4171886p1511k1527j42812J4950P3875j15851r1891p8683j0110m0320o7881
4129A3620125m4594J0563q2781j2919j0757j9091M2424R38K34349J24192P1098
$$ y = [14040954, 14155664, 14422567, 14597661, 14701600, 14809073, 15021698, 15165121, 15407099, 15430196, 15489281, 15773156, 15986679, 16227794, 16374388, 16538052, 16577283, 16747742, 16917429, 17032499, 17105303, 17204188, 17174972, 17128272, 17192014, 17182473, 17093455, 17061775, 17046385, 17081758, 17022103, 16951414, 16908153, 16858362, 16750961, 16600129, 16546899, 16508149, 16336448, 16283887, 16145617, 15937098, 15842173, 15732223, 15680451, 15581184, 15508241, 15419900, 15351174, 15213102, 15157811, 15129809, 15083954, 14890577, 14652094, 14667838, 14475079, 14433845, 14475307, 14505014, 14364207, 14347556, 14171886, 14100375, 14078848, 13936036, 13950986, 14024861, 13909010, 13817119, 13738436, 13728326, 13688006, 13620125, 13575531, 13586094, 13503313, 13490394, 13479637, 13460546, 13502970, 13503908, 13738257, 13862449, 13933547]
4118A3933547J04217J55256R2158R3545q0067J07883J5513m0861O6466Q7223l9496
4107A4495384N2948O2076R6902K29804J89179J18293J92242P7215j4630q4284
4097A5415129N6427j95575k08963j43582j82576K9640j26259j70712j8157j967
4087A4453405R96J04165J53501M8345J56368J70669P1106J97446K41312J42529
4077A5739842K48674K61559K59457K14735K23428J06058J19285J68805M7178n911
4067A7383110P9032P4447j23359K9381R8375J67179J6821Q8438j3991J3144m3426
4056A7769151R7882M0577j27959r7885l16260k71710k57371k62570j77451j79722
4046A6216682J1876r0437M9106Q9728l4918Q315J50539J46260Q499r222L3098
$$ y = [13933547, 14037764, 14193020, 14285178, 14378723, 14298656, 14406539, 14422052, 14381191, 14447657, 14534880, 14495384, 14548332, 14610408, 14707310, 14937114, 15126293, 15244586, 15436828, 15514043, 15499413, 15415129, 15471556, 15275981, 15067018, 14923436, 14740860, 14770500, 14644241, 14473529, 14455372, 14453405, 14454401, 14558566, 14712067, 14760412, 14916780, 15087449, 15158555, 15356001, 15597313, 15739842, 15988516, 16250075, 16509532, 16724267, 16947695, 17053753, 17173038, 17341843, 17389021, 17383110, 17462142, 17536589, 17413230, 17442611, 17540986, 17708165, 17724986, 17813424, 17799433, 17812577, 17769151, 17867033, 17907610, 17779651, 17681766, 17365506, 17093796, 16836425, 16573855, 16396404, 16216682, 16228558, 16138121, 16187227, 16276955, 16242037, 16250352, 16400891, 16547151, 16555650, 16546428, 16579526]
4035A6579526M7137J36436R2503O2236K92756L04914K18606L73288L41254J81368
4025A8630024J82996L00803L11044J28310L28413L63813L15080M55321N22802
4016B1538606N31161O00773P43729P20922P86540R46637J006551J077572R37504
4007B8889995P57388L78083J10545j37594q5445j46470j44209j95363l45560l42791
3997B8738579l23110n23250o30045o11697o68912p64333p66992o61769o52812
3988B3135659n03780o31467p01387n30193n56669m17511l32300m75183m06329
3979A8580840l81041l52398m63269l53026j69135j91242k08157k50584j35805
3970A6076183k11990l04121k28854j83341j27757j21415K4884j37998k27788j50393
$$ y = [16579526, 16626663, 16763099, 16855602, 16917838, 17210594, 17515508, 17734114, 18107402, 18448656, 18630024, 18813020, 19113823, 19424867, 19553177, 19881590, 20245403, 20560483, 21015804, 21538606, 22069767, 22670540, 23414269, 24135191, 24921731, 25868368, 26874919, 27952491, 28889995, 29647383, 30025466, 30136011, 29998417, 29912972, 29766502, 29622293, 29426930, 29081370, 28738579, 28415469, 27892219, 27262174, 26650477, 25981565, 25217232, 24450240, 23788471, 23135659, 22631879, 22000412, 21299025, 20768832, 20212163, 19794652, 19462352, 18987169, 18580840, 18199799, 17847401, 17384132, 17031106, 16861971, 16670729, 16462572, 16211988, 16076183, 15864193, 15560072, 15331218, 15147877, 15020120, 14898705, 14923589, 14785591, 14557803, 14407410]
3960A4407410R187j31284j54425q9133m6812r3489J8578k1554j77530l4290j35297
3949A3551361j26094j96300k6447j01965m7493p6763o1577l8772j07782j5754
3939A2752414q5458O7893p8502o3124M3145j12335k5692K5056j2347O4756j8911
3928A2556895j28721J7018o2562k4930P6428j38015r5823J08888K1630j75002
3918A2155806L556O0053n4700J27463o7484j18894J39362k6359K4915j18146j16120
3907A2009452M5723M9362K6543j9209m3818j16236j43653j19177K0939p2189N0425
3896A1688162l4063o6357J1006q0082l9914j2004n573o6470l191o0243p8562l9269
3884A1213440n002q2369n1842P1111j14453j15250k5100N8508q2566j1655J0642
$$ y = [14407410, 14416597, 14285313, 14130888, 14041755, 13994943, 13901454, 13920032, 13898478, 13720948, 13686658, 13551361, 13425267, 13228967, 13202520, 13100555, 13053062, 12976299, 12914722, 12875950, 12768168, 12752414, 12666956, 12734849, 12656347, 12593223, 12636368, 12524033, 12498341, 12523397, 12511050, 12575806, 12556895, 12428174, 12445192, 12382630, 12357700, 12434128, 12296113, 12200290, 12309178, 12330808, 12155806, 12159362, 12219415, 12164715, 12292178, 12224694, 12105800, 12245162, 12218803, 12243718, 12125572, 12009452, 12055175, 12104537, 12131080, 12111871, 12068053, 11951817, 11808164, 11688987, 11709926, 11637737, 11688162, 11654099, 11587742, 11598748, 11518666, 11478752, 11466748, 11461175, 11394705, 11391514, 11331271, 11252709, 11213440, 11208438, 11126069, 11074227, 11145338, 11030885, 10915635, 10890535, 10949043, 10866477, 10854822, 10865464]
3873A0865464r0411k6147M3054O7011k477o2631l7050m6732l0178m3579j75335
3862A0460989P7058L5120J0770q1932L613m6082K2143N148L7344J01654N7738
3851A0683563J9952m8350j5655N4142K3829M6517M4558J2589N3261M8034J71711
3840A1094151Q4493M1630Q0256J58972m0526j8092J04896J35288J26978J22922
3830A1890968J40679J49218J45368J99637k2946K83147K47829K44523Q5315N1342
3820A3415080J93779K04293J38133J87717J65058J55989J70806J86313N7680N1443
3810A4926291K6522p687m8068J2049N9602j22087j85981l31191j95932j61306
3800A3972212j02395j09982k13416l39756k67462k02095k47231k65741j92415
$$ y = [10865464, 10775053, 10748906, 10791960, 10858971, 10856494, 10793863, 10756813, 10710081, 10679903, 10636324, 10460989, 10538047, 10573167, 10583937, 10502005, 10505618, 10459536, 10481679, 10486827, 10524171, 10625825, 10683563, 10703515, 10655165, 10639510, 10693652, 10717481, 10763998, 10808556, 10821145, 10874406, 10922440, 11094151, 11178644, 11220274, 11300530, 11459502, 11418976, 11400884, 11505780, 11641068, 11768046, 11890968, 12031647, 12180865, 12326233, 12525870, 12502924, 12786071, 13033900, 13278423, 13363738, 13415080, 13608859, 13813152, 13951285, 14139002, 14304060, 14460049, 14630855, 14817168, 14874848, 14926291, 14952813, 14945126, 14897058, 14909107, 14968709, 14846622, 14660641, 14329450, 14133518, 13972212, 13869817, 13759835, 13546419, 13206663, 12939201, 12737106, 12489875, 12224134, 12031719]
3791A2031719l12754k80637j92860k49112k33034j70086l05652k75470k13642
3782I798472j52481j32831j62741k04582q4072j62908j02388j65802j66230q0757
3772H383680p8582j00925J7519j32426q1141k5863L6935L2924K8209j42162O0058
3761G998226J03153K4902J23452N6657J50109J54905J35556J04933Q3731P803
3751H943427p8539k77552k92358l05192k10118k96864l44390k53631k00654j72208
3741F511921j68555j46270j87292k2819j16335q5005j61842k41482K3996q7778
3731E318539J1529r0576n8172o3263m6155o446j98127p0391N3284j28310p1052
3720D650860n3214m8822n4453m3064M2184K9881n6031n9039Q0110n1631r9369
$$ y = [12031719, 11718965, 11438328, 11245468, 10996356, 10763322, 10593236, 10287584, 10012114, 9798472, 9645991, 9513160, 9350419, 9145837, 9061765, 8898857, 8796469, 8630667, 8464437, 8383680, 8305098, 8204173, 8221692, 8089266, 8008125, 7982262, 8019197, 8052121, 8080330, 7938168, 7998226, 8101379, 8126281, 8249733, 8306390, 8456499, 8611404, 8746960, 8851893, 8935624, 8943427, 8864888, 8587336, 8294978, 7989786, 7779668, 7482804, 7138414, 6884783, 6684129, 6511921, 6343366, 6197096, 6009804, 5986985, 5870650, 5785645, 5623803, 5382321, 5406317, 5318539, 5330068, 5239492, 5181320, 5118057, 5071902, 5065456, 4867329, 4796938, 4850222, 4721912, 4650860, 4597646, 4548824, 4494371, 4451307, 4493491, 4523372, 4467341, 4408302, 4488412, 4436781, 4337412]
3709D337412n2935k3514R1077n5629k06027j8812J3261N5577l2621o3399k0295
3698D024095n6293m9877l0396m266O5406q3839p429J5708K3698L7198q9697j7140
3686C827168j6602M9216N1480L7397q9981M9692K6327m3223k359q478r5857R6423
3674C881203l4710J9824L6807K7898q7988o0557J08121L2672j07306R4843n8643
3663C852164l4324O1075O4241N5215N4291k9374j9011J00243o8104n8856J8648
3652C996208M9683j42371L6462O1776J05228K1681m4648j8182R1707K5061p6248
3641D106357P1082P7611L0915R7982n286J05147j0677j4099P9419P7979J53089
3630D769519Q8890Q1825L0020P6123N9608J44599J00361K12353J64847J13578
$$ y = [4337412, 4284477, 4260963, 4352040, 4296411, 4090384, 4071572, 4084833, 4140410, 4107789, 4044390, 4024095, 3967802, 3917925, 3887529, 3883263, 3948669, 3864830, 3857401, 3873109, 3896807, 3934005, 3844308, 3827168, 3810566, 3859782, 3911262, 3948659, 3858678, 3908370, 3934697, 3891474, 3889115, 3880637, 3784780, 3881203, 3846493, 3866317, 3903124, 3931022, 3843034, 3782477, 3890598, 3923270, 3815964, 3910807, 3852164, 3817840, 3878915, 3943156, 3998371, 4052662, 4023288, 4004277, 4104520, 4036416, 3977560, 3996208, 4045891, 3903520, 3939982, 4001758, 4106986, 4128667, 4084019, 4065837, 4157544, 4182605, 4106357, 4177439, 4255050, 4285965, 4383947, 4378661, 4483808, 4473131, 4459032, 4538451, 4616430, 4769519, 4858409, 4940234, 4970254, 5046377, 5105985, 5250584, 5350945, 5563298, 5728145, 5841723]
3620E841723K13416J51920J17366K61995J89950J21993J49345Q8867r6847M555
3610G044283o8252p5961j36000j10455J8955o2661j118J8163R3044n6014O6805
3599F730789M2998M6706j3078K8943r2860J21332J02394Q9919J5111O8664O7100
3588G208018J03621L4583J16419P6441N5595J64099R9895J30768J40919q076l8948
3577H083334O9759J38534J07711K2072J61462J32032M3340J5248Q5173L8985J71644
3566I069294J26985l686J08733j0395J33113J42880l512R4876O5738P1968q103
3555I787891J25373J07121n3779J10503k1020O1054J44949J34606J15255j1088
3545A0500865J01586R9605k5857q2956J4893J21601J08365Q6926l2759j48314
$$ y = [5841723, 6055139, 6207059, 6324425, 6586420, 6776370, 6898363, 7047708, 7136575, 7039728, 7044283, 6976031, 6900070, 6764070, 6653615, 6672570, 6609909, 6608791, 6626954, 6719998, 6663984, 6730789, 6773787, 6820493, 6807415, 6836358, 6743498, 6864830, 6967224, 7057143, 7072254, 7140918, 7208018, 7311639, 7346222, 7462641, 7539082, 7594677, 7758776, 7858671, 7989439, 8130358, 8122282, 8083334, 8153093, 8291627, 8399338, 8421410, 8582872, 8714904, 8758244, 8773492, 8858665, 8897650, 9069294, 9196279, 9192593, 9301326, 9290931, 9424044, 9566924, 9563412, 9658288, 9724026, 9795994, 9787891, 9913264, 10020385, 9966606, 10077109, 10056089, 10117143, 10262092, 10396698, 10511953, 10500865, 10602451, 10702056, 10676199, 10593243, 10608136, 10729737, 10838102, 10925028, 10892269, 10743955]
3535A0743955R8755M7467K1566q615k7964N2146j4706j68869K1479Q5890m6231
3524A0804873n2756N5627J46942r658k164m6281l9065m2487l0930L9721l2614
3513A0791208r9922j36285R1041l0570j27847m9849J01383L1362l3546m0016q3964
3502A0412995j15918j3271n9455L1941k1521o6393j05855j40968K1423o303j55007
3491I781668l3252l9763p4659k1354K6255q4077n3373m5900j51982j29335N5311
3480I229539n3268m6141K8064L1226j9243j20414n0170k7003l853K5631M4702
3469I039070j02948R9599j4247L9119q4943O3527O8299J15800j42641O4862O6401
3458I211898J7808J23747P4540q726m5480J39930J49115M0711P3093J7401r679
$$ y = [10743955, 10842710, 10890177, 10911743, 10903128, 10875164, 10927310, 10912604, 10743735, 10765214, 10851104, 10804873, 10752117, 10807744, 10954686, 10945028, 10942864, 10896583, 10857518, 10815031, 10784101, 10823822, 10791208, 10691286, 10555001, 10646042, 10615472, 10487625, 10437776, 10539159, 10570521, 10536975, 10496959, 10412995, 10297077, 10283806, 10224351, 10256292, 10234771, 10168378, 10062523, 9921555, 9942978, 9936675, 9781668, 9748416, 9708653, 9633994, 9612640, 9638895, 9554818, 9501445, 9455545, 9303563, 9174228, 9229539, 9176271, 9130130, 9158194, 9189420, 9170177, 9049763, 8999593, 8972590, 8968737, 8994368, 9039070, 8936122, 9035721, 9021474, 9060593, 8975650, 9039177, 9107476, 9223276, 9080635, 9145497, 9211898, 9229706, 9353453, 9427993, 9419267, 9373787, 9513717, 9662832, 9703543, 9776636, 9794037, 9784358]
3447I784358J10005J94678J22462q732K11329O4139K10864K9954N8188R4863J15124
3436A0987232J69362J33673J15150J99287J10543J64804K70737K33973J59055
3427A2543816J85151L62883K44330K37433L00307L14366K42817K41282L92218
3418A5064603M08093K85681K83862L01013K21417M11213L42172K87703K77955
3409A7883712L70095M39913M19351M11103N39861N39568N29869M77215M35417
3400B2046104N38098N76727O51277N03507N13964O85353P42131N34484O50593
3391B7442238L86998L54403L44841M10649L08862K16454K11651L81325L32983
3382C0390404K97747L14407L81601O28603N39244O64470O52754O82275O97446
$$ y = [9784358, 9894363, 10089041, 10211503, 10202771, 10414100, 10478239, 10689103, 10719057, 10777245, 10872108, 10987232, 11156594, 11290267, 11405417, 11604704, 11715247, 11880051, 12150788, 12384761, 12543816, 12728967, 13091850, 13336180, 13573613, 13873920, 14188286, 14431103, 14672385, 15064603, 15472696, 15758377, 16042239, 16343252, 16564669, 16975882, 17318054, 17605757, 17883712, 18253807, 18693720, 19113071, 19524174, 20064035, 20603603, 21133472, 21610687, 22046104, 22584202, 23160929, 23812206, 24315713, 24829677, 25515030, 26257161, 26791645, 27442238, 27829236, 28183639, 28528480, 28939129, 29247991, 29464445, 29676096, 30057421, 30390404, 30688151, 31002558, 31384159, 32012762, 32552006, 33216476, 33869230, 34551505, 35248951]
3373C5248951Q63649R96138Q73538J041450J159799J402440J391609J390714J406550
3364D5774838J518176J600376J534169J644024J850147J894703J753952J961129
3356E9531514J892258K122170K390840K515248K656641L135933L431781L746003
3348H1422388M268908M512129M970949N476966O144301P022072Q119598R264629
3340A31201940J0743596J2328788J4238852J6469601J9395233K2742413K7188915
3333B54309338L2412836L7457980M1144256M0414635L1004988J1326679j3537352
3326D34533360l4048705m3722439m4279990l9641269l3242736k6877767k1874698
3319A90845756j8015532j5099199j2690708j0909457r279742q032715o950228
$$ y = [35248951, 36112600, 37108738, 37982276, 39023726, 40183525, 41585965, 42977574, 44368288, 45774838, 47293014, 48893390, 50427559, 52071583, 53921730, 55816433, 57570385, 59531514, 61423772, 63545942, 65936782, 68452030, 71108671, 74244604, 77676385, 81422388, 85691296, 90203425, 95174374, 100651340, 106795641, 113817713, 121937311, 131201940, 141945536, 154274324, 168513176, 184982777, 204378010, 227120423, 254309338, 286722174, 324180154, 365324410, 405739045, 436744033, 448070712, 434533360, 400484655, 356762216, 312482226, 272840957, 239598221, 212720454, 190845756, 172830224, 157731025, 145040317, 134130860, 124851118, 116818403, 109868175]
3312A09868175n972756n090931m194373l459437k760448k298007j878225j653173
3304H2560825j487859j409159j425760j273613j140582j078613j026429r56545
3296G2762265q97568q56237p94682p90139n53690l84712k46337q7013j97231r1503
3286F7863153Q1781K67010K50326K20372L32372L55926M47692O22802P50842P00233
3276G1892509Q59286J133425J101327J169254J306793J323111J547095J610447
3268H1943247J664791J677962J979280K036568K033244K226358K524296K679147
3260I8764893L038520L354921L561193L999358M394800M968100N390041N923484
3252A33395310O718384P589262Q445026R526873J0600253J1809198J2873736J3701929
$$ y = [109868175, 103895419, 98804488, 94610115, 91150678, 88390230, 86092223, 84213998, 82560825, 81072966, 79663807, 78238047, 76964434, 75823852, 74745239, 73718810, 72762265, 71864697, 71008460, 70213778, 69423639, 68869949, 68485237, 68238900, 68151887, 67954656, 67863153, 67944934, 68211944, 68462270, 68682642, 69015014, 69370940, 69818632, 70441434, 71192276, 71892509, 72751795, 73885220, 74986547, 76155801, 77462594, 78785705, 80332800, 81943247, 83608038, 85286000, 87265280, 89301848, 91335092, 93561450, 96085746, 98764893, 101803413, 105158334, 108719527, 112718885, 117113685, 122081785, 127471826, 133395310, 140113694, 147702956, 156147982, 165674855, 176275108, 188084306, 200958042, 214659971]
3244B14659971J3904746J3656161J2279582R890636O371801K202209k068148o214355
3236B64682603r736433j2955191j4987291j6211601j6451947j5907689j5118767
3229A63313684j3910019j2437676j0976991r895781q801331p586147o911927o074551
3221H6719261n402212m745502m266545l738993l315717l046496k747334k469515
3213E6986947k337004k113772j811108j724963j641878j469082j278945j304959
3205D3305236r86848j012434r43281q34047o37730o46056n44934m32267n97007
3196C6670632n82599o48041p84603p16326p34029q80652q83819r10378p78446
3187B9751739p99704o78192n98858o12480o06687o47595o29185o16228n40718
$$ y = [214659971, 228564717, 242220878, 254500460, 264391096, 270762897, 272965106, 270896958, 264682603, 254946170, 241990979, 227003688, 210792087, 194340140, 178432451, 163313684, 149403665, 136965989, 125988998, 116093217, 107291886, 99705739, 92793812, 86719261, 81317049, 76571547, 72305002, 68566009, 65250292, 62203796, 59456462, 56986947, 54649943, 52536171, 50725063, 49000100, 47358222, 45889140, 44610195, 43305236, 42318388, 41305954, 40362673, 39528626, 38890896, 38244840, 37699906, 37267639, 36670632, 36088033, 35439992, 34655389, 33939063, 33205034, 32324382, 31440563, 30530185, 29751739, 28952035, 28273843, 27674985, 27062505, 26455818, 25808223, 25179038, 24562810, 24022092]
3178B4022092n93352o92906m62550n83012n11058m22913m33729m02778l37086
3169A9582708k50579m57491l16558l59896m48599l99636l72159j82574m02618
3160A6392598n39998l61444l59164k62805n30358m21390j90384m20119l92279
3151A2914657k36957k07588j10726j63654l06133l63931j96484j41600j29495
3142A1058089j64066j97250k67162j43065j89174k35112j26025j44169R6286k07772
3132I480580o4245k45703j61680p0659j37445p6045r8360q694q9804j76530j12926
3121H238489q4292o3524p0771J9922j04492q8443P5509j34628j5078O0457J5174
3110G848323o7063j32680r6817P9280P0253j91959j0873R419j3338k0186p8021
$$ y = [24022092, 23428740, 22735834, 22273284, 21690272, 21179214, 20756301, 20322572, 19919794, 19582708, 19332129, 18874638, 18558080, 18198184, 17749585, 17349949, 16977790, 16795216, 16392598, 15852600, 15491156, 15131992, 14869187, 14338829, 13917439, 13727055, 13306936, 12914657, 12677700, 12470112, 12359386, 12195732, 11889599, 11525668, 11329184, 11187584, 11058089, 10894023, 10696773, 10429611, 10286546, 10097372, 9862260, 9736235, 9592066, 9688352, 9480580, 9416335, 9170632, 9008952, 8938293, 8800848, 8724803, 8626443, 8617749, 8527945, 8351415, 8238489, 8154197, 8090673, 8019902, 8039824, 7935332, 7846889, 7922398, 7787770, 7772692, 7833149, 7848323, 7781260, 7648580, 7551763, 7631043, 7701296, 7509337, 7498464, 7507883, 7494545, 7474359, 7396338]
3099G396338j11535r2733Q8974l4877q2531r0702j2001j3012J8995j05218L976
3088F965674p9459o5497p614r5819n6881o8414j03188m6339L499p3110k3603m2585
3076F306664j18175j03732r9282q0147l0465r389J4806j12557j09881m7073j02956
3065E507813j03187O529M858n5780Q387q6177k4682K7759J09601q7206j71330
3054E136585j37901P2528J24126n5003N8351N5377J67070Q3954m4040J02866J34428
3043E698341J63510J85507J01041k3947p5134j3939j58902k16485r2827k02732
3033E364433j43028j78044j52510l3467r3916j9871k01450k16012n6922L0435
3023D299648J370m0073j3433l479N2977K1658n2233J9113M1578p2843j08441j7876
$$ y = [7396338, 7284803, 7192070, 7281044, 7246167, 7163636, 7072934, 7060933, 7047921, 7066916, 6961698, 6965674, 6886215, 6820718, 6813104, 6717285, 6660404, 6591990, 6488802, 6442463, 6445962, 6372852, 6349249, 6306664, 6188489, 6084757, 5985475, 5905328, 5874863, 5865474, 5880280, 5767723, 5657842, 5610769, 5507813, 5404626, 5411155, 5416013, 5360233, 5368620, 5282443, 5257761, 5285520, 5395121, 5307915, 5136585, 4998684, 5071212, 5195338, 5140335, 5198686, 5254063, 5421133, 5505087, 5461047, 5563913, 5698341, 5861851, 6047358, 6148399, 6124452, 6049318, 6035379, 5876477, 5659992, 5567165, 5364433, 5221405, 5043361, 4890851, 4857384, 4763468, 4743597, 4542147, 4326135, 4269213, 4299648, 4301018, 4260945, 4247512, 4244033, 4297010, 4318668, 4266435, 4285548, 4327126, 4254283, 4145842, 4127966]
3011D127966K5593k4103r9428J6099O0626o687n365O442J4380K8484j7036O9096
2999D196067k0907l6703J09511r200R512o4834m7698R0583K9133O4302L7574l4768
2987D322572k86J0627J04869k1281k8910J9015J5568N1582N257k5675Q6448J00955
2975D640741J11413Q8493J09705j347l1959J59641K7014l0655K1738M6600P8196
2964E219580Q8385k253J32016J19873J20049K8914P6961J20628P6345J00336J40121
2953F220955J50097J12774R8726J98218N9639J28672K28142K19618J49129K14188
2943G780158L89093Q2452K19836M22652M12823L69107N15831N09384N67800N65943
2933A1835079N57490O51776O72148M95184O23813N52423L06186K04122M9931P8849
$$ y = [4127966, 4153559, 4129456, 4030028, 4046127, 4106753, 4100066, 4094701, 4101143, 4115523, 4144007, 4126971, 4196067, 4175160, 4138457, 4247968, 4238768, 4248280, 4183446, 4135748, 4226331, 4255464, 4319766, 4357340, 4322572, 4322286, 4332913, 4437782, 4416501, 4387591, 4406606, 4422174, 4473756, 4479013, 4453338, 4539786, 4640741, 4752154, 4840647, 4950352, 4949005, 4917046, 5076687, 5103701, 5073046, 5094784, 5141384, 5219580, 5307965, 5305712, 5437728, 5557601, 5677650, 5706564, 5783525, 5904153, 5980498, 6080834, 6220955, 6371052, 6483826, 6582552, 6780770, 6840409, 6969081, 7197223, 7416841, 7565970, 7780158, 8169251, 8251703, 8471539, 8894191, 9307014, 9676121, 10191952, 10701336, 11269136, 11835079, 12392569, 13044345, 13716493, 14211677, 14835490, 15387913, 15694099, 15898221, 15948152, 16027001]
2923A6027001j65244j45213j65587l3508n210L1142o0874m035m6363N0023J29903
2912A5612035J75016K37192L61693L84505M26586N84577Q86545J041278J053395
2903B0762822J370415J689167J966099J606858N89803p59914j616910k152204
2895B3456136k082651j790763j611950j312322r74648p76917q61855o12116l62665
2886A3070249m29745l81045l51501j85483k38069j81102L157L0670K7833J11855
2876A1476819J21108J62730K55038K73782J75156J11580R1834K8145k60443m00026
2866A2035723m50001o57215p08296o42008p11429n05866m87344m68527l62062
2857G042975l86122l56707l69137k52800k15964k10280k82875q3661j55127k74955
$$ y = [16027001, 15861757, 15716544, 15550957, 15517449, 15512239, 15543381, 15482507, 15478472, 15432109, 15482132, 15612035, 15787051, 16024243, 16385936, 16770441, 17197027, 17781604, 18668149, 19709427, 20762822, 22133237, 23822404, 25788503, 27395361, 27985164, 27225250, 25608340, 23456136, 21373485, 19582722, 17970772, 16658450, 15683802, 14906885, 14045030, 13432914, 13070249, 12640504, 12259459, 11907958, 11722475, 11484406, 11303304, 11306461, 11337131, 11364964, 11476819, 11597927, 11760657, 12015695, 12289477, 12464633, 12576213, 12668047, 12696192, 12435749, 12035723, 11585722, 10928507, 10220211, 9578203, 8866774, 8360908, 7873564, 7405037, 7042975, 6656853, 6300146, 5931009, 5678209, 5462245, 5251965, 4969090, 4885429, 4730302, 4455347]
2847D455347j13519m8116j42227j76511k61936j83598l1627l1126n2740j18511
2837C295436j18912j35259k14236j17605n8651j07770Q709m524n2152m3730P5122
2826B526428m0584j16497j49585k0999J0446l5500m9660m4302J5778p7055o4075
2815A954395m2850J3011L1729p660N266r8912j88660o2686P959m5169M764q7236
2803A483951k2043J2182j1592O5841l778j40032q1329N9532n5078M5849N786M2555
2791A401844j49713j11071P5013N1778N0668n8365j3065Q7213J0097o5610K0873
2780A299662l9883j13959P9942N9410j64140O7283J2203q931M1661q1903q3367
2769A067978K8487j14871L0876j610k9252K2788J5928N3776j20645k4491k6218
$$ y = [4455347, 4341828, 4293712, 4151485, 3974974, 3713038, 3529440, 3497813, 3466687, 3413947, 3295436, 3176524, 3041265, 2827029, 2709424, 2650773, 2543003, 2551712, 2547188, 2495036, 2451306, 2526428, 2485844, 2369347, 2219762, 2198763, 2209209, 2173709, 2124049, 2079747, 2095525, 2018470, 1954395, 1911545, 1924556, 1956285, 1948625, 1953891, 1854979, 1666319, 1603633, 1611592, 1566423, 1571187, 1483951, 1461908, 1474090, 1462498, 1528339, 1524561, 1384529, 1303200, 1362732, 1307654, 1353503, 1359289, 1401844, 1252131, 1141060, 1216073, 1267851, 1318519, 1260154, 1247089, 1334302, 1344399, 1278789, 1299662, 1259779, 1145820, 1225762, 1285172, 1121032, 1188315, 1200518, 1191587, 1233248, 1151345, 1067978, 1096465, 981594, 1012470, 1010860, 981608, 1004396, 1020324, 1074100, 953455, 928964, 902746]
2758I02746N9491l3177k0411o0772j6009P0329k8292m3508o436p828j998Q4003
2746H98138J3987L841j00736L3780o1111r583K9071l8359J07489j53871O7064
2735G89710j17179m5195R701L7079L8042j37558L0627L6590N9618m3744l6704
2724F20987J62k8106J4783N8356O2891j259l1146k27703Q2089J2076m6776J6169
2712E32523L3450K5276M0988K9938K631m9199p6814K7392l4468K629R9124K6723
2700F60193o6973P35m4022l9672O6504j6410J664o2194K802M6418l534o0281l5983
2687D49247O908k9508j5637k4328J09118n9007l951j9212o5373K414P9662m3682
2675C86651p6129m6640O3581M0051J04778k3434n1823j1467k6976r120N9998k3645
$$ y = [902746, 962237, 929060, 908649, 847877, 831868, 902197, 873905, 830397, 823961, 816133, 814135, 898138, 912125, 915966, 815230, 849010, 787899, 778316, 807387, 769028, 876517, 722646, 789710, 672531, 627336, 637037, 674116, 712158, 574600, 605227, 641817, 701435, 657691, 620987, 621149, 593043, 607826, 666182, 729073, 727814, 696668, 468965, 551054, 563130, 516354, 532523, 565973, 591249, 632237, 662175, 664806, 615607, 538793, 566185, 531717, 534346, 633470, 660193, 593220, 593955, 549933, 510261, 576765, 560355, 562019, 499825, 502627, 549045, 545511, 485230, 449247, 456155, 426647, 411010, 386682, 495800, 436793, 432842, 413630, 348257, 350671, 430333, 386651, 310522, 263882, 327463, 367514, 472292, 448858, 397035, 385568, 358592, 349472, 409470, 385825]
2663C85825l5307n0337N7862M5158L0040p1885M628M2506J5928q6423q3942R2617
2651C46670J05709N7458p1696o2206M0030k7052J1275P0948o1679l0723M8604
2640D27338N13j63866m1619J57997N5513p7804o1938Q4535n5652l7561M6028p096
2628C26388j1439j06109N547J0925J21865M2753M5739k141L6280l5907k7878l9804
2616C66219M8158m3635k3776M8203p623k992p2446J05275l0925o6150m5857J5795
2604B90246N5072j01904k1832n0172o1446k0110M6885P4092R215q8480l0844J25261
2592B25983m3589J7120R01p3998Q0964J1748l7541Q4233r3592N9523K4459J3945
2580B70156N8851j44677Q513N178K1287m9534Q820o2508Q3625M6535o8307k3308
$$ y = [385825, 350518, 300181, 358043, 403201, 433241, 361356, 365984, 408490, 424418, 337995, 254053, 346670, 452379, 509837, 438141, 375935, 415965, 388913, 400188, 471136, 409457, 378734, 427338, 427851, 263985, 222366, 380363, 435876, 358072, 296134, 380669, 325017, 287456, 333484, 326388, 314949, 208840, 214387, 225312, 347177, 389930, 435669, 433528, 469808, 433901, 406023, 366219, 414377, 370742, 346966, 395169, 387546, 384554, 312108, 417383, 386458, 320308, 274451, 290246, 345318, 243414, 221582, 171410, 109964, 89854, 136739, 210831, 220046, 131566, 100722, 225983, 182394, 199514, 200415, 126417, 207381, 219129, 181588, 265821, 172229, 231752, 256211, 270156, 329007, 184330, 192843, 198021, 219308, 169774, 178594, 116086, 199711, 246246, 177939, 154631]
2568A54631J16969j5114r5795l5805l3735K2400P5368R133J3508J1990r533o137
2556B07880P860k8582k6672R4523j28200l3086L2631k6124K5574L5092q2839j3766
2544F4291o2666m2640M5482J33212J441l8355q4117k4082j901j2723R1215m2089
2532B7068R2256O0134k7288n9703k0496J07941o7820l9417r2423l0059J53633
2521A03826j6034M9544M5542n2719o1017n8374l486n633j4317k3111N2416K08281
2509B24918J1547o1600m0872m8490o0866n4062R9898k9810n2509P2271m3735p103
2497I587J06529L2461k3423k2367j8604N0558O93l8711P1055j02659K9812K4531
2485A19462p5747J3205k7590P6701O540n7498q9830k3943J42525K2970q8782r057
$$ y = [154631, 271600, 256486, 160691, 124886, 91151, 113551, 188919, 198052, 211560, 223550, 214017, 207880, 215740, 187158, 160486, 255009, 126809, 93723, 126354, 100230, 125804, 160896, 78057, 64291, 1625, -41015, 4467, 137679, 139120, 100765, 16648, -7434, -9335, -22058, 69157, 27068, 119324, 179458, 152170, 92467, 71971, 179912, 112092, 72675, -19748, -49807, 103826, 87792, 137336, 182878, 130159, 69142, 10768, 7282, 1649, -12668, -35779, 16637, 224918, 236465, 174865, 133993, 85503, 24637, -29425, 70473, 40663, -11846, 60425, 16690, 9587, 116116, 148577, 125154, 102787, 84183, 134741, 135434, 96723, 167778, 65119, 94931, 119462, 43715, 56920, 29330, 106031, 112571, 55073, -34757, -58700, 83825, 106795, 18013, 8956]
2473H956l6638j9225J08396P6723o6481K944O2970P0791j10289k5659j07705p1831
2461a07048O4771N3283O4425l0852j8679j3866o561J0301K3436N590K2031o9695
2449b864K6525L6193R0011o9364j2736n8492Q0826N0553q8071P0476N1675j45896
2437B8836K6309o0910m7793O8386o6687P9291M5853J7893o2658O532L223P366
2425D5641k0354O3666l9744J3574R7255L0901j55297K817k842Q1700N3038q8279
2413H2076m6265R3527K7105m8606P3006n1180j3542K1859K3061r095j26289P5608
2401A01265k1506K4409j8664m8152J8969O73O4938l1981k1122n8899k4688P195
2389g563R6986l7290o7253J767J35500j6852O1795j6079p3285l6644K837J5666
$$ y = [8956, -27682, -46907, 61489, 138212, 71731, 74675, 137645, 208436, 98147, 72488, -35217, -107048, -42277, 11006, 75431, 44579, 25900, 12034, 5473, 15774, 39210, 44800, 66831, -2864, 23661, 59854, 149865, 80501, 67765, 9273, 90099, 140652, 52581, 123057, 174732, 28836, 55145, -5765, -53558, 14828, -51859, 27432, 73285, 91178, 28520, 35052, 38275, 45641, 25287, 88953, 49209, 62783, 160038, 190939, 35642, 38459, 35617, 117317, 170355, 82076, 35811, 129338, 156443, 107837, 180843, 129663, 116121, 137980, 161041, 151946, 25657, 101265, 79759, 104168, 85504, 37352, 56321, 56994, 121932, 89951, 68829, 9930, -14758, -7563, 89423, 52133, -15120, -13353, 122147, 105295, 167090, 151011, 77726, 41082, 43919, 59585]
2377E9585l2571J7779N4637N2644P392L767K7184O560l2497n5044o213O4840M2163
2364B10226j0463k4541J2809j078r3842l260J1309L0743j5731q8660j03611O3953
2352a2146J13885P0172j3643j15132l2874N6140m2817n6234M7722J4906P6033
2341A06012O5560n7035k7011j02485r7455L9963M2560J10694R9433j16874r0183
2330b6821L1343N5463m466o7441L7368J4449k1013p6463j340L2267M2128k1551
2318f077J6569q2171m2040N8431j0457Q8229J49063o7970J0073M3829o1876O3932
2306A59535r421r4172j10761p1107k1076O8539Q1571J3983j0972M0049K2021J819
2294G0008o6564K962Q1375N0754j03132q2118O3536r2826M803O0500J7960n8430
$$ y = [59585, 27014, 44793, 99430, 152074, 159466, 163233, 190417, 196977, 164480, 109436, 103223, 168063, 210226, 199763, 175222, 188031, 186953, 93111, 89851, 101160, 131903, 116172, 27512, -76099, -12146, 101739, 171911, 158268, 43136, 10262, 66402, 23585, -32649, 15073, 29979, 106012, 171572, 114537, 87526, -14959, -112414, -72451, -29891, 80803, 180236, 63362, -26821, 4522, 59985, 55519, -11922, 25446, 39895, 18882, -57581, -58921, -26654, 15474, -6077, 10492, -71679, -113719, -55288, -65745, 22484, 171547, 103577, 113650, 157479, 95603, 159535, 150114, 55942, -54819, -125926, -147002, -78463, 3108, 17091, 6119, 46168, 68189, 70008, 3444, 6406, 87781, 138535, 35403, -46715, 16821, -76005, -71202, -10702, 7258, -51172]
2282e1172k0861K3212N9390O4603n5881j3673P0977K6894n1905O2036k6256m2540
2270D4824N0051j3014J64879n6715k9252K159J8427J8239o2373n2400N83M2830
2258A28238k4075n1582J01959k9803n6857J03180n4403j12864J67049J4249j02927
2247H2164m5332L0651J2532O6309Mj31545k5908N2342R7744p5059q387M4482R365
2234A09362L5946l9059J191R852P6125O502n7738L7773l0297J13315m2700r4145
2222A26127j6278O9766Q144m5371L3674j194M240q4661R7531L1091r2803j246
2210A29020K2915N635j997R6645Q1808k7640n3957j0795k9129P7856j3606p561
2198B69194K5545O4631J6086K2149j7679j39277O1040K1946o8087P6656q2639
$$ y = [-51172, -72033, -48821, 10569, 75172, 19291, 5618, 76595, 103489, 51584, 113620, 87364, 44824, 94875, 81861, 246740, 190025, 160773, 162932, 181359, 199598, 137225, 84825, 85408, 128238, 104163, 52581, 154540, 124737, 67880, 171060, 116657, 3793, 170842, 185091, 82164, 36832, 67483, 80015, 146324, 146328, 14783, -11125, 41217, 138961, 63902, 55515, 99997, 109362, 145308, 106249, 107440, 117292, 193417, 199919, 142181, 179954, 149657, 262972, 220272, 126127, 109849, 179615, 187759, 142388, 176062, 174868, 179108, 94447, 191978, 223069, 130266, 129020, 151935, 157570, 155573, 252218, 334026, 306386, 252429, 241634, 212505, 290361, 276755, 269194, 294739, 359370, 375456, 397605, 379926, 240649, 301689, 323635, 255548, 332204, 249565]
2187B49565K8454k8165J26328l7693J48321Q840L1992j6092j7646J7684k3040
2176D88548m2734m4191R1249p0084P1130Q9106m5584o3298J09242L7527L5784
2165F56695Q7146O2282j6931q066r0022J22713J15405j09531M8421o098k3856
2154H38158P0844k9571j7132J09407R0286K0467k3307J7400R1525K7592O6390
2143A262059j1475O335J07430J30386J49753J33549J9586q2550Q354J57544J33898
2132B014869J53416L9338M6801J14419M4482N8016P1275J70934J86765J96281
2122C096596K65026K96460Q6962L19542N00620M16422K98514K7540K78218M41436
2112F027336L99878P26124J015598J209501J497699K048698K547501L628120N231712
$$ y = [249565, 278019, 249854, 376182, 338489, 486810, 495650, 527642, 511550, 493904, 511588, 488548, 445814, 401623, 492872, 422788, 493918, 583024, 537440, 474142, 583384, 620911, 656695, 743841, 806123, 789192, 781126, 691104, 813817, 929222, 819691, 868112, 862014, 838158, 909002, 879431, 862299, 971706, 1061992, 1082459, 1059152, 1076552, 1168077, 1195669, 1262059, 1250584, 1256919, 1364349, 1494735, 1644488, 1778037, 1797623, 1715073, 1723427, 1880971, 2014869, 2168285, 2207623, 2254424, 2368843, 2413325, 2471341, 2542616, 2713550, 2900315, 3096596, 3361622, 3658082, 3745044, 4064586, 4565206, 4981628, 5280142, 5307682, 5585900, 6027336, 6427214, 7153338, 8168936, 9378437, 10876136, 12924834, 15472335, 19100455, 24332167]
2103B4332167O527502M658934k937895o247405n443807m909742l394793k271955
2095A0313006j629028j245413r15428q65288o09347l98928l52491j21228j50054
2086D025801k56961l57292l93257j75738k32752j08744j88954k55454m9108m5794
2076A961747j28702j50643k9392j7779j37354j86434l1079j9467J7667M4726j5583
2065A307707j23074r8805n7885J838P5694K061p9649q0645o5991p2528n7979r7459
2053F53285J3674O4555M092J7842J9128j67909j02606O3763j2667o0015n4920
2042D38222J6957O5608K8128j73049J0611P9951q3698k2161N452J05201k1166
2031D50056l6587j10167q3116m75K0999K8573o0346l025P9602n6297N6938J3892
$$ y = [24332167, 30859669, 35518603, 32580708, 26333303, 20889496, 15979754, 12584961, 10313006, 8683978, 7438565, 6523137, 5657849, 5048502, 4649574, 4297083, 4175855, 4025801, 3768840, 3411548, 3018291, 2842553, 2609801, 2501057, 2312103, 2056649, 2007541, 1961747, 1833045, 1682402, 1653010, 1635231, 1497877, 1311443, 1280364, 1260897, 1278564, 1323290, 1307707, 1184633, 1085828, 1027943, 1029781, 1105475, 1107536, 1027887, 947242, 881251, 808723, 750744, 653285, 666959, 731514, 735606, 753448, 772576, 604667, 502061, 565824, 553157, 493142, 438222, 455179, 520787, 548915, 375866, 386477, 466428, 382730, 360569, 366021, 471222, 450056, 413469, 303302, 220186, 219711, 240710, 269283, 208937, 205912, 285514, 229217, 286155, 300047]
2019C00047k1862m5543k5417p4282M7667J12594R4555l4788j01704j5685j48748
2008H6834L0478J13607M3332q7977m589O5834J9661r3938j95563k0175J07498
1997F5002K5921m610R1793l2822m8959P0336j9627r4633M5196k6092Q1330J07083
1985B59918j04549N6461N3238n0703m6814p7748j1682m2748O8291K5542M8855
1974A78061p1376j13879K069k097R638o443N660j9572J15944m0959l2218O7870
1962I2698L9476L9567j48017q0583o869k4707R426M5775J1501N8940j7291J3090
1950C3006j3319q83o9550Q8713J03714j20862J3193j176J55955j33160q7403o762
1938c8534p0124j5529J40653p3102m4270K4737o4167O9284J10325n9248K3263
$$ y = [300047, 278185, 232642, 207225, 132943, 180610, 293204, 387759, 352971, 251267, 235582, 86834, 117312, 230919, 274251, 186274, 181685, 247519, 267180, 173242, -22321, -42496, 65002, 90923, 86313, 178106, 145284, 96325, 166661, 147034, 52401, 97597, 71505, 152835, 259918, 155369, 211830, 265068, 214365, 167551, 89803, 78121, 35373, 103664, 129206, 178061, 106685, -7194, -5125, -7222, 2416, -4027, 1633, -17939, 98005, 57046, 24828, 92698, 132174, 171741, 23724, -56859, -63728, -88435, -79009, -33234, -21733, 37207, 19916, 33006, 19687, 18804, -50746, 37967, 141681, 20819, 34012, 32836, 188791, 55631, -31772, -38534, -108658, -124187, 16466, -56636, -100906, -76169, -140336, -71052, 39273, -19975, 3288]
1927C288N3401o9113M8637O7498K0861n7718p2062n4673J34632J2439n8294m5955
1915a7059K2308n8524M3078N0502k8245k2299O6951K8450n4530M0141k8359N5720
1903I8134N8757o5009K3808j24256K0106J03688j39483n3728l0315L9286j6456
1892h5468k2254J05161K1061j14906L8748Q121k0419J54826L9684j23678k7068
1881b6192j3839K4002q6464l8509L7089L7954j7337J51690o92j09238O6251m2564
1869a7849j26330k0903O3255N2418J13442j67L7769l1021k5769q577j22074k5254
1857a11060K7576O5526N9Q1497l2022m9873N5694r235o4507L6039O6959p3515
1845f862L3862J25340m2828q6740K6313k7942j23685J0213O2756r513N0741M9997
$$ y = [3288, 56689, -12424, 36213, 103711, 124572, 66854, -5208, -59881, 74751, 87190, 28896, -17059, 5249, -53275, -10197, 40305, 12060, -10239, 56712, 85162, 30632, 70773, 42414, 98134, 156891, 91882, 115690, -8566, 11540, 115228, -24255, -77983, -108298, -69012, -85468, -107722, -2561, 18500, -96406, -57658, -49537, -69956, 84870, 124554, 876, -26192, -40031, -16029, -102493, -141002, -103913, -65959, -83296, 68394, 67702, -41536, 24715, -17849, -144179, -165082, -101827, -49409, 64033, 63866, 101635, 70614, 44845, 36268, -85806, -111060, -83484, -17958, -17899, 63598, 31576, -18297, 37397, 28162, -36345, -306, 66653, -6862, 27000, 152340, 109512, 22772, 49085, 21143, -102542, -92329, -29573, -39086, 11655, 61652]
1833F1652L7116P3548l4723r10n7115j13938N9160K9732L1865o3320P9804l4160
1821F8711j217J6689q8607L4010R601L8095l0044r9648n938r979n5900L7959P6326
1808i942K9599R2725p68j17686l3196L1206n9144L0485K2632r1089j11206O8739
1796a47645J07311K6248M3732m9297j23438Q4916J05849r8638K3752m8291K8737
1785d6764j2274J6869k6911j2500L7013J0517L84r0484M7578O03l0808j8843P026
1772a18594M3405o5946P1695P7302p5014L5043O114p1923k1250k8797L1228N827
1760a10910J9340J6535r087Q0645n9388l7241L9331J21931q5874K9375J2520m3368
1748b6191n5551N0174M8491k7200m9495o911N5565j465K1171o6346r5163L912
$$ y = [61652, 98768, 172316, 137593, 136683, 79568, -34370, 24790, 54522, 86387, 23067, 102871, 68711, 67494, 84183, -4424, 29586, 39187, 77282, 47238, -52410, -58348, -68327, -124227, -86268, -9942, 19657, 112382, 111614, -6072, -39268, -8062, -67206, -36721, -14089, -105178, -216384, -147645, -40334, -14086, 29646, -19651, -143089, -58173, 47676, -50962, -27210, -75501, -46764, -59038, -42169, -69080, -81580, -44567, -34050, -33666, -124150, -76572, -75969, -106777, -125620, -118594, -75189, -141135, -69440, 7862, -67152, -32109, -25995, -97918, -119168, -147965, -116737, -110910, -91570, -75035, -84122, -3477, -62865, -100106, -60775, 61156, -24718, 4657, 17177, -26191, -81742, -31568, 16923, -10277, -59772, -66683, -11118, -12583, 8588, -57758, -152921, -149009]
1736a49009J31442M9947p8909K1215J17743Q960n6421r4356J06065k6980q7298
1725e7601J3300L1407L2296l9091r2314O844p102O1218L8965J9465o283q530Q2851
1712G5425j15048j05647P7478K211O2193K9824o21K0049J0753m0849P7675J03351
1700A96794q0822j02454o827j6138n7034O1552J15278p3235l9769o9370J7407
1689e4618M4998j5136J28296q7028K0702p0663P8424M6053p2519m9470P7158j4560
1677C1637k0756l2794J4643n0225j2288R8607l3606l2207j4637k7630M542P8258
1665C544J2659l4807j0325L9452j3475p9687k1670O1373l1557J4710k4871k4102
1653a08756M553J4198j5518L856o2337Q2851J1301K4986K1828L999K7189j24734
$$ y = [-149009, -17567, 32380, -46529, -25314, 92429, 101389, 44968, -49388, 56677, 29697, -57601, -44301, -12894, 19402, -19689, -112003, -105159, -112261, -51043, -12078, 7387, 1104, -7426, 75425, -39623, -145270, -67792, -65581, -3388, 26436, 25815, 45864, 56617, 15768, 93443, 196794, 115972, 13518, 6691, -9447, -66481, -4929, 110349, 37114, -2655, -72025, -54618, -9620, -24756, 103540, 16512, 37214, -33449, 44975, 91028, 18509, -30961, 46197, 31637, 10881, -21913, -7270, -57495, -69783, 28824, -4782, -36989, -51626, -79256, -74714, 3544, 16203, -18604, -28929, 10523, -2952, -82639, -104309, -42936, -74493, -59783, -84654, -108756, -104203, -90005, -105523, -101667, -164004, -81153, -69852, -44866, -23038, -19039, 8150, -116584]
1641a16584P6516M9955n752K0852j11255L5852L0800q983j6325j19847j1124J25769
1629e0126P1939j16817K652j6109N422R0922m6488J1114l5388J8107R1886o2985
1617c5871k1459R7517q9809P1716M5400k2801j13645l8276J87949J6782q8681
1606H822k5025k6578j2660M2069L4741q4512k9694O3386o951N0823l4129j3041
1594c2749Q1600K9006q0806m8667m1605O0474O1337k592m7857r6456P7409j3591
1582e4497m0207k0526M5192K0786r3436L1716O9843n4083q9651L3402N679M7000
1570i8782J5493O0052N6378n6334l5455j9457L2700P2323N3814m0012q8389N7090
1558I421o2536l3403j9616n389K7673J5705J59328o1995j9031K7178n4322k7985
$$ y = [-116584, -40068, 9887, 4135, 24987, -86268, -50416, -19616, -28599, -44924, -164771, -175895, -50126, 21813, -95004, -92352, -108461, -103039, -12117, -58605, -47491, -82879, -64772, 27114, -35871, -57330, 40187, -49622, 22094, 67494, 44693, -68952, -107228, 80721, 97503, 8822, -16203, -42781, -55441, -13372, 21369, -63143, -92837, -29451, -36402, 14421, -19708, -32749, 48851, 77857, -2949, -51616, -93221, -32747, 28590, 25998, -21859, -118315, -40906, -54497, -94704, -115230, -70038, -49252, -142688, -110972, -41129, -95212, -184863, -151461, -145782, -98782, -83289, -23237, 33141, -23193, -58648, -78105, -45405, 26918, 80732, 40720, -47669, 9421, -53115, -86518, -106134, -111523, -83850, -68145, 91183, 29188, 10157, 37335, -16987, -44972]
1546d4972K1269o0241m9095J01060N4774J6662K8978j08242K050N3952K0808p0736
1534c3733J8452P1124l6767N9823q2172r5253L7012M8711j44143N0630J94870
1523H8554q2558j3913J1147j10418K9312K7799L404L1917p9933K5676P9770l1428
1511b0671N921q4736O5233k5711M9957K2526K3675l2040o7929O6990P0505m1695
1499C2025m1466m5158M5804q728l4705k8626Q0162k8912j44000M8890J33103n4441
1487d6052k1467R1518j3427k5457j0061Q5209Q0649p2620j31878j48079k6360
1476b38025O5228J17280J00690l5633J2151j21553P0718j2219l7210k0905L3527
1465f5951p9886M8717N4371l7091o2605k2489N489M2756M5242j2890L8785M6094
$$ y = [-44972, -23703, -83944, -133039, -31979, 22795, 39457, 68435, -39807, -37757, 16195, 37003, -33733, -15281, 55843, 19076, 78899, -3273, -98526, -61514, -12803, -156946, -106316, 88554, 5996, -7917, 3230, -107188, -77876, -50077, -46673, -14756, -94689, -69013, 10757, -20671, -14750, -99486, -34253, -59964, -10007, 12519, 36194, 4154, -63775, 3215, 73720, 32025, -9441, -54599, -8795, -17523, -52228, -80854, -692, -29604, -173604, -124714, 8389, -46052, -67519, 23999, 10572, -14885, -24946, 60263, 140912, 68292, -63586, -211665, -238025, -172797, -55517, 45173, 9540, 21691, -99862, -29144, -41363, -78573, -99478, -65951, -145837, -97120, -42749, -79840, -142445, -164934, -159445, -116689, -71447, -84337, -45552, 542]
1453E42m2528J2766L5740O0098R0108j49921l6588m3669K8475m7725m9052L9188
1441a02566Q4709p9687l5168Q9532K441K9675j04106M7326J04782l3799L734n5445
1429d8572m4715k2273K0575M9609k9579m0509m4078m0828O4259k502L9968M4009
1417e4636j44409M7811P1439R1756k6697l9641l0053L1351J05837j8435r3407
1406e9084n5046k960J38655L9741j6929n1528M2404l1963K6278O5320o535q2300
1394F053R8253n0933j01667Q7534J777p3899m6515M0640O8725O790J8951l2536
1382B3173l8202j4037r0451k6074Q7000j00099J9640J57430j5073M3693o9801
1371b2801n2591m3401l6082J5031J32087l7289M7117n7178p8127j0284P2594m1222
$$ y = [542, -41986, -29220, 6520, 66618, 156726, 6805, -29783, -73452, -44977, -92702, -141754, -102566, -17857, -97544, -132712, -43180, -40739, -11064, -115170, -67844, 36938, 3139, 6873, -48572, -93287, -115560, -94985, -45376, -74955, -115464, -159542, -200370, -136111, -138613, -98645, -54636, -199045, -151234, -79795, 11961, -14736, -54377, -84430, -53079, 52758, 34323, -59084, -114130, -117090, 21565, 61306, 44377, -7151, 35253, 3290, 29568, 94888, 88353, 6053, 104306, 53373, -48294, 39240, 41017, -32882, -79397, -38757, 29968, 36758, 55709, 23173, -15029, -29066, -119517, -145591, -58591, -158690, -139050, 18380, 3307, 47000, -22801, -75392, -118793, -154875, -139844, -7757, -45046, 2071, -55107, -133234, -143518, -70924, -112146]
1359a12146j1792J6049M9536j2450O4097P9446j26041Q03P5322N6071m5915j6377
1347A6603N0440j40748o0881J01334J8549p228k7429K0347J2826M7233K6881j8148
1335C9779j14541m3919K1067J02734M0772q1795m4473k2350Q4463K2619l8987
1324c4631r4334L1048P9944p1062O3384O2861m985p734k5227j30405j02j2652
1312a43895J29820L8803l7353M4896p3724J29568q2635q8611L1278n2060Q079
1301i5834P8099J4776j3472o4072R895l3890J18325M2448j3958l4477k2615o8177
1289h2952Q5980k1922P4641n0237J296J7421p3192k4822K5292R1402J5355j32130
1277g3868q8980K9879M6693J13802l1857o757j01434O8447p316q8818P1254Q17
$$ y = [-112146, -123938, -107889, -58353, -70803, -6706, 72740, -53301, -52498, 22824, 78895, 32980, 16603, 67043, -73705, -134586, -33252, -14703, -21931, -49360, -29013, -16187, 31046, 57927, 39779, -74762, -118681, -97614, 5120, 45892, -35903, -80376, -102726, -18263, 4356, -34631, -128965, -97917, -17973, -89035, -25651, 37210, 32225, 24491, -736, -131141, -131243, -143895, -14075, 24728, -12625, 32271, -41453, 88115, 5480, -83131, -51853, -103913, -95834, -17735, -2959, -16431, -80503, -70608, -104498, 13827, 56275, 42317, 7840, -14775, -82952, 3028, -18894, 55747, 5510, 6806, 24227, -48965, -73787, -48495, 42907, 58262, -73868, -162848, -132969, -86276, 27526, -4331, -11088, -112522, -44075, -51391, -140209, -68955, -68138]
1265f8138q3210N2206J15146m4916J2872J9785j03972K6658R0994J6262o6849
1254c3162P8563n0472n1998j8935J00841n0834r9646J22401O7952O3667m1844
1243H6533j03514l21J1405r5643j5826Q674L168k4757K3833K0510L3626P8788
1231B6476j4975J0813j07224o7328K473O4359J9761J12688M2211p3759q0165J003
1219f3667J3741j1451M075Q6444p7804R2079M7512j75705k5184Q6891q531L4688
1207C088j13345k177R375k4752j1115O472n6198P4543R6143J3811P6211j52816
1195h0760P5916k2638j06686M8585p377M8670P6406n8690L143J35183R4355j04110
1183A01997k1836j47529K0118J15831l1817l3465n5287O3624m2810o1355j14362
$$ y = [-68138, -151348, -99142, 16004, -28912, -16040, 3745, -100227, -73569, 17425, 33687, -33162, 45401, -5071, -57069, -76004, 24837, -25997, -125643, -3242, 64710, 128377, 86533, -16981, -17302, -5897, -101540, -117366, -108692, -105524, -130281, -106448, -85938, -52312, 26476, 11501, 22314, -84910, -152238, -149765, -85406, -65645, 47043, 89254, 15495, -64670, -63667, -49926, -61377, -57302, 29142, -48662, 43417, 90929, -84776, -109960, -23069, -31600, 3088, -110257, -112434, -103059, -127811, -138926, -132454, -188652, -114109, -17966, -4155, 72056, -80760, -4844, -27482, -134168, -85583, -92960, -44290, 32116, -26574, -23431, 111752, 206107, 101997, 80161, -67368, -47250, 68581, 36764, 3299, -51988, 11636, -31174, -92529, -206891]
1172b06891J31351P7211P654p9667k9814j02098J9248N7477q3594J02567l8517
1161a45073J22720J2181M1739l0883m9346K0236J45788m1810j20773r9602L689
1150a41134N3062N5409o3405j7962K0109Q4757r3257M2975Q7948k7229k2338m482
1138b5547O3937k9889N3110M767o036k5838J8230m8716p7706k7784J5916N7692
1126b7864K3189j2263k1903m366M1202n8722N1236l7839p2832N0648o7876O0460
1114g6930J09916j01015q4614J68167N7987R504J33010q6230m9635p1862j12070
1103a03772N4148o9966O5753J27368k5196m9652j123L2024N99p4009p750R4290
1091D2714o990m2088q480n3133k7982K8254P7994n9490n4056K0538N0382P5661
$$ y = [-206891, -75540, 1671, 9325, -70342, -100156, -202254, -183006, -125529, -209123, -106556, -145073, -22353, -10172, 31567, 684, -48662, -28426, 117362, 75552, -45221, -144823, -141134, -88072, -32663, -96068, -114030, -93921, -9164, -102421, -59446, 28502, 1273, -21065, -25547, 38390, 8501, 61611, 66378, 60342, 34504, 52734, 4018, -73688, -101472, -85556, -27864, -4675, -16938, -38841, -43207, -2005, -60727, -9491, -47330, -120162, -69514, -137390, -76930, 32986, -68029, -152643, 15524, 73511, 83015, 216025, 129795, 80160, 8298, -103772, -49624, -119590, -53837, 73531, 48335, -1317, -2440, 29584, 30183, -43826, -51576, 42714, 35724, -6364, -14844, -67977, -95959, -67705, 10289, -49201, -103257, -82719, -32337, 43324]
1079D3324o7678K8396M125j26307n4169O1719K4806J14335k3381l9569R4197j008
1067E8790k1815j13324j2672P8940j4071J9325k1444O4649p8538j0162L7385L010
1055i927q1667j2616J3626o0188J6806J01518m4808J657J02547j0956K7264L1154
1043G4410r0553n6718l114p4408J24675K4889P2037l5195J2895m3466r013J27523
1031A23962m6050o4880j02725M6854R1446m2932l5944k1604N0014J4349j3586
1020a096n9780Q072M2669J03503L1556j4086l3894m9939n1809J5573O7929j3859
1008D4839q0263n5574O6979k3251p9979J96631K2219r4269r325k553J8650J4027
996A8131j2933q363J1060l5045j8231M608J09058n9497k2974m1361Q43o6667K4789
$$ y = [43324, -24354, 4042, 8167, -118140, -172309, -110590, -85784, 28551, 5170, -34399, 59798, 58790, 36975, -76349, -89021, -10081, -24152, -4827, -26271, 38378, -40160, -50322, -12937, -9927, -91594, -104210, -90584, -150772, -133966, -32448, -77256, -75599, 26948, 15992, 43256, 74410, -16143, -72861, -75975, -150383, -25708, -819, 71218, 36023, 48918, 5452, -3561, 123962, 77912, 13032, -89693, -42839, 48607, 5675, -30269, -51873, -1859, 12490, -1096, -60876, -52804, -10135, 93368, 124924, 110838, 76944, 27005, -24804, -9231, 58698, 44839, -35424, -90998, -24019, -47270, -127249, 69382, 91601, -2668, -11993, -14546, 4104, 18131, 5198, -3165, 7895, -27150, -45381, -40773, 68285, 8788, -14186, -55547, -54704, -121371, -96582]
983i6582l426K5568k9889P0298J3096K8204L2569n8003L1986K1521m1074j29866
971a35598N5192J8959R3656l2476J3005J5450k6698Q9375n7708J6497n673J868
959D5849l5853j1876r0877J6517J12541o938j5624K1260r880q283J8048q4944
947e0060j3671O5721j0390p063O1420j6011k9495J0382o0516r7196K1702K5227
935i9950O2808l1781j4451P5503L1950J19352l6828j59508J04221l2491l7301
924a8476q890n2593L0080L4649Q1335l5922r08p3974j4204K2153j3981m622P8184
911B2831o0589m2666J5474J01527p874l7525J7888O9108P2203r7278o3586j15230
899a25717M1848O7404L4973m6225P4576o172n1747L9199P867P2044p4784p838
$$ y = [-96582, -100008, -74440, -104329, -34031, -20935, 7269, 39838, -18165, 13821, 35342, -5732, -135598, -80406, -61447, 32209, -267, 12738, 28188, 1490, 90865, 33157, 49654, 43981, 45849, 9996, -1880, -92757, -76240, 36301, 29363, 13739, 34999, 25119, 16836, 34884, -50060, -63731, 1990, -8400, -15463, 45957, 29946, 451, 10833, -49683, -146879, -125177, -99950, -37142, -68923, -83374, -7871, 24079, 143431, 106603, -52905, 51316, 18825, -18476, -27366, -79959, -49879, -15230, 66105, 30183, 29275, -44699, -58903, -36750, -50731, -55353, 22831, -37758, -80424, -64950, 36577, 28703, -8822, 9066, 78174, 150377, 53099, -10487, -125717, -83869, -16465, 18508, -27717, 46859, 40687, -11060, 28139, 36006, 108050, 33266, 25428]
887B5428K2641j07218P0698r1737K8487J38104p222n3026j5329k4906J1571M9331
875D6822k8717n4523P1049Q5165j5025l0431J9611m3620j27531P6016m7056r670
863e7910N2525r0505n924j0051N1030Q2527n6421j8979Q9176l9282N1873k1894
851B6165K9145j8620K2755j101J7032R189j10883K7961j6059p5596r9628L9493
839a50147O7126N1437J7054n8461J1673K4363P1782q68m9541r1751j3277J9280
827a01330p3878K4270R3360R0328N6436j24160o7004J38011N7055k4692p7530
816i134k1204L423J30452r7431o8079J419k8675J68765L9000r3012r8421K0301
804e2596j9053M2190O819J6728Q3121k6366l916L4005j20966j1365o073o2292
$$ y = [25428, 48069, -59149, 11549, -80188, -51701, 86403, 79181, 26155, 10826, -14080, -2509, 46822, 18105, -36418, 34631, 119796, 104771, 74340, 93951, 50331, -77200, -1184, -48240, -57910, -5385, -95890, -101814, -111865, -60835, 21692, -34729, -53708, 35468, -3814, 48059, 26165, 55310, 36690, 59445, 58344, 75376, 84565, -26318, 1643, -14416, -90012, -189640, -150147, -83021, -31584, -14530, -72991, -61318, -36955, 34827, 33959, -15582, -107333, -120610, -101330, -175208, -150938, -57578, 32750, 89186, -34974, -101978, 36033, 93088, 68396, -9134, -30338, -26915, 103537, 6106, -61973, -60554, -89229, 79536, 118536, 25524, -72897, -52596, -71649, -29459, -22640, -5912, 77209, 50843, 46927, 80932, -40034, -51399, -57472, -119764]
792a19764J84811j07254r9295R383R0076j0770j11620Q9087R3100K7326r6948
781e1868j7035J06012P718k5988N5702m3995J6594n8445o9103k2688M4595p73
769e9274Q155P3858k4262J07970j32186J130j4051R7874p2750j6509P8450J3929
757F2334r466j1341k2605j0300o1839J99502j0700p5469J1386O9962P402j63539
745a4673P6553L3718l5195r5954Q0684m7406P5827L753m5450k829O2323J6709
733A08060o4510j05410q7376L0207R8880K3334J4581r990l5192n372l5065K2064
721d5789L2396k4429M7284q834Q2975p2111o0824Q9371n2802L6160N1408l524
709G1281j21616n2066Q8091P2936M4818Q1644j89446l9396N9776m5573k7422m2128
$$ y = [-119764, 65047, -42207, -141502, -132119, -42043, -52813, -164433, -75346, 17754, 45080, -51868, -68903, 37109, 44827, 18839, 74541, 30546, 47140, -11305, -80408, -103096, -58501, -59274, -51119, 22739, -1523, 106447, -25739, -24609, -38660, 59214, -13536, -30045, 48405, 62334, 52868, 41527, 18922, 8622, -53217, 146285, 135585, 60116, 71502, 141464, 148866, -14673, 61880, 95598, 60403, -35551, 45133, -2273, 73554, 77307, 31857, 29028, 91351, 108060, 43550, -61860, -149236, -119029, -20149, 3185, 17766, 7776, -27416, -32788, -67853, -45789, -13393, -37822, 9462, 628, 83603, 11492, -49332, 40039, -12763, 23397, 74805, 71281, -50335, -102401, -14310, 58626, 103444, 185088, -4358, -43754, 16022, -29551, -56973, -99101]
697i9101O9396k2365N3124j9408K5525m7802K4409O7912J912p9930O4876R7893
685A36441j30518o3916K5285P1320K2990K4997n3366J2355m826j8724J7567j2162
673B7443N516P6p1110l6013m3152K8430R7157n5752L318Q6645L7916j7295o6026
660b847k8314N9577r9000N805N6336o5165J00985J2883l4686P6978o8735p4586
648f0769P0811l1510l4873O9870k1132J0065L6258K2516q7917J474J40529p9573
636C5749n1284j3375N3007P2549p6335q454L0794N2385p3616k6037M4231O742
624D6356K2055J68944R73p3111O8708j81882k58751P9167J46180j26471J67151
613E9319R7724n8483k9740k8746k1643o3049j323K8069O6628K0953o4066J2131
$$ y = [-99101, -29705, -52070, 1054, -18354, 7171, -40631, -16222, 51690, 53602, -26328, 38548, 136441, 5923, -57993, -32708, 38612, 61602, 86599, 33233, 45588, 40762, 22038, 39605, 27443, 32959, 33035, -38075, -74088, -117240, -88810, 8347, -47405, -44087, 42558, 80474, 63179, -2847, -31161, 28416, -70584, -64779, -8443, -73608, 27377, 40260, 5574, 82552, 13817, -60769, 10042, -21468, -56341, 13529, -7603, 2462, 38720, 61236, -26681, -25207, 115322, 35749, -15535, -28910, 24097, 96646, 20311, 11857, 42651, 95036, 21420, -4617, 39614, 46356, 68411, 237355, 238328, 165217, 233925, 52043, -206708, -127541, 18639, -107832, 59319, 157043, 98560, 68820, 40074, 18431, -44618, -45941, -17872, 48756, 69709, 5643, 17774]
601A7774M6320N077j3531l6572L5520o1612O735K3911o7582l2744J49287n2076
589B0507m7722l4047P741J04490n9894q6486K2716O9204Q239q192j4000m824m3126
576f5394J567j5967L0827N8233j0122m1638l5442L4891J26482K9181K5648j345
564A36921j8287L1842p8396m2689J1446L2657j3505L2907L224R189k5220j01628
552b1539o3966J13405J5532j04688P4728K9109k6594M2587j7554m6194J55282
541A50108j09811M5527K216m7339m1329Q1485o1635p3069J9856P467M0323N224
529A9023L8728j9905J2499K4037r4244J4212l9003O110P2424j17890J4690P4744
517E425J09901m4186r2131r1618Q5844Q1656j01982M7913M3264N7849m2600Q3976
$$ y = [17774, 64094, 69171, 55640, 19068, 54588, -7024, -289, 23622, -43960, -76704, 72583, 20507, -27215, -61262, -53521, 50969, -8925, -95411, -72695, -3491, 4748, -3444, -17444, -22268, -65394, -63827, -79794, -48967, 9266, -856, -42494, -77936, -43045, 83437, 112618, 138266, 136921, 118634, 150476, 72080, 29391, 40837, 73494, 59989, 92896, 96120, 105309, 80089, -21539, -85505, 27900, 43432, -61256, 13472, 42581, 15987, 58574, 41020, -5174, 150108, 40297, 85824, 88040, 40701, -628, 80857, 19222, -53847, -33991, -26524, 13799, 19023, 57751, 37846, 50345, 74382, -19862, -5650, -44653, -38543, 33881, -84009, -69319, 5425, 115326, 71140, -20991, -112609, -26765, 54891, -47091, 822, 44086, 101935, 59335, 143311]
505A43311k9375q5899N491m9121J24757O8826j51113O796j5829j09596l627L2459
493f2920j7858M5484M0943M7399p7111n4913J29403r2111m0747J02923j4579p2581
481f6668R4542L012J05328r8791j11613m0173J3672J02639J0499l3436M3189o9680
469d7480J27411L9598J9718m3731j1932k0323p2737j955j4542M4953P223m3004
457a6801p4678Q5507k3196K5887K4147M1229m2491n8849M9073k536P7782P175
445I2249k563q1134j1875m2307P4042J04071k45425L2302M9368K6573j4885Q815
433a0769J2037J2306N8175j01615o3400O7361L4966l101k3357L7079L2979Q0594
421A33255J7104r7675L0792o2552j03684n0300R8205J49406M8107j18575M5798
$$ y = [143311, 113936, 28037, 33528, -15593, 109164, 177990, 26877, 33673, 17844, -91752, -95379, -62920, -80778, -35294, 5649, 53048, -24063, -78976, 50427, -41684, -82431, 20492, 5913, -66668, 27874, 30886, 136214, 37423, -74190, -114363, -100691, 1948, 12447, -20989, 22200, -47480, 79931, 119529, 139247, 95516, 83584, 63261, -9476, -11431, -25973, 18980, 26203, -16801, -91479, -5972, -29168, -3281, 20866, 62095, 19604, -39245, 9828, 7292, 85074, 92249, 89686, 8552, -3323, -45630, 28412, 132483, -112942, -80640, -31272, -4699, -19584, -10769, 1268, 13574, 71749, -29866, -93266, -25905, 9061, 5960, -17397, 19682, 52661, 133255, 150359, 52684, 83476, 20924, -82760, -133060, -34855, 114551, 162658, 44083, 89881]
410H9881r1278q924L6217Q971N4240K0577k5119k3052l7467L9253l9252k2195
398A852R615n3866J13565p5295n8074P2997O193N2820p0102m0514J01916l3328
386B7779m458L6654n6596l7445J22225K5955m3091n7162L6173n1946J731K5958
374B5777Q9131K5403O0184q9545L2306Q051p7801l1863k2205n3783l3513N1398
362a6460J1768Q4754q6421m0787m7024J6077O7710N7034M4143n2889l0664k8814
350b1573j9333M8404N6815r1780M4507L6640J3871j43299P8328J91130j00221
339I3489k9410k7545J5731N0380J4667l3939K1098j38248L9449N5926O6421L0212
327A58231L2220N1745j25140k6028K8161l0343k7194O4857p9940Q355J5499k5802
$$ y = [89881, -1397, -10321, 25896, 34867, 89107, 109684, 84565, 61513, 24046, 63299, 24047, 1852, 11467, -42399, 71166, -4129, -62203, 10794, 16987, 69807, -295, -40809, 61107, 27779, 23321, 59975, 3379, -34066, 88159, 114114, 71023, 13861, 50034, -1912, -181, 25777, 114908, 140311, 200495, 110950, 143256, 151307, 73506, 41643, 19438, -34345, -67858, -16460, -4692, 80062, -6359, -47146, -94170, -78093, -10383, 46651, 90794, 37905, 7241, -21573, -40906, 7498, 64313, -27467, 17040, 53680, 67551, -75748, 2580, 193710, 93489, 64079, 36534, 52265, 102645, 117312, 83373, 104471, -33777, 5672, 61598, 128019, 158231, 190451, 242196, 117056, 91028, 119189, 88846, 61652, 126509, 46569, 54924, 70423, 44621]
315D4621M056M652K0672n1180K9589R58m9896K5571k8358r5001J16710J1875j6230
302A8039k4829K0601K1793k1143j8313j5620O3979j5925j5320M2405q8008j6239
290d8580L0124k3251J38358k6557q7935M6454o880R38L9540k8827o9432p6261
278a12309J90481K010j3440Q1776j0484M9327j49338j4015q663l4173K8177M3836
266E3185n8908l2631J12934J0977j875P4054q9550j12029J21723o0043r3617J06950
254C1170l870J146M8832o9979J8544n754p4201m788k9703J4901R6561L9084m0877
241B1066p8085M2211M7108L2301j6158j6131O6060p9620N4853N7624k5508K1202
229A26923k7104J5946L925r550o719o2563m490J6071M6142J4450q0562o470K4351
$$ y = [44621, 48677, 53329, 74001, 22821, 52410, 53368, 3472, 29043, 685, -94316, 22394, 34269, 18039, -6790, 13811, 35604, 14461, -3852, -19472, 44507, 28582, 13262, 55667, -32341, -48580, -18456, -41707, 96651, 70094, -17841, 28613, 21733, 22671, 62211, 33384, -36048, -112309, 78172, 80182, 66742, 148518, 138034, 187361, 38023, 24008, 15345, -18828, 9349, 53185, -5723, -38354, 74580, 85557, 83682, 157736, 68186, -43843, 77880, 17837, -75780, 31170, 27300, 28446, 77278, 7299, 25843, 20089, -54112, -58900, -88603, -73702, 22859, 61943, 21066, -57019, -14808, 32300, 64601, 48443, 32312, 98372, 18752, 73605, 131229, 105721, 126923, 99819, 115765, 119690, 110140, 103421, 40858, 36368, 52439, 98581, 113031, 32469, 25999, 50350]
216E0350M5062p9475l5986M5545M7934K58k1346p3120J3580J0363O0165J7142
204H0472j15428Q4024o1404p4717J9901Q0465m4357Q1155Q0561l3892L2186p2246
192E6720R065N8090M3084j00105j1520o5365M4465l406p926J15438J1204J3128
180A62872j24316j5860N4232L0734n6492m0060L6390M4154k4945O8172M5546k13469
168c3042k9764J24652J3559j8141j8584K1345O4636k5648m9123K0221r0896n5946
156g6731K2080J4813J16030K9634n3355r527R079N0766J742k1531l3426k4724
144B4850k8234R342q453P3623M9279R2555k8572m9396j7889q2228o1150L2877
132F604M3187J7758P7574p2114k469l0774n6105l950L7976J0148l3088R1771o2615
$$ y = [50350, 95412, 15937, -20049, 25496, 73430, 73688, 52342, -20778, -7198, 3165, 63330, 80472, -34956, 49068, -12336, -87053, -67152, 13313, -31044, 50111, 130672, 96780, 128966, 56720, 65785, 123875, 166959, 66854, 55334, -10031, 34434, 31028, 23102, 138540, 149744, 162872, 38556, 22696, 76928, 107662, 51170, 11110, 47500, 91654, 66709, 134881, 180427, -33042, -62806, 61846, 75405, 57264, 38680, 60025, 124661, 99013, 49890, 70111, -20785, -76731, -54651, -39838, 76192, 105826, 52471, 42944, 52023, 102789, 104531, 83000, 49574, 24850, -3384, 5958, -2495, 71128, 120407, 212962, 184390, 134994, 117105, 34877, -26273, 6604, 49791, 67549, 145123, 73009, 70540, 39766, -16339, -20289, 17687, 27835, -5253, 86518, 23903]
119B3903L5688L5870m5219n1135m2157M0430k950j7690P4384M7389q2619M9469
107F5363L9725j15370M1593n7280Q1419L4741m1080m4427p060N9242l2135j086
95B3645n8731q05l4202J16651P8594r209p9157K9891k1768O6671M0540r4716n3131
82D273k1273k87P9779m0242k7038K5361J06312j7830m9480J0355q7123l0199N4322
69F930M6458P0059L3722n5183N1104J1373o9929m3754K4852j07020L524N4919
57B7055j1595L9074m4384M6218L3432j2449n4972j9151K7535M515J6982L8609
$$ y = [23903, 59591, 95461, 50242, -893, -43050, -2620, -5570, -23260, 51124, 98513, 15894, 65363, 105088, -10282, 31311, -25969, 55450, 90191, 49111, 4684, -2376, 56866, 24731, 23645, -35086, -35891, -70093, 46558, 125152, 115943, 36786, 66677, 44909, 111580, 152120, 57404, 4273, -17000, -17287, 62492, 22250, -4788, 20573, 126885, 109055, 59575, 69930, -17193, -47392, 6930, 53388, 123447, 157169, 101986, 153090, 164463, 94534, 50780, 75632, -31388, -27864, 27055, 15460, 54534, 10150, 56368, 89800, 77351, 22379, 3228, 30763, 35278, 52260, 90869]
$$ [...]
##END NTUPLES=NMR SPECTRUM
##END=
