##TITLE=1H_EC-3296(XII-1)
 CDCl3
 8 sc, 
 10.7.2023
##JCAMPDX= 6.0         $$ Bruker NMR JCAMP-DX V2.0
##DATA TYPE= NMR SPECTRUM
##DATA CLASS= NTUPLES
##ORIGIN= UXNMR, Bruker Analytische Messtechnik GmbH
##OWNER= root
$$ XWIN-NMR		Version 3.5
$$ Mon Jul 10 14:08:19 2023 Russian Standard Time (UT+4h)  she@DPX200
##.OBSERVE FREQUENCY= 200.13135
##.OBSERVE NUCLEUS= ^1H
##.ACQUISITION MODE= SIMULTANEOUS
##.ACQUISITION SCHEME= undefined
##.AVERAGES= 8
##.DIGITISER RES= 18
##SPECTROMETER/DATA SYSTEM= spect
##.PULSE SEQUENCE= zg30
##.SOLVENT NAME= CDCl3
##.SHIFT REFERENCE= (INTERNAL, CDCl3, 0, 15.7083)
##AUDIT TRAIL= $$ (NUMBER, WHEN, WHO, WHERE, WHAT)
$$ ##TITLE= Audit trail, XWIN-NMR		Version 3.5
$$ ##JCAMPDX= 5.01
$$ ##ORIGIN= Bruker BioSpin GmbH
$$ ##OWNER= she
$$ F:/spectra/data/she/nmr/H-F/1/pdata/1/auditp.txt
$$ ##AUDIT TRAIL=  $$ (NUMBER, WHEN, WHO, WHERE, WHAT)
(   1,<2023-07-10 14:06:57.70 +0400>,<she>,<DPX200>,
      <created by zg, POWCHK disabled, PULCHK disabled
       configuration hash MD5:
       00 E9 B6 7A A2 85 ED C7 34 08 36 98 17 FE 4E 26
       data hash MD5: 16K
       49 77 7D A3 E1 6A 8F 4A 40 9B 96 B1 2B E0 CD CC>)
(   2,<2023-07-10 14:07:02.04 +0400>,<she>,<DPX200>,
      <Start of raw data processing
       efp BC_mod = 2 LB = 0.24 FT_mod = 6 PKNL = 1 PHC0 = -20992.42 PHC1 = 15.05272 SI = 16K 
       data hash MD5: 16K
       DC 97 00 23 43 50 91 24 A4 C5 5D CE 6D 81 31 2D>)
(   3,<2023-07-10 14:07:22.14 +0400>,<she>,<DPX200>,
      <pk PHC0 = -1.621407 PHC1 = 1.6 
       data hash MD5: 16K
       CC 55 28 C7 42 E3 6C FA 42 13 77 71 C3 5B D9 10>)
(   4,<2023-07-10 14:07:25.43 +0400>,<she>,<DPX200>,
      <abs ABSG = 5 
       data hash MD5: 16K
       EB 14 20 F3 89 4A 40 F7 21 88 36 47 1F 21 C8 A0>)
(   5,<2023-07-10 14:07:52.57 +0400>,<she>,<DPX200>,
      <abs ABSG = 5 
       data hash MD5: 16K
       F7 39 A4 F2 CC 4C C9 FD 0E D2 19 45 CC 4E B3 39>)
$$ ##END=
$$ 
$$ hash MD5
$$ 3A DF 55 83 C2 A0 F5 C3 F7 53 6B E9 B9 64 44 E5
##$RELAX= 
##$RELAX= 
##$RELAX= 
##$RELAX= 
##$RELAX= 
##$RELAX= 
$$ Bruker specific parameters
$$ --------------------------
##$DU= <F:/spectra>
##$EXPNO= 1
##$NAME= <H-F>
##$PROCNO= 1
##$TYPE= <nmr>
##$USER= <she>
##$AMP= (0..31)
100 100 100 100 100 100 100 100 100 100 100 100 100 100 100 100 100 100 
100 100 100 100 100 100 100 100 100 100 100 100 100 100 
##$AQSEQ= 0
##$AQ_mod= 1
##$AUNM= <au_zg>
##$AUTOPOS= <>
##$BF1= 200.13
##$BF2= 200.13
##$BF3= 200.13
##$BF4= 200.13
##$BF5= 200.13
##$BF6= 200.13
##$BF7= 200.13
##$BF8= 200.13
##$BYTORDA= 1
##$CFDGTYP= 0
##$CFRGTYP= 5
##$CHEMSTR= <none>
##$CNST= (0..31)
1 1 145 1 1 1 1 1 1 1 1 1 1 1 1 1 1 1 1 1 1 1 1 1 1 1 1 1 1 1 1 1 
##$CPDPRG= <>
##$CPDPRG1= <>
##$CPDPRG2= <>
##$CPDPRG3= <>
##$CPDPRG4= <mlev>
##$CPDPRG5= <mlev>
##$CPDPRG6= <mlev>
##$CPDPRG7= <mlev>
##$CPDPRG8= <mlev>
##$CPDPRGB= <>
##$CPDPRGT= <>
##$D= (0..31)
0 1.2 0 0 0 0 0 0 0 0.06 0 0.03 0 0 0 0 0.0002 0 0 0 0 0 0 0 0 0 0 0 0 
0 0 0 
##$DATE= 1688983617
##$DBL= (0..7)
$$ [...]
##$SUBNAM3= <"">
##$SUBNAM4= <"">
##$SUBNAM5= <"">
##$SUBNAM6= <"">
##$SUBNAM7= <"">
##$SUBNAM8= <"">
##$SUBNAM9= <"">
##$SW= 18.05172834244
##$SWIBOX= (0..15)
0 0 2 0 0 0 0 0 0 0 0 0 0 0 0 0 
##$SW_h= 3612.71676300578
##$TD= 16384
##$TD0= 1
##$TE= 0
##$TE2= 300
##$TE3= 300
##$TEG= 300
##$TL= (0..7)
0 120 120 120 120 120 120 120 
##$TP= (0..7)
150 150 150 150 150 150 150 150 
##$TP07= 0
##$TPNAME0= <>
##$TPNAME1= <>
##$TPNAME2= <>
##$TPNAME3= <>
##$TPNAME4= <>
##$TPNAME5= <>
##$TPNAME6= <>
##$TPNAME7= <>
##$TPOAL= (0..7)
0.5 0.5 0.5 0.5 0.5 0.5 0.5 0.5 
##$TPOFFS= (0..7)
0 0 0 0 0 0 0 0 
##$TUNHIN= 0
##$TUNHOUT= 0
##$TUNXOUT= 0
##$USERA1= <user>
##$USERA2= <user>
##$USERA3= <user>
##$USERA4= <user>
##$USERA5= <user>
##$V9= 5
##$VALIST= <valist>
##$VCLIST= <CCCCCCCCCCCCCCC>
##$VD= 0
##$VDLIST= <DDDDDDDDDDDDDDD>
##$VPLIST= <PPPPPPPPPPPPPPP>
##$VTLIST= <TTTTTTTTTTTTTTT>
##$WBST= 1024
##$WBSW= 4
##$XGAIN= (0..3)
0 0 0 0 
##$XL= 0
##$YL= 0
##$YMAX_a= 610970
##$YMIN_a= -754243
##$ZGOPTNS= <>
##$ZL1= 120
##$ZL2= 120
##$ZL3= 120
##$ZL4= 120
##$ABSF1= 15.70833
##$ABSF2= -2.343519
##$ABSG= 5
##$ABSL= 3
##$ALPHA= 0
##$AQORDER= 0
##$ASSFAC= 0
##$ASSFACI= 0
##$ASSFACX= 0
##$ASSWID= 0
##$AUNMP= <proc_1d>
##$AZFE= 0.1
##$AZFW= 0.1
##$BCFW= 0
##$BC_mod= 2
##$BYTORDP= 0
##$COROFFS= 0
##$CY= -3
##$DATMOD= 1
##$DC= 0
##$DFILT= <>
##$DTYPP= 0
##$F1P= 0
##$F2P= 0
##$FCOR= 1
##$FTSIZE= 16384
##$FT_mod= 6
##$GAMMA= 0
##$GB= 0
##$INTBC= 1
##$INTSCL= 3.70164e-10
##$ISEN= 128
##$LB= 0.24
##$LEV0= 0
##$LPBIN= 0
##$MAXI= 10000
##$MC2= 0
##$MEAN= 0
##$ME_mod= 0
##$MI= 1.114404
##$NCOEF= 0
##$NC_proc= -6
##$NLEV= 6
##$NOISF1= 3.799351
##$NOISF2= 2.8
##$NSP= 0
##$NTH_PI= 0
##$NZP= 0
##$OFFSET= 15.70833
##$PC= 1
##$PHC0= -20994.04
##$PHC1= 16.65272
##$PH_mod= 1
##$PKNL= yes
##$PPARMOD= 0
##$PSCAL= 0
##$PSIGN= 0
##$REVERSE= no
##$SF= 200.130012650733
##$SI= 16384
##$SIGF1= 3
##$SIGF2= 2
##$SINO= 5.538805
##$SIOLD= 16384
##$SREGLST= <1H.CDCl3>
##$SSB= 0
##$STSI= 16384
##$STSR= 0
##$SW_p= 3612.71676300578
##$SYMM= 0
##$S_DEV= 0
##$TDeff= 16384
##$TDoff= 0
##$TI= <>
##$TILT= no
##$TM1= 0
##$TM2= 0
##$TOPLEV= 0
##$USERP1= <user>
##$USERP2= <user>
##$USERP3= <user>
##$USERP4= <user>
##$USERP5= <user>
##$WDW= 1
##$XDIM= 16384
##$YMAX_p= 454892478
##$YMIN_p= -271551
$$ End of Bruker specific parameters
$$ ---------------------------------
##NTUPLES= NMR SPECTRUM
##VAR_NAME=  FREQUENCY,     SPECTRUM/REAL,   SPECTRUM/IMAG
##SYMBOL=    X,             R,               I
##VAR_TYPE=  INDEPENDENT,   DEPENDENT,       DEPENDENT
##VAR_FORM=  AFFN,          ASDF,            ASDF
##VAR_DIM=   16384,         16384,           16384
##UNITS=     HZ,            ARBITRARY UNITS, ARBITRARY UNITS
##FACTOR=    0.220516191357247, 1,           1
##FIRST=     3143.70831252575, 0,            0
##LAST=      -469.008450480026, 0,           0
##MIN=       -469.008450480026, -271551,     0
##MAX=       3143.70831252575, 454892478,    0
$$ Real data points
##PAGE= N=1
##DATA TABLE= (X++(R..R)), XYDATA
$$ [...]
6329d539m3976k3302J1297J05293k3775K625J2014k8553K1477J7481J8144j7764
6317D6422K0200m7875Q9515K6780j17178m5850n9851m6544L7733J3051J7333P8311
6305A2047J5897P346j5519L1643J11232N2957m4906j55704O697R494M850Q6238
6293A22272m4734k0435k673n2700j1602m8819J4736N7592O6015l4389k8303J7099
6281C4059J6655l8504k8408R3265R908J5754k9563o7042R5911q2098k4779K2350
6269A7508Q3719o972R1456q5978q8044J08300o5519k6424j26360O3254P0597j3715
6257B1822q2317N5918M2765K2980j10434o952J2031Q32P3019K4665p39J3567p9224
6244a2067k9892j16221J13071J58429o5663m2866j01894P1391k575J4782N4539
$$ plain form
6329 -4539 -48515 -71817 -60520 44773 20998 23623 35637 7084 28561 46042 64186 46422
6317 46422 66622 18747 108262 135042 17864 -27986 -87837 -134381 -96648 -83597 -66264 12047
6305 12047 27944 35290 19771 51414 162646 215603 170697 14993 21690 31184 36034 122272
6293 122272 77538 57103 54430 1730 -9872 -58691 -43955 13637 79652 45263 16960 34059
6281 34059 50714 12210 -16198 77067 86975 102729 73166 6124 102035 19937 -4842 17508
6269 17508 101227 94255 185711 99733 11689 119989 54470 28046 -98314 -35060 35537 21822
6257 21822 -60495 -4577 38188 61168 -49266 -56218 -44187 -43355 29664 54329 53590 67157 -12067
6244 -12067 -41959 -158180 -45109 113320 47657 4791 -97103 -25712 -28287 -13505 41034
6233D1034L3443L0585N6057L1241k5254o1166r0164N7325Q3158O200r0213k7220
6221D5026j0351n510Q6341N4791m8405j09730j7938P2231L1969n1840Q4762l4937
6209I6409Q0789J2364P1041k9929n9130j3730n5784Q4819n0565n1433l2651J704
6197E3904N5356K9617j04854L0249K6738j7374J22906m7983j00898m7580J6629
6186A6710J1225J1497K1793J2753n1081K1174j9625M2546P074L6165l1060k3841
6174E5330O1070p941L5465J3513L6046l1600m2371l3013p386M8657K2663q7200
6162F3233P1437K9974j12306l2529P560k3824R178o59K4802J34694o7802p8121
6150B5637O4930O5372J4982O285k0209l2758j7689k3456L9511R333j3609N8233
$$ plain form
6233 41034 74477 105062 161119 192360 167106 105940 15776 73101 156259 162459 72246 45026
6221 45026 34675 29165 115506 170297 121892 12162 -5776 66455 98424 46584 131346 96409
6209 96409 177198 189562 260603 230674 171544 157814 102030 186849 136284 84851 52200 53904
6197 53904 109260 138877 34023 64272 91010 73636 196542 148559 47661 81 16710
6186 16710 27935 39432 61225 73978 22897 44071 24446 66992 74066 110231 79171 55330
6174 55330 116400 108459 143924 157437 193483 161883 119512 86499 79113 127770 150433 63233
6162 63233 134670 164644 52338 19809 27369 3545 12723 12064 36866 171560 103758 25637
6150 25637 90567 155939 170921 177206 156997 124239 106550 83094 122605 131938 118329 176562
6138A76562m5903l0088K9368o2947Q9643P502R8075k2063j9382m5317n2123J02362
6126B25689q6868O3079j1627Q504k2913K6054R062l1091M3961N669K5369J809
6114B56697J2298k4825J7240j25264m0098M5662K45650K6147j18111j21804M5196
6103B18788R381j1116J64030l2112p9193j2191K3118j25147k0687J13535J53188
6092D01594m598j30116m6938l5534J19780M1620R872j39799J20216J06068J1745
6081D53910O5196j81564n6302O7864J40634J3597q834m9341J30108O2966o5999
6070E72235Q4359K23236J10718O7819J59686J36803j4267k22037p4272j22325
6060I21955j80845k4022j063r8355L2310M3756J480k973l1676k0806M9916O6653
$$ plain form
6138 176562 130659 100571 129939 66992 156635 164137 262212 240149 220767 175450 123327 225689
6126 225689 138821 201900 190273 198777 175864 201918 210980 179889 223850 229519 254888 256697
6114 256697 268995 244170 261410 136146 96048 141710 387360 413507 295396 173592 218788
6103 218788 228169 217053 381083 348971 269778 257587 280705 155558 134871 248406 401594
6092 401594 396996 266880 219942 184408 304188 345808 355680 215881 336097 442165 453910
6081 453910 519106 337542 281240 349104 489738 503335 494501 445160 575268 638234 572235
6070 572235 656594 879830 990548 1058367 1218053 1354856 1340589 1118552 1044280 921955
6060 921955 741110 717088 716025 617670 649980 693736 695216 692243 660567 639761 689677 756330
6048G56330l4645o7184K5535N6666J10597M7150N3963O5946J38318K71929J82293
6037A606898K91372K60679K79604j22903k78891m16042k12495k10604j99208l8349
6027I60061p5780o602n8711n6470p9962r5142k3015L1042l9532J01133l0888m6263
6015E79871Q1902Q5256P5639m404o3397P6900J0615Q1671J14510M1725K15558
6004A295846K5805j11500m1809q5366j79534r5087o5213j50375J9499n5280j20417
5993D36569P3571J7662R855q1872j38900N714O8868L3363K2704k1542N66k6638
5981C99920K2387k3407j6621l888k938l7214O3046p4795J0453M8278J620Q6208
5969D73049j8335n8834p7814q7859O6964J36100m5819K3118j34590j3649Q836
$$ plain form
6048 756330 721685 654501 680036 736702 847299 894449 948412 1014358 1152676 1424605 1606898
6037 1606898 1898270 2158949 2438553 2315650 2036759 1620717 1408222 1197618 998410 960061
6027 960061 884281 877679 818968 762498 682536 587394 564379 595421 555889 657022 626134 579871
6015 579871 661773 747029 822668 818264 754867 831767 842382 924053 1038563 1080288 1295846
6004 1295846 1321651 1210151 1168342 1082976 903442 808355 743142 592767 612266 556986 436569
5993 436569 510140 527802 537657 455785 316885 322599 391467 424830 447534 425992 426558 399920
5981 399920 422307 398900 382279 378391 375453 338239 401285 326490 336943 385221 386841 473049
5969 473049 454714 395880 318066 230207 297171 433271 387452 410570 275980 262331 271167
5958B71167p2487k667j2643Q1470o575j9296o231L2647J63068j5613N2035m5879
5946D18996O3206J26081k6795k5733p1851K3512J9332O2103Q968p975n2770j44405
5934C92669M8950J8489o0902n8391j1900M8944M5192P0739n6214P9765J04331
5923F21672n1658N0237J1822L5935j11475O1226j39592J32847P2163l6746M9868
5912F96299P6277O528J47439L15555J14902N8194k53213j41309j42696n9262j22098
5901F96616K4090j25155p7477J26745l9015l6250J5175j17635P723J43300j50
5890F17967o0081m114O0530p13M954P0727K4184M6806j3936P3347N6827J22717
5878I99215J14914J21305K54657j0148k43930n1721j79633q0675j86968p7673
$$ plain form
5958 271167 198680 196013 183370 264840 258265 238969 232738 265385 428453 412840 464875 418996
5946 418996 482202 608283 581488 555755 483904 507416 526748 588851 597819 589844 537074 392669
5934 392669 441619 460108 399206 340815 328915 377859 423051 493790 437576 517341 621672
5923 621672 570014 620251 632073 668008 556533 617759 478167 611014 683177 646431 696299
5912 696299 772576 779104 926543 1242098 1357000 1415194 1161981 1020672 877976 818714 696616
5901 696616 720706 595551 518074 644819 605804 569554 584729 467094 474817 618117 617967
5890 617967 557886 553772 614302 613589 618543 689270 713454 760260 746324 819671 876498 999215
5878 999215 1114129 1235434 1490091 1479943 1236013 1184292 1004659 923984 737016 659343
5868F59343M567j56587N8893j01329j9825k2408m0493N9649L8010o024l24p0582
5856D02890J6354J080J02189M2541L2295J91J6961j0451K3856O7415o2676O6313
5844F98958P5284l7301L9045j01440j67362J46965q3583q4434O5825q1807m4764
5833D25386O4542L8834m6959r2166o8502M3547K9245l7946l53J23520n763j5773
5821D57612J26674l7123o6793M2692P808R5377M7441q4046p1209j38602J9356
5810C99187O622q8014J19585J8322k0325J1630M9684l6885J2059j1180m3805j7080
5798C99800J2275k5686l9297N8054J01622q3677j68695K5723K2460O0591l7674
5787C25496Q2411p6404K1631R0089n098q909r812q7000N3110M1211J0115n9789
$$ plain form
5868 659343 663910 507323 566216 464887 445062 422654 382161 441810 479820 473796 473472 402890
5856 402890 419244 420324 522513 565054 597349 597540 614501 604050 627906 695321 632645 698958
5844 698958 774242 736941 775986 674546 507184 654149 570566 486132 551957 470150 425386
5833 425386 489928 528762 481803 389637 321135 364682 393927 355981 355628 479148 473385 457612
5821 457612 584286 547163 480370 523062 530870 626247 673688 589642 518433 379831 399187
5810 399187 405809 317795 437380 455702 435377 447007 496691 459806 471865 460685 416880 399800
5798 399800 412075 386389 347092 405146 506768 423091 254396 280119 302579 363170 325496
5787 325496 407907 331503 353134 443223 438125 429216 419404 332404 385514 426725 436840 377051
5775C77051l780P4195q0501o7316q5475J01521M2125o2769j6401p2032N5774J45474
5763D07866j1300q1606p006p1426k7265P4028P4429Q583p9745n8798Q242Q2440
5751C18442J34825n60m8566J6223n2904K6979k5605r3996K1916l9568n8959M9462
5739B47689O7839N7463l1015k1922j7329K9410n2719K5440J5156M6271m5047j63504
5727A57732K1776K5657L859M6496m4352l1766Q2689J3205m6318J02725q379P856
5715C31180m4339j3746m3766l1055J4381O6858J0102Q4588M9827j35676P8971
5704C67325M8007r9999k6558n1056j4287j5904K8146P5210j9596Q5027N283n6760
5692C24838l8894j677K3929k2192n5891P6709O2302P7808l0602j62421R6290Q5877
$$ plain form
5775 377051 373271 447466 366965 299649 214174 315695 357820 295051 278650 206618 262392 407866
5763 407866 396566 314960 307954 236528 209263 283291 357720 366303 286558 227760 236002 318442
5751 318442 453267 452707 404141 420364 367460 394439 368834 274838 296754 257186 198227 247689
5739 247689 315528 372991 341976 320054 302725 332135 279416 304856 320012 366283 321236 157732
5727 157732 179508 205165 209024 255520 211168 179402 262091 275296 228978 331703 323324 331180
5715 331180 286841 273095 229329 198274 212655 279513 289615 374203 424030 288354 367325
5704 367325 415332 315333 288775 237719 223432 207528 235674 310884 291288 376315 381598 324838
5692 324838 285944 284267 308196 286004 230113 306822 369124 446932 416330 253909 350199 436076
5680D36076n7278r29j1830l4738L7621M6556m2508k1639R977N4716k9757l6300
5668C49967p3103J60046j8415r3318N3083L631J8943Q8244n644J7902J5093N8417
5656E74846r3907p9674J3653O0850L2830m857m6273p0849j1538j6821P226m9095
5644C16391P7041R5818p490p6093j1550n9184m2499P6225N6401M8337M3361k8961
5632D87797j6878P6001l197p2743M9914k8584J9910r0947m5212Q9036J6641K9587
5620E11325J0035j7432l5502l5816Q5874k9260k5228O6348n9756q2623l4039K7166
5608C81092M0347N7192j2471m1634r6596o6154K7603R0165J07686L7480p1331
5597D53379q6669M6968l9988o0807N8032K3271K1684J38085o4934M8058k6478
$$ plain form
5680 436076 378798 377869 366039 331301 368922 415478 372970 351331 361308 416024 386267 349967
5668 349967 276864 436910 418495 325177 378260 381891 400834 489078 483434 501336 516429 574846
5656 574846 480939 401265 414918 475768 508598 503741 457468 386619 375081 358260 365486 316391
5644 316391 393432 489250 481760 405667 394117 334933 292434 368659 425060 473397 516758 487797
5632 487797 470919 546920 543723 470980 520894 492310 512220 421273 376061 465097 481738 511325
5620 511325 521360 503928 468426 432610 518484 489224 463996 530344 470588 387965 353926 381092
5608 381092 421439 478631 466160 424526 327930 261776 289379 379544 487230 524710 453379
5597 453379 366710 413678 373690 312883 370915 394186 415870 553955 489021 537079 510601
5586E10601j0546P3465o4810k2553l5765m3973P4049k7555N020k6412P1856N0966
5574E54343K4115R938j06307J3587q7495M7239j3824O9026R5704J0794p2244k8157
5562E16719J21308j31673l9996P2122P4650Q618n5905j04868J23046k1406N437
5551E68052J00178j22531J2556j9567M9785M9502q030o7001k5726O1134j2135
5540E86217p4725j0982k3394n896o3065m4455P5062m392R2810k4711J0620Q4918
5528E98007m1998L7304n4196K3927J6915M3833o7713o778k2812K3889O9128J2735
5516F32241j24214L5966J68483n8895m5809j02163L356J9915k1978O0949K8583
5505E96434J184O7624k9784j5871P8126m6015k3840o348K470p1929J8591P4411
$$ plain form
5586 510601 500055 573520 508710 486157 450392 406419 480468 452913 457933 431521 503377 554343
5574 554343 578458 588396 482089 495676 408181 455420 441596 510622 606326 617120 544876 516719
5562 516719 638027 506354 466358 538480 613130 621748 565843 460975 584021 562615 568052
5551 568052 668230 545699 558255 538688 588473 637975 629945 562944 537218 598352 586217
5540 586217 511492 500510 477116 471220 408155 363700 438762 434370 527180 502469 513089 598007
5528 598007 556009 593313 539117 563044 579959 623792 556079 549301 526489 550378 619506 632241
5516 632241 508027 543993 712476 653581 607772 505609 508965 528880 506902 567851 596434
5505 596434 597618 665242 635458 619587 697713 651698 627858 621510 623980 552051 570642 645053
5493F45053L5438p4051m7372O2469N9019j54470n8977J29652R3L4691Q8682M0793
5481G61020k8790M3797k6220j05435j52010K0623P2151M2094l2009p9920P2274
5470E87575N4265k5645q1037K0612N619P948J16617K4433M1681m4113o196J09371
5458H11130l1829q4342o9025J02741k9398M0282M1314j14030P7617l3038k4822
5447F86600m2971K2607J445K8266o879k8607L8724k5400p5492r128K5485J0448
5435F25098J23120K4540j9004j3628o8940M2160Q692o8104j5772K4074R7311j17501
5423F42046R5673L6843O5369L815j6548k0339r0635n1518n4323O9076J1304L2243
5411G23006L0882o4873j568M7968n7764O8769n1240P5122p7260j07351J11962
$$ plain form
5493 645053 680491 606440 559068 621537 680556 526086 467109 596761 596854 631545 720227 761020
5481 761020 732230 776027 749807 644372 492362 512985 585136 627230 595221 515301 587575
5470 587575 641840 616195 535158 555770 561389 569337 685954 710387 752068 707955 701759 811130
5458 811130 779301 694959 625934 728675 699277 739559 780873 666843 744460 711422 686600
5447 686600 643629 666236 667681 695947 689068 660461 699185 673785 598293 589165 614650 625098
5435 625098 748218 772758 753754 740126 671186 713346 722038 653934 638162 662236 759547 642046
5423 642046 737719 774562 839931 843746 827198 806859 716224 664706 610383 679459 690763 723006
5411 723006 753888 689015 687447 735415 677651 746420 695180 770302 693042 585691 697653
5400F97653Q1499n1640j4212j8293K0058R1663r5262l0841J14726M3893n3969
5389G85275l2103m4611R729N4546N3708J7958j03197q551Q9831r9217k1602R1512
5377G93278K0746o6312o63q107m8623M4362m4875L809N5009K019j3177M7611m3612
5364G41465N0076J6840q8847q4664L9511P6736j9067j9102O0284q3908L6163q7202
5352F38285k849Q4037M1653k644L9372K8042j18621M3207Q4002l8276k0400l9496
5340G36312J5548P9051p3247L3652n8778J0752o2156j05378R9254M0546N0516
5329G66072J8266l5603l0078r942p671J01881M8995r6650K0492j44092J19368
5318G51038J83nM8727j02237q53l3019J8738m690K4530k1583k6236M8017O4093
$$ plain form
5400 697653 779152 727512 713300 695007 715065 806728 711466 680625 795351 839244 785275
5389 785275 753172 708561 718290 772836 826544 844502 741305 732754 822585 723368 701766 793278
5377 793278 814024 747712 747049 738942 690319 734681 689806 693615 748624 750643 737466 785077 741465
5364 741465 791541 808381 719534 634870 674381 751117 732050 712948 773232 689324 725487 638285
5352 638285 635436 719473 761126 758482 797854 825896 707275 750482 834484 796208 775808 736312
5340 736312 751860 830911 757664 791316 732538 743290 681134 575756 675010 715556 766072
5329 766072 784338 748735 718657 708715 701044 802925 851920 755270 775762 631670 751038
5318 751038 751221 751216 799943 697706 696853 663834 682572 677882 702412 680829 654593 702610 766703
5305G66703O876M0318o5217K7358L8363m4973j9860L1185k7449n2645L3732O0482
5293G94873N639n9951J00403K8441p641L1818o6952j00687R1902l4657L436K7011
5281H13635m992L5535K5386r0531p6211q0793N8635P9980J2585O276N4785l379
5269H30911l3480L0661P6907k5927l2826k5728J4855P6894J1947n1956P4643J3437
5257I60338j22603L4676O7195m7330P7509j61955j4497O4331k5103L4973N1838
5246I19372K2632q0318l2315j0510l2925l637L3439q153k7749M405R5110n3061
5234H26290j0542J11825P5047m8634J4190l3092J0509l29J1481P7886m7939r9513
5222H87179o6096L2127K3230p448Q2511o0920K8949Q6325L9320P934j44158j7525
$$ plain form
5305 766703 773579 813897 748680 776038 814401 769428 749568 780753 753304 700659 734391 794873
5293 794873 800512 740561 840964 869405 861764 893582 826630 725943 817845 783188 786624 813635
5281 813635 808643 844178 869564 779033 702822 622029 680664 760644 773229 779505 834290 830911
5269 830911 797431 828092 904999 879072 846246 820518 835373 912267 924214 872258 946901 960338
5257 960338 837735 872411 939606 892276 969785 807830 793333 857664 832561 867534 919372
5246 919372 942004 861686 829371 818861 785936 782299 815738 807585 779836 784241 879351 826290
5234 826290 815748 927573 1002620 953986 968176 935084 945593 945264 956745 1034631 986692 887179
5222 887179 821083 853210 876440 868992 951503 890583 919532 1005857 1045177 1053111 908953 891428
5210H91428P3201O4315l7638j20457K7702J3747J65794q2169l3472k0080J36479
5199A078850q5918K8185L4932R8567l3322j15184M1516n3840J12609j12211k3586
5188I70598M0352P2046N5677Q0661k8287l0782k351K6583M3862R123m163r2202
5176A141117M7053j30806M6563R1858l6597n8266r5728L2915R6044J0906R9869
5165A244928l6278k7097M9238J7042p572l4840Q3685m8316M2883k9049K0666n206
5153A270084K2589K7140J11204j19616j42351q257L8570N5273R2063J02526m3878
5142A405347n1384n4651J5545l7852R8058P5715N4149r6691o7035L6557j7546
5131A360212m2759O8811l0617l3252M4405L3098J9474n9919M5285N0488L6686
$$ plain form
5210 891428 964629 1028944 991306 870849 898551 912298 1078092 995923 962451 942371 1078850
5199 1078850 992932 1021117 1056049 1154616 1121294 1006110 1047626 993786 1106395 994184 970598
5188 970598 1010950 1082996 1138673 1219334 1191047 1160265 1157914 1184497 1228359 1237482 1233319 1141117
5176 1141117 1188170 1057364 1103927 1195785 1159188 1100922 1005194 1038109 1134153 1145059 1244928
5165 1244928 1208650 1181553 1230791 1247833 1240261 1205421 1289106 1240790 1283673 1254624 1275290 1270084
5153 1270084 1292673 1319813 1431017 1311401 1169050 1160793 1199363 1254636 1346699 1449225 1405347
5142 1405347 1353963 1299312 1314857 1277005 1375063 1450778 1504927 1408236 1341201 1377758 1360212
5131 1360212 1317453 1386264 1355647 1322395 1366800 1399898 1419372 1359453 1404738 1455226 1491912
5120A491912J3136j1650j07327j997N5850O8071M7015M7394o7226j7794p3692
5109A443692J1457O0426k8343m54L8322O6841o2121j09860N4731J04176Q140l6638
5097A550369j8621L2597M5519k5269l7124q6517Q4338L3692r6266O4659r6140
5086A451237K4572J00653M0428o5584L3955Q7336J8062n7402l3777K0651N071
5075A625202O2888j2685N4900n4526K6546j0020J7448K7985O1619j7226r9276
5064A682855j3438j3548j04360M8246J16123P282J4011P5699p5264J2822O8662
5053A819090J3379L0746n8859q8330l1781M4R0079J5769o2073l7279P6060R3180
5041A860025l9221r5233L4136N6559J4673J4919P7980k874M8243Q326j2252j1108
$$ plain form
5120 1491912 1505048 1493398 1386071 1384074 1439924 1507995 1555010 1602404 1535178 1517384 1443692
5109 1443692 1455149 1515575 1487232 1486778 1525100 1591941 1529820 1419960 1474691 1578867 1587007 1550369
5097 1550369 1531748 1564345 1609864 1584595 1547471 1460954 1545292 1578984 1482718 1547377 1451237
5086 1451237 1475809 1576462 1616890 1551306 1585261 1672597 1690659 1633257 1599480 1620131 1625202
5075 1625202 1688090 1675405 1730305 1675779 1702325 1692305 1709753 1737738 1799357 1782131 1682855
5064 1682855 1669417 1655869 1551509 1599755 1715878 1723160 1737171 1812870 1737606 1750428 1819090
5053 1819090 1832469 1863215 1804356 1716026 1684245 1684289 1774368 1790137 1728064 1690785 1766845 1860025
5041 1860025 1820804 1725571 1759707 1816266 1830939 1845858 1923838 1920964 1969207 1977533 1965281 1954173
5029A954173L5209O7274M009J31546j34089m3707j2797M133M1690L4056K6797
5018B108294k2676J0225l0633p5673K120M9549J0394j06018L0161m851N5400p2645
5006A953647l7474J80823O7581n0314j9734m4203O3644R9006M2624l2316P9092
4995B302376j13392O7282k8197J3492j3869m8562J11801p5858j3727L8546J8338
4984B258230O8622l170P313r045l7903L3363J54900O0833o5650m0400J2513M9404
4972B489010n5274k2843o9109Q5045K5574J3699l1821K2060J84752R5002q2493
4961B653602o0930j66891j132N2775n816K1767P2136J34838k6784L7293n351l0835
4949B674672q104l7237K1085l393l2962J1405J00405J1553M5490M1782j6109M8094
$$ plain form
5029 1954173 1989382 2056656 2060665 2192211 2058122 2014415 2001618 2005751 2047441 2081497 2108294
5018 2108294 2085618 2095843 2065210 1989537 1991657 2041206 2051600 1945582 1975743 1970892 2026292 1953647
5006 1953647 1916173 2096996 2164577 2114263 2094529 2050326 2113970 2212976 2255600 2223284 2302376
4995 2302376 2188984 2256266 2228069 2241561 2227692 2179130 2290931 2215073 2201346 2239892 2258230
4984 2258230 2326852 2323682 2330995 2321950 2284047 2317410 2472310 2533143 2467493 2427093 2439606 2489010
4972 2489010 2433736 2410893 2341784 2426829 2452403 2466102 2434281 2456341 2641093 2736095 2653602
4961 2653602 2592672 2425781 2424649 2477424 2471608 2493375 2565511 2700349 2673565 2710858 2705507 2674672
4949 2674672 2666568 2629331 2650416 2647023 2614061 2625466 2725871 2737424 2782914 2824696 2808587 2856681
4937B856681K2960Q7033K0219r296l8933O592n1784O5418J50787r2805n7307J05390
4925C064955O930k0274r2391N1707J25219p3284Q6130L0965j03921j18799N0384
4914C007621O3207N2915J17882m8642L4893o007O289K2123j9574K20460n2679
4903C398488r6454J11769j0527L4654j9607L5939M8238j4057p1547M0524L7315
4892C494735J07354o5655j15317K2682L3940O7423n2599o0476q0716J07050K1507
4881C479928J8075l1568r890M698Q8512R494K262q9879R7720O7503Q6797N129
4869C728781K4288o2328l3507m7157J5777O4562M1118j21150o0427K9162R6426
4858C675545k6260K413N4697j31563n3001k527N5733N2652M4649j69696L3902
$$ plain form
4937 2856681 2879641 2966674 2986893 2977597 2938664 2945256 2893472 2958890 3109677 3016872 2959565 3064955
4925 3064955 3071885 3051611 2959220 3010927 3136146 3062862 3148992 3179957 3076036 2957237 3007621
4914 3007621 3070828 3123743 3241625 3192983 3227876 3221869 3228158 3250281 3230707 3451167 3398488
4903 3398488 3302034 3413803 3403276 3437930 3418323 3454262 3502500 3488443 3416896 3457420 3494735
4892 3494735 3602089 3536434 3421117 3443799 3477739 3545162 3492563 3432087 3351371 3458421 3479928
4881 3479928 3498003 3466435 3456545 3461243 3549755 3559249 3561511 3471632 3569352 3636855 3723652 3728781
4869 3728781 3753069 3690741 3657234 3610077 3625854 3690416 3731534 3610384 3549957 3579119 3675545
4858 3675545 3649285 3651698 3706395 3574832 3521831 3519304 3575037 3627689 3672338 3502642 3536544
4847C536544j5102R2547R2358n2072n8427l157R9886J12836j29515m489M771J1480
4835C687660l479K5114o0547P7863N5155l4314j08212j18282l1143R1398R4945
4824C676158j04388j30481J4872O5031J6507r16M5477P5837n5180q7689o3127
4813C452101P5689k871n201R373N5839r170Q2011J0721N1127l4607m3062O9133
4801C711083O9140K72987J75965Q9101J78627M8551l1555L0055j68609j17342
4791D258003j52871q2845j25179q5978l4223K3137J3461p6191j09979O9120m0334
4780C656121j12020R8036N2055O459m9906M2072M7273o7345m5529k6577K6651
4769C627290J1882O4892K7374m3741O0824n5997J43596j4783p447J41716n4800
$$ plain form
4847 3536544 3521442 3613989 3706347 3654275 3595848 3592691 3692577 3805413 3675898 3671409 3676180 3687660
4835 3687660 3684181 3709295 3648748 3726611 3781766 3747452 3639240 3520958 3489815 3581213 3676158
4824 3676158 3571770 3441289 3456161 3521192 3537699 3536783 3582260 3658097 3602917 3515228 3452101
4813 3452101 3527790 3524919 3519718 3529091 3584930 3575760 3657771 3668492 3719619 3685012 3641950 3711083
4801 3711083 3780223 4053210 4229175 4318276 4496903 4545454 4513899 4543954 4375345 4258003
4791 4258003 4105132 4022287 3897108 3811130 3776907 3800044 3813505 3737314 3627335 3696455 3656121
4780 3656121 3544101 3642137 3694192 3700651 3650745 3692817 3740090 3672745 3627216 3600639 3627290
4769 3627290 3639172 3704064 3731438 3687697 3748521 3692524 3836120 3821337 3813890 3955606 3900806
4758C900806k8914p5338N496k3697P3982J93854O750N2967n0723N394r4094R9175
4746D065658J31938L8573J90762K8053M1021J81215P9606R6429J58017P7013K9219
4735E117504l7250p2615k72127j17853M655j6786K9795j54940k01656N596Q600
4724D292923O4270N4353n2830K3694O0069q6703N002R1075Q5189j2997R8543p8067
4712D544521K6179J9285j30799L0992N7396K4271N7968O1233l5755K0742K8011
4701D704044m6606N2079m7254M8336M4919k2272j9089R0719M6239o309J8363k9598
4689D833571O7245M3513j2295k9005J4823Q735K7885L7401P5882q071R4884j9318
4677E135250L9228k853R0865m3517k9366J28047L6578L0872L4400L5688K0841
$$ plain form
4758 3900806 3871892 3796554 3802050 3778353 3852335 4046189 4052939 4105906 4055183 4060577 3966483 4065658
4746 4065658 4197596 4236169 4426931 4454984 4496005 4677220 4756826 4853255 5011272 5088285 5117504
4735 5117504 5080254 5007639 4735512 4617659 4622314 4605528 4635323 4480383 4278727 4284323 4292923
4724 4292923 4357193 4411546 4358716 4382410 4442479 4355776 4360778 4451853 4537042 4524045 4622588 4544521
4712 4544521 4570700 4589985 4459186 4490178 4547574 4571845 4629813 4691046 4655291 4676033 4704044
4701 4704044 4657438 4709517 4662263 4710599 4755518 4733246 4714157 4804876 4851115 4844806 4863169 4833571
4689 4833571 4900816 4944329 4932034 4903029 4917852 4926587 4954472 4991873 5067755 5059684 5154568 5135250
4677 5135250 5174478 5171625 5262490 5218973 5189607 5317654 5354232 5385104 5419504 5455192 5476033
4666E476033j0593K1842l6500O127J9629J6904L4791R0060M0583J5209Q6361K2774
4654E783220n2717Q7664N3611J17794J8578R7727M7420L7214J7097R750J51455
4643F368813k2123k8006O9542R1556J29304J41385Q6919Q2651J6643Q1583J01359
4632G119626m3421N7575J10664l9029N9409J54511J27180O1731L4252J98473J09338
4621G950309J74352N9245k8824L796j22765j11659j1777m2793p7694n8596o1963
4610G671631l0179p0856K9479j10248O7581n492k1456Q9109M253o5747m6068R415
4598G521422M2647N9579M2931K5118L5697L6857R7061L6818K0980j8578N2630
4587G953162M1023r4665L4916L8707j38415M1859n7420L5195Q9150N4371j9440
$$ plain form
4666 5476033 5465440 5487282 5450782 5456909 5476538 5493442 5528233 5618293 5658876 5674085 5760446 5783220
4654 5783220 5730503 5818167 5871778 5989572 6008150 6105877 6153297 6190511 6207608 6217358 6368813
4643 6368813 6346690 6318684 6388226 6479782 6609086 6750471 6837390 6920041 6936684 7018267 7119626
4632 7119626 7076205 7133780 7244444 7205415 7264824 7419335 7546515 7608246 7642498 7840971 7950309
4621 7950309 8124661 8183906 8155082 8158878 8036113 7924454 7912677 7869884 7792190 7733594 7671631
4610 7671631 7641452 7570596 7600075 7489827 7557408 7551916 7530460 7619569 7623822 7558075 7512007 7521422
4598 7521422 7564069 7623648 7666579 7691697 7727394 7764251 7861312 7898130 7919110 7900532 7953162
4587 7953162 7994185 7899520 7934436 7973143 7834728 7876587 7819167 7854362 7943512 7997883 7978443
4576G978443k4985J59122N9179n4621J33197K79051J9068K681J57734J40399J87946
4565I037214N6967J09414J90555Q4314Q6848Q7022R2098J15955K19412J11689
4555A0191488J13937j4689k3845J29469Q7696r7657k7267L8042p3793o6604k9928
4544A0226849n1420j7841J3725M9164j4558n832J63380n1701L8446Q3403M1899
4533A0475514K3793K60707K19315K1934J47205Q7853J95978K06053J39635r69
4523A1777018J12440J28709o4044O9577J30948J04475L3161P6833O0194n5004
4513A2374307N8757L6637Q0273O3667K9213J06610p3680j01260m0274j2807m9917
4502A2471526M8293J3460q2468M1448R8186O3085K3459P4078N8238R2665Q4767
$$ plain form
4576 7978443 7953458 8112580 8171759 8117138 8250335 8529386 8548454 8551135 8708869 8849268 9037214
4565 9037214 9094181 9203595 9394150 9478464 9565312 9652334 9744432 9860387 10079799 10191488
4555 10191488 10305425 10290736 10266891 10396360 10484056 10386399 10359132 10397174 10323381 10256777 10226849
4544 10226849 10175429 10157588 10171313 10220477 10205919 10200087 10363467 10311766 10350212 10433615 10475514
4533 10475514 10499307 10760014 10979329 11001263 11148468 11236321 11432299 11638352 11777987 11777018
4523 11777018 11889458 12018167 11954123 12023700 12154648 12259123 12292284 12369117 12429311 12374307
4513 12374307 12433064 12469701 12549974 12613641 12642854 12749464 12675784 12574524 12534250 12521443 12471526
4502 12471526 12519819 12533279 12450811 12492259 12590445 12653530 12676989 12751067 12809305 12901970 12986737
4491A2986737R9539l1037m7781M4682L3263m0742n7714K385L6120j9204r7579
4480A2908669n2251J73106J386k17487N1103O0492n0850R040k9284Q5484K02205
4469A3141613J4386J86302J44760J03622O2393j4902K9419j28367o8270j58301
4459A3312655l7610N742q0512j52935o8470K8557K028M5678k4418n6711n5188
4448A2918816P9150q6274o8395J0661o5652n5979K9916o3231J3109P294l1809
4437A2687606N9787j01645j0009J105j03478p0938J8626K716M8956j16897p6102
4426A2339727r177J8519o205l6940Q38J74427l0597P0929r84j7137M4246q7p2572
4413A2474987l6829N0065j24069j43934j42219j34850N8262l5938j77587q2201
$$ plain form
4491 12986737 13086276 13055239 13007458 13052140 13085403 13044661 12986947 12989332 13025452 13006248 12908669
4480 12908669 12856418 13029524 13030910 12813423 12864526 12925018 12874168 12883208 12853924 12939408 13141613
4469 13141613 13155999 13342301 13487061 13590683 13653076 13638174 13667593 13539226 13470956 13312655
4459 13312655 13275045 13280787 13200275 13047340 12978870 13007427 13009455 13055133 13030715 12974004 12918816
4448 12918816 12997966 12911692 12843297 12853958 12788306 12732327 12762243 12699012 12712121 12719415 12687606
4437 12687606 12747393 12645748 12635739 12636844 12533366 12462428 12481054 12483770 12532726 12415829 12339727
4426 12339727 12330550 12349069 12342864 12305924 12306762 12481189 12450592 12521521 12520537 12503400 12547646 12547559 12474987
4413 12474987 12438158 12488223 12364154 12220220 12078001 11943151 12001413 11965475 11787888 11705687
4403A1705687j0122L4709J73611J32295L4590L2494M3072N7313J23283j7276L2678
4392A2342334J75631K57565J87524K32677K06138J16141J39454p128j36917j04361
4382A3409058r5063j22784K706j61288q3569o5708m3359m4617J4038P9082K53050
4371A3141546P917M1687O1692J75875k2421j2536N2396k3683r3121L2281j34350
4360A3227283l14926k18991j89084j28763j59709j13800j26530j16115L1943K1975
4350A1913283P4135r993R5262J31307j711j8972j01270l3731j21606j67642k43702
4339A1515360k31748j30503j30039J18903k1616k676P039j1321j04203J0025K9574
4328A1048795o3843j15935j82341m6792R0902N9873l6689M3511j36597N8302p2612
$$ plain form
4403 11705687 11695565 11730274 11903885 12036180 12070770 12103264 12146336 12203649 12326932 12309656 12342334
4392 12342334 12517965 12775530 12963054 13195731 13401869 13518010 13657464 13650336 13513419 13409058
4382 13409058 13313995 13191211 13193917 13032629 12949060 12883352 12839993 12795376 12809414 12888496 13141546
4371 13141546 13149463 13191150 13252842 13428717 13406296 13393760 13446156 13422473 13329352 13361633 13227283
4360 13227283 12912357 12693366 12504282 12375519 12215810 12102010 11975480 11859365 11891308 11913283
4350 11913283 11987418 11977425 12072687 12203994 12202283 12183311 12082041 12048310 11926704 11759062 11515360
4339 11515360 11283612 11153109 11023070 11141973 11120357 11117681 11124720 11113399 11009196 11019221 11048795
4328 11048795 10984952 10869017 10686676 10639884 10730786 10790659 10753970 10797481 10660884 10719186 10646574
4317A0646574J6043Q6948O2820J20324J4445P5912J56110J54195O0528O2384R3165
4306A1549448J79889M2678K4356L3301r5989p6472K4956Q3605O0905M8973P3163
4295A1948813J19735J82000K63910L72020J97363J21848M24001M75778M77228
4286A4582696M95513P41250Q60681J130916J498910J875092K648946L461931L709472
4277C1005407L043239k39211l425868l814293l360661k720699j836768j319044
4269A7332102j126167q06891m93415l19175j76336q1300q4435k25999q7107k74483
4259A3656794j86037j74373j52144K4261J50417M8734L9344q6757j455m6198P3743
4248A3346329J83476J51109K24168J29706K61373J73129J53611L25276M27746
$$ plain form
4317 10646574 10662617 10749565 10812385 10932709 10947154 11023066 11179176 11333371 11393899 11456283 11549448
4306 11549448 11729337 11772015 11796371 11829672 11733683 11657211 11682167 11765772 11826677 11875650 11948813
4295 11948813 12068548 12250548 12514458 12886478 13083841 13205689 13629690 14105468 14582696
4286 14582696 15078209 15819459 16680140 17811056 19309966 21185058 23834004 27295935 31005407
4277 31005407 34048646 33809435 30383567 26569274 23208613 20487914 18651146 17332102
4269 17332102 16205935 15399044 14905629 14586454 14410118 14328818 14244383 14018384 13931277 13656794
4259 13656794 13470757 13296384 13144240 13168501 13318918 13367652 13406996 13320239 13318784 13272586 13346329
4248 13346329 13529805 13680914 13905082 14034788 14296161 14469290 14622901 14948177 15375923
4239A5375923K78776K26666L98674N40756M74625M97154L71546L97614O2222o7840
4229A8556116o9301k28894j83232j91476k05496j80151j13846o1313j14912j27901
4219A7079594j0776J07756J10597P2075J51657K07039K21482M9362J35782J07467
4209A8232035J61735J62356K89652J48558J13650J60448J45685K47275n5163J2075
4199A9618306m2905K3366m072j03839q3951j52572k09800N5783J35229r1501K0160
4188A9164204K57411J81028L21627M69768O79988R15816J486378K046429K742307
4179B8264956L427564K683408l97743k989339l394041k819257k183218j474910
4171B1117420j147295q42166m35013n14215m17212l36338j91131j08757j50549
$$ plain form
4239 15375923 15654699 15881365 16280039 16820795 17295420 17792574 18164120 18561734 18623956 18556116
4229 18556116 18486815 18257921 18074689 17883213 17677717 17497566 17383720 17322407 17207495 17079594
4219 17079594 17068818 17176574 17287171 17359246 17510903 17717942 17939424 17988786 18124568 18232035
4209 18232035 18393770 18556126 18845778 18994336 19107986 19268434 19414119 19661394 19606231 19618306
4199 19618306 19575401 19598767 19594695 19490856 19406905 19254333 19044533 19100316 19235545 19144044 19164204
4188 19164204 19421615 19602643 19924270 20394038 21074026 21989842 23476220 25522649 28264956
4179 28264956 31692520 34375928 33978185 30988846 27594805 24775548 22592330 21117420
4171 21117420 19970125 19127959 18692946 18178731 17761519 17425181 17234050 17125293 16974744
4162A6974744r7270q1843n9873j70804j71541j72562k27449j63112j82569j86396
4152A5461325k51082k08996j18239j50411j26503k8001N385m9170J67166J4634
4142A4716108M2307J74181J06931J47353J94258K53500M33133O23523J098893
4133A7790187J364737J530554R46567q38455j630625j492879j375719r54665n83942
4124A4755760o05196m93456l25454k83275l38666k81187j96643j20080k88122
4115A1823681j57726k77002j60948k33098k41503o1610j34209o1243j87016n4170
4105A0255156j09938j66951j7614j90608K6386j9512j00054j7031j7180l7552
4095I605102Q4454J40804j4532J35692m031j30003r2238j11354k8110l4083r9956
$$ plain form
4162 16974744 16877474 16795631 16735758 16564954 16393413 16220851 15993402 15830290 15647721 15461325
4152 15461325 15210243 15001247 14883008 14732597 14606094 14578093 14583478 14534308 14701474 14716108
4142 14716108 14758415 14932596 15039527 15186880 15381138 15634638 16067771 16691294 17790187
4133 17790187 19154924 20685478 21632045 20793590 19162965 17670086 16294367 15339702 14755760
4124 14755760 14150564 13657108 13331654 13048379 12709713 12428526 12231883 12111803 11823681
4115 11823681 11665955 11388953 11228005 10994907 10753404 10691794 10557585 10496342 10309326 10255156
4105 10255156 10145218 9978267 9960653 9770045 9796431 9776919 9676865 9659834 9642654 9605102
4095 9605102 9689556 9830360 9815828 9951520 9947489 9817486 9725248 9613894 9585784 9551701 9451745
4084I451745j5571K6353r0228j14254N6399p5638p4630r8586j58225j19651o8892
4073H718822j9942k9380m4730r1355j2622j0062O8653K2070N3338L0180O8060
4062H753032J71604J30341j13359l252j24336j11853j80451k8377j01055j06802
4052H285492J7748n1536j1320p767R977p4615L1170m5404m5135N9700L8873k3100
4040H184083J74206N4527L8563J60627J40733K78589L30929L64814N43465O40455
4030A0910991P64971M40851m86958p45647o17534n83062l87088k08258j43560
4021H944706j81751j13953l0207p0211r8048n5155n427M9578J1944n067J08308
4010H554717P966o595o893r001M9268r425P0453l681K9125R7002l5019k5823p243
$$ plain form
4084 9451745 9436174 9462527 9372299 9258045 9314444 9238806 9164176 9065590 8907365 8787714 8718822
4073 8718822 8698880 8669500 8624770 8533415 8520793 8510731 8579384 8601454 8654792 8684972 8753032
4062 8753032 8924636 9054977 8941618 8938366 8814030 8702177 8521726 8493349 8392294 8285492
4052 8285492 8303240 8251704 8240384 8232617 8242594 8167979 8199149 8153745 8108610 8168310 8207183 8184083
4040 8184083 8358289 8412816 8451379 8612006 8752739 9031328 9362257 9727071 10270536 10910991
4030 10910991 11675962 12116813 11629855 10884208 10266674 9683612 9296524 9088266 8944706
4021 8944706 8762955 8649002 8618795 8548584 8450536 8395381 8389954 8439532 8451476 8446409 8554717
4010 8554717 8562683 8556088 8549195 8540194 8589462 8580037 8650490 8646809 8675934 8772936 8737917 8712094 8704851
3997H704851l1548J74790O8990K3110j8046j046j2887P4154M6876M7919J82578
3986I259741L8442n4165K3557R2529M1986o2959J54224J62185o37N4108M5094
3975I754105o6284k7269m8360M2747J33939k7242p987P0522R4681J01269P9395
3964A0099516K3208j5103J29361R2966R5762P1966m750J8087K09244O5711r2600
3953A0693368l4281N1347O1114M285Q1350J52062P9499O907R7388O3101Q857M042
3941A1269039m136L2595M2600J3356P6293q098J67624J02704R2908M7562j9458
3930A1812989n5356L5362P3463J9455N4443o5936N2123K9140J05759J16353J2273
3919A2190068L9731R8167P1682q2571J19483J17966Q4379K0081k4051O2168K859
$$ plain form
3997 8704851 8673303 8848093 8917083 8940193 8922147 8921101 8908214 8982368 9029244 9077163 9259741
3986 9259741 9298183 9244018 9267575 9360104 9402090 9339131 9493355 9655540 9654903 9709011 9754105
3975 9754105 9687821 9660552 9612192 9654939 9788878 9761636 9753649 9824171 9918852 10020121 10099516
3964 10099516 10122724 10107621 10236982 10329948 10425710 10497676 10492926 10511013 10720257 10785968 10693368
3953 10693368 10659087 10710434 10771548 10775833 10857183 11009245 11088744 11095651 11193039 11256140 11264997 11269039
3941 11269039 11264903 11297498 11340098 11353454 11429747 11421649 11589273 11691977 11784885 11832447 11812989
3930 11812989 11757633 11792995 11866458 11885913 11940356 11874420 11926543 11955683 12061442 12177795 12190068
3919 12190068 12229799 12327966 12399648 12317077 12436560 12554526 12638905 12658986 12634935 12697103 12699962
3908A2699962Q4592Q9009Q7996r924L7768J50687O1581j7843O8082l992Q1307
3897A3329225P8088J86704O0665j67586J17648J19142M0280R3655r675l2431K9228
3886A3844943J64378J38052p8286q95k1757R7907Q6304P9233m880Q6768J07360
3875A4499127J37173R015k1555R2602N3140M367P9721m2263K1384N2466J41298
3864A5026475J04947L5397N0750j37O0712K39377O2346l8624R3676O1696l0922
3853A5665693n6746J04181J37818J43570L4633m2077l2949N7953J30316J06247
3843A6248639K1831Q0770O4448L2129J09287m4297P7902J51203J07415N9728l4455
3832A6874600K15810K42300K1504m9864P7221L2162J59169J22087M8333O4242
$$ plain form
3908 12699962 12784554 12873563 12961559 12951635 12989403 13140090 13201671 13183828 13251910 13247918 13329225
3897 13329225 13407313 13594017 13654682 13487096 13604744 13723886 13764166 13857821 13848146 13815715 13844943
3886 13844943 14009321 14147373 14069087 14068192 14046435 14144342 14230646 14309879 14304999 14391767 14499127
3875 14499127 14636300 14645315 14623760 14716362 14769502 14773869 14853590 14811327 14832711 14885177 15026475
3864 15026475 15131422 15166819 15217569 15217432 15278144 15517521 15579867 15541243 15634919 15696615 15665693
3853 15665693 15608947 15713128 15850946 15994516 16029149 15987072 15954123 16012076 16142392 16248639
3843 16248639 16270470 16351240 16415688 16447817 16557104 16512807 16590709 16741912 16849327 16909055 16874600
3832 16874600 17090410 17332710 17354214 17304350 17381571 17413733 17572902 17694989 17743322 17807564
3822A7807564N3476O5540J13970J02981J29273J49752J7769Q8278R8921P4631
3812A8702155Q6099K8122Q3444Q9036J49873Q717K08916J32343Q9268K7617P6661
3801A9682251J62405M9845J09282K02584J04298J27743J91238P1305Q8829K44137
3791B1033917J75316J24801Q4325R6121R0469J40967K12196K09226Q5615N6708
3781B2309661J49209K90414K28346K26811K34580K01903K78161L18526L65203
3772B4602814N10518N44913Q19332R18677P39229J50526n97068n35704m63121
3763B6690116k75483j61900p064l9619J05473J65741J68770K9990P5595O9337
3753B6820956J61040J50576J80887K49233K47706J70901J61598K19308P5842J44187
$$ plain form
3822 17807564 17861040 17926580 18040550 18143531 18272804 18422556 18440325 18528603 18627524 18702155
3812 18702155 18788254 18816376 18899820 18988856 19138729 19147446 19356362 19488705 19577973 19605590 19682251
3801 19682251 19844656 19894501 20003783 20206367 20310665 20438408 20629646 20700951 20789780 21033917
3791 21033917 21209233 21334034 21418359 21514480 21604949 21745916 21958112 22167338 22252953 22309661
3781 22309661 22458870 22749284 22977630 23204441 23439021 23640924 23919085 24237611 24602814
3772 24602814 25113332 25658245 26477577 27396254 28135483 28286009 27688941 27153237 26690116
3763 26690116 26414633 26252733 26245669 26206050 26311523 26477264 26646034 26676024 26751619 26820956
3753 26820956 26981996 27132572 27313459 27562692 27810398 27981299 28142897 28362205 28438047 28582234
3743B8582234J93510K26704L74554K07070L50677M44364L93468L40511N31205
3734C1644297N44684P45150P35897R47097J228181J200141R28325M67352J87739
3725C8628863m74310p75887p33611o64437m15593l12659k60344q5148r6876p62
3715C4809236Q4241Q9131Q1517R8707R6906L1971K88255K10182O2975K12255J82321
3704C6247697K56746J39018J24307J31973K63353R2381J89742J59819K79859L62524
3694C8247419J84443K12351K49552J79851K05610J45294J90999J49752J11548
3685C9876819P5402J80194J34291P8078P9346J77864J33730J08890J57886O6975
3675D1069475N7383J72914J22088n584J82356J97345J54367L16886K48027M53009
$$ plain form
3743 28582234 28775744 29002448 29377002 29584072 29934749 30379113 30772581 31113092 31644297
3734 31644297 32188981 32934131 33670028 34617125 35845306 37045447 37973772 38441124 38628863
3725 38628863 38154553 37378666 36645055 35980618 35565025 35252366 34992022 34906874 34809998 34809236
3715 34809236 34893477 34982608 35064125 35162832 35259738 35291709 35579964 35790146 35853121 36065376 36247697
3704 36247697 36504443 36643461 36767768 36899741 37163094 37255475 37445217 37605036 37884895 38247419
3694 38247419 38431862 38644213 38893765 39073616 39279226 39424520 39615519 39765271 39876819
3685 39876819 39952221 40132415 40266706 40344784 40424130 40601994 40735724 40844614 41002500 41069475
3675 41069475 41126858 41299772 41421860 41416276 41598632 41795977 41950344 42267230 42515257 42968266
3665D2968266N27480M29480Q83031R69854J014170R74005O85165J99547k66210
3656D8384788o31767p40168q38908p87725n10471m56452k90207k07189j75081
3647D3746820j10521q4811j3184j8959M5893J07536j8123k9159k0156j16800k8040
3636D3460496J8910J36818L9585p2722j08989j19161q7261q169j5118L602l6843
3625D3211148K3496M5456L411q6452n0913j60154j38172j20008j3519N5621j21066
3614D2648848j13299j34306L0314J34367j26886j93229M4206l9070p7461N9248
3604D2232732J06848l4884n3739m7273m3936J38205N5487k0339j22412J67845
3594D2378534P1516j45583M8038Q8371q3125R9575J34974J14816J12354R1244
$$ plain form
3665 42968266 43495746 43925226 44808257 45778111 46792281 47766286 48451451 48650998 48384788
3656 48384788 47753021 47012853 46173945 45386220 44875749 44419297 44129090 43921901 43746820
3647 43746820 43636299 43551488 43538304 43519345 43565238 43672774 43654651 43625492 43605336 43488536 43460496
3636 43460496 43479406 43616224 43655809 43583087 43474098 43354937 43267676 43259507 43244389 43247991 43211148
3625 43211148 43234644 43280100 43283511 43197059 43146146 42985992 42847820 42727812 42714293 42769914 42648848
3614 42648848 42535549 42401243 42431557 42565924 42439038 42245809 42290015 42250945 42173484 42232732
3604 42232732 42339580 42304696 42250957 42203684 42159748 42297953 42353440 42333101 42210689 42378534
3594 42378534 42450050 42304467 42352505 42440876 42357751 42457326 42592300 42707116 42819470 42910714
3584D2910714K0003R1852J32214J22591J54159R0484P4606J75767J82561J10321
3574D4065272P2117M7959J59841J77493J80153L3936N4905P7551J38305N1406
3564D5058938R1993J5695J34961K16606J55012J11692k9322j13076L0266O2127
3554D5734892J95908R3211Q1415M9845R6006K40676J53207J85915J84715J42731
3544D7158521J84235K78675K64319J32289J45296R0814J32516K16133J4826J09670
3534D8727294J43059R173Q3101J73148J08186n6600R9626N3062R7564q1621J01135
3523D9457127J38543J08345J42883Q8692Q0251K11690K37373J78477K04806J14348
3513E0962535K08247K55696K80423J73587J69336j1714L0592K7988J44450Q1139
$$ plain form
3584 42910714 42930717 43022569 43154783 43277374 43431533 43522017 43596623 43772390 43954951 44065272
3574 44065272 44137389 44185348 44345189 44522682 44702835 44736771 44791676 44869227 45007532 45058938
3564 45058938 45150931 45166626 45301587 45518193 45673205 45784897 45755575 45642499 45672765 45734892
3554 45734892 45930800 46024011 46105426 46155271 46251277 46491953 46645160 46831075 47015790 47158521
3544 47158521 47342756 47621431 47885750 48018039 48163335 48254149 48386665 48602798 48617624 48727294
3534 48727294 48870353 48879526 48962627 49135775 49243961 49187361 49286987 49340049 49437613 49355992 49457127
3523 49457127 49595670 49704015 49846898 49935590 50015841 50227531 50464904 50643381 50848187 50962535
3513 50962535 51170782 51426478 51706901 51880488 52049824 52038110 52068702 52096690 52241140 52322279
3503E2322279j08991M9124J97117J82191R1765K0375J03558q5469N7101J20544
3493E2949594O5022N1637P6766J55900J10419K86035J92085K18812K28296J77233
3483E4511799J54341K10182J63252J12431K03691j4865r8748K06316R6353K4202
3473E5568954J08751K8312J72145J49645J34721J27411K23229K55469K27830J26289
3463E7122756Q954J06420J13493J2065O4823K08627K7652J93431K42972K60672
3453E8361865L51925K63679J48850K87810K81193J62141K10138J07418J80477
3444F0355496J86338K69080R1849O6045J71442L17565L82680L14817M30589N38642
3434F3124543O27333O05522L55371N1345L8241O8988P0956J37465K01266M20399
$$ plain form
3503 52322279 52213288 52262412 52459529 52641720 52733485 52753860 52857418 52771949 52829050 52949594
3493 52949594 53014616 53066253 53143019 53298919 53409338 53695373 53887458 54106270 54334566 54511799
3483 54511799 54666140 54876322 55039574 55152005 55355696 55340831 55242083 55448399 55544752 55568954
3473 55568954 55677705 55706017 55878162 56027807 56162528 56289939 56513168 56768637 56996467 57122756
3463 57122756 57131710 57238130 57351623 57363688 57428511 57637138 57664790 57858221 58101193 58361865
3453 58361865 58713790 58977469 59126319 59414129 59695322 59857463 60067601 60175019 60355496
3444 60355496 60541834 60810914 60902763 60968808 61140250 61457815 61840495 62155312 62585901 63124543
3434 63124543 63751876 64357398 64712769 64764114 64802355 64871343 64942299 65079764 65281030 65701429
3424F5701429M76208M10689M35391M15360J03262J57008O1102J42656K09249L04018
3414F8416372L94997N26987N09402L95909N31967K63069J30084J32525K94952
3405G1596264M19959L86942O29578N36580O36153M43383L47046M42320M31070
3396G5869295N09691O61681O32484O55628Q03499Q25966O31308J29418r165m6694
3386H0663111K02556M72491L93661N17673N51625M61481N30302N47254O08537
3377H4948691N62660N00567N11961N30687N55788P71172O40173N37240P72257
3368I0331196P89437P92649Q37495P42073Q29838P22936Q10400P67641Q39759
3359I7463424P81521P47502Q94854R20988J063311J102410R93875J033726J021086
$$ plain form
3424 65701429 66177637 66588326 67023717 67439077 67542339 67699347 67760449 67903105 68112354 68416372
3414 68416372 68811369 69338356 69847758 70243667 70775634 71038703 71168787 71301312 71596264
3405 71596264 72016223 72403165 73032743 73569323 74205476 74648859 74995905 75438225 75869295
3396 75869295 76378986 77040667 77673151 78328779 79132278 79958244 80589552 80718970 80709805 80663111
3386 80663111 80865667 81338158 81731819 82249492 82801117 83262598 83792900 84340154 84948691
3377 84948691 85511351 86011918 86523879 87054566 87610354 88381526 89021699 89558939 90331196
3368 90331196 91120633 91913282 92750777 93492850 94322688 95045624 95856024 96623665 97463424
3359 97463424 98244945 98992447 99887301 100808289 101871600 102974010 103967885 105001611 106022697
3350A06022697J188510J112022J224699J142635J219071J229206J309644J592180
3342A16040664J654065J711504J920708J724984J282478P46270L29459K99657
3334A25709789N82736Q12991R39188J076645J180676J419133J365512J473238
3326A34559908J406855J491187J720393J789783J694282J923722J983790J899907
3318A48469827J945292J990108K019737J839312J649005J880441J747456J828199
3310A63369377J983541K203832K228759K112607K273014K138830K422058K746128
3302A81478146K880819L116898L385893L330360L108123L145850L460423L879933
3294B07786445M208480M512958M418150L757455L169915L308069L799813M438927
$$ plain form
3350 106022697 107211207 108323229 109547928 110690563 111909634 113138840 114448484 116040664
3342 116040664 117694729 119406233 121326941 123051925 124334403 125080673 125410132 125709789
3334 125709789 126292525 127105516 128044704 129121349 130302025 131721158 133086670 134559908
3326 134559908 135966763 137457950 139178343 140968126 142662408 144586130 146569920 148469827
3318 148469827 150415119 152405227 154424964 156264276 157913281 159793722 161541178 163369377
3310 163369377 165352918 167556750 169785509 171898116 174171130 176309960 178732018 181478146
3302 181478146 184358965 187475863 190861756 194192116 197300239 200446089 203906512 207786445
3294 207786445 211994925 216507883 220926033 224683488 227853403 231161472 234961285 239400212
3286B39400212N104041N800034O569569P209441P953780Q979590R875908J0585747
3278C01478322J1518001J2525785J3391102J4352656J4967300J5249131J5440856
3271C98923153J5071679J3884129J1892776R003009N263801Q53931m677689j0738327
3263D39476462j6822291k0760301k1783118k0982516j8972699j6826299j4841906
3256C08487332j3149997j1636846j0422614r557592q683727p929910p215352o545991
3248B33345303o199575n855301n126044m866771m520424m119348l894277l593376
3240A95170187l373337l227761l059717l035847k804142k690235k857610k698805
3232A71422733k856631k741069k753223k798429k801493k713306k580962k497535
$$ plain form
3286 239400212 244504253 250304287 256873856 264083297 272037077 281016667 290892575 301478322
3278 301478322 312996323 325522108 338913210 353265866 368233166 383482297 398923153
3271 398923153 413994832 427878961 439771737 448774746 454038547 454892478 450214789 439476462
3263 439476462 422654171 401893870 380110752 359128236 340155537 323329238 308487332
3256 308487332 295337335 283700489 273277875 263720283 255036556 247106646 239891294 233345303
3248 233345303 227145728 221290427 216164383 211297612 206777188 202657840 198763563 195170187
3240 195170187 191796850 188569089 185509372 182473525 179669383 176979148 174121538 171422733
3232 171422733 168566102 165825033 163071810 160273381 157471888 154758582 152177620 149680085
3224A49680085k356570k266415k211560k029022j928978j787604j647353j604994
3216A33847589j485178j391623j323535j261593j198826j200588j147394j072374
3208A23766478j162766j114951j199349j043513j106041j229871j007817r22118
3200A14980052j078346r94209r82124q17404q56360r05718q84191q38045q39861
3191A06783794r34782q20060q11853p35957p66557q08672p57685p38536o40055
3182I9769637p08190p67289o04929n96560n09030o09155n56946m82432m22833
3173I4512273n28098n92157m32908l07094m42589n38271o15272n95804m64696
3164H9995384o82873q34379o02129n70453n58879n49663n01279o04261m93398
$$ plain form
3224 149680085 147323515 145057100 142845540 140816518 138887540 137099936 135452583 133847589
3216 133847589 132362411 130970788 129647253 128385660 127186834 125986246 124838852 123766478
3208 123766478 122603712 121488761 120289412 119245899 118139858 116909987 115902170 114980052
3200 114980052 113901706 112907497 111925373 111107969 110251609 109345891 108461700 107623655 106783794
3191 106783794 105849012 105028952 104217099 103481142 102714585 101905913 101148228 100409692 99769637
3182 99769637 99061447 98294158 97689229 97092669 96583639 95974484 95417538 94935106 94512273
3173 94512273 93984175 93392018 92959110 92652016 92209427 91671156 91055884 90460080 89995384
3164 89995384 89312511 88478132 87876003 87305550 86746671 86197008 85695729 85091468 84598070
3155H4598070n08353m55334l50428n70513n36811m61123m57406m39176m84245
3146H0334681l60579m26839m04213k31515l94113m01900l06062l83677m48008
3137G6977775m19882l79289l51451m47659m22964n55165m75887l65324m15088
3128G3145066k66744l41935k87381l31642l98753m01872m34437l26136l03150
3119G0053016j70114l51873k19827k13124l40779j58414j9385j4429j40000j37872
3109F8287199k44416j49029m9877j41276j80123k14433j59068j62278j72205k11427
3099F6603067j63270j29733k41341k22924k09047j17123j50283k22196k63144
3090F4884006k38820k09337j94679j92007j29742j87690k25747j37418j25765
$$ plain form
3155 84598070 84089717 83634383 83283955 82713442 82176631 81715508 81258102 80818926 80334681
3146 80334681 79974102 79547263 79143050 78911535 78517422 78115522 77809460 77425783 76977775
3137 76977775 76557893 76178604 75827153 75379494 74956530 74401365 73925478 73560154 73145066
3128 73145066 72878322 72536387 72249006 71917364 71518611 71116739 70682302 70356166 70053016
3119 70053016 69882902 69531029 69311202 69098078 68757299 68598885 68579500 68565071 68425071 68287199
3109 68287199 68042783 67893754 67843877 67702601 67522478 67308045 67148977 66986699 66814494 66603067
3099 66603067 66439797 66310064 66068723 65845799 65636752 65519629 65369346 65147150 64884006
3090 64884006 64645186 64435849 64241170 64049163 63919421 63731731 63505984 63368566 63242801
3081F3242801j69146j97184j57648n9254l0580l5197j25244j27897j20012q8308
3071F2132331j21363j02571N307o2175j26915k22403j44572r2246j69901l9540
3061F1055952j65530j09600q5096p3424l6507k0726K6983N9911m1020j9421J30161
3050F0721683J59172J14137p5079J4136J38681J78529K42385L04252J37505K72040
3040F2207441L03416L15498L93869M81177N12949O44699N65635N85969N96889
3031F6607542O55671O44933N55616M49601L86067M16926M03951M11153L26012
3022G0857472N84214N32603O35256O72235O77553O86641N41589M14027N60038
3013G6161628N89064N60827N41790N80371O75654P46605R53911R90288J128740
$$ plain form
3081 63242801 63073655 62876471 62718823 62659569 62628989 62593792 62468548 62340651 62220639 62132331
3071 62132331 62010968 61908397 61913704 61851529 61724614 61502211 61357639 61265393 61095492 61055952
3061 61055952 60890422 60780822 60695726 60622302 60585795 60565069 60592052 60651963 60610943 60591522 60721683
3050 60721683 60880855 60994992 60919913 60934049 61072730 61251259 61493644 61797896 61935401 62207441
3040 62207441 62510857 62826355 63220224 63701401 64214350 64859049 65424684 66010653 66607542
3031 66607542 67263213 67908146 68463762 68913363 69299430 69716356 70120307 70531460 70857472
3022 70857472 71441686 71974289 72609545 73281780 73959333 74645974 75187563 75601590 76161628
3013 76161628 76750692 77311519 77853309 78433680 79109334 79855939 80809850 81800138 82928878
3004H2928878J086686J282901J387710J274024J178986J177688J156692R67046
2996I2440611P93592N18310L58435N29657O42379P28173O37022P34231O01607
2987I7984017M80273M50116M94482O82268Q33555P62993Q32719J079982J030016
2978A04630421R41841R56648R70950J134782J345635J623107J466162J509868
2970A14579414J558425J632307J805074J782487K054635K141635K235108K232243
2962A30021328K361756K566707K794174K763600K666449K600743K638938K389710
2954A50803405J913273J664048J264896R17002Q13706R91809R91512J061376J146511
2945A61567538J335301J471404J564349K007594K277281K618213L129145L672757
$$ plain form
3004 82928878 84015564 85298465 86686175 87960199 89139185 90316873 91473565 92440611
2996 92440611 93234203 93752513 94110948 94640605 95282984 96011157 96648179 97382410 97984017
2987 97984017 98464290 98914406 99408888 100091156 100924711 101687704 102520423 103600405 104630421
2978 104630421 105572262 106528910 107499860 108634642 109980277 111603384 113069546 114579414
2970 114579414 116137839 117770146 119575220 121357707 123412342 125553977 127789085 130021328
2962 130021328 132383084 134949791 137743965 140507565 143174014 145774757 148413695 150803405
2954 150803405 152716678 154380726 155645622 156562624 157376330 158368139 159359651 160421027 161567538
2945 161567538 162902839 164374243 165938592 167946186 170223467 172841680 175970825 179643582
2937A79643582M313270M795999N367662O163129O686051P628394Q604094R221635
2929B32423816R259742P849491N029400J733076j547007m467615o372709p328908
2921B36579286p688067o880688n564617m175215k918986j871589r59004j86607
2913B06334513P05439J273718J873536K651809L296346L523449L660482L523266
2905B26842558L037416K951004K479794K304088K330181J985106J196858j91212
2897B42935793k476134m444961n628907o275388p120274p619076p590135o948739
2889A94832179o032831n093781m346952l530374k898159k354094j553607j159988
2881A67862393p58180m87727l48543r23852j513826j940255k641677l349544l608464
$$ plain form
2937 179643582 183956852 188752851 194120513 200283642 206969693 214598087 223202181 232423816
2929 232423816 241683558 249533049 254562449 256295525 254748518 250280903 243908194 236579286
2921 236579286 228891219 222010531 216445914 212270699 209351713 207480124 206521120 206334513
2913 206334513 207039952 208313670 210187206 212839015 216135361 219658810 223319292 226842558
2905 226842558 229879974 232830978 235310772 237614860 239945041 241930147 243127005 242935793
2897 242935793 240459659 236014698 230385791 224110403 216990129 209371053 201780918 194832179
2889 194832179 188799348 183705567 179358615 175828241 172930082 170575988 169022381 167862393
2881 167862393 167104213 166616486 166267943 165344091 163830265 161890010 159248333 155898789 152290325
2872A52290325l670931l987147m267937m256381m385097m097686l953191l760850
2864A19911105l504971l161477l013160k701932k671276k514704k262078k066257
2856I8015250j871481j543620j415480j439767j515931j353326j146886j360648
2848H6368111j413615j555624j543899j466148j562610j745692j451354j505193
2840G4123976j341723j277814j192226j013062j090689j042768q30647r18886
2832F5416161r25403r68536j262379j063639j154655j245455j198060j209044
2824E6388990r03020q58659r75272r21230p81672p58105o13902o88753o65271
2815D9223106n93008n99402n59539n84056p17010p61524o73368p04182o36980
$$ plain form
2872 152290325 148619394 144632247 140364310 136107929 131722832 127625146 123671955 119911105
2864 119911105 116406134 113244657 110231497 107529565 104858289 102343585 100081507 98015250
2856 98015250 96143769 94600149 93184669 91744902 90228971 88875645 87728759 86368111
2848 86368111 84954496 83398872 81854973 80388825 78826215 77080523 75629169 74123976
2840 74123976 72782253 71504439 70312213 69299151 68208462 67165694 66335047 65416161
2832 65416161 64490758 63522222 62259843 61196204 60041549 58796094 57598034 56388990
2824 56388990 55485970 54627311 53652039 52730809 51949137 51191032 50577130 49888377 49223106
2815 49223106 48630098 48030696 47471157 46887101 46170091 45408567 44735199 44031017 43394037
2806D3394037o06747o26243p08377p72804o29045p06830p20954o12901p03687
2797C7306449o30375p14557o11805m48808o87819n99207l20503l60518m05913
2788C2526944n29703m08703m52483m95845k59547l14516m36987m20125m43163
2779B8765872l81651m41666l73310m42033m05421l91074m58622l97749l95219
2770B5079127m43304k48981l06728l51785l30990m27634m25122k56193l63667
2761B1924723l00923k51100k81947l35024k81541k89668k74661k79258l34226
2752A9296375p2203k17324l09921l12484k12463k56317k60386j72449k53396k51357
2742A6978075p6866k82213l03800k27530k30971l35020k03605j13083k73037k24669
$$ plain form
2806 43394037 42787290 42161047 41452670 40679866 40050821 39343991 38623037 38010136 37306449
2797 37306449 36676074 35961517 35349712 34900904 34213085 33613878 33293375 32932857 32526944
2788 32526944 31997241 31588538 31136055 30640210 30380663 30066147 29629160 29209035 28765872
2779 28765872 28384221 27942555 27569245 27127212 26721791 26330717 25872095 25474346 25079127
2770 25079127 24635823 24386842 24080114 23728329 23397339 22969705 22544583 22288390 21924723
2761 21924723 21623800 21372700 21090753 20755729 20474188 20184520 19909859 19630601 19296375
2752 19296375 19224172 19006848 18696927 18384443 18171980 17915663 17655277 17482828 17229432 16978075
2742 16978075 16901209 16618996 16315196 16087666 15856695 15521675 15318070 15204987 14931950 14707281
2732A4707281k17302k09243j92445j07562j22463J5792n7400j07978j18482j13677
2722A3476521r2700k14349o8326p0338r9362j13915j05289j73207m8358q6058
2712A2404619r7236j30820l8319n395j38385m6822j59932j02107j49079q1170
2702A1455354o3800j57367n9246j74868j72759j67131j0034r8034j07235j19092
2692A0325788j36863l7853j23760r0631n0009K4860L2129o3673j04275m3451o2748
2681I669514q6968q3742j63237n2976m772j248l3456J7129r4216q6676j014m7684
2669I030654O036j12488p0600j23037n188L4293k9323q1368j16077j80310l9461
2658H313131Q866q885O985L9377o4205Q1058P4258j03731J02593J12027Q9074
$$ plain form
2732 14707281 14489979 14280736 14088291 13980729 13858266 13874058 13816658 13708680 13590198 13476521
2722 13476521 13383821 13169472 13101146 13030808 12931446 12817531 12712242 12539035 12490677 12404619
2712 12404619 12307383 12176563 12138244 12132849 11994464 11947642 11787710 11685603 11536524 11455354
2702 11455354 11391554 11234187 11174941 11000073 10827314 10660183 10650149 10552115 10444880 10325788
2692 10325788 10188925 10151072 10027312 9936681 9886672 9911532 9943661 9879988 9775713 9732262 9669514
2681 9669514 9582546 9498804 9335567 9282591 9277819 9276571 9243115 9260244 9166028 9079352 9078338 9030654
2669 9030654 9036690 8924202 8853602 8730565 8725377 8759670 8730347 8648979 8532902 8352592 8313131
2658 8313131 8321997 8313112 8320097 8359474 8295269 8376327 8450585 8346854 8449447 8561474 8650548
2647H650548l6524K0873K5524j41043K5999N2296k8194l2998n9994n7152j29789
2636H289546j08531l8220O8558l0566l4085j24592P1832j65474j14378J07540
2626G921630o8824j00240l1629M4888K2609M9630K4104j46762K2096O7584N2660
2615G857746N0209R0196L4380P5231q3685j18556j9057j41875k25156k00238j65526
2604G153669j47948O5359q4620n0638n1447n9750j21121j27961p7737O2064j55956
2593F403914n3402j4461n9624l8897j22043r3931j44630j50540N4692j2077r4409
2582E674592o3244j5119N5692J6875Q8751p4681n5248P084r5893j51723j18774
2571E268312j57266k28937J9482o3530j63221n5987o4258o4911j25997n667j40478
$$ plain form
2647 8650548 8614024 8634897 8660421 8519378 8545377 8597673 8569479 8536481 8476487 8419335 8289546
2636 8289546 8181015 8142795 8211353 8180787 8146702 8022110 8093942 7928468 7814090 7921630
2626 7921630 7852806 7752566 7720937 7765825 7788434 7838064 7862168 7715406 7737502 7805086 7857746
2615 7857746 7907955 7998151 8032531 8107762 8024077 7905521 7886464 7744589 7519433 7319195 7153669
2604 7153669 7005721 7071080 6986460 6935822 6884375 6824625 6703504 6575543 6497806 6559870 6403914
2593 6403914 6350512 6336051 6276427 6237530 6115487 6021556 5876926 5726386 5781078 5769001 5674592
2582 5674592 5611348 5596229 5651921 5668796 5757547 5682866 5627618 5634702 5538809 5387086 5268312
2571 5268312 5111046 4882109 4901591 4838061 4674840 4618853 4554595 4489684 4363687 4358020 4217542
2560D217542n0866J20499K7147j24207j18950Q5124j20902j68415j26186J10763
2550C851549J664p0055k1584j05792j16384Q12l6927j90227J12784L1292o5556
2539C391576R666j17973o7021N247O6776p8548l8298k24431n5364k8270r1121
2528B772239N3441k1576j24395r6702j2073P5698l7243o875J1642l569j12192
2517B498395o2637L0351j14795p7994j04514O0000M5014l3088N2700m8210K0990
2506B266212k3407M469L3388o8839q0440k9213J8740j3025j01141j0388J16885
2495B113241j17572n8885k3465r8844N363J26359p7437q1108o5557p0818K3356
2484A674633R338j1134L9185m7002J5150k7500J0427L2629o4215j59622n731Q261
$$ plain form
2560 4217542 4166676 4287175 4314322 4190115 4071165 4156289 4035387 3866972 3740786 3851549
2550 3851549 3853213 3783158 3761574 3655782 3539398 3540210 3503283 3313056 3425840 3457132 3391576
2539 3391576 3401242 3283269 3216248 3221495 3288271 3209723 3171425 2946994 2891630 2863360 2772239
2528 2772239 2825680 2804104 2679709 2583007 2570934 2646632 2609389 2602514 2614156 2610587 2498395
2517 2498395 2435758 2466109 2351314 2273320 2168806 2228806 2273820 2240732 2293432 2245222 2266212
2506 2266212 2242805 2247274 2280662 2211823 2131383 2102170 2120910 2107885 2006744 1996356 2113241
2495 2113241 1995669 1936784 1913319 1814475 1819838 1946197 1868760 1787652 1722095 1651277 1674633
2484 1674633 1683971 1672837 1712022 1665020 1680170 1652670 1663097 1695726 1631511 1471889 1466158 1474419
2472A474419J07967r4032j0577o539L7904k8410n453m8819J9364N3355j39788
2461A359391j1892J8018r8151N2834O3779q2832j0473l5237m9468N4619l3132
2450A227456n7872N3382k8137j3086R7456j23680l3361J7183q9184q1104R5395
2439A064448M9256n5350l7537J3084M4809P397J2228o1285J06193M1033j49936
2428A034340k3696j826M581l0355O9554O6975J3912l3887j35122m6276m9499K6629
2416H95330k2564L7385k2537K7205L6686L2526n5156M6603k5852m9369J1410n562
2404I06105o1713K1820J09187m312j30441O384L3587L642K0057R94q3607m2093
2392G79610r840O9756j21597m9944O3128L2234n8136k2903L1978J89601K195j08665
$$ plain form
2472 1474419 1582386 1488354 1477777 1471238 1509142 1480732 1475279 1426460 1445824 1499179 1359391
2461 1359391 1347499 1365517 1267366 1320200 1383979 1301147 1290674 1255437 1205969 1260588 1227456
2450 1227456 1169584 1222966 1194829 1181743 1279199 1155519 1122158 1139341 1050157 969053 1064448
2439 1064448 1113704 1058354 1020817 1033901 1078710 1086107 1098335 1037050 1143243 1184276 1034340
2428 1034340 1010644 1008818 1013399 983044 1052598 1119573 1133485 1099598 964476 918200 868701 895330
2416 895330 872766 910151 887614 914819 951505 984031 928875 975478 949626 900257 911667 906105
2404 906105 844392 866212 975399 971087 840646 847030 880617 884259 904316 905310 821703 779610
2392 779610 769770 839526 717929 667985 731113 763347 705211 682308 714286 903887 906082 797417
2380G97417l2610n1340j74755N2717N2664q2633j7897m0489J7604N0495k8125
2369E43048N0004P0680m043n727l0483k0020M6932N6342J7125J829k15681Q772
2357E18778J1546R74R8670j47890j0844O8408p1600O3918j7082K2713m2624L5012
2345E29979L4399j9129j1086O3045m9213j8058n80n0395Q8260K8437l7441K3394
2333E81612o5025q8511J8790P4411l7521m644N0717M7734k862o4455n9799j7837
2321D32610K6903K1994k5128k7191P7407K5705k6334L3564j13714j30508Q6269
2310C81577K4055P9536n7781N4205J9262n9020N4852k5266M5596m4512q3509L2910
2298D21905K8166P115n7484o5935O6293P5899J11125o1864K1042K6680J7037r9415
$$ plain form
2380 797417 764807 713467 538712 591429 644093 561460 543563 503074 520678 571173 543048
2369 543048 593052 663732 659689 653962 623479 603459 650391 706733 723858 725687 510006 518778
2357 518778 530324 531298 629968 482078 471234 539642 468042 531960 514878 537591 494967 529979
2345 529979 564378 545249 534163 597208 547995 529937 529357 478962 567222 595659 558218 581612
2333 581612 516587 428076 446866 521277 483756 479112 529829 577563 574701 510246 450447 432610
2321 432610 459513 481507 456379 429188 506595 532300 505966 539530 425816 295308 381577
2310 381577 405632 485168 427387 481592 500854 441834 496686 471420 517016 472504 388995 421905
2298 421905 450071 457186 399702 333767 400060 475959 587084 525220 546262 572942 589979 490564
2286D90564j54285J4216l1910N9186R6077O0825r212j82521o3281J65970j9346
2275D26283n0884L5631K8393l8407J40022M7065j13418J7279k3597Q276j181k2198
2263D53264R1423J8591k9958q1229j29656P489J33616O4929m9705m168l6515O7418
2251E05499P6786n1431j6297J1612m7730m5943L6765j4812r1901M553M6038K2078
2239D35217r250Q0048j148P9443j8850p1168O0375R3507o7159P5311l8213m7384
2227E70729P7198p1310m548r1137K1923J18329j8039j16674J2376J06055j5286
2216E89616J5304J00175J017R1382K1051m696M063M171j2221K5674O424P5748
2204I17708O522k0935n0442n071J37391O8442K3509J20280k2087J1502N3524m5877
$$ plain form
2286 490564 336279 350495 318585 377771 473848 534673 525461 342940 279659 445629 426283
2275 426283 375399 411030 439423 401016 541038 588103 474685 491964 468367 476643 475462 453264
2263 453264 544687 563278 533320 452091 322435 329924 463540 528469 478764 474596 438081 505499
2251 505499 582285 530854 514557 526169 478439 432496 469261 454449 362548 367101 413139 435217
2239 435217 425967 506015 504867 584310 565460 494292 554667 648174 581015 656326 618113 570729
2227 570729 647927 576617 572069 480932 502855 621184 603145 486471 498847 604902 589616
2216 589616 604920 705095 706112 797494 818545 813849 817912 822083 809862 835536 841960 917708
2204 917708 924230 903295 852853 847782 985173 1053615 1077124 1197404 1175317 1186819 1240343 1194466
2192A194466o1028j04985Q6233K6902o5099n226J057N030J06645k2138Q24k2417
2180A140264P199N062L5290O3113R8228j7766M4918M6238m2776O538Q898L5023
2168A430229L0122J14503Q2561l451K9393L7157J48191n9737J61158M3571J20521
2157B134218N2035L2935J66202P1771l4053L8852R0608J29915J29800J79640J74084
2146C166007J60879L51143K89219L67989L51216Q6287J35900L15617L84189M78201
2136F086647O61285P86767R88283J414254J968454K590291L544707M984038O441234
2127B9465960N468687l618298o586004n118120m348122l073377k167940j533516
2119H489270j272309q36491p31001m84159l91640j50023p7557j97097m12835l83160
$$ plain form
2192 1194466 1133438 1028453 1114686 1141588 1076489 1071263 1072320 1077350 1183995 1161857 1162681 1140264
2180 1140264 1147463 1152525 1187815 1250928 1349156 1331390 1376308 1422546 1379770 1386308 1395206 1430229
2168 1430229 1460351 1574854 1657415 1653964 1683357 1720514 1868705 1808968 1970126 2013697 2134218
2157 2134218 2186253 2219188 2385390 2457161 2423108 2461960 2552568 2682483 2812283 2991923 3166007
2146 3166007 3326886 3678029 3967248 4335237 4686453 4772740 4908640 5224257 5608446 6086647
2136 6086647 6747932 7534699 8522982 9937236 11905690 14495981 18040688 23024726 29465960
2127 29465960 34934647 31316349 24730345 19612225 15264103 12190726 10022786 8489270
2119 8489270 7216961 6380470 5649469 5165310 4773670 4623647 4546090 4348993 3936158 3552998
2109C552998m08413k13279j43599j37110k29959j63460j16368n6189j43318o2173
2099A879130j48020j96070j5753O8432o2500K5094o9043n2692j45724J3786o7699
2088A228941l3025j19228N5447k9525q4287P6392J3602j39376m8288n3131k1912
2077H45610J0544Q6573j46471q938L1145r2285R175k6900m4533J03320k782n3610
2065G10848m5302j8671J2414j3254Q556o75j69956j41473L8310O4807J4253K600
2053D62457R2433j2508q1281k6801L9707k4751N8296j2475l8405r387k9325K2096
2041D40056K5064n9535m899K0956o2591J799m5145P7621o296N672L6472q8237
2029C40937k7522L5265J9772k938n1925n9403m234j8211K9879Q365J9658N0717
$$ plain form
2109 3552998 3144585 2931306 2787707 2650597 2420638 2257178 2140810 2084621 1941303 1879130
2099 1879130 1731110 1535040 1519287 1587719 1525219 1550313 1481270 1428578 1282854 1296640 1228941
2088 1228941 1195916 1076688 1132135 1102610 1018323 1094715 1108317 968941 920653 867522 845610
2077 845610 856154 942727 796256 787318 818463 726178 735353 708453 663920 767240 764458 710848
2065 710848 665546 646875 659289 646035 654591 653916 483960 342487 380797 445604 459857 462457
2053 462457 554890 542382 461101 434300 474007 449256 507552 495077 456672 447285 417960 440056
2041 440056 465120 405585 400686 421642 359051 360850 315705 393326 387030 392702 429174 340937
2029 340937 313415 348680 368452 365514 313589 254186 249952 231741 261620 269985 289643 340360
2017C40360L8069Q0840j25641l5841k0997j31387P7127R869J8160O3191j2267
2006C01483N242N4626m1842J9035L480j08344K0007R6511l4365o2107k5966M202
1994B31962M6690P626k0237k7933p4203O9538J18260l6424r3203L3679q2208j9162
1982A54385L9714q6753J28113J039m8444L4692j8793K2870M2266P2893n6422j38372
1970A47188q3667J12973K9314q5643k0019R1639l1280o177J11046l3280l6790
1959A95304L4982P6148q3137p279R3004j18717L1937P4063k2171p4393q7959J18
1947A11900K241J4943Q7055k546Q2770j4615l4728n880j28317O1215P45K8006
1935B02789o520j1292m2869m7740J46259K9815o4935N649Q170P904J8512K4982
$$ plain form
2017 340360 378429 459269 333628 297787 276790 145403 222530 232399 250559 313750 301483
2006 301483 306725 361351 319509 338544 342024 233680 253687 350198 315833 253726 227760 231962
1994 231962 278652 286278 266041 238108 163905 233443 351703 315279 222076 255755 173547 154385
1982 154385 194099 107346 235459 236498 188054 222746 203953 226823 269089 341982 285560 147188
1970 147188 63521 176494 205808 120165 100146 191785 160505 154328 265374 232094 195304
1959 195304 230286 306434 223297 216018 309022 190305 222242 296305 274134 199741 111782 111900
1947 111900 114141 129084 216139 213593 296363 281748 247020 241140 112823 174038 174783 202789
1935 202789 196269 184977 142108 94368 240627 270442 205507 211156 219326 227230 245742 270724
1923B70724j6841j25492j8430n4209Q7247O5675K604l2064j978R9993Q6772m4437
1911C19564n9895j10102k7570l0891K2036N2750J14360j73291p4830J19596R4596
1900B46323q4728l939k6528L7534L661m4892j9427p229m4920r8443O6711o888
1888A7235K7903N7908l2588N442J05443l2318p0337Q3633O4216j60267M2380n4562
1876E4088J08021K7614l8178N997J8098m9237J8702p7011R1954j8447Q9177j18119
1864A12659K1392Q5473n4539N7049M5120j84k5134p549Q1030L0857j64406n3444
1852A28324j8645M0793r047r1274k4884J35898L8045o4649l0636P118k926r866
1840I8251o9153Q3617j6199j25507Q9803N405k2252M027O5262m4493Q6007K35
$$ plain form
1923 270724 253883 128391 109961 55752 142999 208674 211278 179214 177236 277229 364001 319564
1911 319564 259669 149567 121997 91106 113142 165892 280252 106961 32131 151727 246323
1900 246323 161595 157656 131128 168662 172323 127431 108004 100775 55855 -42588 24123 17235
1888 17235 45138 103046 70458 75900 181343 149025 78688 162321 226537 66270 108650 54088
1876 54088 162109 189723 151545 157542 175640 126403 145105 68094 160048 141601 230778 112659
1864 112659 134051 219524 164985 222034 267154 266970 241836 234287 315317 346174 181768 128324
1852 128324 109679 150472 141425 50151 25267 161165 199210 134561 103925 111043 108117 98251
1840 98251 29098 112715 96516 -28991 60812 66217 43965 47992 113254 68761 154768 155003
1828A55003M5140k3070p6218L8489l8392K8709o9093P9368l7037j2025n8388K4704
1816E7190K2746J1930M9889j26852M8817M4154J9932o0525K1639O7988k4725l8490
1804I3693J4406K503m3406J4178j3358n8748L5998n0180m0390O4552J16594l4608
1792A01234J3755N5354r9127o9870Q6543L9969N3216k7970j07255P4671J3111
1781A33631j04873K0736L4371l9789n4795j4897K0276k504K1526M4847j7069m8349
1769f889L0920m4767J3911m1520N4492Q9638k3991r2262M0770m0769M4094m3796
1757b0169M7640K6089J1086r3394j029J12054J51057o1076r0840n2605k7578N9085
1745F0320r981N653j7886q6945M6339n4566N6119P0933r9447k4267R3887J5461
$$ plain form
1828 155003 200143 177073 100855 139344 100952 129661 60568 139936 102899 90874 32486 57190
1816 57190 79936 91866 141755 14903 63720 107874 127806 67281 88920 156908 132183 93693
1804 93693 108099 110602 67196 81374 68016 9268 45266 -4914 -45304 19248 135842 101234
1792 101234 114989 170343 71216 1346 87889 127858 181074 153104 45849 120520 133631
1781 133631 28758 49494 83865 44076 -10719 -25616 -5340 -7844 13682 58529 41460 -6889
1769 -6889 24031 -20736 -6825 -48345 6147 95785 71794 -20468 20302 -20467 23627 -20169
1757 -20169 27471 53560 64646 -28748 -29777 82277 233334 172258 81418 28813 1235 60320
1745 60320 50339 55992 38106 -48839 -2500 -57066 -947 69986 -29461 -53728 40159 55620
1733E5620M5765J9892n1268m9921J9267l3419j6101N9812O2836o1274m1469J45343
1721A55083k3385J6003k4902r0059L9353l2871L1427R8290o4451k7951Q0403o4220
1709I2720J2126M6322j45437r278N5134P5514j3508L8622o7714O7044L0011j29507
1697E2049O9874J9597n8238J03654m9019j09742k1349O3003p4404m444K9636j05027
1685h4410l4084O3524O8566M6286K2706l4051j00649Q0545m7669M9380K339j7382
1673A5101l3827L6491p895M9044P4821l6253n5254L9534l6271l6802l7494q2849
1661a11654M1338M3484r6704K4969J16628J06159o1158r7129J27487q6964l886
1650B570m0743J6941j7946K2360M8415K038L3470q7230P5512K3729p1512M0540
$$ plain form
1733 55620 101385 121277 70009 20088 39355 5936 -10165 49647 112483 51209 9740 155083
1721 155083 131698 147701 122799 32740 72093 39222 70649 168939 104488 76537 156940 92720
1709 92720 104846 151168 5731 -3547 51587 127101 113593 152215 84501 151545 181556 52049
1697 52049 121923 141520 83282 186936 137917 28175 6826 69829 -4575 -9019 20617 -84410
1685 -84410 -118494 -54970 13596 59882 82588 48537 -52112 28433 -19236 30144 32483 15101
1673 15101 -18726 17765 9870 58914 133735 97482 42228 81762 45491 8689 -28805 -111654
1661 -111654 -70316 -26832 -123536 -98567 18061 124220 63062 -34067 93420 6456 2570
1650 2570 -38173 -21232 -39178 -16818 31597 33635 67105 -20125 55387 79116 7604 48144
1638D8144M9212J2251l7135L343j7338R7428j5212r9646P5690K3964q8065n8170
1626e534k4297O2632R58k2878p7838K945M8724K2722M0650J7969o8789m7860m5084
1613i5680L0755L7279M4815o2370m0653R2517N437K7553m5247K8385m1852j8396
1601c7457m141L0444L7833J2966P0974j3435k4874n0446n595k7678m1658L5440
1589a7627J15403M0020l5520J90j7191p801j21637L8508M5390N321J1010m0004
1577A6062j4776J8148j7079M7173L0276j128K6998q8975l7880K5221j7826l0555
1565d4341J760J6544L1349M1575K1131q6113O2337r2935j3424J21448M7950j2723
1553I4558p9030k2060l7625Q4890J28086n8788J5512k2834k5030k7321r2098k4622
$$ plain form
1638 48144 97356 109607 72472 75815 58477 155905 140693 41047 116737 140701 52636 -5534
1626 -5534 -29831 32801 33759 10881 -66957 -64012 -15288 7434 48084 66053 -2736 -50596 -95680
1613 -95680 -64925 -27646 17169 -45201 -85854 6663 12100 39653 -5594 22791 -19061 -37457
1601 -37457 -41598 -11154 26679 39645 110619 97184 72310 21864 16269 -11409 -53067 -17627
1589 -17627 97776 137796 102276 102466 85275 77474 -44163 -5655 39735 45056 56066 16062
1577 16062 1286 19434 2355 49528 79804 78676 105674 16699 -21181 4040 -13786 -44341
1565 -44341 -42581 -26037 5312 46887 68018 -18095 44242 -48693 -62117 59331 107281 94558
1553 94558 15528 -6532 -44157 40733 168819 110031 125543 102709 77679 50358 -41740 -66362
1541f6362R7639Q1388j23046n3098Q6686N4891L0847N743n8243p3855J06272k9662
1529E9200k4796j8134m0190J03685L3173q8861L7943k4340J8242N263q1157m0570
1517f0542M1018P5843l4008M6235p506K4009j8883n3958j2474r535J046q5896
1505i4651r42J04723J9588m0064n6811J49342k682p6023L867P3755L2061L1344
1493A43507n4354L8025Q863r7343Q5458q7071o5270J55916N885m3979k2387r3798
1481b6548J9216l298j3581R0891L2508r3104J2121L9367j7839j8470N3462M527
1469G9252k9011K2321N7970K1877l6653P770r4288O6589k7656o2178k0388J02563
1457H8168l8541l2119L4770J3224K2370m0342l2327k5790r9473n1080j8133O4445
$$ plain form
1541 -66362 31277 112665 -10381 -63479 23207 78098 108945 114688 56445 -17410 88862 59200
1529 59200 34404 16270 -23920 79765 112938 24077 62020 37680 55922 61185 -19972 -60542
1517 -60542 -19524 56319 22311 68546 61040 85049 66166 12208 -266 -9801 -8755 -94651
1505 -94651 -95593 9130 28718 -11346 -68157 81185 78503 2480 6347 80102 112163 143507
1493 143507 89153 127178 136041 38698 124156 37085 -28185 127731 133616 89637 67250 -26548
1481 -26548 -7332 -10630 -24211 66680 99188 6084 18205 57572 39733 21263 74725 79252
1469 79252 50241 72562 130532 152409 115756 123526 29238 95827 68171 5993 -14395 88168
1457 88168 49627 17508 52278 65502 87872 47530 15203 -10587 -110060 -161140 -179273 -114828
1445a14828J50994M485k9717L0128K7509J8977O7172k3014l9509j13489P6437
1434E5145j9419Q197o6156j01450R0021L8776N2032l9654O4739p549l2654l8198
1422C830k7568k9046p885N0510M0222o281o0732j7390L0393O7601j01893j1572
1410f9811J23500K646j4037j30277Q1474J16112j18117l8328J35110M5738m6212
1399H7798k7751l9060j33387o763J85989k5881l7272m4920N1473K1090O3697j8585
1387G6428l0826j8964J09247j2706n5046k7163O9020m1949N2031m2181q2756P0559
1375F5694K589K2540M6888m4327k6315K2263r4202m8120Q5099J9855n6360P2141
1363F7745j32155k9664R7798M1605L7218p3715N978P1942p4749k0079N5088o8270
$$ plain form
1445 -114828 36166 40651 10934 41062 68571 87548 154720 131706 92197 -21292 55145
1434 55145 35726 43923 -22233 -123683 -33662 5114 57146 17492 82231 74682 42028 3830
1422 3830 -23738 -52784 -60669 -10159 30063 23782 -36950 -54340 -23947 43654 -58239 -69811
1410 -69811 53689 56335 42298 -87979 -6505 109607 -8510 -46838 88272 134010 87798
1399 87798 60047 20987 -112400 -119163 66826 40945 3673 -41247 10226 31316 95013 76428
1387 76428 45602 26638 135885 123179 68133 40970 109990 68041 120072 77891 -4865 65694
1375 65694 68283 90823 137711 93384 67069 89332 -4870 -52990 32109 51964 -4396 67745
1363 67745 -64410 -94074 3724 45329 82547 8832 14810 86752 12003 -8076 47012 -21258
1351b1258m8614k2154L892k0357K8441L2160N0814N8761o2995j01547l8505J5954
1339a25408m0519J63009J56981n9557m1216q5223R8260J1046o1043K7326l9060
1328D596k2002r5904O3862J4069k673L3053O0979j3181j5414l2019K0760J14075
1316A30201N737n2164j13243j13153J69203L063J22902j50516J396O6915q2365
1305a2024m179O4684l3308M2246J4255o9047N1921K821n0394j3804o358o200M522
1292a4865L524J31506j2454m5164J2195j29849R859Q3267p9781Q5761n6398r8231
1280a10630P4659J0320k1680L7141q089M0227L6740k2672J2714k7644J2261m1146
1268g799J290j687m2905n2331q9879J83477m1276j9655Q5051l1093K8998n1165
$$ plain form
1351 -21258 -69872 -92026 -88134 -108491 -80050 -47890 2924 61685 -1310 -102857 -141362 -125408
1339 -125408 -165927 -2918 154063 94506 53290 -31933 66327 77373 16330 43656 4596
1328 4596 -17406 -113310 -49448 -35379 -38052 -4999 55980 42799 27385 -4634 16126 130201
1316 130201 135938 83774 -29469 -142622 26581 29644 152546 2030 3426 70341 -12024
1305 -12024 -16203 48481 15173 57419 71674 2627 54548 57369 6975 -6829 -13187 -19387 -14865
1292 -14865 -11341 120165 107711 62547 74742 -55107 -45248 38019 -41762 43999 -12399 -110630
1280 -110630 -35971 -25651 -47331 -10190 -18279 21948 58688 36016 48730 21086 33347 -7799
1268 -7799 -6509 -8196 -51101 -103432 -193311 -9834 -51110 -70765 14286 -16807 12191 -38974
1256c8974L8528J05881o9154K5396J7135j22114j9430J06174n0987j8825N7740
1245C1370j8721r0260J9104n372J32811j5795L2240n7392L291Q083J1913j4400
1233C6872j2003Q195l7183L8082k7678k3100N01l6907L6162L2976p066q1445M2449
1220c0145M8621J5398j9108r5071l2461O1763L8865N7711j10369L5469K2539l6742
1208d3530J15776J3013N2659o2558k194M1927l9089p6097p6382m6825Q0394R072
1196c3834O3347n2173k1852L778J35734n2097l1737Q407l2500M8949j7284l4141
1184a5403p264j18021M213J06799K0531q2196M8423K2261P6145K6315P1407o8878
1172H4332j31496o316p2674J03578J4295O2588m46j4547J10908r3002o2525k3447
$$ plain form
1256 -38974 -446 105435 36281 61677 78812 -43302 -62732 43442 -7545 -26370 31370
1245 31370 12649 -77611 -58507 -63879 68932 53137 85377 27985 31276 39359 51272 36872
1233 36872 24869 33064 -4119 33963 6285 -16815 -16314 -53221 -17059 15917 8851 -72594 -30145
1220 -30145 18476 33874 14766 -80305 -112766 -51003 -12138 45573 -64796 -29327 -6788 -43530
1208 -43530 72246 85259 137918 75360 73166 115093 76004 -93 -76475 -123300 -42906 -33834
1196 -33834 29513 -22660 -44512 -40734 95000 42903 11166 19573 -12927 36022 18738 -15403
1184 -15403 -22667 -140688 -136475 -29676 -9145 -91341 -42918 -20657 55488 81803 153210 84332
1172 84332 -47164 -53480 -126154 -22576 -8281 54307 53861 39314 150222 57220 -5305 -28752
1160b8752M8677m4182Q4165M9514r5573m5732P2978j02533J9060J2511M963O9530
1148D4626n3085p4569L8334M6236p0628O5997l5095l2185N0898R5420m3356O6311
1136I8904j1816j1940q722m8970o6667k416p867j01663o6590J02055N6180J37289
1124F7777l4245l2533K9831m3518o2329K625O167L7279K0401k7063j7336J23682
1112G0738p7636r3367J06032N0928n7109j48872N2753L1830K5600j532J26687
1101H6052m1715J31551O4197r5237j03563L9913L7634n5332r332n8162J00085
1090I6091l1669r7235N852O5490n4295o0447J82772m5617p3208O0617J2676K3065
1078H4092M467j5193l0255o7198n0733J58477j2943K49j21448L9096N337p1703
$$ plain form
1160 -28752 19925 -24257 59908 109422 13849 -31883 41095 -61438 -42378 -29867 -24904 44626
1148 44626 -8459 -83028 -44694 1542 -69086 -3089 -38184 -70369 -19471 75949 32593 98904
1136 98904 87088 75148 66426 17456 -49211 -51627 -59494 -161157 -227747 -125692 -69512 67777
1124 67777 33532 999 30830 -12688 -75017 -72392 -66225 -28946 -8545 -35608 -52944 70738
1112 70738 -6898 -100265 5767 56695 -414 -149286 -96533 -64703 -39103 -40635 86052
1101 86052 44337 175888 240085 144848 41285 81198 118832 63500 54168 -3994 96091
1090 96091 64422 -32813 -26961 38529 -15766 -76213 106559 60942 -12266 48351 61027 84092
1078 84092 88559 73366 43111 -24087 -74820 83657 70714 70963 -50485 -11389 -6052 -77755
1066g7755m711J13093j16406k3912J41901L679k6914j9694M4117L6724P3667o2239
1054H1550p0370K6151O7654o4881q7024L4614O1933q4125K1914J2593P991m8791
1042d0791N8330j4665k9208j12256J17501P3250j06008k0062j0404J3645M1307
1031b9361J1900l4034l7835M7144O2705L7828J3159O436j02453k2816K130n0502
1019i5699J5438P4379j336q3637J04012l1969j9388J54308j3911q8810P8492j13419
1007b1540j2495j6143J57134p8375r1598L4792K3087n5016K3659J9301N5830Q260
995D6896M54j3398n921o43k6490Q714l8296O2725L0695J3141O3453l5815j3919
982I1596j78346m1511J04077P2392J6965j29010Q0583N219j070j29569k129j4885
$$ plain form
1066 -77755 -82466 30627 -85779 -109691 32210 35889 8975 -10719 33398 70122 143789 81550
1054 81550 11180 37331 104985 40104 -46920 -12306 49627 -34498 -12584 9 8000 -40791
1042 -40791 17539 2874 -26334 -138590 -21089 52161 -53847 -73909 -84313 -70668 -29361
1031 -29361 -17461 -51495 -89330 -42186 20519 58347 71506 77942 -24511 -47327 -45197 -95699
1019 -95699 -80261 -5882 -7218 -90855 13157 -18812 -38200 116108 102197 13387 91879 -21540
1007 -21540 -34035 -50178 106956 28581 -63017 -28225 -5138 -60154 -36495 -17194 38636 46896
995 46896 47350 33952 28031 27388 898 9612 -28684 34041 64736 77877 141330 105515 91596
982 91596 -86750 -128261 -24184 48208 65173 -63837 16746 21965 20895 -108674 -110803 -125688
970a25688J05995K6358n2093R4359n2298q5061j1861R49L7775J09521N1747j0239
958H9464k6759N2597l0108l9888p0076o3569m6969j6533J03570j33405J16364
947f5312N8945J34242n0346q7937k625l3154L0827m5013j35681M9197J29814m3449
935f0492j1889N7075M0480J0876m531M1784K3325o7999R128q7325M3784Q7426
923H1642K1369j763m1350Q8213O810q8104j04955p6720O2985L6754n0230n9032
911a24381k4985J54231J27055j18921o0905R9880k4853m8183m880p2874o3395
900a62211R7553R5166l8416l555L0825K6431N3834p704l6012k5771j01373K4107
888d7126J2210N1557j5421J2068J1361q7324N9998j6329r4814M9692k0257Q2346
$$ plain form
970 -125688 -19693 6665 -45428 48931 -3367 -88428 -100289 -99340 -61565 47956 99703 89464
958 89464 62705 115302 85194 45306 -24770 -88339 -135308 -151841 -48271 -181676 -65312
947 -65312 -6367 127875 77529 -10408 -13033 -46187 -15360 -60373 -196054 -146857 -17043 -60492
935 -60492 -72381 -15306 25174 36050 31519 73303 96628 28629 37757 -49568 -5784 81642
923 81642 103011 101248 59898 148111 154921 66817 -38138 -114858 -51873 -15119 -65349 -124381
911 -124381 -149366 4865 131920 12999 -47906 51974 27121 -21062 -25942 -98816 -162211
900 -162211 -64658 30508 -7908 -11463 19362 45793 99627 91923 55911 30140 -71233 -47126
888 -47126 -34916 16641 1220 13288 24649 -62675 -2677 -19006 -113820 -64128 -84385 -2039
876b039J05503n3546J4224J2070l9190k0590p0006N789l3664j9802J13394N9758
864G1901o7094q2399j0177O6463j48115M0554R0089P0569P7918L6659n6409o9240
852B0719m5047j2762N3395p5194j01216K1205J25164Q7875q8215p391j5253K8552
840h168L4555j9740O1903o8054J9367M9611P9471j35049j1458l6388m5883N7952
828b1881J00631p564j32393j0239M8948l7548Q6452o90o4264J14668l3483o9517
816b6880P5452K334m9719r6016J0307M423L0303J6918o4377j0430j5388M5426
804g7647P661p046M6610O4799l1995N3681l6141j70320O621J9799O1675K5682
792c6621K3748j10060Q338R8114l8145J0051O779K2232O9373j5252M211O5917
$$ plain form
876 -2039 103464 49918 64142 76212 37022 16432 -53574 -47785 -81449 -101251 12143 71901
864 71901 4807 -77592 -87769 -21306 -169421 -128867 -38778 31791 109709 146368 89959 20719
852 20719 -24328 -37090 16305 -58889 -160105 -138900 -13736 74139 -14076 -21467 -36720 -8168
840 -8168 26387 6647 68550 496 19863 69474 148945 13896 2438 -33950 -79833 -21881
828 -21881 78750 71186 -61207 -71446 -22498 -60046 26406 25716 -38548 76120 42637 -26880
816 -26880 48572 50906 1187 -94829 -84522 -80099 -49796 -32878 -97255 -107685 -123073 -77647
804 -77647 -69986 -77032 -30422 34377 2382 56063 19922 -150398 -143777 -123978 -62303 -36621
792 -36621 -12873 -122933 -114595 -16481 -54626 -44575 -37796 -15564 53809 38557 42768 108685
780A08685o3331K5204j10297J8951P1432L1557j48730q414j44514l7094K2807
769b33744N2720J57055P3232p3905m5154O2744l6650R75m3087J4985O9394N496
757D061l6191N2352Q4672o7911l3556o2949l8056L4358p958m5477p2057Q2896
745a05816n3151M4317J22243n8491N4480J2961l6068L1846o8428J09630o0054
734f531M9428k2360q2381k5846N145O6273j6651j851P8441O500q5139Q2727q9977
721d2222q4382Q2777M3539J28531R725n2756l7001j11610m5488M4040M8660M1708
709B5521o899n49n0706l7074N9817k2461k7680N3940N8750o9708J8733J11522
697A13206j359J4359n6824l5744l0635j8405p100J9902M0372Q9032q1061l1916
$$ plain form
780 108685 45354 70558 -39739 -20788 50644 82201 -66529 -74943 -219457 -256551 -233744
769 -233744 -181024 -23969 49263 -24642 -69796 -7052 -43702 -42727 -85814 -70829 -1435 4061
757 4061 -32130 20222 104894 36983 3427 -59522 -97578 -63220 -71178 -116655 -188712 -105816
745 -105816 -158967 -114650 7593 -50898 3582 16543 -19525 12321 -56107 53523 -6531
734 -6531 42897 20537 -61844 -87690 -82545 -16272 -32923 -34774 43667 50167 -34972 47755 -42222
721 -42222 -126604 -43827 -288 128243 137968 85212 48211 -63399 -108887 -64847 -16187 25521
709 25521 18622 18073 -32633 -69707 -9890 -32351 -60031 -6091 52659 -17049 1684 113206
697 113206 111847 126206 69382 33638 3003 -15402 -22502 -2600 37772 126804 45743 13827
685A3827j43189p4804P8454O7552N9592N2288k1293J9184k6701j29593R4673L9602
673B9592o1574M571k9278M9198j7282r2336K1422j06012R652J61493M8605n0150
661c2099l5174Q2940o2097l8437l7287L9202J2590l3139K3543m8884M2218K1832
649f4792L1182K5775j2412k6810O9558q3399p968o6369J03158M0756j07272q895
637a07488N8108K983k8660N7165n7704m9448K1883J0359J32890l1407P3786j15722
625c3255K7389N210K2704L7272L3355k5988p4313M795R353m0027j0950N676J32399
612I3620K2769J5002q0444n4520l653J1430Q036l3162O2703l8584N7318n4202
600F313J9146n2499q986k1937o0813N3101K0332r4366J58388o1067L4331J22248
$$ plain form
685 13827 -129362 -204166 -125712 -58160 1432 53720 32427 51611 24910 -104683 -10010 29592
673 29592 -31982 -27411 -56689 -7491 -24773 -117109 -95687 -201699 -192047 -30554 18051 -32099
661 -32099 -67273 15667 -46430 -84867 -122154 -82952 -70362 -103501 -79958 -128842 -86624 -64792
649 -64792 -33610 -7835 -20247 -47057 22501 -60898 -68866 -135235 -32077 8679 -98593 -107488
637 -107488 -49380 -46397 -75057 -17892 -75596 -125044 -103161 -92802 40088 8681 82467 -33255
625 -33255 -5866 -656 22048 59320 92675 66687 -7626 -2831 6522 -33505 -44455 -38779 93620
612 93620 116389 131391 50947 -3573 -7226 4204 12240 -20922 41781 3197 60515 6313
600 6313 25459 -27040 -36026 -57963 -118776 -65675 -45343 -139709 18679 -42388 -8057 114191
588A14191j487o9841k4338j57643L0569Q4669O4194L8798r1676j12874o8287K0162
576a73563J30803L2085j3205j5830N6412q942j2145m258l8970j0070M3935k3729
564c7477k6888k2077M6981M1656K0693L1684o4681k746P3306J7491j42815K8901
552c5972N8804m7521o2239R7592m8506P835j5841J8907L236R8314j9008j39462
540h3861R625Q6074m4732k5372M1076n0630n9568Q115M5804l9714K8537K123K822
527g9701M7903j9453j03804p4160J13149R210N3384k7969K286o058K6959N1175
515g079p3892o1329k9241Q4642R0637n0930j6921K9746o8119O2937O9398l047
503B6802N216P017k9897O694j13854J0736L4322Q591L3622L3718n2921L4484k0982
$$ plain form
588 114191 112704 42863 18525 -139118 -108549 -23880 40314 79112 -12564 -125438 -193725 -173563
576 -173563 -42760 -10675 -23880 -39710 16702 7760 -4385 -8643 -47613 -57683 -13748 -37477
564 -37477 -64365 -86442 -39461 2195 22888 54572 -10109 -12855 60451 77942 -64873 -35972
552 -35972 22832 -24689 -86928 10664 -37842 -30007 -45848 -26941 -23705 74609 55601 -83861
540 -83861 -74236 11838 -32894 -58266 -17190 -67820 -127388 -119273 -73469 -113183 -84646 -82523 -79701
527 -79701 -31798 -51251 -155055 -229215 -116066 -106856 -53472 -81441 -79155 -85213 -58254 -7079
515 -7079 -80971 -142300 -171541 -86899 3738 -47192 -64113 -34367 -102486 -39549 29849 26802
503 26802 32018 39035 9138 15832 -98022 -87286 -52964 -44373 -10751 22967 -29954 4530 -16452
490a6452m2052M4909j802k4258J7491j2576R6376q714p6774L9194j9103n8710
478f2471k0167l6185N111O8514R799j3684Q4063j4573j1155p3851k2857P541l2781
465a12696j3981J37350Q8940q1529l093l4519M003l8112N1981l8174N3917N3592
453F7679r6838q0577O6241p3816L1999L6799k4096L8344N282J7151O069P1090
441F5327M2400l5029j42892j12189J42131L0160n3132k6894M206P6271j9186L542
429b5285O6381Q7722j38990o9834M4511p771j0625P1387o7385Q1517J10573j21418
417B0783p217j24059N7255J23711K957M1730j36015n8508O2907o2861K3519k0647
405g6445L6537L4941j03741p0906N6077M5192P0515j20780N6945J8219k4253K8120
$$ plain form
490 -16452 -58504 -13595 -15397 -39655 -22164 -34740 61636 52922 -23852 15342 -3761 -62471
478 -62471 -82638 -118823 -113712 -45198 -35399 -49083 34980 20407 9252 -64599 -87456 -79915 -112696
465 -112696 -126677 10673 99613 18084 14991 -19528 -15525 -53637 -1656 -39830 14087 67679
453 67679 -29159 -109736 -43495 -117311 -85312 -48513 -72609 -34265 -28983 -11832 -5763 65327
441 65327 107727 72698 -70194 -182383 -40252 -10092 -63224 -90118 -85912 -9641 -28827 -25285
429 -25285 41096 128818 -10172 -80006 -35495 -43266 -53891 17496 -49889 31628 142201 20783
417 20783 13566 -110493 -53238 70473 73430 115160 -20855 -79363 -16456 -79317 -55798 -76445
405 -76445 -39908 -4967 -108708 -179614 -123537 -78345 -7830 -128610 -71665 -53446 -77699 -49579
393d9579N6501n1883j07179J50105l2947q1691P3736j0047j14831O0264P3499
382c4052l3079n7857M3608N3818k0509m0665k3746Q31j12433M7259N9444l5543
370a52924k2815O8380N3130l9913M3139m4605M3328n0797R8422j1493J7577L6484
358C7913o9566J05693k6440n1299k8246K1827P1081j10362r6604m4396J09684
347h0715J22617m4424l2597n1032p5987J22323n2709K6356n0168k9261N7548n3627
335a41676N2698m392J3890k4684J18776M514n2670K5028J6282j41273L3700P1057
323b8750j33632J3555M2675J07649J9173J6011j32469j4589N171P1993m4235j4495
311i1943o0850j9294J20426j23750L5366L5371N0993j7955l2638m4817M8968j6541
$$ plain form
393 -49579 6922 -44961 -152140 -2035 -34982 -116673 -42937 -52984 -167815 -107551 -34052
382 -34052 -67131 -124988 -81380 -27562 -48071 -88736 -112482 -111651 -224084 -176825 -117381 -152924
370 -152924 -175739 -107359 -54229 -94142 -51003 -95608 -52280 -103077 -4655 -16148 1429 37913
358 37913 -31653 74040 47600 -3699 -31945 -10118 60963 -49399 -146003 -190399 -80715
347 -80715 41902 -2522 -35119 -86151 -162138 -39815 -92524 -66168 -116336 -145597 -88049 -141676
335 -141676 -88978 -93370 -79480 -104164 14612 19126 -33544 -8516 7766 -133507 -99807 -28750
323 -28750 -162382 -148827 -106152 1497 20670 36681 -95788 -110377 -105206 -33213 -77448 -91943
311 -91943 -152793 -172087 -51661 -175411 -140045 -104674 -53681 -71636 -104274 -149091 -100123 -116664
299a16664k2019J92791M070m4879M3427j15091K965K1054j6712o8407M2768N9506
287a7191l7709n9394M2825n9298m3993N2984O9170M1167r5268j8880N3693K1140
275e0754j7648o886K3164n2219J09845M045j05955j3318j8022J8723R9001j3116
263b3140K3494j6917q7598K8849J13302q7213l7877K811Q5026j4767l1968j9636
251f5634o9552l0026R3597Q6191n8569o2968N3310P0316q6229J39544q2957K2836
239I859j14993K4037n658P9250L1691j90909l7481N6595k1533O6882J00542l4438
227c6156r2713L0984O448N732O99m336l5258m2267M1015J3861o1632j8911J13191
214g9343m5940N607P1518L5025o8090R214n4378Q959N7899L3642L4421K3254j5835
$$ plain form
299 -116664 -138683 54108 58178 13299 56726 -58365 -55400 -34346 -51058 -119465 -76697 -17191
287 -17191 -54900 -114294 -71469 -130767 -174760 -121776 -52606 -11439 -106707 -125587 -71894 -50754
275 -50754 -68402 -75288 -52124 -104343 5502 9547 -96408 -109726 -127748 -109025 -10024 -23140
263 -23140 354 -16563 -104161 -75312 37990 -49223 -87100 -84289 737 -14030 -45998 -65634
251 -65634 -135186 -165212 -71615 14576 -43993 -106961 -53651 16665 -69564 69980 -12977 9859
239 9859 -105134 -81097 -86755 -7505 24186 -166723 -204204 -147609 -169142 -102260 -1718 -36156
227 -36156 -128869 -97885 -91437 -85705 -85006 -89342 -124600 -166867 -125852 -111991 -173623 -192534 -79343
214 -79343 -125283 -119676 -48158 -13133 -81223 -72009 -126387 -117428 -59529 -25887 8534 31788 15953
201A5953j4380j03544o2055N2453m4136N5773J20611O687j26371k5149n1242j3826
189a89226K0444K9514L4477R5220j14263L1554j5415K3658O1207p8422q4157J09956
177g5453Q3826r438j9408O0587N1528o7568j1533p7237l9890m202J79184k2575
165D7821j67900k0423L4126l007k1537L89P4419J7089m2120p4721J09157Q783
153c7924k3789l168P4979k0373j4993O1507M1449j47662n2283M5767J4264J01359
141C9133m1005m5192p53k185l2339q5350M11R288N6595N2435M7127l2078k2031
128e5944R693L8765o6229M000o147j4628R1503Q374l6991l3896P4636L6897q5854
$$ plain form
201 15953 1573 -101971 -164026 -111573 -155709 -99936 20675 27362 -99009 -124158 -175400 -189226
189 -189226 -168782 -139268 -104791 -9571 -123834 -92280 -107695 -84037 -22830 -101252 -185409 -75453
177 -75453 8373 -1065 -20473 40114 91642 24074 12541 -64696 -104586 -108788 70396 47821
165 47821 -120079 -140502 -106376 -109383 -130920 -130531 -56112 -39023 -81143 -155864 -46707 -37924
153 -37924 -61713 -64881 10098 -10275 -25268 36239 77688 -69974 -122257 -76490 -62226 39133
141 39133 -1872 -47064 -47817 -50002 -82341 -167691 -167280 -157992 -101397 -48962 -1835 -33913 -55944
128 -55944 -46251 -7486 -73715 -69715 -75862 -90490 1013 9387 -27604 -61500 13136 50033 -35821
$$ [...]
##END NTUPLES=NMR SPECTRUM
##END=
