##TITLE=1H_EC-3296(XI-X)
 DMSO
 8 sc, 
 6.7.2023
##JCAMPDX= 6.0         $$ Bruker NMR JCAMP-DX V2.0
##DATA TYPE= NMR SPECTRUM
##DATA CLASS= NTUPLES
##ORIGIN= UXNMR, Bruker Analytische Messtechnik GmbH
##OWNER= root
$$ XWIN-NMR		Version 3.5
$$ Thu Jul  6 14:54:18 2023 Russian Standard Time (UT+4h)  she@DPX200
##.OBSERVE FREQUENCY= 200.13135
##.OBSERVE NUCLEUS= ^1H
##.ACQUISITION MODE= SIMULTANEOUS
##.ACQUISITION SCHEME= undefined
##.AVERAGES= 8
##.DIGITISER RES= 18
##SPECTROMETER/DATA SYSTEM= spect
##.PULSE SEQUENCE= zg30
##.SOLVENT NAME= DMSO
##.SHIFT REFERENCE= (INTERNAL, DMSO, 0, 15.7568)
##AUDIT TRAIL= $$ (NUMBER, WHEN, WHO, WHERE, WHAT)
$$ ##TITLE= Audit trail, XWIN-NMR		Version 3.5
$$ ##JCAMPDX= 5.01
$$ ##ORIGIN= Bruker BioSpin GmbH
$$ ##OWNER= she
$$ F:/spectra/data/she/nmr/H-F/1/pdata/1/auditp.txt
$$ ##AUDIT TRAIL=  $$ (NUMBER, WHEN, WHO, WHERE, WHAT)
(   1,<2023-07-06 14:53:09.12 +0400>,<she>,<DPX200>,
      <created by zg, POWCHK disabled, PULCHK disabled
       configuration hash MD5:
       00 E9 B6 7A A2 85 ED C7 34 08 36 98 17 FE 4E 26
       data hash MD5: 16K
       B8 C6 A4 4A 99 53 86 DE 4F EE 74 BC 31 DA B8 93>)
(   2,<2023-07-06 14:53:11.42 +0400>,<she>,<DPX200>,
      <Start of raw data processing
       efp BC_mod = 2 LB = 0.24 FT_mod = 6 PKNL = 1 PHC0 = -20786.34 PHC1 = 10.05272 SI = 16K 
       data hash MD5: 16K
       D0 44 1C 28 46 00 99 D2 46 3F 4F C4 39 E3 74 D7>)
(   3,<2023-07-06 14:53:28.62 +0400>,<she>,<DPX200>,
      <pk PHC0 = -3.617579 PHC1 = 1.8 
       data hash MD5: 16K
       A1 50 CE 8D A0 BB 8C 05 D2 9C CF 84 8C CD 6E D3>)
(   4,<2023-07-06 14:53:32.34 +0400>,<she>,<DPX200>,
      <abs ABSG = 5 
       data hash MD5: 16K
       20 9C DD 22 99 7A CB F4 AF 43 70 EF 71 37 6F 2C>)
$$ ##END=
$$ 
$$ hash MD5
$$ 38 BE DD A4 CF 6D A6 5D FF DB 9F CD FA D0 5E 07
##$RELAX= 
##$RELAX= 
##$RELAX= 
##$RELAX= 
##$RELAX= 
##$RELAX= 
$$ Bruker specific parameters
$$ --------------------------
##$DU= <F:/spectra>
##$EXPNO= 1
##$NAME= <H-F>
##$PROCNO= 1
##$TYPE= <nmr>
##$USER= <she>
##$AMP= (0..31)
100 100 100 100 100 100 100 100 100 100 100 100 100 100 100 100 100 100 
100 100 100 100 100 100 100 100 100 100 100 100 100 100 
##$AQSEQ= 0
##$AQ_mod= 1
##$AUNM= <au_zg>
##$AUTOPOS= <>
##$BF1= 200.13
##$BF2= 200.13
##$BF3= 200.13
##$BF4= 200.13
##$BF5= 200.13
##$BF6= 200.13
##$BF7= 200.13
##$BF8= 200.13
##$BYTORDA= 1
##$CFDGTYP= 0
##$CFRGTYP= 5
##$CHEMSTR= <none>
##$CNST= (0..31)
1 1 145 1 1 1 1 1 1 1 1 1 1 1 1 1 1 1 1 1 1 1 1 1 1 1 1 1 1 1 1 1 
##$CPDPRG= <>
##$CPDPRG1= <>
##$CPDPRG2= <>
##$CPDPRG3= <>
##$CPDPRG4= <mlev>
##$CPDPRG5= <mlev>
##$CPDPRG6= <mlev>
##$CPDPRG7= <mlev>
##$CPDPRG8= <mlev>
##$CPDPRGB= <>
##$CPDPRGT= <>
##$D= (0..31)
0 1.2 0 0 0 0 0 0 0 0.06 0 0.03 0 0 0 0 0.0002 0 0 0 0 0 0 0 0 0 0 0 0 
0 0 0 
##$DATE= 1688640788
##$DBL= (0..7)
120 120 120 120 120 120 120 120 
##$DBP= (0..7)
150 150 150 150 150 150 150 150 
##$DBP07= 0
##$DBPNAM0= <>
##$DBPNAM1= <>
##$DBPNAM2= <>
##$DBPNAM3= <>
##$DBPNAM4= <>
$$ [...]
##$SUBNAM3= <"">
##$SUBNAM4= <"">
##$SUBNAM5= <"">
##$SUBNAM6= <"">
##$SUBNAM7= <"">
##$SUBNAM8= <"">
##$SUBNAM9= <"">
##$SW= 18.05172834244
##$SWIBOX= (0..15)
0 0 2 0 0 0 0 0 0 0 0 0 0 0 0 0 
##$SW_h= 3612.71676300578
##$TD= 16384
##$TD0= 1
##$TE= 0
##$TE2= 300
##$TE3= 300
##$TEG= 300
##$TL= (0..7)
0 120 120 120 120 120 120 120 
##$TP= (0..7)
150 150 150 150 150 150 150 150 
##$TP07= 0
##$TPNAME0= <>
##$TPNAME1= <>
##$TPNAME2= <>
##$TPNAME3= <>
##$TPNAME4= <>
##$TPNAME5= <>
##$TPNAME6= <>
##$TPNAME7= <>
##$TPOAL= (0..7)
0.5 0.5 0.5 0.5 0.5 0.5 0.5 0.5 
##$TPOFFS= (0..7)
0 0 0 0 0 0 0 0 
##$TUNHIN= 0
##$TUNHOUT= 0
##$TUNXOUT= 0
##$USERA1= <user>
##$USERA2= <user>
##$USERA3= <user>
##$USERA4= <user>
##$USERA5= <user>
##$V9= 5
##$VALIST= <valist>
##$VCLIST= <CCCCCCCCCCCCCCC>
##$VD= 0
##$VDLIST= <DDDDDDDDDDDDDDD>
##$VPLIST= <PPPPPPPPPPPPPPP>
##$VTLIST= <TTTTTTTTTTTTTTT>
##$WBST= 1024
##$WBSW= 4
##$XGAIN= (0..3)
0 0 0 0 
##$XL= 0
##$YL= 0
##$YMAX_a= 144429
##$YMIN_a= -130079
##$ZGOPTNS= <>
##$ZL1= 120
##$ZL2= 120
##$ZL3= 120
##$ZL4= 120
##$ABSF1= 15.75681
##$ABSF2= -2.295039
##$ABSG= 5
##$ABSL= 3
##$ALPHA= 0
##$AQORDER= 0
##$ASSFAC= 0
##$ASSFACI= 0
##$ASSFACX= 0
##$ASSWID= 0
##$AUNMP= <proc_1d>
##$AZFE= 0.1
##$AZFW= 0.1
##$BCFW= 0
##$BC_mod= 2
##$BYTORDP= 0
##$COROFFS= 0
##$CY= -3
##$DATMOD= 1
##$DC= 0
##$DFILT= <>
##$DTYPP= 0
##$F1P= 0
##$F2P= 0
##$FCOR= 1
##$FTSIZE= 16384
##$FT_mod= 6
##$GAMMA= 0
##$GB= 0
##$INTBC= 1
##$INTSCL= 3.70164e-10
##$ISEN= 128
##$LB= 0.24
##$LEV0= 0
##$LPBIN= 0
##$MAXI= 10000
##$MC2= 0
##$MEAN= 0
##$ME_mod= 0
##$MI= 1.114404
##$NCOEF= 0
##$NC_proc= -7
##$NLEV= 6
##$NOISF1= 3.799351
##$NOISF2= 2.8
##$NSP= 0
##$NTH_PI= 0
##$NZP= 0
##$OFFSET= 15.75681
##$PC= 1
##$PHC0= -20789.96
##$PHC1= 11.85272
##$PH_mod= 1
##$PKNL= yes
##$PPARMOD= 0
##$PSCAL= 0
##$PSIGN= 0
##$REVERSE= no
##$SF= 200.130002948349
##$SI= 16384
##$SIGF1= 3
##$SIGF2= 2
##$SINO= 5.538805
##$SIOLD= 16384
##$SREGLST= <1H.CDCl3>
##$SSB= 0
##$STSI= 16384
##$STSR= 0
##$SW_p= 3612.71676300578
##$SYMM= 0
##$S_DEV= 0
##$TDeff= 16384
##$TDoff= 0
##$TI= <>
##$TILT= no
##$TM1= 0
##$TM2= 0
##$TOPLEV= 0
##$USERP1= <user>
##$USERP2= <user>
##$USERP3= <user>
##$USERP4= <user>
##$USERP5= <user>
##$WDW= 1
##$XDIM= 16384
##$YMAX_p= 524575151
##$YMIN_p= -273345
$$ End of Bruker specific parameters
$$ ---------------------------------
##NTUPLES= NMR SPECTRUM
##VAR_NAME=  FREQUENCY,     SPECTRUM/REAL,   SPECTRUM/IMAG
##SYMBOL=    X,             R,               I
##VAR_TYPE=  INDEPENDENT,   DEPENDENT,       DEPENDENT
##VAR_FORM=  AFFN,          ASDF,            ASDF
##VAR_DIM=   16384,         16384,           16384
##UNITS=     HZ,            ARBITRARY UNITS, ARBITRARY UNITS
##FACTOR=    0.220516191357247, 1,           1
##FIRST=     3153.41046943974, 0,            0
##LAST=      -459.306293566035, 0,           0
##MIN=       -459.306293566035, -273345,     0
##MAX=       3153.41046943974, 524575151,    0
$$ Real data points
##PAGE= N=1
##DATA TABLE= (X++(R..R)), XYDATA
$$ [...]
8727F955907P9563J34406M92486L58916k4900l39785k58108j60992k8522j84617
8717G024354l47855k94792l10964m3459j11198R9666J11166J40691J91743J83106
8707F642458K11735J70819J93259K61361L21670K74918K61119J10942j6539j0763
8697H420979R864K07226L47313M01197L61793K64341J93769r8742m14081o41533
8687I052126o64582n32493m11257q6060Q6916j4807K1487n0603J941N2128Q5912
8676G540708J95277J37212Q4642J84828K96274J96820J57327n297r5745O7704
8666H759750Q1292M4595j51746j81341l46608m31112l46841m6382L1060j75935
8656G236732j88112l70298k89992k405j2240j97019k75977k32453L8572r6306
$$ y = [6955907, 7035470, 7169876, 7662362, 8021278, 7996378, 7656593, 7398485, 7237493, 7208971, 7024354, 6676499, 6381707, 6070743, 6027284, 5916086, 6015752, 6126918, 6267609, 6459352, 6642458, 6854193, 7025012, 7218271, 7479632, 7801302, 8076220, 8337339, 8448281, 8431742, 8420979, 8430843, 8638069, 8985382, 9386579, 9748372, 10012713, 10206482, 10107740, 9693659, 9052126, 8387544, 7855051, 7443794, 7357734, 7444650, 7429843, 7451330, 7400727, 7402668, 7454796, 7540708, 7735985, 7873197, 7957839, 8142667, 8438941, 8635761, 8793088, 8787791, 8692046, 8759750, 8841042, 8885637, 8733891, 8552550, 8205942, 7774830, 7427989, 7381607, 7412667, 7236732, 7048620, 6678322, 6388330, 6385925, 6373685, 6176666, 5900689, 5668236, 5706808, 5610502]
8646E610502K2436J31546K33989M51986M11390O54906N12010K50379o145p5133
8636H197866j99765l05516m58511m39860l86590l29321k85046l36435m7673p8513
8626E330636n2008K458q4803p053J49491J62547N9355K58751K31730K00016K65476
8615F516596L15135M15371M15314L18453L90442K46435J63658k32232k33063l14533
8605H001576l84873m93258l61634j68011k94298j32872j2780k08436j89575k66902
8595E488937k95895o4753k03400j63034n9815p8310j224o3389j9479k6213J13043
8584D626468J02720m222m6612J63361K0128q0941j43386n4713j38291m9058k74080
8573D121374q8409L2102m43834O1130k4679J6199n3027k8886k6772k26763k19805
$$ y = [5610502, 5632938, 5764484, 5998473, 6450459, 6861849, 7516755, 8028765, 8279144, 8272999, 8197866, 7998101, 7692585, 7234074, 6794214, 6407624, 6078303, 5793257, 5456822, 5409149, 5330636, 5278628, 5281086, 5196283, 5189230, 5338721, 5501268, 5560623, 5819374, 6051104, 6251120, 6516596, 6831731, 7247102, 7662416, 7980869, 8371311, 8617746, 8781404, 8549172, 8316109, 8001576, 7616703, 7123445, 6761811, 6593800, 6299502, 6166630, 6153850, 5945414, 5755839, 5488937, 5193042, 5128289, 4924889, 4761855, 4702040, 4623730, 4622506, 4559117, 4539638, 4513425, 4626468, 4729188, 4724966, 4678354, 4841715, 4861843, 4780902, 4637516, 4582803, 4444512, 4395454, 4121374, 4032965, 4065067, 3621233, 3682363, 3657684, 3673883, 3620856, 3591970, 3565198, 3338435, 3118630]
8562C118630j27946j38673j84172k91385K2144j74225k41163m4448p3161r1245
8552A774356l0374j5905o8181j19724J25346j07195p083p0161j8918o9405M547
8541A397303J8276M6643k1930k9491p9503m0691M6816q9458M4876l6654q4753
8530A171434K9239R7294q1304j30156M6484k0855j27407j53560M9341k4066M8273
8519I04717O4631j19633p7434j8509Q8240m1563K1953N0644j14251n5549j24935
8508E78311n4543K3320K0677J31299p7585p4008P2945k2618n4258m947Q801O0984
8496F08378J657k555m7730k1787M0828l671p3157J7918J46067j3741j37726L3231
8484E47712o7844l9685n44J63254k2977j20359o9903K0625m8224J20564L5876
$$ y = [3118630, 2990684, 2852011, 2667839, 2376454, 2398598, 2224373, 1983210, 1938762, 1865601, 1774356, 1743982, 1728077, 1659896, 1540172, 1665518, 1558323, 1551240, 1481079, 1462161, 1392756, 1397303, 1415579, 1462222, 1440292, 1410801, 1331298, 1290607, 1337423, 1247965, 1292841, 1256187, 1171434, 1200673, 1297967, 1216663, 1086507, 1132991, 1112136, 984729, 831169, 880510, 856444, 904717, 969348, 849715, 772281, 753772, 842012, 800449, 822402, 873046, 758795, 703246, 578311, 523768, 547088, 567765, 699064, 621479, 547471, 620416, 597798, 543540, 538593, 547394, 608378, 610035, 607480, 559750, 537963, 578791, 575120, 501963, 519881, 665948, 652207, 514481, 547712, 479868, 440183, 439639, 602893, 579916, 459557, 389654, 410279, 362055, 482619, 518495]
8473E18495r5411j600p5214q3358R2525K7291P338p250o5491J25535J70J2401
8461D55431m1505n5682l7664J5088Q9159M6247j37048k3106L1270q148Q923k3934
8449C19031J05771L8388o9230l5885l8756k1752Q2852M4327r477l6297L7507o4481
8437C51998M615q9277j01268P8375K05219O071q370m9536j08126O5696Q2159j29320
8425C08236L538m5744K4500L0023l5941M6892J4378K1858p790r9959j1137J3629
8413B62483K5463Q3708m3592J3795k1021q8388K9232R7053P430k734q3634R4494
8401C74289N3228P3322q8281r8209o1871p8772J35793O3135Q3509M6026l7323
8390D64846r3946J1416P0716j64925o9460J56153J18619j5988O1498k4448l5942
$$ y = [518495, 423084, 421484, 346270, 262912, 355437, 382728, 390066, 382816, 317325, 442860, 443030, 455431, 413926, 358244, 320580, 335668, 424827, 471074, 334026, 310920, 342190, 334042, 342965, 319031, 424802, 463190, 393960, 358075, 319319, 297567, 380419, 424746, 415269, 378972, 416479, 351998, 356613, 267336, 166068, 244443, 449662, 455733, 447363, 397827, 289701, 355397, 437556, 308236, 311774, 266030, 290530, 320553, 284612, 331504, 345882, 367740, 359950, 259991, 248854, 262483, 287946, 371654, 328062, 341857, 320836, 232448, 261680, 358733, 366163, 363429, 279795, 374289, 427517, 500839, 412558, 314349, 252478, 173706, 309499, 372634, 456143, 502169, 464846, 370900, 382316, 453032, 288107, 218647, 374800, 493419, 477431, 538929, 514481, 478539]
8379D78539L2684L5526n6048N6685M792K6945R236N2427N2031o8100p4638M1873
8367E91952J6704M0991o1072P3614J30320q5318J0965K0749K2725R0074K5713
8356H77417k7380M0925M4678L7392n9262K8165M6874o4394n5005K364J2228l6401
8344H47601j59393r137O7385r4747K285m160o2973M7517j096j5586N0636J0940
8332F79272q2929j15021O5584J9907p0553j3231l1901L7840P5693m5034l8379
8321D81248n9710N1322M2523l0376l7593j41142l0932M5765O0775J4248k4773
8310C71355j08155j7637m127J16357p675M7279Q4744o1749p8019j08454o2539
8299A71380K2466l9739j01706K08969J28719q1875r6363M2630k5719m947K7034
$$ y = [478539, 511223, 546749, 490701, 547386, 552178, 579123, 588359, 640786, 692817, 624717, 550079, 591952, 608656, 649647, 588575, 662189, 792509, 707191, 718156, 738905, 761630, 851704, 877417, 850037, 890962, 935640, 973032, 913770, 941935, 988809, 924415, 869410, 871774, 884002, 847601, 688208, 679071, 746456, 651709, 653994, 649834, 586861, 634378, 633282, 617696, 668332, 679272, 596343, 481322, 546906, 566813, 496260, 483029, 451128, 488968, 564661, 519627, 481248, 421538, 472860, 515383, 485007, 447414, 306272, 275340, 321105, 381880, 396128, 371355, 263200, 245563, 241436, 357793, 350118, 397397, 482141, 420392, 342373, 233919, 171380, 193846, 154107, 52401, 261370, 390089, 308214, 211851, 254481, 228762, 223815, 250849]
8288B50849l5687N3907o0649P3724j6711L508P9997k9805n4599k1383L7661R767
8276B90579j39973n173m0974l9462J45754l9117O902n3839P8738O4173K9475n3302
8264B43781j18078L4493P5913l0517J1443L7246n7102j15040q9003N4690L3025
8253H0851J5440J9149o8447M5813k8942N5512q3047n914M6682L9573j1862O159
8241A10967K0695n6639k8219n2145L6517O8601j07024n2433P9769l7521J11638
8230I4206m1665Q9936M459j32568J25858P63p6589q1934J9706P5122j4924j1125
8218E1245O9161P8779k15622J56962m6655j7118j02469N0711L9671P6781n6304
8207H5142o1470P1532R3008l1033j5659k841J19937j81068o0386p0167j8163J41097
$$ y = [250849, 215162, 269069, 208420, 282144, 265433, 268941, 348938, 319133, 264534, 243151, 280812, 290579, 150606, 145433, 104459, 64997, 210751, 171634, 178536, 124697, 203435, 267608, 297083, 243781, 125703, 160196, 236109, 205592, 217035, 254281, 197179, 82139, -6864, 47826, 80851, 96291, 115440, 46993, 92806, 63864, 119376, 36329, 30415, 77097, 116670, 104808, 110967, 131662, 75023, 46804, -5341, 31176, 99777, -7247, -59680, 20089, -17432, 94206, 52541, 142477, 146936, 14368, 140226, 140989, 64400, -17534, 2172, 77294, 62370, 51245, 120406, 199185, -16437, 140525, 93870, 76752, -25717, 24994, 64665, 141446, 85142, 23672, 95204, 188212, 157179, 141520, 138679, 258616, 77548, 17162, -53005, -71168, 69929]
8195F9929L8311l1535M68155J28153q68119O6067r8521M642j2780J24474M5108
8184f6116J790p8842J03578N8484j05373j19933Q4317O9977J3943N0719O9506
8173H2050K3662K9982r5401r1591Q0947o8111n5379J68569l6954o6769Q061m8032
8161f8966K6905j04758J52630k9491P4561M5907j12109Q0858O101k8403j41867
8150i8632N9524P6544L7901j5042N811J08157j30800k8707o1696O9386m7416K9961
8138D991K901J2170m5646K388M9476n840M4983j26952P399L760m0386M9288J8043
8125b3425k6668Q1133j03837k9989N3419L0887O740q2056J0374j4856P0879K3069
8113d330m5736J8452n987m3027J46829q0464m4674K3359l8538K4545J6767l1485
$$ y = [69929, 108240, 76705, 544860, 673013, -195106, -129039, -227560, -222918, -235698, -111224, -66116, -64326, -143168, -39590, 18894, -86479, -206412, -122095, -52118, -38175, 12544, 82050, 105712, 135694, 40293, -51298, 29649, -38462, -93841, 74728, 37774, -28995, -20934, -68966, -42061, -146819, 5811, -23680, 50881, 96788, -15321, 65537, 71638, 43235, -98632, -39108, 37436, 75337, 60295, 66106, 174263, 43463, 14756, -46940, 22446, -24970, 4991, 7892, 20062, -25584, -23196, 26280, 20440, 65423, -61529, -54130, -50370, -90756, -41468, -23425, -50093, 31040, -72797, -102786, -49367, -18480, -11740, -93796, -83422, -98278, -27399, -4330, -50066, -31614, -37601, -80628, 66201, -14263, -58937, -35578, -74116, -49571, -32804, -64289]
8101f4289k7234L3652Q9069m5461M2544n9279K2056j1909n5811l1445l8245J08033
8089c8319J5195N975j60287K513J40074l7690Q653P7340J8108p4076n3525O9922
8077b6117K4134Q8k3691Q2254q4618j06999R0690n7829j359O4524q0975J49639
8065B9741o1778l0640j0087p3248l1176J05328j9390L4940k5170K6664J0121p9796
8053a24491R7656J7513J969J06510l7976n3022k9242J3132J6948l0402L2716j03968
8041i2657j06550N3131k658O3184j4397J34210K3943q4040L0593r4812k5058K6212
8029h8899J0896M6783O0082o3764L2158j9239o2247P6001K9678J4580J5437p8793
8017b7327q7983o0159N6210l7052N2384K2690m4392L8713M2859N4997o4327n5547
$$ y = [-64289, -91523, -57871, 31198, -14263, 28281, -30998, -8942, -20851, -76662, -108107, -146352, -38319, -23124, -17149, -177436, -174923, -34849, -72539, -63886, 13454, 31562, -42514, -96039, -26117, -1983, -1895, -25586, 56668, -27950, -134949, -44259, -102088, -103447, -38923, -119898, 29741, -32037, -62677, -72764, -146012, -177188, -71860, -91250, -56310, -81480, -54816, -44695, -124491, -26835, -9322, -7353, 99157, 61181, 8159, -21083, -7951, 8997, -21405, 11311, -92657, -199207, -146076, -148734, -85550, -99947, 34263, 58206, -25834, 4759, -90053, -115111, -88899, -78003, -31220, 28862, -34902, -2744, -21983, -84230, -8229, 21449, 36029, 51466, -27327, -115310, -175469, -119259, -156311, -103927, -81237, -125629, -86916, -44057, 10940, -53387, -108934]
8005a08934R1110P091n0773k9102J12759l4884q4292j76320R7962Q9312J08827
7994B2756N5746Q47o8774q3578j0981O867L9643Q8587j5933n4681Q257O7325k0526
7981C5555k323k2805q1006p141K6706l6723Q2904J5400r3609k4066N6662Q9704
7969C9258q6351J25289r377o4910p3703J5120J608J3363k8528n4655L7401P1636
7957a3849j916n5318K343L3039l274j21816p7652Q0262j1222R3694L2819o8494
7945a11384j0534K4081o2528P6406J56328J729J01372n2490j60750K9139r4917
7934a03548L4391R4940l891J5853j4501j3477n236j6740j9782L9153K8923n0486
7922a4401j7136R1636J1257K5585j12796Q9048K4366j66324K1168o933q4560p341
$$ y = [-108934, -17824, -10733, -61506, -90608, 22151, -12733, -97025, -273345, -175383, -86071, 22756, 78502, 79349, 10575, -73003, -83984, -77117, -37474, 51113, 35180, -19501, -11244, 56081, 35555, 33232, 10427, -70579, -77720, -51014, -87737, -4833, 10567, -83042, -107108, -50446, 39258, -47093, 78196, 68819, 3909, -69794, -54674, -53066, -39703, -68231, -122886, -85485, -13849, -15765, -71083, -68740, -35701, -38975, -160791, -238443, -158181, -169403, -75709, -42890, -111384, -121918, -97837, -160365, -83959, 72369, 74098, 175470, 122980, -37770, -8631, -103548, -69157, 25783, 21892, 37745, 23244, 9767, 4531, -12209, -31991, 7162, 36085, -14401, -31537, 60099, 71356, 96941, -15855, 73193, 97559, -68765, -47597, -54530, -139090, -146431]
7910a46431L8966N3627l5206p5270Q6011R716q2556J45723R3932j8762N9304n8494
7898G0560m1127n1461j03935K391j5635j1385j1898N2667P1956n8064k1173j2233
7886a29337K3220J14472p9587K0964r768l7401O9537R3041m6908m3042n9392p2097
7874a56298K3384J69662L0359l9144N306K3225O4560n0141q4551L1081M0661j0745
7862D7359n6387K3594J59028k9134m6577r1442J55916N8236p5878l4128o1198
7851D9389n6112J93059q1006K1239m6609m3887k7120M4681q2715L6292M9147P051
7839F3409M0704J7931J0673M9023k2803q6643N2510L1796O8803M2814M5656n7451
7827B56422n9819q0330J7361L434O9817J90223J71724J52053J11661J99187Q3965
$$ y = [-146431, -107465, -53838, -89044, -164314, -78303, -68587, -151143, -5420, 88512, 69750, 129054, 70560, 29433, -22028, -125963, -123572, -139207, -150592, -162490, -109823, -37867, -95931, -117104, -129337, -106117, 8355, -71232, -50268, -60036, -97437, -27900, 65141, 18233, -24809, -84201, -156298, -132914, 36748, 67107, 27963, 33269, 56494, 121054, 70913, -13638, 17443, 58104, 47359, -9028, 14566, 173594, 144460, 97883, 6441, 162357, 220593, 144715, 110587, 49389, -6723, 186336, 105330, 126569, 79960, 36073, 8953, 53634, -29081, 7211, 56358, 63409, 104113, 122044, 132717, 181740, 158937, 72294, 124804, 156600, 225403, 268217, 313873, 256422, 196603, 116273, 133634, 137068, 206885, 397108, 568832, 720885, 832546, 1031733, 1115698]
7816A115698k3034j80521k11579l05709L42499L09069m07848K8516n5641j25526
7806D85924o3527j3764k4793L9772k07702Q6429N8423o4898n4897L394M1534L4303
7794C20198o7625L5004J9962k1423J9185j9000p0141J20031n588n439J23687m9979
7782C98872l4074O9855J00238J74186J49366N7258k5719J30771J87720J34089
7772A342562K54209m0091l36858j75776j60195q9657J2618j03901q7906j03994
7762E11011P7900K1047K0095r4937J5648J2250n4494L2828N1325N3790m4579L051
7750F04935N5011N6578J94609P9562J14193J86453J64001J72980L45644L78054
7740B352020K96520J34669l53074n60127l00938k74844j94729j16311k4824j47153
$$ y = [1115698, 1092664, 912143, 700564, 394855, 737354, 1046423, 638575, 667091, 611450, 485924, 422397, 408633, 383840, 423612, 215910, 302339, 360762, 295864, 240967, 244361, 285895, 320198, 252573, 287577, 307539, 286116, 305301, 286301, 216160, 336191, 330603, 325164, 448851, 398872, 364798, 434653, 534891, 709077, 858443, 915701, 889982, 1020753, 1208473, 1342562, 1596771, 1556680, 1219822, 1044046, 883851, 794194, 806812, 702911, 615005, 511011, 588911, 609958, 630053, 535116, 550764, 563014, 508520, 541348, 592673, 646463, 601884, 604935, 659946, 716524, 911133, 990695, 1104888, 1291341, 1455342, 1628322, 1973966, 2352020, 2648540, 2783209, 2430135, 1870008, 1569070, 1294226, 1099497, 983186, 958362, 811209]
7730H11209q1544O8743j45063l9226N9835j31298k8746L5799l7101j07641j946
7719D03021K4862k056N6408n8507k024K0538K0210N3191R7973Q172k2748J37814
7707G36854J5656m4595J07266o906R2684O8507L2866K36990K51185K71871L52418
7696B114796N00873K97201r3945l41151m59276l28524l35093l00805k32195K0511
7686H42392n0469o0745q1842k768n6236k7859j34723k4197m7578J2442M8699q9559
7674C27557j2250l308R0111k7506p4259L065J9352j9234q0233N1717l0731l7226
7662B07055O0189j46639P015J95437r3263j3117n0075P3400Q5380j68543N2400
7651B09239L1474j5514o3410M2258m9126k7398r071J86928l4914j31110N2477
$$ y = [811209, 729665, 798408, 653345, 614119, 673954, 542656, 513910, 549709, 512608, 404967, 403021, 427883, 425827, 482235, 423728, 421704, 442242, 462452, 515643, 613616, 621788, 599040, 736854, 752510, 707915, 815181, 808275, 900959, 969466, 1002332, 1239322, 1490507, 1762378, 2114796, 2615669, 2912870, 2818925, 2477774, 2018498, 1689974, 1354881, 1054076, 821881, 842392, 791923, 731178, 649336, 646568, 590332, 562473, 427750, 403553, 355975, 368417, 417116, 327557, 315307, 311999, 402110, 374604, 300345, 303410, 322762, 303528, 223295, 275012, 244281, 207055, 267244, 120605, 127620, 323057, 229794, 216677, 166602, 240002, 325382, 156839, 209239, 240713, 225199, 161789, 204047, 154921, 127523, 118452, 305380, 270466, 139356, 191833]
7640A91833L4877o8504M0494m9998M4161k001J2101O9611Q3019l5060j00045P6606
7628B97094O115J8226j02769l4431O9376m518q0013O692O4226j17R9879J04895
7616D44655l3327O034J15848j51561n6393R3373M7418L0392q5423K4872K3425
7605D59313k0596Q59L1315K4412K4549P3126J5261M2349N5590P3630Q9689O2809
7593I32306J19228J66130R0895K72071K81881M01920M37266M18867J43401j12490
7583C151475l17213m11682j91103k42110j28142J00322L04661L44392M90003L39042
7573C439645p5567l48206o08572m35671k83365k68252j57711l15216j18068j33145
7563F95872k544K263j09673M6133q9983K4951K3855m5184r9821L508J8076q7970
$$ y = [191833, 226710, 158206, 198700, 148702, 192863, 190862, 202963, 272574, 355593, 320533, 220488, 297094, 303209, 321435, 218666, 184235, 253611, 249093, 169080, 175772, 239998, 239881, 339760, 444655, 411328, 417362, 533210, 381649, 325256, 418629, 466047, 496439, 411016, 435888, 459313, 438717, 439576, 470891, 495303, 519852, 592978, 608239, 650588, 706178, 779808, 869497, 932306, 1051534, 1217664, 1308559, 1580630, 1862511, 2264431, 2701697, 3120564, 3263965, 3151475, 2834262, 2422580, 2231477, 1989367, 1861225, 1961547, 2266208, 2610600, 3100603, 3439645, 3364078, 3015872, 2407300, 1971629, 1688264, 1420012, 1262301, 947085, 829017, 695872, 693328, 695591, 585918, 632051, 542068, 567019, 590874, 545690, 445869, 449377, 467453, 379483]
7551C79483q5341k4026O2221R368n5090J22866N9794j71507N6753L5751o5628
7540C24644l6644Q1425J249m3501p6813R1884l0732N0356l3635L6501M9647n8268
7528C56113o679n0622M8429j33149K4582K10958o651N1217p5000N4059J53771
7517F27028M5542M816R7850m7617j4613M497J39018L12844L67071K67662j85711
7506A618387k32830j62248j25017j62554j7655J50163r0608R8405K96048O1347
7496A433438J2269j20555k55082j10233o4940j22243q7251p1703k9258r7288k04711
7485B82443j4603j01995l9753K5565J31025J01538o1061n2180n5335J4413m4387
7474A85670K4948L8397M0409o0651J3112o9843N551O1343n6896n7114L0233P8460
$$ y = [379483, 294142, 270116, 332337, 341705, 286615, 409481, 469275, 297768, 354521, 390272, 324644, 288000, 369425, 370674, 327173, 250360, 342244, 311512, 361868, 328233, 364734, 414381, 356113, 349434, 298812, 347241, 214092, 238674, 449632, 442981, 494198, 419198, 473257, 627028, 672570, 677386, 775236, 727619, 713006, 717503, 856521, 1169365, 1536436, 1804098, 1618387, 1385557, 1223309, 1098292, 935738, 918083, 1068246, 977638, 1076043, 1372091, 1433438, 1445707, 1325152, 1070070, 959837, 894897, 772654, 685403, 613700, 584442, 487154, 282443, 267840, 165845, 126092, 151657, 282682, 384220, 323159, 270979, 215644, 230057, 185670, 210618, 249015, 289424, 228773, 241885, 172042, 177593, 238936, 182040, 124926, 155159, 233619]
7462B33619M0514n3147j4084j21721m0729J04268j1860p2043k4613j07730Q9210
7451B1684L1695l3610Q5795M2136k2574n9224j9416n6706n3932L431O4950M4127
7439D8356L0384M5214j39343o9846K8667N9177L7561J06045j1302j10508m0285
7428a5880N0415R183l485n6161O2355o688p842p5277M3894j1593m4655M8269P1114
7415F3649m8013m1375p5736J09342K3710j01869P2217j04898k9665M5451N6954
7404c0233l3865q252J8720o04P9961n7000l2251l2898K8147J27491l9077p1695
7392e1556o564P539l8319j14891M0158J20081o8889J4034m317J1756M1528n661
7380e5101l8794J53915q5534l8545O9560m1030R612K5314R8580j0664q1327m6749
$$ y = [233619, 274133, 220986, 206902, 85181, 44452, 148720, 136860, 64817, 40204, -67526, 21684, 53379, 19769, 105564, 147700, 125126, 65902, 46486, -10220, -64152, -60721, 4229, 48356, 78740, 123954, -15389, -85235, -56568, 2609, 40170, 146215, 134913, 24405, -15880, 34535, 43718, 40233, -15928, 46427, 39739, 31897, -43380, 514, -11079, -55734, -7465, 63649, 15636, -25739, -101475, 7867, 31577, -70292, 1925, -102973, -132638, -87187, -30233, -64098, -72350, -53630, -54234, 25727, -31273, -63524, -96422, -68275, 59216, 20139, -51556, -58120, -50581, -88900, -203791, -163633, -43552, -112441, -98407, -102724, -90968, -49440, -55101, -93895, 60020, -25514, -64059, 5501, -35529, -25917, -603, 97977, 87313, 5986, -40763]
7368d0763j32250o039J55642j3549r4202J33345N8034r875m1904K4558j42097
7357a09100K2892J4150J399L8038J63342j50253M1009L5877k8447m0244j07388
7346a18725O3575P279K1599N4247M4527q1064O5268K8070q0313n3084N9369J6642
7334B7390l2170K9699l5713K520p0077n2808j8567J00401P2900o5175O1187L7217
7322E6804m4973m375K1723K2169M25J165j9283j08411M8077r749n8065K1104O0041
7309a3348J09898M7777l8928r4299j19358J1471P0579J5897K3230o1026J9901
7298b8206J9639K0325P693r0957R615K8899L5836J7378m6281o8558J48058R3099
7286A46540r8701l1859J06877j95671J6293J4840J1066J0277n2658J353J17912
$$ y = [-40763, -173013, -179052, -23410, -36959, -131161, 2184, 60218, 50343, 8439, 32997, -109100, -86208, -72058, -70659, -32621, 130721, -19532, 21477, 57354, 28907, -11337, -118725, -55150, -47871, -26272, 27975, 72502, -8562, 56706, 84776, 4463, -48621, 10748, 27390, -4780, 24919, -10794, -8274, -78351, -131159, -149726, -49325, 23575, -41600, 19587, 56804, 11831, 7456, 29179, 51348, 51773, 52938, 33655, -74756, -26679, -36428, -94493, -73389, -13348, 96550, 144327, 105399, 11100, -108258, -96787, -26208, -10311, 12919, -48107, -28206, -8567, 11758, 19451, -71506, -61891, -32992, 2844, 20222, -26059, -94617, 53441, 146540, 47839, 15980, 122857, -72814, -56521, -41681, -30615, -20338, -72996, -71643, 46269]
7275D6269k9378K3351l0810k3105J23846r7005q3443R1176q133O0857L7670j15609
7263d314M4886L0258L4425n9116r5198j03295M0249P2744R6794r5853R6481L2777
7251I0838p7511J2557L4342M2048r0507n5980m6939O368j7442k3732R0952Q4758
7239D9752p4386M4485K3861n0028J34321M0456j34579k8785K0768l4311N0390
7228D1944K2909K5341j5743p3664L9294r023j9930J7134L3965K2233J4880k6887
7216G2453L3581q2503J6571K8553j18j4440P6688L2287r3872k5581R2936k5121
7204A11434K6305q1550M7858j9936R4431J2180l5877K715J2200R2052o1802k5858
7192A74152K2865n713p9364l7344j42979R2662N5749l2686P3071M0679p0048J08233
$$ y = [46269, 16891, 40242, 9432, -13673, 110173, 13168, -70275, 20901, 12768, 73625, 111295, -4314, 40572, 70830, 105255, 46139, -49059, -152354, -112105, -39361, 57433, -38420, 58061, 90838, 13327, 25884, 60226, 102274, 11767, -44213, -91152, -84784, -102226, -125958, -35006, 49752, -24634, 19851, 43712, -6316, 128005, 168461, 33882, 5097, 25865, -8446, 41944, 64853, 90194, 74451, 787, 40081, 31058, 11128, 28262, 62227, 84460, 99340, 72453, 106034, 23531, 40102, 68655, 68537, 54097, 130785, 163072, 69200, 43619, 136555, 111434, 137739, 56189, 104047, 84111, 178542, 190722, 154845, 157560, 169760, 261812, 200010, 174152, 197017, 191304, 111940, 74596, -68383, 24279, 80028, 47342, 120413, 161092, 91044, 199277]
7180A99277l0155n8970N0647k4229p3669k28J27598p0208j09531J20325r578N5987
7168A77266j9189M0842j1810O1976q849O841j25519O4060Q7129M7972l5825n6823
7156B28071P1296Q2039P6903o6569o1886k6808M5460J36170m4804O3156J80458
7145F83486p1929j9783n155o5273M6918k9314k8874N3240r9495k6628Q5454J41635
7133F64282N708m548N230j2567P0326J19298K8234K184J4811n2801Q1795o0750
7121H61202N6817n8517K4735K5494N5191J78066o164r3979J01000J65856R1099
7110A400800l3288K7823K00834O1804J63834R2956J20440J78567L65619L69318
7100B948707M23686L68784L3514k54570j93653k31919j51497p961O0092J35377
$$ y = [199277, 169122, 110152, 160799, 136570, 62901, 62673, 190271, 120063, 10532, 130857, 121279, 177266, 158077, 198919, 187109, 249085, 240236, 247077, 121558, 185618, 272747, 320719, 284894, 228071, 299367, 381406, 458309, 391740, 329854, 303046, 348506, 484676, 439872, 503028, 683486, 611557, 591774, 586619, 521346, 568264, 538950, 510076, 563316, 463821, 437193, 522647, 664282, 669990, 665442, 670672, 658105, 728431, 847729, 875963, 878147, 892958, 840157, 921952, 861202, 918019, 859502, 884237, 909731, 964922, 1142988, 1136824, 1042845, 1143845, 1309701, 1400800, 1367512, 1395335, 1596169, 1657973, 1821807, 1914763, 2035203, 2213770, 2579389, 2948707, 3372393, 3741177, 3774691, 3520121, 3326468, 3094549, 2943052, 2935091, 2995183, 3130560]
7090C130560K83965K63630L46257P9594r0131j62043k18044k40974r0925j62451
7080C139438J8010m782M5164J49776P8537J20093K78463J44302K52362L57049
7070D578412M17606M24422M27464P00670R46444J229640J553124J921542K028526
7061A4227850J881864J012357p2905o77225j534724j663470j383567j229785j066272
7052I494123r96781p70844n33882l27172k59368j31473j29448J3437J92747q408
7042F542931k21842l35834m82014m20398k56286P1139j3742l5253P4970K40159
7032E163830K26308J33341j72662j39386k03869k76290l97908l23360n38517m24544
7022C046943k85084j64941k34640k12348k06085k60285j38167p4962Q3369o3779
$$ y = [3130560, 3414525, 3678155, 4024412, 4104006, 4013875, 3851832, 3633788, 3392814, 3301889, 3139438, 3157448, 3152666, 3197830, 3347606, 3426143, 3546236, 3824699, 3969001, 4221363, 4578412, 4996018, 5420440, 5847904, 6548574, 7495018, 8724658, 10277782, 12199324, 14227850, 16109714, 17122071, 17049166, 16371941, 14837217, 13173747, 11790180, 10560395, 9494123, 8497342, 7726498, 7192616, 6865444, 6606076, 6474603, 6345155, 6358592, 6551339, 6542931, 6321089, 5985255, 5503241, 5082843, 4826557, 4897696, 4883954, 4848701, 4923671, 5163830, 5390138, 5523479, 5350817, 5211431, 5007562, 4731272, 4333364, 4010004, 3471487, 3046943, 2761859, 2596918, 2362278, 2149930, 1943845, 1683560, 1545393, 1470431, 1553800, 1490021]
7012A490021n1471j81382k23790J4993P7660l9651r8514o8434L6976q7411m5804
7001H23193l8451l7867K6500l8940R1530j14393n918o9139L9312k2939p7361j4079
6989E61448p4612n7278K6127N9588j7693n4039K9215r486j1010o2499j11520M8725
6977C26966J16671O8590j67706k4997n9962j26727P4052O2916l7840K3369M5417
6966C00749L3559m2177N4800o9519K316J3524n2233J3805K2968j9916k1431n730
6954B30715k2805q149p9950R0901L1625j01586P8301P073p605p8019j9297j3159
6942A08045P9883o9872m0635P7258L9989l0555o9886q880J8501K5880N9632k4684
6930A64676j7638j97524P3453L1874K1277O6577L3015l6265p721j3727j08762
$$ y = [1490021, 1438550, 1257168, 1033378, 1048371, 1126031, 1086380, 987866, 919432, 956408, 868997, 823193, 784742, 746875, 773375, 734435, 825965, 711572, 705654, 636515, 675827, 652888, 575527, 561448, 486836, 429558, 455685, 515273, 497580, 443541, 472756, 463270, 452260, 389761, 278241, 326966, 443637, 512227, 344521, 319524, 259562, 132835, 206887, 269803, 231963, 255332, 300749, 334308, 292131, 346931, 277412, 279728, 293252, 241019, 254824, 277792, 257876, 236445, 230715, 207910, 199761, 119811, 210712, 242337, 140751, 219052, 226125, 218520, 140501, 121204, 108045, 187928, 118056, 77421, 154679, 194668, 164113, 94227, 85347, 103848, 129728, 189360, 164676, 147038, -50486, 22967, 54841, 76118, 142695, 175710, 139445, 131724, 117997, 9235]
6919I235P1795O13l3704K7120O3205l9566p9418M1226J71975k5296o2908J9660
6907A63937O4976j6472p8367j5069L5810P949j9510j25229l7069k4307m4721K0838
6895f7234L9488P239O1943Q0807l9062K4624j27738L0089J79300K4686p5186p129
6883A31827k9957N526l2910j12875j3289P5275J66638o8087j05986n6682M6903
6872F383Q730K3736L5258o781n5751K4245j3486J4475o2015r670l8840J24431
6860E0715m6524n6504K1592m2578Q3254j07582j7587L7446O2040N4894j0765O0816
6848H9217k8938j9395o3579Q2146k9562n4797J35107l7930j531p885R766k9207
6836D3412K4062Q4743q4427j25195N9557K2238N5266P398R4155j1399l6924q2284
$$ y = [9235, 81030, 81643, 47939, 75059, 138264, 98698, 19280, 60506, 232481, 207185, 144277, 163937, 228913, 212441, 134074, 119005, 154815, 162764, 143254, 18025, -19044, -43351, -88072, -67234, -27746, -20507, 41436, 122243, 83181, 107805, -19933, 10156, 189456, 214142, 138956, 131827, 101870, 107396, 74486, -38389, -51678, 23597, 190235, 122148, 16162, -40520, 6383, 15113, 38849, 74107, 67326, 11575, 35820, 22334, 36809, -25206, -34876, -73716, 50715, 4191, -52313, -30721, -73299, 9955, -97627, -115214, -77768, -15728, 39166, 28401, 89217, 60279, 40884, -22695, 59451, 29889, -24908, 110199, 72269, 70738, 62853, 72619, 43412, 67474, 152217, 67790, -57405, 2152, 24390, 79656, 87054, 181209, 169810, 132886, 50602]
6824E0602j17518O0301N6504M4156o2657l9351M7870j14604O6113m3149m7411
6813i9144J29336k8989l1043l2786J4236j5072R4903m5907p3058O182R9639R8836
6801A17133q4506P51n5247k0874J4505k2228M4630P235J05684J7647l6612q3235
6789D883J1768P967O820R434J683q2134Q890K1382J29701K032r3847K1809L7929
6776H8317m3444J2720k1214M0296O8241Q043o3655j01762J01126n5420n0318o2992
6764h0062J21204K1319k4037O8833l789m0664N1040J7500o3329l8789P9023M3403
6752A51652k3124k9491m4617O0070r2325R233J7685n8978J86859r2898j22510
6741c8444K3485J18158O8362j28326o5716K3462m7289k179J17755k0929J6368
$$ y = [50602, -66916, -6615, 49889, 94045, 31388, -7963, 39907, -74697, -8584, -51733, -99144, 30192, 1203, -29840, -62626, -48390, -63462, 31441, -14466, -87524, -81342, 18297, 117133, 32627, 33378, -21869, -42743, -28238, -50466, -5836, 1399, 107083, 124730, 88118, 4883, 16651, 24618, 31438, 40872, 42555, -39579, -30689, -9307, 120394, 122426, 28579, 50388, 88317, 44873, 57593, 36379, 76675, 144916, 152959, 89304, -12458, 88668, 33248, -17070, -80062, 41142, 62461, 38424, 107257, 103468, 62804, 113844, 131344, 68015, 29226, 108249, 151652, 128528, 99037, 54420, 114490, 22165, 31398, 49083, -9895, 176964, 84066, -38444, -14959, 103199, 171561, 43235, -22481, 981, -46308, -48487, 69268, 48339, 64707]
6730F4707J662K0974l6959o9008l1498N8749k4837n3571N5327j07958L8803J80042
6718I6433k4017o1204j5910l6822j7737p8563Q4939k0578N5294m8136Q5109j51187
6706a32379M3901O0276N0982m2840N5877P5217l6226o854l2155M1075j6454m3701
6694A6719k9758p6011Q4204Q6210o4687n5250K717Q3475Q761R246n1664J16757
6682A30719p1640j05447K115N3869p933k9521K1204N4847M5100L6994r9655q940
6670B1712k5632p8116Q4408N7822J891j12915K4632J8390n0699J18403p5556Q0748
6658F5088J6319l6735O2925p4834M2885J15469j68846m6018j8154J3435j33154
6647a61620K03527N5862Q4431j5635m8374q3143l2244n5137L7310J46085q3582
$$ y = [64707, 66369, 87343, 50384, -18624, -50122, 8627, -16210, -69781, -14454, -122412, -83609, 96433, 72416, 11212, -4698, -41520, -59257, -137820, -52881, -73459, -18165, -66301, 18808, -132379, -88478, -28202, 22780, -20060, 35817, 111034, 74808, 67954, 35799, 76874, 60420, 16719, -13039, -89050, -4846, 81364, 16677, -38573, -35856, 47619, 56380, 65626, 13962, 130719, 59079, -46368, -44253, 9616, 1683, -27838, -6634, 48213, 93313, 130307, 30652, 21712, -3920, -82036, 2372, 60194, 62085, -50830, -26198, -7808, -58507, 59896, -15660, 65088, 81407, 44672, 107597, 32763, 75648, 191117, 22271, -23747, -41901, -28466, -161620, 41907, 97769, 182200, 166565, 118191, 35048, 2804, -52333, -15023, 131062, 47480]
6636D7480n9607n0270L8353R0334M1199l1404m9270k5823J7487L9383L4514j06916
6624a4540M5554J44771l5531J6848p5232n2313l6548k1972N3306n066j0649M985
6612A3613N8863k7607m0643l2809K4529L0283Q9406q1461o8391n7398J09692K4474
6600D2551m1924p9724M2355P3285M1225n6722Q6184k2898o7614o6596k4964O2719
6588a2123P5311Q6533l9411k2363o2296n7988N6374L7629P5308j8146k5205k0911
6576G2712P033n2300k2962m0797M5712j5203m068J19703k0600m0573q3766Q352
6564b6757J0165P0556N6459L395J6376o0791m0627J14739m6836r164J5173l6286
6552F6402o3131l7892Q0954p3060r5750M2552L709J65889R7022j69927p3558P3067
$$ y = [47480, -12127, -62397, -24044, 66290, 107489, 76085, 26815, 992, 18479, 57862, 92376, -14540, 31014, 175785, 140254, 157102, 81870, 29557, -6991, -28963, 24343, 19277, 8628, 13613, 72476, 44869, 4226, -28583, -4054, 26229, 115635, 34174, -34217, -91615, 18077, 42551, 627, -79097, -36742, 36543, 77768, 21046, 107230, 84332, 16718, -49878, -74842, -12123, 63188, 149721, 110310, 87947, 25651, -32337, 24037, 61666, 136974, 118828, 93623, 72712, 79745, 27445, 4483, -36314, 9398, -5805, -9873, 109830, 89230, 48657, -35109, -26757, -16592, 53964, 110423, 113818, 130194, 69403, 28776, 143515, 96679, 87515, 102688, 66402, 3271, -34621, 46333, -26727, -122477, -79925, -76216, 89673, 186695, 16768, -56790, 16277]
6540A6277O295k1525J32766j6340k0891l3242n2505J26643M7257o8958j93392
6529g7615M7085J45786l8994l3742O985j5970j1115K2267L5047l3786k65p7754
6517c2071O6307P8447l8446j3436J1025J08636J1414j18401p4599L0960j1343
6506A8493k9728k4269J02649J3325n9002j3777j4499p8383R4693m002j18632J23143
6494A0011P5576n1168p1175o1973q6924Q6403Q0651Q6874Q1229j3171j20244j4280
6482A809R1560q42M8749l7348p5864K1542m2606J4850O4351R321j5624j2891k5626
6469D1381K6610k6036K8637q897J1703O2890j22584R4077J7027p709j3107j5596
6457H8396m0555R9008N7678m3480m3542n122L7017j26192J5655O9860K3388m1698
$$ y = [16277, 22572, 1047, 133813, 117473, 96582, 63340, 10835, 137478, 184735, 115777, -77615, -30530, 115256, 76262, 42520, 49505, 33535, 22420, 44687, 79734, 45948, 45683, -32071, 34236, 112683, 74237, 60801, 71826, 180462, 191876, 73475, -1124, 29836, 18493, -11235, -35504, 67145, 80470, 21468, 7691, -6808, -85191, 9502, 5500, -113132, 10011, 85587, 34419, -36756, -98729, -185653, -99250, -18599, 68275, 149504, 136333, 16089, 1809, 93369, 92527, 141276, 103928, 28064, 49606, 7000, 21850, 86201, 95522, 79898, 67007, 41381, 67991, 41955, 70592, 61695, 73398, 136288, 13704, 107781, 124808, 117099, 103992, 88396, 47841, 146849, 204527, 161047, 117505, 112383, 149400, 23208, 38863, 108723, 132111, 90413]
6445I0413p3350m8661J70756j24137r2161J9719Q8352L6002K5918P0772n0587
6434A13036k0935q7824n8154J28648J9865j4983J8226l4649j5763j5058N2462
6423H4871r970Q4445j07030J8473N3516k718J3723J5895p7059O9602m1184p331
6411I5233q8369n5434J4322P8403l1959m4030J15700N7198k1144p1993R7253K3279
6399A68459K5719n5143L568k370k7257l77N0304J4395j33636p7718J64346M2869
6387A73159n1798l8367j527k6273J66258O6427j25147p1155J5238n4171J04747
6376A57391J1772K7489J99819r2351k33610l0917Q1630m0744M7366O1361p559
6365A81647o0991P1861j5611J2814J3355J1521N4637j2709o9924j49805J2720
$$ y = [90413, 17063, -31598, 139158, 15021, -77140, -57421, 30931, 66933, 92851, 163623, 113036, 92101, 4277, -53877, 74771, 94636, 79653, 97879, 63230, 47467, 32409, 84871, 74901, 159346, 52316, 70789, 124305, 121587, 135310, 151205, 74146, 143748, 102564, 95233, 6864, -48570, -34248, 44155, 12196, -31834, 83866, 141064, 119920, 47927, 145180, 168459, 194178, 139035, 142603, 140233, 112976, 112599, 162903, 177298, 43662, -34056, 130290, 173159, 121361, 82994, 81467, 55194, 221452, 287879, 162732, 91577, 106815, 52644, 157391, 169163, 196652, 396471, 304120, 70510, 39593, 121223, 80479, 127845, 189206, 181647, 120656, 192517, 176906, 189720, 203075, 214596, 269233, 256524, 186600, 36795, 49515]
6354D9515R9038P9106q0251N6724m7293q9285M1930P7289K1870l4389P8119J8377
6342B70750j25537m8133P0610k9481L4649P503j07975l0028j7673K4313J05526
6331A54524R340J9503k254L1912p0989m1359J1811j1153K895j05297L2018M0132
6319G1083M2912q7574M3662K0141J00324L5140k4607r0217l1841J15441n8603
6308A35861n3895K1598j03341K7013J38490l1432J6369J9182J9229j4730l0644
6297A43700N5545M2140q5274J60032q9923K5148j6319o2355l5482J05967K6126
6286B69305K1640j07089J1300J08651l8086m6327l7080m2350O5830r1693J3579
6275A27680J52310O725l7014p2575R0869J02260M09r1193l5545j09375L5995l3779
$$ y = [49515, 148553, 227659, 147408, 204132, 156839, 67554, 109484, 186773, 208643, 174254, 252373, 270750, 145213, 97080, 167690, 138209, 172858, 180361, 72386, 42358, 24685, 48998, 154524, 163864, 183367, 181113, 213025, 142036, 100677, 112488, 101335, 104230, -1067, 30951, 71083, 113995, 26421, 70083, 90224, 190548, 225688, 201081, 110864, 79023, 194464, 135861, 81966, 103564, 223, 27236, 165726, 134294, 150663, 169845, 189074, 174344, 143700, 199245, 241385, 156111, 316143, 226220, 251368, 235049, 172694, 137212, 243179, 269305, 290945, 183856, 195156, 303807, 265721, 219394, 182314, 139964, 205794, 114101, 127680, 279990, 286715, 249701, 177126, 267995, 370255, 370664, 279471, 243926, 134551, 170546, 136767]
6263A36767M4072L9091l8042O0408j53787o2897J1679P2996J18036m6171l8584
6252A43568M7293M6131o2976j9326J32385M2501j23385K3206p1850j5638Q4180
6241B26089n4193J4197l2763o2576k4887L2454N1736j95J9374P1550J10842r0397
6229B61231l4188j10804J58075M8537q0232k2933m152m254j597L8567o9202J8320
6217A97368L5996M4810p2784j02787R5131o9402K9981O0010K31j9168K7315K1386
6205B48087k1520J26898O692J9559l0144q2531m302l6509J4310Q4395k6345m5002
6193B53588o3621J5271J40827k549o5370N475J3651l8504O7446j48264L3563O6638
6181B78151j5490R2088l5211j6059n9208n8386K1364P5814j6121L6139N5061J6286
$$ y = [136767, 180839, 219930, 181888, 242296, 88509, 25612, 37291, 110287, 228323, 182152, 143568, 190861, 236992, 174016, 154690, 287075, 329576, 206191, 229397, 157547, 141909, 226089, 171896, 186093, 153330, 90754, 65867, 98321, 150057, 149862, 169236, 240786, 351628, 261231, 227043, 116239, 274314, 322851, 242619, 219686, 215534, 211280, 209683, 248250, 179048, 197368, 233364, 278174, 205390, 102603, 197734, 128332, 158313, 218323, 218554, 199386, 226701, 248087, 226567, 353465, 360157, 379716, 349572, 267041, 262739, 226230, 240540, 324935, 298590, 253588, 189967, 205238, 346065, 343516, 278146, 283621, 297272, 258768, 326214, 177950, 211513, 278151, 262661, 354749, 319538, 303479, 244271, 185885, 207249, 283063, 266942, 303081, 358142, 374428]
6169C74428p705P6836q1463n2909o7718M804L2303R1064j23169K8947J1723J2967
6157C00108J3833P3060n6817l7193N4975L4204r2446q1768P0253O208o6273n6473
6145A61671J03442j7718M6120K9380L2386l9121l3639j06119L2728l8737N7470
6134B27863p4389N2476Q1953l2946m2722Q7580N2223k9684R00m0151p8424M1406
6122B46085O5607M3951j02377m8488Q9057k2865J7099j1580j9651o28M5112R6034
6110C97356k2194j08879m7672r96O8293j1351Q7346L2318l6419q8184J05592Q7610
6098D62820j4303m4821k4014P1083j6617n0605r276Q120l955N7656J1218q8101
6086C59205K5404j28l1720K2185p9229Q9974k7493l9244j153O635k2083K0369
$$ y = [374428, 366723, 443559, 362096, 309187, 241469, 246273, 278576, 369640, 246471, 275418, 287141, 300108, 313941, 387001, 330184, 292991, 347966, 382170, 289724, 207956, 278209, 284417, 218144, 161671, 265113, 247395, 293515, 322895, 355281, 316160, 282521, 176402, 209130, 170393, 227863, 153474, 205950, 287903, 254957, 212235, 299815, 352038, 322354, 323254, 283103, 204679, 246085, 311692, 355643, 253266, 204778, 293835, 270970, 288069, 276489, 256838, 256210, 301322, 397356, 375162, 266283, 218611, 217615, 285908, 274557, 361903, 394221, 357802, 269618, 375210, 462820, 448517, 403696, 379682, 450765, 434148, 383543, 374267, 382387, 378432, 436088, 447306, 359205, 384609, 384481, 352761, 374946, 295717, 385691, 358198, 318954, 317801, 324436, 302353, 322722]
6074C22722R6954J1532P6427j38036j0473L8282m5651m4679l203K1633M0213j6250
6062C49471L4647l5302L5121P1648J9095r8598L575R694l3849P8487m3264k4771
6050C65954K0617J599J17803m4448n9458P3045J7767m7301M1806r2349k692N3457
6038D45800j05067k5699K8323L4239L9318J55047q4108k5824L5173n4972k078
6027D40152O985l4275j9777m4847J320l2498N6864k3068L1695O610K6861Q3388
6015D99410l1306n5149M7548k8153J5709l7472J6812J9896m9031r618o664J415
6003C83397l2114J39522j3689j8909N6110j0563j9226r9406J32839N8774q1562
5992D95173k8485m0962k4140J33737L9519j50461N7593N967m8666O4204K6099
$$ y = [322722, 419676, 431208, 507635, 369599, 359126, 397408, 351757, 307078, 303875, 325508, 365721, 349471, 384118, 348816, 383937, 455585, 474680, 376082, 379657, 389351, 355502, 433989, 390725, 365954, 386571, 388170, 505973, 461525, 402067, 475112, 492879, 445578, 487384, 395035, 392343, 445800, 340733, 315034, 343357, 377596, 416914, 571961, 487853, 462029, 497202, 442230, 440152, 447137, 412862, 393085, 348238, 349558, 317060, 373924, 350856, 382551, 389161, 416022, 499410, 468104, 412955, 460503, 432350, 448059, 410587, 427399, 447295, 398264, 388646, 381982, 383397, 351283, 490805, 477116, 458207, 514317, 503754, 484528, 385122, 517961, 576735, 495173, 466688, 425726, 401586, 535323, 574842, 424381, 481974, 487941, 439275, 503479, 529578]
5981E29578L0730J1289M3718N8606o6851N6624p356k7716r352l365j2106L5778
5969F39577q9920m85O3497K0426o6984N4099M7315M6746j4595l8188J1827N3646
5957G26961p3213M128M3279Q0380m2009j7008M3266j03464M1307N49M8030q8986
5945F63220Q7708k4869m719K5820K0429k0292K3621j1936l4781N7160k0952K3503
5933G83912p49K686P5013K8176J3632l5048r0561j3041L0056l0038p9182M3388
5921G28244J08078M7094l5573J3519J01584j06737J39915n0780r6644K9538n005
5910H73233L6583M436O2828J73666j9247j19295J01518q3090J7940M5926l5533
5899A058965m1112Q02l4062j6458J24035j307o7531J38946k1328m5782J6842r8929
$$ y = [529578, 560308, 571597, 615315, 673921, 607070, 663694, 656338, 628622, 619270, 615905, 603799, 639577, 549657, 549172, 612669, 633095, 566111, 620210, 667525, 714271, 699676, 661488, 673315, 726961, 653748, 657876, 701155, 781535, 739526, 722518, 765784, 662320, 703627, 704176, 752206, 663220, 750928, 726059, 721340, 747160, 767589, 747297, 770918, 758982, 724201, 781361, 760409, 783912, 783163, 785849, 860862, 889038, 902670, 867622, 777061, 764020, 794076, 764038, 684856, 728244, 836322, 883416, 847843, 861362, 962946, 856209, 996124, 945344, 848700, 878238, 873233, 909816, 914252, 977080, 1150746, 1131499, 1012204, 1113722, 1030632, 1048572, 1094498, 1058965, 1017853, 1018655, 984593, 968135, 1092170, 1090863, 1023332, 1162278, 1140950, 1095168, 1112010, 1013081]
5887A013081K6381O0265o8441l4404L9002n424O2185M8394n7844O6724J8563J0034
5875A178516J39537m1597q7448N0721J8703j5254L7273K6526J09945J23982q4783
5864A456121k1344L2688m6165L1883o374m9876M5887Q7949l9144P6428L8357m4818
5852A561592m074k917l0877j0001Q0333R949P1634m5701K250K5105p4640N5725
5840A638378Q3294n5520J0457J05256r762m1351M263P9229q8954J21174J29593
5829A976057l2301o1352l8244L7992o520K0558L4923q2757m1544Q3752l8152L0785
5817A883197n3125J68252j6044p8813Q6088O3427J02605n308j13917k0517N1414
5806B067259L2678Q0511o33M749J0269J2155P5056p0421n6176P0438K2513l510
$$ y = [1013081, 1039462, 1099727, 1031286, 996882, 1035884, 1030460, 1092645, 1141039, 1083195, 1149919, 1168482, 1178516, 1318053, 1276456, 1189008, 1239729, 1258432, 1243178, 1280451, 1306977, 1416922, 1540904, 1456121, 1434777, 1467465, 1421300, 1453183, 1446809, 1396933, 1442820, 1530769, 1491625, 1568053, 1606410, 1561592, 1557518, 1554601, 1523724, 1513723, 1594056, 1604005, 1675639, 1629938, 1632188, 1657293, 1582653, 1638378, 1721672, 1666152, 1676609, 1781865, 1772103, 1730752, 1735015, 1814244, 1725290, 1846464, 1976057, 1943756, 1882404, 1844160, 1882152, 1875632, 1896190, 1931113, 1848356, 1806812, 1890564, 1852412, 1883197, 1830072, 1998324, 1982280, 1903467, 1989555, 2052982, 2155587, 2150279, 2036362, 2015845, 2067259, 2099937, 2180448, 2179815, 2184564, 2194833, 2206988, 2282044, 2211623, 2155447, 2225885, 2248398, 2244888]
5794B244888O4372J6310J17989k8387j12723L5967J02060k421P1499O2793j3788
5783B558559j07002j359O2841J12636Q1063L6949L3364J5538P3616l3615K6234
5772B858824J4276J8381m6228m598O2022J01497M3047m6313O8975O5601l0082
5761C105402K491l278O8651L0099O7365J86063Q6438l8932N9976l4378K4986L6203
5749C591086K1567l3977K7281Q4662K3810N5722O9234Q3272J8848K566l3628M6087
5737C956530O7808L7009P5061j1725k5079O1935O1378J8546P8833O2673N5061
5726D438030n5739J29858K9712M6316L3706K5941K380J37684P7275R8997J85937
5715E150097M1460L6944n2319R1806P3995m8643J01595Q9069O671J27042O3548
$$ y = [2244888, 2309260, 2325570, 2443559, 2415172, 2302449, 2338416, 2440476, 2438055, 2509554, 2572347, 2558559, 2451557, 2450198, 2513039, 2625675, 2706738, 2743687, 2777051, 2792589, 2866205, 2832590, 2858824, 2873100, 2891481, 2845253, 2840655, 2902677, 3004174, 3047221, 3000908, 3069883, 3135484, 3105402, 3107893, 3104615, 3173266, 3203365, 3270730, 3456793, 3543231, 3504299, 3564275, 3529897, 3554883, 3591086, 3612653, 3578676, 3605957, 3690619, 3714429, 3770151, 3839385, 3922657, 3941505, 3944071, 3910443, 3956530, 4024338, 4061347, 4136408, 4124683, 4099604, 4161539, 4222917, 4241463, 4320296, 4382969, 4438030, 4382291, 4512149, 4541861, 4588177, 4621883, 4647824, 4650204, 4787888, 4865163, 4964160, 5150097, 5191557, 5228501, 5176182, 5267988, 5341983, 5293340, 5394935, 5484004, 5490675, 5617717, 5681265]
5704E681265J11418J02613O765M8766J75518J19126P8194o673J10022O3142l4832
5693F455324K15968M3749O157M4844J31414O4155J95552N8510l7852K1434L3637
5682G232892J43442M6470J45956J58275Q3872L9156Q2148M8152J78760K0382J59441
5671H338946J46332J38317K40128J15119J03215K7470J29195K65081R2289J81572
5661I777664K21427K7762J03885K25936K24324J74978Q3625M3526J09518J91171
5651A1183816K42384R6307J68822K80392O5566K00485K35024J31545J57124K68316
5641A3029781K23169K20894J55290J12756J40726J35947K31175L42491K10438
5632A4802667J19847K49708K54285K32737K32139K32676K66188K25132K20777
$$ y = [5681265, 5792683, 5895296, 5902061, 5950827, 6126345, 6245471, 6323665, 6316992, 6427014, 6490156, 6455324, 6671292, 6715041, 6721198, 6766042, 6897456, 6961611, 7157163, 7215673, 7177821, 7199255, 7232892, 7376334, 7422804, 7568760, 7727035, 7810907, 7850063, 7932211, 7980363, 8159123, 8179505, 8338946, 8485278, 8623595, 8863723, 8978842, 9082057, 9109527, 9238722, 9503803, 9596092, 9777664, 9999091, 10026853, 10130738, 10356674, 10580998, 10755976, 10839601, 10883127, 10992645, 11183816, 11426200, 11522507, 11691329, 11971721, 12037287, 12237772, 12472796, 12604341, 12761465, 13029781, 13252950, 13473844, 13629134, 13741890, 13882616, 14018563, 14249738, 14592229, 14802667, 14922514, 15172222, 15426507, 15659244, 15891383, 16124059, 16390247, 16615379, 16836156]
5623A6836156K67182L78670L49109L46642K68500K49649L90760L75845M13153
5614A9875666L78295L65160M76254M58397K86995L20300N19447N05379N05717
5605B3691610M14113M69630N81950N49759N07950N13471N48164O67310O36343
5596B8580300O34273O08016P02438P24056Q10079P67678O65189P92526Q29983
5587C5114538Q03879P05332P45315P75985R35897Q99263J024711J075771R20288
5578D3000979J000931J044289J176988J224881J171293J309844J253644J337697
5570E2520546J401209J371376J357610J466688J434242J508686J506483J632527
5562F4199367J589848J731623J792832J763539J872775J896310K051555K143614
$$ y = [16836156, 17103338, 17482008, 17831117, 18177759, 18446259, 18695908, 19086668, 19462513, 19875666, 20253961, 20619121, 21095375, 21553772, 21840767, 22161067, 22680514, 23185893, 23691610, 24105723, 24575353, 25157303, 25707062, 26215012, 26728483, 27276647, 27943957, 28580300, 29214573, 29822589, 30525027, 31249083, 32059162, 32826840, 33492029, 34284555, 35114538, 35918417, 36623749, 37369064, 38145049, 39080946, 39980209, 41004920, 42080691, 43000979, 44001910, 45046199, 46223187, 47448068, 48619361, 49929205, 51182849, 52520546, 53921755, 55293131, 56650741, 58117429, 59551671, 61060357, 62566840, 64199367, 65789215, 67520838, 69313670, 71077209, 72949984, 74846294, 76897849, 79041463]
5554G9041463K159630K292728K345686K426977K508862K613596K834210K990796
5546I9213948L102214L174867L336954L525875L616735L879680L875400M142707
5538A27868380M322384M339994M639763M880163N168671N387950N700124N945464
5530A68252893O409268O668484P084142P663232Q320755Q806521R382756R967790
5522B32555841J0762367J1390078J2040713J3074171J3820250J4677684J5523136
5515C23844240J6395190J7088215J7813792J8158391J8291026J8524428J8135477
5508D48250759J7352277J6138986J4068802J1862778Q949254N676134K276161
5501E24575151j730847n428011q748105j1925772j4544442j6575699j8107025
$$ y = [79041463, 81201093, 83493821, 85839507, 88266484, 90775346, 93388942, 96223152, 99213948, 102316162, 105491029, 108827983, 112353858, 115970593, 119850273, 123725673, 127868380, 132190764, 136530758, 141170521, 146050684, 151219355, 156607305, 162307429, 168252893, 174662161, 181330645, 188414787, 196078019, 204398774, 213205295, 222588051, 232555841, 243318208, 254708286, 266748999, 279823170, 293643420, 308321104, 323844240, 340239430, 357327645, 375141437, 393299828, 411590854, 430115282, 448250759, 465603036, 481742022, 495810824, 507673602, 516622856, 522298990, 524575151, 522844304, 517416293, 508668188, 496742416, 482197974, 465622275, 447515250]
5494D47515250j9141625j9669310j9620360j9447185j8899653j8313123j7381365
5487C15042629j6465577j5581355j4498502j3765134j2942149j2047454j1284579
5480B18457879j0591094r899976r112932q482000q078598p654891p108540o657101
5472A50872747o292044n814587n571687n201209m958869m752751m409898m120177
5464A09751525l938149l762022l514912l459276l130414l081013k968693k606125
5456H3290921k621034k522863k324905k255117k139736j999134j879922j726628
5448F5821582j691100j573801j547179j514735j487225j573420j543533j699327
5440E3191262j603079j602743j521734j388034j403952j338997j208632j184181
$$ y = [447515250, 428373625, 408704315, 389083955, 369636770, 350737117, 332423994, 315042629, 298577052, 282995697, 268497195, 254732061, 241789912, 229742458, 218457879, 207866785, 197966809, 188853877, 180371877, 172293279, 164638388, 157529848, 150872747, 144580703, 138766116, 133194429, 127993220, 123034351, 118281600, 113871702, 109751525, 105813376, 102051354, 98536442, 95077166, 91946752, 88865739, 85897046, 83290921, 80669887, 78147024, 75822119, 73567002, 71427266, 69428132, 67548210, 65821582, 64130482, 62556681, 61009502, 59494767, 58007542, 56434122, 54890589, 53191262, 51588183, 49985440, 48463706, 47075672, 45671720, 44332723, 43124091, 41939910]
5432D1939910j046175r71901j042407j143217q74564p39126q32650q37494r38471
5423C3513905q92432p73949o61781o64035o31548p28779q04647n93310o00938
5414B7162486o20361n98644n50141m95079n36442m40920l74906n28774m64090
5405B2553129l48114n65106m51690k90945l26980m59341m58337l43759l59805
5396A8949052k63933j59488l15691l78532m20771l47430k43537k81776k36911
5387A6300983k18541k20868l40233k79821k50343l03953k53990j81499k01339
5378A4050396k11183k04677k12785k11302k02946j43678l08063k79990j18156
5369A2157616k26037k37083j41120j93548k38540j58190p2312k63793j05401k0896
$$ y = [41939910, 40893735, 39921834, 38879427, 37736210, 36861646, 36122520, 35289870, 34452376, 33513905, 32621473, 31847524, 31185743, 30521708, 29890160, 29161381, 28356734, 27763424, 27162486, 26542125, 25943481, 25393340, 24898261, 24361819, 23920899, 23545993, 23017219, 22553129, 22205015, 21639909, 21188219, 20897274, 20570294, 20110953, 19652616, 19308857, 18949052, 18685119, 18525631, 18209940, 17831408, 17410637, 17063207, 16819670, 16537894, 16300983, 16082442, 15861574, 15521341, 15241520, 14991177, 14687224, 14433234, 14251735, 14050396, 13839213, 13634536, 13421751, 13210449, 13007503, 12863825, 12555762, 12275772, 12157616, 11931579, 11694496, 11553376, 11359828, 11121288, 10963098, 10890786, 10626993, 10521592, 10500696]
5359A0500696q6116k79861j87532j55469j52489k4100P6363p7445j80658j94004
5349I239385j87406r7870j77129m1317r5912k8726o4249j81699q2042j58692r4867
5338H029476p8460j8205q1925m3074j05444p0826r6958l9997p5988j05319q8959
5327G224321j03876p3543j58791n3299p0057j04884j30658L7081p4308j73912
5317F318074r0713r709j64619o9360N8889n7647j23667n3836j8341n97n0652k64864
5305E472958j38989j3308j522R5230j04615l6906j20705n259n0776q2686j42343
5294D871079J35141j09653j04867N9544q9828K2531l7470m6557J1271p5063q7137
5283D548991Q3982o6265j9856o4009o4037n3655J08212P4952j54038k9386o9014
$$ y = [10500696, 10414580, 10134719, 9947187, 9791718, 9639229, 9615129, 9691492, 9614047, 9433389, 9239385, 9051979, 8954109, 8776980, 8735663, 8639751, 8611025, 8546776, 8365077, 8283035, 8124343, 8029476, 7951016, 7932811, 7850886, 7807812, 7702368, 7631542, 7534584, 7494587, 7418599, 7313280, 7224321, 7120445, 7046902, 6888111, 6834812, 6764755, 6659871, 6529213, 6566294, 6491986, 6318074, 6227361, 6217652, 6053033, 5983673, 6042562, 5984915, 5861248, 5807412, 5789071, 5788474, 5737822, 5472958, 5333969, 5320661, 5319139, 5414369, 5309754, 5272848, 5152143, 5146884, 5096108, 5013422, 4871079, 5006220, 4896567, 4791700, 4851244, 4761416, 4783947, 4746477, 4699920, 4711191, 4636128, 4548991, 4632973, 4566708, 4546852, 4482843, 4418806, 4365151, 4473363, 4548315, 4394277, 4364891, 4295877]
5272D295877p0989m7177n4796k8294m8986k5698k9595m7842m9446L9392j5775
5261C916671l7101q058l325j06642n3245P4617k5941j72438p6353p1496j6183
5250C420506k8996O4554o0283r1189j56604j7960J16355k6615j724M6397O2932
5239C327373p4651n3916Q1794J2148q3077j16637l609J83243J14004j9624Q773
5228C375821J72679J89461J86512K6172m7771k49621k47485k15430j21973O2478
5218C130843m8453j84925j74714J70207K3550n5735j84826k9375p389K5364O6241
5207B730788k8734J2825k8709j55125J4061R8374R497o4264K8077N1113J17043
5196B784946K00061J70707J35169R8057j21059k09006k09968j38445l6875k93779
$$ y = [4295877, 4224888, 4177711, 4122915, 4094621, 4045635, 4019937, 3990342, 3942500, 3893054, 3932446, 3916671, 3879570, 3871512, 3868187, 3761545, 3708300, 3782917, 3756976, 3584538, 3508185, 3436689, 3420506, 3391510, 3456064, 3395781, 3304592, 3147988, 3130028, 3246383, 3219768, 3218044, 3264441, 3327373, 3252722, 3198806, 3280600, 3292748, 3209671, 3093034, 3089425, 3272668, 3386672, 3367048, 3375821, 3548500, 3737961, 3924473, 3950645, 3902874, 3653253, 3405768, 3190338, 3068365, 3130843, 3082390, 2897465, 2722751, 2892958, 2916508, 2860773, 2675947, 2646572, 2639183, 2664547, 2730788, 2702054, 2714879, 2686170, 2531045, 2545106, 2643480, 2652977, 2588713, 2616790, 2667903, 2784946, 2985007, 3155714, 3290883, 3388940, 3267881, 3058875, 2848907, 2710462, 2673587, 2379808]
5186B379808K5766m1174j29865M354J693n2420M2090p290j2336J9723K8993m3967
5174B215375l1603n4154m8357m6726O3619k2363J29862o3210m3939m1349m4010
5163B013145O6728P9682P0162j9653j31647n5056M6874o8434j30622q6049M264
5152A789394m4983K1054k1834j0742k7292J15348J472j12613k2013r2396j3284
5141A582111q065l461N9065L3035p6033j5282J05830j04028K2306M6148l7444
5130A604182j03786L9217j1052O1597k8976K8949k4328n0623o9837l136M7705
5119A489912K794N3847q1017l688N2101r7973N4896P4551j12251P7176K754L211
5107A516313j0134o2827K3474J8203o0788k6349m5527n2064o9146J37006K7128
$$ y = [2379808, 2405574, 2364400, 2234535, 2238889, 2240582, 2188162, 2230252, 2222962, 2210626, 2230349, 2259342, 2215375, 2183772, 2129618, 2081261, 2034535, 2098154, 2075791, 2205653, 2142443, 2098504, 2057155, 2013145, 2079873, 2159555, 2229717, 2210064, 2078417, 2023361, 2070235, 2001801, 1871179, 1785130, 1789394, 1744411, 1765465, 1743631, 1732889, 1705597, 1820945, 1822417, 1709804, 1687791, 1595395, 1582111, 1574046, 1570585, 1629650, 1662685, 1586652, 1571370, 1677200, 1573172, 1595478, 1641626, 1604182, 1500396, 1539613, 1528561, 1590158, 1561182, 1590131, 1565803, 1515180, 1445343, 1442207, 1489912, 1492706, 1546553, 1465536, 1461848, 1513949, 1415976, 1470872, 1545423, 1433172, 1510348, 1513102, 1516313, 1506179, 1443352, 1466826, 1485029, 1424241, 1397892, 1352365, 1300301, 1231155, 1368161, 1395289]
5096A395289j18201k4098o8008P6556l9675j737O2929j0408n4678O4202Q1116
5085A363287o6200l978M1056M3511q4877l7164l884j8275o823K2792J0854N4571
5073A314870o7165J3772M8378K6814p6182n3201M0458r3471r0501M5451P2856
5062A182079o9987J2490J15621m0495o0474j1557J26866K5352j65783O729m5375
5051A075466j02354J63342Q15Q0214p3521j19543Q9085n832j9658N4743l7982
5040A104775O3329M3936m8001p6617Q254J05443j35961J03816L5072M862M0158
5029A249066p382j6665N82PJ14686K5670j16009K2069P0078N605j2278j0250Q5501
5016A410680J3997m0976o8337J14696m9332j3614K0754K6458L8060N6758o4210
$$ y = [1395289, 1277088, 1252990, 1184982, 1261538, 1221863, 1220126, 1283055, 1272647, 1217969, 1282171, 1363287, 1297087, 1293109, 1334165, 1377676, 1292799, 1255635, 1251751, 1233476, 1226653, 1249445, 1260299, 1314870, 1247705, 1261477, 1309855, 1336669, 1260487, 1207286, 1247744, 1154273, 1063772, 1109223, 1182079, 1112092, 1124582, 1240203, 1199708, 1139234, 1127677, 1254543, 1279895, 1114112, 1120841, 1075466, 973112, 1136454, 1137269, 1217483, 1143962, 1024419, 1113504, 1107672, 1088014, 1142757, 1104775, 1168104, 1212040, 1164039, 1087422, 1095676, 1201119, 1065158, 1168974, 1204046, 1208908, 1249066, 1241684, 1225019, 1225601, 1225608, 1340294, 1365964, 1249955, 1272024, 1342102, 1347707, 1335429, 1325179, 1410680, 1424677, 1383701, 1315364, 1430060, 1380728, 1367114, 1387868, 1414326, 1452386, 1509144, 1444934]
5005A444934l6430l4136l3580M1948M5609L8575O2943q4819m017N6330L4395m1095
4993A490657n9318J12485N674J11174O3107k4177J4363K5069p472J19992J37995
4982A989549l177j2488K64l6624J01068R7970J06136J46670J39823J16956K44467
4971B890614J37628K23208L28515M39435N62683P00673J052038J699077K437844
4962A0471715K133699L46286j940042k564908j807195j175907q66602o27347n27150
4953C442549k94354k26733j53877j87693k29056j83506n3677q3679p8939J8096
4943A969131j69867n8252p2128j58849J83370m769j35727j758L0264K4829j52034
4932A454210L3233k7010K1117J149l6465J1190L0444j5829K0069k7514R7727K3389
$$ y = [1444934, 1408504, 1374368, 1340788, 1382736, 1428345, 1466920, 1529863, 1445044, 1441027, 1497357, 1531752, 1490657, 1431339, 1543824, 1549498, 1660672, 1723779, 1699602, 1713965, 1739034, 1731562, 1851554, 1989549, 1986372, 1973884, 1974148, 1937524, 2038592, 2136562, 2242698, 2389368, 2529191, 2646147, 2890614, 3028242, 3251450, 3579965, 4019400, 4582083, 5282756, 6334794, 8033871, 10471715, 12605414, 12951700, 11011658, 8446750, 6639555, 5463648, 4597046, 3969699, 3442549, 3148195, 2921462, 2767585, 2579892, 2350836, 2167330, 2113653, 2029974, 1951035, 1969131, 1799264, 1741012, 1668884, 1510035, 1693405, 1688636, 1552909, 1551151, 1581415, 1606244, 1454210, 1487443, 1460433, 1481550, 1482699, 1446234, 1457424, 1487868, 1472039, 1492108, 1464594, 1562321, 1585710]
4920A585710o8191N3973j26444M249J78799n13L1895j23788q554l8612r2316j22375
4908A273833O294K5027o0005l7947N1319R247O8865n7362L3422K8632K5297o6189
4896A300433N0563J03133P5895J3133j21054M583k2759K8572j05294M3357L9742
4885A410304o4833R8000N9665J18689R048m4035j67817j33206n666m9206Q464
4874A239407j3188l5750q3153O0557k121n5192J2915m320M355J46004N5052P0838
4862A395404n9476K026k2249j6283K1344q2579o3076Q648j02930P2350q8269N2388
4850A117298m0122J7499j12715J1685K4034n5914L6796j1362m3335k9986j283
4839I12595O151M4962m3755N549n6772K5416K8735m0787r907j4786Q5687k6787
$$ y = [1585710, 1517519, 1571492, 1445048, 1449297, 1628096, 1627583, 1659478, 1535690, 1527136, 1488524, 1396208, 1273833, 1280127, 1305154, 1245149, 1207202, 1258521, 1267768, 1336633, 1279271, 1312693, 1341325, 1366622, 1300433, 1350996, 1454129, 1530024, 1543157, 1422103, 1426686, 1403927, 1432499, 1327205, 1370562, 1410304, 1345471, 1443471, 1503136, 1621825, 1630873, 1586838, 1419021, 1285815, 1280149, 1230943, 1239407, 1226219, 1190469, 1107316, 1167873, 1165752, 1110560, 1123475, 1119155, 1123510, 1269514, 1324566, 1395404, 1335928, 1337954, 1315705, 1299422, 1320766, 1238187, 1175111, 1183759, 1080829, 1153179, 1064910, 1117298, 1077176, 1094675, 981960, 993645, 1017679, 961765, 998561, 987199, 943864, 913878, 912595, 918746, 963708, 919953, 925502, 868730, 894146, 922881, 882094, 872187, 857401, 943088, 916301]
4827I16301k69n0009j06500J5409q4926K7190N8029m9568R5324j1146j33557k6429
4815F49849R4729K984r9201n958R953k9738N0505j4088j19454O2718q642K1877
4803F15534K6691j2839J63698K3078o0710n7759k0254q1993j9231M8158o6184
4792E58189r04p5827N6738k8800K1433j0199R1209m2555J0595m1851o1987M7388
4780E23429N0709n5100R968J18140Q4182j42423j68514J19641p2260M8484l2994
4769D83262l056R5291N0647O7843k3623j10851L8341m8186l6784O2588m9774p4773
4757D50925l7295j3834M3344K4538j2593N4261q7662o3917n6520J42522o317J3574
4745D51026n6012r558N1876r4475k2254J18971R3024n4796L988j6831P8223J27010
$$ y = [916301, 916032, 866023, 759523, 774932, 690006, 717196, 775225, 725657, 820981, 809835, 676278, 649849, 744578, 747562, 648361, 642403, 652356, 622618, 673123, 659035, 539581, 602299, 593657, 615534, 642225, 629386, 793084, 816162, 755452, 697693, 677439, 595446, 576215, 624373, 558189, 557285, 481458, 538196, 509396, 530829, 520630, 611839, 569284, 579879, 538028, 476041, 523429, 574138, 519038, 529006, 647146, 731328, 588905, 420391, 540032, 467772, 516256, 483262, 480206, 575497, 626144, 693987, 670364, 559513, 597854, 549668, 512884, 575472, 525698, 450925, 413630, 399796, 443140, 467678, 455085, 509346, 421684, 357767, 301247, 443769, 437452, 451026, 395014, 385456, 437332, 342857, 320603, 439574, 532598, 477802, 481790, 464959, 543182, 670192]
4733F70192m0352L505j6513m2312L7326o0006P4003m2597L1213j31963Q3718K1637
4721E87851l2983R3747k5803L9916j7800J11032q775O8092K0421J04910K98925
4710A239533J82356J38727O4363j41910j15377k13301k41375o2696n9238j03636
4700F87446p4693k6203O170O5899P1693j36141P9594M4979m2010o9451p1983l8670
4688D96630J09253Q6225j03047l196M7944l1394J4381o449J53567n75k2363j01212
4676F39764R383l9184N2829q1462j6946J39412m1708L6900j26825K1199K1098
4665F14460q2377Q1516Q5987L3991p7499j31901J8774o9661K4452L0837J0354
4654E38933p5043j2934R7792N0694j7859K3873K2107r5983q7188O6316K4417N5957
$$ y = [670192, 629840, 633345, 616832, 574520, 611846, 551840, 625843, 583246, 614459, 482496, 566214, 587851, 554868, 648615, 622812, 662728, 644928, 755960, 747185, 815277, 835698, 940608, 1239533, 1421889, 1560616, 1624979, 1483069, 1367692, 1154391, 913016, 850320, 791082, 687446, 612753, 586550, 592720, 658619, 730312, 594171, 673765, 718744, 676734, 607283, 535300, 496630, 605883, 692108, 589061, 585865, 633809, 602415, 616796, 610347, 763914, 763339, 740976, 639764, 649147, 609963, 662792, 581330, 564384, 703796, 662088, 698988, 572163, 593362, 614460, 532083, 613599, 699586, 733577, 656078, 524177, 542951, 473290, 497742, 528579, 538933, 463890, 450956, 548748, 599442, 581583, 605456, 627563, 531580, 444392, 510708, 535125, 591082]
4642E91082J0443k1693o4175j32151M5135J6254j82837J94300K1142o0065m085
4631D13350O0413P931M3524p1366M0226m7410M3699l3046l9745O3299O1349q0919
4619D61305J0933l6241O580l5692M2127K2057k915M607O8000o7548m9995J05032
4607E28250n4148r2281L1176O6630P5180o9070n7152J5550l2488J18788k6709
4596E03726M0766O9754r2760o9302J56378j232L4824o205q3481K4513K9190k1715
4584E84456O2897j4652k2939n227N4433J0292M0762P2325m7153K9224k8121K6580
4572G62877Q6220k9636J4385J57183N2579m465J62960J06101J26642n4620L9117
4561A419343r3619j18140j82388j45719r6086K5090p6657K920j54989N6223M0793
$$ y = [591082, 601525, 579832, 515657, 383506, 428641, 444895, 262058, 456358, 477500, 417435, 413350, 473763, 481694, 525218, 453852, 494078, 446668, 490367, 457321, 417576, 480875, 542224, 461305, 472238, 435997, 442577, 406885, 449012, 471069, 468154, 472761, 540761, 473213, 423218, 528250, 474102, 381821, 412997, 479627, 554807, 485737, 428585, 444135, 411647, 530435, 503726, 544492, 614246, 521486, 452184, 608562, 607330, 642154, 635949, 552468, 576981, 606171, 584456, 647353, 632701, 609762, 604535, 658968, 669260, 710022, 782347, 735194, 764418, 736297, 762877, 849097, 819461, 833846, 991029, 1043608, 1039143, 1202103, 1308204, 1434846, 1380226, 1419343, 1325724, 1207584, 1025196, 879477, 783391, 808481, 731824, 734744, 579755, 635978, 676771]
4550F76771O5799j629r7326o9608O5031L4016L0528M6270n0469J7324p9275P8228
4538G15660N1003p1558Q701N8779Q8464m8938n9689Q223j3088q6482J2464M2522
4526G06061l8629R6538J54378j42222l9885l3331j5047O1246l5776m4653p224
4515F61456Q1924k0156j4159J06084m7340N9386J7668q2816O2256L8153M509j05854
4503G61111P234j23517Q8964R7593j6940P2712J9562j06949M0122M2086L1415
4492I13393K7712j1466j5010n0310q0947k0809j7501L7414L7652R9420R913O1252
4480I90713J056J11627J8417k7814L9215k1797K2631k7444j3972l480r909O2887
4468A142130O3652m8412N4645J60856L8540M1907j34709J4472n8965M5230J24134
$$ y = [676771, 742570, 740941, 643615, 574007, 639038, 673054, 703582, 749852, 699383, 716707, 637432, 715660, 766663, 695105, 703806, 762585, 851049, 802111, 742422, 750645, 737557, 651075, 663539, 706061, 667432, 763970, 918348, 776126, 736241, 702910, 687863, 749109, 713333, 668680, 661456, 743380, 723224, 709065, 815149, 767809, 827195, 844863, 762047, 824303, 862456, 866965, 761111, 768345, 644828, 733792, 831385, 814445, 887157, 906719, 799770, 839892, 881978, 913393, 941105, 929639, 914629, 864319, 783372, 762563, 745062, 782476, 820128, 919548, 929461, 990713, 991769, 1103396, 1121813, 1093999, 1133214, 1111417, 1134048, 1106604, 1092632, 1089152, 1079243, 1142130, 1205782, 1157370, 1212015, 1372871, 1411411, 1453318, 1318609, 1333081, 1274116, 1319346, 1443480]
4457A443480O7941n3558j7357j2523J76Q8614l3511o375n2118R6729J17050p3069
4445A565479J04761P5893R794Q839Q0152J9636K2050O7895p1557j4126Q9814J14228
4433B072858k9138L6701M7876R5106k064M0582L7828Q5410J47916l4629O8142
4422B566588J37593m474R484P0613R5852J01255J09998k6060j4033K01206J32204
4411C380226K8324J13604J30709R8314N7853L1752J24296J69853K24017K48330
4401D607278J04869K35675J91733J29044K60744K53900J89581J78080K08914K42495
4391F602313M04992M54084M53916M88897O71385P86663Q59686J162741J224683
4382A3109360J288688J205727R65446P83943P78021P86530J112351J648962K057127
$$ y = [1443480, 1511421, 1457863, 1440506, 1427983, 1428159, 1516773, 1483262, 1476887, 1424769, 1521498, 1638548, 1565479, 1670240, 1746133, 1755927, 1764766, 1844918, 1864554, 1886604, 1954499, 1882942, 1868816, 1958630, 2072858, 2043720, 2080421, 2128297, 2223403, 2221339, 2261921, 2299749, 2385159, 2533075, 2498446, 2566588, 2704181, 2699707, 2709191, 2779804, 2875656, 2976911, 3086909, 3060849, 3046816, 3248022, 3380226, 3408550, 3522154, 3652863, 3751177, 3809030, 3840782, 3965078, 4134931, 4358948, 4607278, 4712147, 4947822, 5139555, 5268599, 5529343, 5783243, 5972824, 6150904, 6359818, 6602313, 7007305, 7461389, 7915305, 8404202, 9075587, 9862250, 10721936, 11884677, 13109360, 14398048, 15603775, 16569221, 17353164, 18131185, 18917715, 20030066, 21679028, 23736155]
4373B3736155J757505J184494L25760j30669N077M89692J055388J679181J807006
4364C1909589J002513j77821j342368j688352j424953q93091k75503J83081j5496
4355B7277599n32414j307597j797703j871111j564615j067796p55766o53364p25464
4346A7001769r75338j231073j246981j279841r18558o61485o01668n57403l73250
4337I156172l47416l05280k74696p8160j62785k07190p6628m3690N3245O685M5484
4326G765741L5426O7401j10673O5696J551k9888j10425k07708k72344l30728k33541
4315F640508k44811k45658k45150j74708j56163j79268o619j24664q3336r271
4305E170860r6243l8387j5175K3169N0305k7850N2825Q5009O404K8732P5286M7663
$$ y = [23736155, 25493660, 26678154, 27003914, 26873245, 26878322, 27368014, 28423402, 30102583, 31909589, 32912102, 32734281, 31391913, 29703561, 28278608, 27385517, 27110014, 27293095, 27277599, 26745185, 25437588, 23639885, 21768774, 20204159, 19136363, 18380597, 17727233, 17001769, 16026431, 14795358, 13548377, 12268536, 11349978, 10688493, 10086825, 9529422, 9156172, 8808756, 8503476, 8228780, 8150620, 7987835, 7780645, 7704017, 7660327, 7713572, 7720257, 7765741, 7801167, 7868568, 7757895, 7823591, 7825142, 7795254, 7684829, 7477121, 7204777, 6874049, 6640508, 6395697, 6150039, 5904889, 5730181, 5574018, 5394750, 5388131, 5263467, 5180131, 5170860, 5074617, 5036230, 5021055, 5044224, 5094529, 5066679, 5119504, 5204513, 5210917, 5239649, 5314935, 5362598]
4293E362598N7830m2506r8191j9033L3717j01432k91678j37504j98915r7777j81749
4282D285360K5656k20900l4342j76955j58523q2353j14891N1261P391p1868J3217
4271C523053l7719j18085M756o1227L8778n0202j40941r5325J54345r2703o396
4260C118334n4062p595L0588N8322l4691j6275j21861o4847J41503Q9957P6522
4249C215895k2327m9207n2786M4680N1258l2165l4808l5861l8821M4874R7708
4238C188440M0507r1675r5230N5538Q9857J17399j5675P1358L6455O5957L042
4227C465973p150o8365L6655P6659N6160m5899J35718J16123N438J61584R8849
4216D031745O6766Q7707J06084N2406O743P3912J43044P6784K20366J36721R9113
$$ y = [5362598, 5420428, 5377922, 5279731, 5260698, 5294415, 5192983, 4901305, 4763801, 4564886, 4467109, 4285360, 4311016, 4090116, 4055774, 3878819, 3720296, 3637943, 3523052, 3574313, 3581704, 3509836, 3523053, 3485334, 3367249, 3372005, 3310778, 3349556, 3299354, 3158413, 3063088, 3217433, 3124730, 3118334, 3064272, 3056677, 3087265, 3145587, 3110896, 3094621, 2972760, 2907913, 3049416, 3139373, 3215895, 3193568, 3144361, 3091575, 3136255, 3187513, 3155348, 3120540, 3084679, 3045858, 3090732, 3188440, 3228947, 3137272, 3042042, 3097580, 3187437, 3304836, 3289161, 3360519, 3396974, 3462931, 3465973, 3458823, 3390458, 3427113, 3503772, 3559932, 3514033, 3649751, 3765874, 3771312, 3932896, 4031745, 4098511, 4186218, 4292302, 4344708, 4351451, 4425363, 4568407, 4645191, 4865557, 5002278, 5101391]
4205E101391R5032K47948P8474J11867J42591K66457K00347J86803K74469L39576
4195G044955K13013K47139L35374L64065N05754M60274O61964O83193Q37436R33516
4185A2286683J057530J170427J210789J092979J043156J125171J265593J415841
4177B1668169J606431J998116J981761J969720J786604J293650O24483o50364
4169C2278570j578803k120956k576126k933539k684845k411705k111083j681615
4161A4179898j283531r82911q42366n59013m66414l38788m20081l61769j23775
4152H801250k65816p7888m1340M7016L4345J50218J81852k0369J91569O4496k1427
4141I043906k4058j16232j49941j19356k75538l00433j01769k36017k03190j92488
$$ y = [5101391, 5196423, 5444371, 5522845, 5634712, 5777303, 6043760, 6244107, 6430910, 6705379, 7044955, 7257968, 7505107, 7840481, 8204546, 8710300, 9170574, 9832538, 10515731, 11353167, 12286683, 13344213, 14514640, 15725429, 16818408, 17861564, 18986735, 20252328, 21668169, 23274600, 25272716, 27254477, 29224197, 31010801, 32304451, 32928934, 32278570, 30699767, 28578811, 26002685, 23069146, 20384301, 17972596, 15861513, 14179898, 12896367, 11913456, 11071090, 10512077, 10045663, 9706875, 9286794, 8925025, 8801250, 8535434, 8457546, 8416206, 8463222, 8497567, 8647785, 8829637, 8809268, 9000837, 9065333, 9043906, 9019848, 8903616, 8753675, 8634319, 8358781, 8058348, 7956579, 7720562, 7517372, 7324884]
4131G324884k51785j53353k42460n1223k3771j67244l09128O377j0111k8131m6264
4120F047791j2138J9296m7867l3813O7190m032L6288J62459J12876N20P3444J65864
4108F587878P9665L3943J44526Q8957J96368J16313L5770k587P3081J28616J00530
4097G583060J1661k7105m7058J06724J18431J62945J17601P0400K36294J74851
4087H507804R8963N0233k6360L3240j4093k8329J15184P0487Q4910N9513J16801
4076I068353K32069J42787L38890L68191K65192M14057L67660O03538N39214O34910
4066A2974861P29722P64666Q42311J008761J058219J263865J715326K082416K499146
4057B4939293L203867M019681N201373O030600O031095M677099J854676j407021
$$ y = [7324884, 7073099, 6919746, 6677286, 6626063, 6602292, 6435048, 6125920, 6132297, 6122186, 6094055, 6047791, 6035653, 6054949, 6007082, 5973269, 6040459, 6036427, 6072715, 6235174, 6348050, 6348570, 6422014, 6587878, 6667543, 6701486, 6846012, 6934969, 7131337, 7247650, 7283420, 7280833, 7353914, 7482530, 7583060, 7594721, 7567616, 7520558, 7627282, 7745713, 7908658, 8026259, 8096659, 8332953, 8507804, 8606767, 8657000, 8630640, 8663880, 8649787, 8621458, 8736642, 8807129, 8892039, 8951552, 9068353, 9300422, 9443209, 9782099, 10150290, 10415482, 10829539, 11197199, 11800737, 12339951, 12974861, 13704583, 14469249, 15311560, 16320321, 17378540, 18642405, 20357731, 22440147, 24939293, 28143160, 32162841, 37364214, 43394814, 49425909, 54103008, 55957684, 54550663]
4049E4550663m049164n514968n301548l986086k879907j892176j081675l69505
4041B9475634K72209J29040l65196j546704k414513k619731k330571j988055j591059
4032A7021054j380227j129130j074290p24849q35510n71984n15312m90070l35656
4023I964026l75672l01251l36008k80766j93474k61782o3680j28456J5512L2023
4013H070472n6006J87808R5790K04239M13179M74330K79891K77055J41964l5610
4003A0053112m74640n53679n48710m75479m84079l90855l59515k22400k89940
3994F253815j77930j14139j62262j42807n7463j07542Q8334p1650M482N1641K3994
3983E588473P2880o485k1289l056r4181q9395j43509r6488l1127J45816J7323
$$ y = [54550663, 50501499, 44986531, 39684983, 35698897, 32818990, 30926814, 29845139, 29475634, 29747843, 29876883, 29511687, 27964983, 25550470, 22930739, 20600168, 18612113, 17021054, 15640827, 14511697, 13437407, 12712558, 11877048, 11305064, 10789752, 10299682, 9964026, 9588354, 9287103, 8951095, 8670329, 8476855, 8215073, 8151393, 8022937, 8038449, 8070472, 8014466, 8202274, 8298064, 8502303, 8915482, 9389812, 9669703, 9946758, 10088722, 10053112, 9578472, 9024793, 8476083, 8000604, 7516525, 7125670, 6766155, 6543755, 6253815, 6075885, 5961746, 5799484, 5656677, 5599214, 5491672, 5580006, 5508356, 5512838, 5564479, 5588473, 5661353, 5654868, 5633579, 5630523, 5536342, 5446947, 5303438, 5206950, 5175823, 5321639, 5338962]
3972E338962m0826J2336l8062o9899M056o5193L5294m1381l3904K2979j04305
3961E020057N6584o0783M3484J4758O3106J66590R5438J01696R0194R4421M2686
3950E728231j00550j89286j29626r7564k51895l02397k06371j93274j60781q3050
3940D013437j13841n1266m1401k3544R543k2978r1910r5230J5930k4513k05014
3929C369213j28890L9936o497N1405O8090n7525O8562J05765k6073o8493j07919
3918C307574k14350L5646L301j47717o3828k17343k19718j45121J0508Q378l8700
3907B318630p0029j22017r2327n2273o6986k459j887l3976j36463o026J38124
3896A872311O8654j15468o2394M6571J4960k8165j02588J02565M2586q2681l6591
$$ y = [5338962, 5298136, 5310472, 5272410, 5202511, 5206567, 5141374, 5176668, 5135287, 5101383, 5124362, 5020057, 5076641, 5015858, 5059342, 5074100, 5137206, 5303796, 5399234, 5500930, 5591124, 5685545, 5728231, 5627681, 5438395, 5308769, 5211205, 4959310, 4656913, 4450542, 4257268, 4096487, 4013437, 3899596, 3848330, 3806929, 3783385, 3792928, 3769950, 3678040, 3582810, 3598740, 3574227, 3369213, 3240323, 3280259, 3273762, 3325167, 3393257, 3335732, 3404294, 3510059, 3483986, 3415493, 3307574, 3093224, 3128870, 3132171, 2984454, 2920626, 2703283, 2483565, 2338444, 2348952, 2357330, 2318630, 2248601, 2126584, 2034257, 1981984, 1914998, 1912539, 1910652, 1876676, 1740213, 1734187, 1872311, 1940965, 1825497, 1763103, 1809674, 1824634, 1796469, 1693881, 1796446, 1839032, 1756351, 1719760]
3885A719760J15984q1710N9006O0565n468p0426L05o0091j01172M1260K8777o9178
3873A637612N5327M0448M0389n1317M5791k17226n8174J07888O3910n0527m8247
3862A565874l4269p975Q4545K6937R9058j5911n6590j6828K416R9252L9333q9074
3850A696768P0039P854k0767K2131M1304k2777k4599M4893L0898j00300P4796
3839A820240r8839K9216L1397j18026k4621q7073j1155K8849j01669j3994l6847
3828A417478J03005k32265j06691J44559l5149j1508L0411k759j03230J3486K5701
3817A243038K1006o5955k6895K7353o595n5371l546J09324j5290k5599n0025o6156
3805A085289q0947l2838O8548N0578K861k7566m4501J2329j22165p7266q0111
$$ y = [1719760, 1835744, 1754034, 1813040, 1873605, 1868137, 1797711, 1798016, 1737925, 1636753, 1678013, 1706790, 1637612, 1692939, 1733387, 1773776, 1722459, 1768250, 1551024, 1492850, 1600738, 1664648, 1614121, 1565874, 1531605, 1523630, 1608175, 1635112, 1734170, 1718259, 1661669, 1644841, 1647257, 1746509, 1785842, 1696768, 1766807, 1774661, 1753894, 1776025, 1817329, 1794552, 1769953, 1814846, 1845744, 1745444, 1820240, 1721401, 1750617, 1782014, 1663988, 1639367, 1552294, 1541139, 1569988, 1468319, 1454325, 1417478, 1520483, 1288218, 1181527, 1326086, 1290937, 1279429, 1309840, 1307081, 1203851, 1217337, 1243038, 1264044, 1198089, 1171194, 1198547, 1191952, 1136581, 1133035, 1242359, 1227069, 1201470, 1151445, 1085289, 1004342, 971504, 1040052, 1090630, 1093491, 1065925, 1021424, 1033753, 911588, 834322, 754211]
3794G54211k7367o3996R7800O1918m9139k2645L7283J04537J9617j18070L3014
3783H27163Q6823j16528O0872k6306o9714J593k3381j35608M1588K9416k0045
3772F55873L4499O6648l7725L1098K3713q7754M1834j6542O3180l9082J9406K04761
3760I59909j56272q2216Q6007l6624l8405L5325r3498j9190O7117N6716L1065
3749H09934j16412L8790P0983r1973j7112m9617j1339K4278L3193p0696M1798
3738F61827k7434q2627j7270N4939k7529Q356j676n141k0411n6068j0469J44069
3726F20566p4009m7919M3973L9542m0441j22115J35761p3694n6314k2882J42727
3715E45195L2743n174k332P609q4957L777J69799J4341J4703j12725p011J07027
$$ y = [754211, 726844, 662848, 760648, 822566, 773427, 750782, 788065, 892602, 912219, 794149, 827163, 913986, 797458, 858330, 832024, 762310, 763903, 740522, 604914, 646502, 675918, 655873, 690372, 757020, 719295, 750393, 774106, 686352, 728186, 711644, 774824, 735742, 755148, 959909, 803637, 721421, 807428, 770804, 732399, 767724, 674226, 655036, 722153, 778869, 809934, 693522, 732312, 803295, 711322, 694210, 644593, 633254, 657532, 690725, 620029, 661827, 634393, 551766, 534496, 589435, 561906, 570262, 568586, 563445, 543034, 486966, 476497, 620566, 546557, 498638, 542611, 582153, 541712, 419597, 555358, 481664, 425350, 402468, 545195, 577938, 572764, 570432, 578041, 493084, 496861, 666660, 681001, 695704, 582979, 575968, 682995]
3703F82995n3349j5478j26328j00942R416J39781Q9696k6441j366k00316J0274
3692D07942P1860n0925R8880n0051l0574R67R989l2609J34861m2544m5813K0208
3680D92191m9022q0766M1378J03607M9025O983j40578P8834K3052o9423j178N547
3668D59650J0599l3344Q5435L0549n1441j35390l6956j4973J4219N2197n6167
3657C24378M0528R1835J07536j72741k1960l9236Q0454O417q9166Q4381K7749
3646D40175k8791q2813O5672M693o3323J5702N7199j46156l5419Q2723N0263l1141
3634C28784m2045J15672j22073O710O4941J8302r5756O043J12279N1462N3558
3623D97877j5024K0359r606n7178n9527R492o237L6920Q5055r2494P149K5513
$$ y = [682995, 629646, 614168, 487840, 386898, 396314, 536095, 625791, 599350, 597984, 397668, 407942, 479802, 428877, 527757, 477706, 447132, 448099, 458088, 425479, 560340, 517796, 471983, 492191, 443169, 362403, 403781, 507388, 556413, 563396, 422818, 501652, 524704, 455281, 454103, 459650, 470249, 436905, 522340, 552889, 501448, 366058, 329102, 314129, 328348, 380545, 324378, 364906, 456741, 564277, 391536, 369576, 330340, 410794, 417211, 328045, 412426, 440175, 411384, 328571, 394243, 398936, 335613, 351315, 408514, 262358, 226939, 309662, 359925, 328784, 286739, 402411, 280338, 287048, 351989, 370291, 274535, 280578, 392857, 444319, 497877, 482853, 503212, 493606, 436428, 376901, 386393, 380156, 417076, 502131, 409637, 416786, 442299]
3611D42299O9991j35865q275K281j03459J9198N0846N3730n082J10298k1172o3112
3599D11678j55393M595p4400J43590M3254L5253l6888m0189K4218J20848j5821
3588D60745n8794R537o6365L4897m4284o155O4N5236R3967l411J14P2188p6224
3575D71515q9993M7895M5787l4378p7605j5214P9412q5360L4927M278j5021K6183
3563C92426o357l1472J44257R1907o7137r9734N8876J16224o305j33201N8174
3552E17658L8303j27717O7545l4073l3396m8943J2305K06286J06248r973o4921
3541F29322J695L130l7198j2844L4100N1711L8964j2985K7784K5233O7939K8340
3529H45191L3367m7572p3185k6292M446k5798n9605o6197Q3336j33165l3396J48468
$$ y = [442299, 512290, 376425, 368150, 370431, 266972, 286170, 337016, 390746, 385664, 495962, 474790, 411678, 256285, 260880, 186480, 330070, 373324, 408577, 371689, 331500, 355718, 476566, 460745, 401951, 411488, 345123, 380020, 335736, 329581, 329645, 384881, 478848, 475437, 475551, 547739, 471515, 381522, 429417, 475204, 440826, 363221, 348007, 427419, 342059, 376986, 381264, 366243, 392426, 386069, 354597, 498854, 590761, 523624, 423890, 482766, 598990, 592685, 459484, 517658, 555961, 428244, 495789, 461716, 428320, 379377, 391682, 597968, 704216, 694243, 629322, 631017, 634147, 596949, 584105, 618205, 669916, 708880, 695895, 723679, 748912, 816851, 845191, 878558, 830986, 757801, 731509, 735955, 710157, 650552, 584355, 667691, 534526, 501130, 649598]
3517F49598k218J9403l5793j6867K1560j5963j3498m5032j2247J91833k0148J14661
3505H35289l3956j1509J5203l5541O570K1788q4612p9570L2549M2977k1218J16033
3493H04003j6159J5257O5650N8503K304m7464M919K2722J085k0625k1704j8038
3481H50453M061J5440k3293r1101L4221n6359J1149j9148N1446K8245q914L1370
3469H27570L0358p4614j21113j1982J22478P5893j39432N5953k7435p9514l4558
3458F23604P4953L5693j41837Q6416J01468N0187l3663Q476m1424O098R335k3710
3446G55596k3390R1329p199Q0461L265m7100P2317L2329q5739l5873O2254l8877
3434H59373Q2348M7621l7531q3538J07525O2866K7888q5935K8448K4548m2182
$$ y = [649598, 647380, 666783, 630990, 614123, 635683, 619720, 606222, 561190, 548943, 740776, 720628, 835289, 801333, 789824, 805027, 769486, 776056, 797844, 713232, 633662, 666211, 709188, 687970, 804003, 787844, 803101, 868751, 927254, 929558, 882094, 887013, 909735, 910820, 890195, 868491, 850453, 854514, 869954, 846661, 755560, 789781, 733422, 744571, 725423, 776869, 805114, 796200, 827570, 857928, 783314, 662201, 650219, 772697, 848590, 709158, 765111, 737676, 658162, 623604, 698557, 734250, 592413, 678829, 780297, 830484, 796821, 805297, 763873, 769971, 779306, 755596, 732206, 823535, 816336, 896797, 900062, 852962, 925279, 957608, 871869, 835996, 898250, 859373, 941721, 989342, 951811, 868273, 975798, 1038664, 1066552, 980617, 1009065, 1033613, 991431]
3423I91431J2445j6935o6213P8585R7067N0403N162j1180j41220Q804O3290o704
3411A064935O5654l6692l3014m829m9334k7505P9417K9598J7937M8538J22428
3400A277133n4616o0615p016M0067Q0310P075m2252O3237L1729K4498L7382l1694
3388A365238q4736Q1662P5798L8504r2131P8096Q6502k0341n848q4870R0571J26136
3376A654581O7524k7196p6307q241K7006K82p605Q740r7J02486R857K1440P1152
3363A843622L0747j05485K2405P2054O6934m4162K448P2432k6777J45387k1810
3352B057795L819m8844P5184M8288j44985M3291J09816N5574p623P4030P7425
3341B343770n0428j5067K4274P7982M1691j11997J0922J65648q4605L3035J58070
$$ y = [991431, 1003876, 986941, 920728, 999313, 1096380, 1146783, 1151945, 1140765, 999545, 1008349, 1071639, 1064935, 1130589, 1093897, 1060883, 1056054, 1006720, 979215, 1058632, 1088230, 1106167, 1154705, 1277133, 1222517, 1161902, 1154886, 1194953, 1275263, 1282338, 1240086, 1303323, 1335052, 1359550, 1396932, 1365238, 1280502, 1362164, 1437962, 1476466, 1384335, 1462431, 1548933, 1528592, 1522744, 1437874, 1528445, 1654581, 1722105, 1694909, 1618602, 1610361, 1637367, 1637649, 1630044, 1638784, 1638687, 1741173, 1751030, 1772470, 1843622, 1874369, 1768884, 1791289, 1863343, 1930277, 1886115, 1888563, 1960995, 1934218, 2079605, 2057795, 2061614, 2012770, 2087954, 2136242, 1991257, 2034548, 2144364, 2199938, 2192315, 2266345, 2343770, 2293342, 2278275, 2302549, 2380531, 2422222, 2310225, 2321147, 2486795, 2402190, 2435225, 2593295]
3330B593295P7271j03625J49728N0109m1782J23291K8265J7274J15793J57268
3320C166887o0107J8466P4023j07521P3959J62879J26699P8663K999K3391J27338
3309C687676P3042R7661J58409J5126R9286Q6312J10955J53313N0979K0809J01293
3298D654861J64301J48913K23123N7927J20884J14178Q3622J60564M1753K16754
3288E986880K95772J34506J40423K39331J82766J90874K94695J39627L53873L22271
3278H281018K61366K67012K53573M56367L68738L17334K99521N27610M70560M27523
3268A1930622M50963N63607M41694M82635N96763O23912P20372R71831Q87810
3259A7670209J056973J281066J516905J715109J962593K336836K713936L312105
$$ y = [2593295, 2670566, 2566941, 2716669, 2766778, 2724996, 2848287, 2876552, 2893826, 3009619, 3166887, 3106780, 3125246, 3199269, 3091748, 3165707, 3328586, 3455285, 3533948, 3536947, 3560338, 3687676, 3760718, 3858379, 4016788, 4031914, 4131200, 4217512, 4328467, 4481780, 4532759, 4553568, 4654861, 4819162, 4968075, 5191198, 5249125, 5370009, 5484187, 5567809, 5728373, 5770126, 5986880, 6282652, 6417158, 6557581, 6796912, 6979678, 7170552, 7465247, 7604874, 7958747, 8281018, 8542384, 8809396, 9062969, 9519336, 9888074, 10205408, 10504929, 11032539, 11503099, 11930622, 12381585, 12945192, 13386886, 13869521, 14466284, 15090196, 15810568, 16782399, 17670209, 18727182, 20008248, 21525153, 23240262, 25202855, 27539691, 30253627, 33565732]
3251C3565732M385627N738589P836781J0063848J0961241P498403o58387p792124
3243G1599710j0106167q565041o418449m923797l677341k802497k095651j510214
3235C1500553r64960p58637n81752l64018m96752l43997o0996K10704L35085M79267
3225B8954497P58127R72207J173666J722523K284820K840669L511491L883201
3217D6101201L267130J731213l42981j447228j527335q35358K59600J494382K887172
3208E1587796M178304N172897M878858K193198j955440n446090o688224o094682
3200D7826617n012172m074194l106338k590076j926298j575500j251162r53053
3192B7337824p04025l62703j93430n9562P233k00578o23895j020467j332856j370048
$$ y = [33565732, 37951359, 43689948, 51526729, 61590577, 72551818, 80050221, 79391834, 71599710, 61493543, 52928502, 46510053, 41586256, 37908915, 35106418, 33010767, 31500553, 30535593, 29776956, 29195204, 28831186, 28334434, 27990437, 27929441, 28140145, 28475230, 28954497, 29712624, 30684831, 31858497, 33581020, 35865840, 38706509, 42218000, 46101201, 49368331, 51099544, 50756563, 49309335, 47782000, 46946642, 47206242, 48700624, 51587796, 55766100, 60938997, 65817855, 68011053, 66055613, 60609523, 53921299, 47826617, 42814445, 38740251, 35633913, 33043837, 31117539, 29542039, 28290877, 27337824, 26633799, 26271096, 26077666, 26018104, 26025337, 25824759, 25200864, 24180397, 22847541, 21477493]
3182B1477493j174374q46854p72592p37302o95557l72828l37647l06816k76290
3173A5957233j55508k60955j86450o8665l7324O4929R3760J61782J99095L58101
3163A6125998L02634M11159N65450P55932Q31066J016272J182583J402609J402414
3154B3996117J705731J989432K300293K969125L637394M444965M598269L223673
3146D8864999J78410l270760n059952m878183l989063l071886k193721j521258
3138B5058586j184751o71803o57644r29206j021384j310500j374891j388246j275719
3129A5244442r98267r47047p68649n60680m83685n34928l91752m13766l18158
3120I827510m88031m75157n17337k81286l31568k87569k82463l17216j27831k73916
$$ y = [21477493, 20303119, 19456265, 18683673, 17946371, 17250814, 16877986, 16540339, 16233523, 15957233, 15801725, 15540770, 15354320, 15285655, 15248331, 15313260, 15407020, 15568802, 15767897, 16125998, 16428632, 16839791, 17405241, 18161173, 18992239, 20008511, 21191094, 22593703, 23996117, 25701848, 27691280, 29991573, 32960698, 36598092, 41043057, 45641326, 48864999, 49043409, 45772649, 40712697, 35834514, 31845451, 28773565, 26579844, 25058586, 23873835, 23202032, 22544388, 21615182, 20593798, 19283298, 17908407, 16520161, 15244442, 14246175, 13299128, 12530479, 11969799, 11486114, 10951186, 10559434, 10145668, 9827510, 9339479, 8864322, 8346985, 8065699, 7734131, 7446562, 7164099, 6846883, 6719052, 6445136]
3110F445136k38460j50001r6463j44019j01611j93600j46285j87431o3705o5448
3100E058113m1660M8195q4448l1395j04110n9180j06217N419j84362k49735n6079
3089D194541q7043j05688j10327n7987l9299j44922O362r1704j66759Q5165L441
3078C485780J37513J42637J84913K4656j77680j86347k27899p3353k05113j31997
3068B973110j08051o0474r1172j23926j179j03773m9080M377j14636j2628J06040
3057B418608q8108p7029o028J16748j7312r4986J05173q308l0682J60365K21189
3046B699630K99991M04281N19563N3518l25999n11192l92896j73484j89353k45326
3036B138733j14393k4734r5917j3445n8114n5410o9758o4905K6012M5229R416
$$ y = [6445136, 6206676, 6056675, 5960212, 5816193, 5714582, 5520982, 5374697, 5187266, 5123561, 5058113, 5016453, 5064648, 4980200, 4948805, 4844695, 4785515, 4679298, 4684717, 4500355, 4250620, 4194541, 4107498, 4001810, 3891483, 3833496, 3794197, 3649275, 3655637, 3563933, 3397174, 3482339, 3485780, 3623293, 3765930, 3950843, 3975499, 3797819, 3611472, 3383573, 3310220, 3105107, 2973110, 2865059, 2804585, 2713413, 2589487, 2588308, 2484535, 2435455, 2439832, 2325196, 2312568, 2418608, 2330500, 2253471, 2247443, 2364191, 2346879, 2251893, 2357066, 2348758, 2318076, 2478441, 2699630, 2999621, 3403902, 3923465, 3976983, 3650984, 3139792, 2746896, 2573412, 2384059, 2138733, 2024340, 1999606, 1903689, 1890244, 1832130, 1776720, 1706962, 1642057, 1668069, 1713298, 1722714]
3025A722714o1654l9418J29848l6316j32065k4737N219R0217J13441K5078M1231
3014A833558N5328J89479L01615j6355j22723l34413k71808j46171J1505l0765
3004A469250k6720m9698j36399j83313R157M9653m9218n1305J9159J09304o4274
2993A095596j1836m6378j85090J41274N9599k6495O7176N0496n4639k9073k8217
2982A032413k2114k3489K2024J3713j858o8667k0942m2798o0198m7851m2463J1456
2970G49226O4140J1984N3162O3447p3333Q47l2139O7578J03878p257j01682n9488
2958H40363N29R4804j311k2107q6875p8938k076O6741r8987k9945j9743K7388
2946F89843K1388M1554m8858N5020o9109p4070N6540K8578K4988O1585K4951n6603
$$ y = [1722714, 1661060, 1621642, 1751490, 1715174, 1583109, 1558372, 1563591, 1653808, 1767249, 1792327, 1833558, 1888886, 2078365, 2379980, 2363625, 2240902, 1906489, 1634681, 1488510, 1500015, 1469250, 1442530, 1392832, 1256433, 1073120, 1082277, 1131930, 1082712, 1031407, 1050566, 1159870, 1095596, 1083760, 1037382, 852292, 993566, 1053165, 1026670, 1093846, 1144342, 1089703, 1060630, 1032413, 1010299, 986810, 1008834, 1022547, 1020689, 952022, 931080, 888282, 828084, 780233, 737770, 749226, 813366, 825350, 878512, 941959, 868626, 869473, 837334, 904912, 1008790, 1001533, 899851, 840363, 840892, 935696, 934385, 912278, 825403, 746465, 744389, 811130, 712143, 682198, 662455, 689843, 711231, 752785, 703927, 758947, 689838, 615768, 672308, 700886, 725874, 787459, 812410, 755807]
2934G55807q4895K504p429M4501j15639R1941M4208Q6805Q0348l885j23292k8800
2922G42174J02977j4030l4143L5684K5876l3580N0675n9874q021n5636p638O7906
2910H12370m7325n006j02204k8192L1061j0272P3180q6195l3072j5427M9582j6712
2898F21788n3976j22224M7207J4581k9958J7269q344L4169R5034m2023o8436M4842
2886E49929q1065Q6377K176j3079j3100M7363n7905J158J58456j92297j13687
2875C74326P8745O2255Q2303O4381N0230l3748j39692J45440q0360j46029R1643
2864E49494R8239j31607m057J27375M6745n1959j4051k3293M0394K7819j1462
2853F53637l2342n3891n6991k4714n226j30767M62Q9815M9051o052L863j3340
$$ y = [755807, 670912, 673416, 665987, 710488, 594849, 686790, 730998, 817803, 898151, 894266, 770974, 742174, 845151, 831121, 796978, 832662, 858538, 824958, 875633, 815759, 807738, 752102, 744464, 812370, 765045, 760039, 657835, 629643, 660704, 650432, 723612, 637417, 604345, 588918, 638500, 621788, 567812, 445588, 492795, 507376, 477418, 494687, 486343, 520512, 615546, 573523, 505087, 549929, 468864, 555241, 557417, 544338, 531238, 578601, 520696, 521854, 680310, 488013, 374326, 453071, 515326, 597629, 662010, 712240, 678492, 538800, 684240, 603880, 457851, 549494, 647733, 516126, 512069, 639444, 686189, 634230, 620179, 596886, 637280, 665099, 653637, 621295, 567404, 510413, 485699, 480473, 349706, 350168, 439983, 489034, 482982, 486845, 473505]
2841D73505R338J8603j6281q9791n9197l4224O2386J31590o3780r7558o3599O6448
2829C37440R2524K7179j43633O6340P4975k9161p5855l3282j7843k5223q1974
2818A91487p6049Q2100j9892J04792M7846q1425P625J6419n3884N4246p6653m003
2806A92609M4237m4848M7648m3276L6276p2277M6034J03796K5701p3326J207K2268
2794B86049l3883M5635n3256k1785k6841Q1286L7681j26740P6171j9082l2948
2783B12287j4094j8313Q7653r1211l0509l0087O8973P3454r532j3357k0567j46599
2771F8098K2916L9410M1501J11385k3628j53974M3544J0848m4488l7292J09070
2760A87390N5014j9416M97l5882k1328k7604Q7627n4387m0248R8220p6104K327
$$ y = [473505, 482843, 501446, 485165, 395374, 336177, 301953, 364339, 495929, 432149, 334591, 270992, 337440, 429964, 457143, 313510, 379850, 454825, 425664, 349809, 316527, 298684, 273461, 191487, 115438, 197538, 177646, 282438, 330284, 248859, 256484, 272903, 219019, 273265, 196612, 192609, 236846, 191998, 239646, 196370, 232646, 160369, 206403, 310199, 335900, 262574, 263781, 286049, 252166, 297801, 244545, 222760, 195919, 277205, 314886, 188146, 264317, 245235, 212287, 198193, 179880, 267533, 176322, 145813, 115726, 184699, 258153, 248621, 235264, 214697, 68098, 91014, 130424, 171925, 283310, 259682, 105708, 149252, 160100, 115612, 78320, 187390, 242404, 222988, 223485, 187603, 166275, 138671, 226298, 171911, 131663, 229883, 153779, 156106]
2748A56106J5173o1430J8202J1166N953k4165q1808k4537J52439M1574n7999M0960
2736A91634p538m3299j30326J6149l1830N3058J35911L0153J0157J3098o5106
2725A72061p0583l6077O5493R2686p5389m2776M9032l2387j06092N0273j3715
2714E2526N5172p076O8652N632L883r6333L4052M46K043j477j0233k5184K2881
2701A04984j29643M0282J21482J22741q278j77181k1507m0850r544Q58j2954K8121
2689A8511J3807k8328J38381K187k075p4736k6235q108O1938l3869J10357j23816
2677D8014k01401R0397O5689k4003R1619m9894l9254P5263q8931k7873K5997J9663
2665a4714M7626m3669P4228P7785R520l1929n9722k5490K2921M7485l3670r1279
$$ y = [156106, 171279, 109849, 128051, 139217, 145170, 121005, 39197, 14660, 167099, 208673, 150674, 191634, 184096, 140797, 10471, 26620, -5210, 47848, 183759, 213912, 224069, 237167, 172061, 101478, 65401, 130894, 223580, 148191, 105415, 154447, 122060, 15968, 66241, 52526, 107698, 100622, 169274, 174906, 178789, 82456, 116508, 116954, 118997, 117520, 107287, 82103, 104984, -24659, 15623, 137105, 259846, 251568, 74387, 52880, 12030, 2486, 3344, -9610, 18511, 32318, 3990, 142371, 144558, 142483, 67747, 41512, 33404, 95342, 61473, 171830, 48014, -153387, -62990, 2699, -21304, 70315, 20421, -18833, 56430, -32501, -60374, -34377, -14714, 32912, -10757, 63471, 141256, 150776, 118847, 59125, 33635, 56556, 104041, 70371, -20908]
2653b0908K5365l2458k3050P5034j1964N9222q2295L0830L702J891M4668N2609
2641A22646o6622J4784J14722r3692q1400j8848K7339R8424j2373r1089J12424
2630A26315O7556j05513l316J24880m7230K9985j56157r9505R9207J762p8660
2619d0676O9979Q157j6306K0971o5210P9752N5818l4883P9655Q8837j38237j17046
2607i189m2909P9903p9427P6866O1321m2058p8532J92537j0665N3122n4664l7680
2595A08625l8219J09358j7836k7420r4486J3757J26697o7667n4915n7544J3955
2584A4305K823p1805k5954L5229r178J7127J05452J0139j33306J17837J954n0172
2572A4451r3690Q4928J13181k6549p3407N5085N2602j1368j81848J7236J61M4739
$$ y = [-20908, 4457, -28001, -51051, 23983, 12019, 71241, -11054, 19776, 23478, 25369, 70037, 122646, 56024, 70808, 185530, 91838, 10438, -8410, 18929, 117353, 104980, 13891, 126315, 193871, 88358, 85042, 209922, 162692, 192677, 36520, -62985, 36222, 37984, -40676, 29303, 37460, 21154, 42125, -23085, 56667, 112485, 77602, 157257, 246094, 107857, -9189, -52098, 27805, -51622, 25244, 86565, 44507, -34025, 158512, 147847, 200969, 146305, 108625, 70406, 179764, 161928, 134508, 40022, 53779, 180476, 112809, 57894, 350, 14305, 17128, -54677, -80631, -45402, -54580, -37453, 67999, 78138, -55168, 62669, 64623, 14451, -79239, 5689, 118870, 92321, 18914, 73999, 126601, 115233, -66615, -49379, -49218, -4479]
2560d479M9700O9085J8761q8562n5307J01799L0758l4382j0357P68n4713p6958
2548e3887P5416n2210J00144P2338n2879j7539l3341M9681J6031j6690l7027m1148
2536H889J3646J22371J5052l0285j4963j265j21909p0122P971P9144J5760M8256
2524G2545k4968j9148j2540m3019j12278q1076J25413N8136L8518o0020K8017
2513c0420O2335m8268n9555J9544O9727p954q9229Q2431N3137p5611k3893l472
2501e1228j3536R1534m7618K6332m1465l3358J80574p9154M3645j11308k4L7722
2489B116q0677L1012J20123q4513j3338m2151P2594Q5912p4044L3418k80J5506
2477F5678M8898j3318j23346j4454j8287k981L5138l8438l52N4757n2233j2627
$$ y = [-4479, 45221, 114306, 133067, 44505, -10802, 90997, 121755, 87373, 77016, 77784, 23071, -53887, 21529, -30681, 69463, 141801, 88922, 71383, 38042, 87723, 103754, 87064, 50037, 8889, 22535, 144906, 159958, 129673, 114710, 113445, -8464, -78586, -70615, 8529, 24289, 72545, 47577, 28429, 15889, -27130, -139408, -220484, -95071, -36935, 1583, -58437, -30420, 31915, -16353, -75908, -56364, 13363, 5409, -83820, -1389, 51748, -23863, -47756, -51228, -64764, 26770, -20848, 5484, -35981, -69339, 111235, 32081, 75726, -35582, -35606, 2116, -78561, -47549, 72574, -11939, -25277, -67428, 5166, 91078, 17034, 50452, 50172, 65678, 114576, 101258, -22088, -36542, -54829, -57810, -22672, -61110, -61462, -6705, -58938, -71565]
2465g1565P1095O4837K9471n280l7196O3686j55930O7370l2216j0056l5286J06503
2453E5433L8906M0815n0356k8742n5487l4693R7960L9791l5656j09716q8439P2776
2441e7408Q3822j2938j2393Q1100o25J7073j36140J2014P1908K4914m6589O905
2429C1643N5664L1322J4787k4007j720j64999k0567j555P1220p4312N445M4755
2417c2324P8587K773n4344p8008R2354O073P8576m7705q4252j8567J49181l9847
2405E2497k5946l278m3917P1984J1297L99j02857k192Q3850o597j1882m4146n3090
2392g3878N3518M9467K6368q8265M092L7372P1354q1595n2565J1938q3528J8041
2380a07681M3160R6131m9809l7089k2863J01165Q719K9813n8242K0306K9210P0420
$$ y = [-71565, -470, 64367, 93838, 88558, 51362, 115048, -40882, 26488, -5728, -15784, -51070, 55433, 94339, 135154, 84798, 56056, 569, -34124, 63836, 103627, 67971, -41745, -130184, -57408, 26414, 13476, 1083, 82183, 81558, 98631, -37509, -25495, 46413, 71327, 24738, 31643, 87307, 118629, 133416, 109409, 107689, -57310, -77877, -79432, -8212, -82524, -77079, -32324, 46263, 49036, -5308, -83316, 9038, 15111, 93687, 45982, -38270, -56837, 92344, 52497, 26551, 23273, -20644, 51340, 62637, 63036, -39821, -42013, 41837, 35240, 23358, -20788, -73878, -20360, 29107, 55475, -32790, -28698, 8674, 80028, -1567, -54132, -42194, -125722, -107681, -64521, 31610, -18199, -55288, -78151, 23014, 31733, 61546, 3304, 23610, 52820, 123240]
$$ [...]
##END NTUPLES=NMR SPECTRUM
##END=
