##TITLE=1H_EC-3296(XI-3)
 CDCl3
 8 sc, 
 6.7.2023
##JCAMPDX= 6.0         $$ Bruker NMR JCAMP-DX V2.0
##DATA TYPE= NMR SPECTRUM
##DATA CLASS= NTUPLES
##ORIGIN= UXNMR, Bruker Analytische Messtechnik GmbH
##OWNER= root
$$ XWIN-NMR		Version 3.5
$$ Thu Jul  6 14:36:59 2023 Russian Standard Time (UT+4h)  she@DPX200
##.OBSERVE FREQUENCY= 200.13135
##.OBSERVE NUCLEUS= ^1H
##.ACQUISITION MODE= SIMULTANEOUS
##.ACQUISITION SCHEME= undefined
##.AVERAGES= 8
##.DIGITISER RES= 18
##SPECTROMETER/DATA SYSTEM= spect
##.PULSE SEQUENCE= zg30
##.SOLVENT NAME= CDCl3
##.SHIFT REFERENCE= (INTERNAL, CDCl3, 0, 15.7546)
##AUDIT TRAIL= $$ (NUMBER, WHEN, WHO, WHERE, WHAT)
$$ ##TITLE= Audit trail, XWIN-NMR		Version 3.5
$$ ##JCAMPDX= 5.01
$$ ##ORIGIN= Bruker BioSpin GmbH
$$ ##OWNER= she
$$ F:/spectra/data/she/nmr/H-F/1/pdata/1/auditp.txt
$$ ##AUDIT TRAIL=  $$ (NUMBER, WHEN, WHO, WHERE, WHAT)
(   1,<2023-07-06 14:35:43.56 +0400>,<she>,<DPX200>,
      <created by zg, POWCHK disabled, PULCHK disabled
       configuration hash MD5:
       00 E9 B6 7A A2 85 ED C7 34 08 36 98 17 FE 4E 26
       data hash MD5: 16K
       8C 68 84 50 A6 06 5A 7C CD 33 02 7F 3E D3 A0 F4>)
(   2,<2023-07-06 14:35:46.07 +0400>,<she>,<DPX200>,
      <Start of raw data processing
       efp BC_mod = 2 LB = 0.24 FT_mod = 6 PKNL = 1 PHC0 = -20783.34 PHC1 = 3.65272 SI = 16K 
       data hash MD5: 16K
       32 EE 91 C7 44 E4 CD A0 B8 FA 32 49 12 B6 66 8D>)
(   3,<2023-07-06 14:36:05.70 +0400>,<she>,<DPX200>,
      <pk PHC0 = -3.541161 PHC1 = 7 
       data hash MD5: 16K
       82 79 DC 81 D7 03 29 9B E1 87 A1 27 56 D5 8D 89>)
(   4,<2023-07-06 14:36:08.98 +0400>,<she>,<DPX200>,
      <abs ABSG = 5 
       data hash MD5: 16K
       A4 85 0F 1E 4F 51 40 C5 81 F2 75 AA 41 AD C5 3A>)
$$ ##END=
$$ 
$$ hash MD5
$$ 0F 0A 30 C3 99 F7 89 41 5B 61 69 F0 D0 57 30 00
##$RELAX= 
##$RELAX= 
##$RELAX= 
##$RELAX= 
##$RELAX= 
##$RELAX= 
$$ Bruker specific parameters
$$ --------------------------
##$DU= <F:/spectra>
##$EXPNO= 1
##$NAME= <H-F>
##$PROCNO= 1
##$TYPE= <nmr>
##$USER= <she>
##$AMP= (0..31)
100 100 100 100 100 100 100 100 100 100 100 100 100 100 100 100 100 100 
100 100 100 100 100 100 100 100 100 100 100 100 100 100 
##$AQSEQ= 0
##$AQ_mod= 1
##$AUNM= <au_zg>
##$AUTOPOS= <>
##$BF1= 200.13
##$BF2= 200.13
##$BF3= 200.13
##$BF4= 200.13
##$BF5= 200.13
##$BF6= 200.13
##$BF7= 200.13
##$BF8= 200.13
##$BYTORDA= 1
##$CFDGTYP= 0
##$CFRGTYP= 5
##$CHEMSTR= <none>
##$CNST= (0..31)
1 1 145 1 1 1 1 1 1 1 1 1 1 1 1 1 1 1 1 1 1 1 1 1 1 1 1 1 1 1 1 1 
##$CPDPRG= <>
##$CPDPRG1= <>
##$CPDPRG2= <>
##$CPDPRG3= <>
##$CPDPRG4= <mlev>
##$CPDPRG5= <mlev>
##$CPDPRG6= <mlev>
##$CPDPRG7= <mlev>
##$CPDPRG8= <mlev>
##$CPDPRGB= <>
##$CPDPRGT= <>
##$D= (0..31)
0 1.2 0 0 0 0 0 0 0 0.06 0 0.03 0 0 0 0 0.0002 0 0 0 0 0 0 0 0 0 0 0 0 
0 0 0 
##$DATE= 1688639742
##$DBL= (0..7)
120 120 120 120 120 120 120 120 
##$DBP= (0..7)
150 150 150 150 150 150 150 150 
##$DBP07= 0
##$DBPNAM0= <>
##$DBPNAM1= <>
##$DBPNAM2= <>
##$DBPNAM3= <>
##$DBPNAM4= <>
$$ [...]
##$SUBNAM3= <"">
##$SUBNAM4= <"">
##$SUBNAM5= <"">
##$SUBNAM6= <"">
##$SUBNAM7= <"">
##$SUBNAM8= <"">
##$SUBNAM9= <"">
##$SW= 18.05172834244
##$SWIBOX= (0..15)
0 0 2 0 0 0 0 0 0 0 0 0 0 0 0 0 
##$SW_h= 3612.71676300578
##$TD= 16384
##$TD0= 1
##$TE= 0
##$TE2= 300
##$TE3= 300
##$TEG= 300
##$TL= (0..7)
0 120 120 120 120 120 120 120 
##$TP= (0..7)
150 150 150 150 150 150 150 150 
##$TP07= 0
##$TPNAME0= <>
##$TPNAME1= <>
##$TPNAME2= <>
##$TPNAME3= <>
##$TPNAME4= <>
##$TPNAME5= <>
##$TPNAME6= <>
##$TPNAME7= <>
##$TPOAL= (0..7)
0.5 0.5 0.5 0.5 0.5 0.5 0.5 0.5 
##$TPOFFS= (0..7)
0 0 0 0 0 0 0 0 
##$TUNHIN= 0
##$TUNHOUT= 0
##$TUNXOUT= 0
##$USERA1= <user>
##$USERA2= <user>
##$USERA3= <user>
##$USERA4= <user>
##$USERA5= <user>
##$V9= 5
##$VALIST= <valist>
##$VCLIST= <CCCCCCCCCCCCCCC>
##$VD= 0
##$VDLIST= <DDDDDDDDDDDDDDD>
##$VPLIST= <PPPPPPPPPPPPPPP>
##$VTLIST= <TTTTTTTTTTTTTTT>
##$WBST= 1024
##$WBSW= 4
##$XGAIN= (0..3)
0 0 0 0 
##$XL= 0
##$YL= 0
##$YMAX_a= 233644
##$YMIN_a= -293540
##$ZGOPTNS= <>
##$ZL1= 120
##$ZL2= 120
##$ZL3= 120
##$ZL4= 120
##$ABSF1= 15.79647
##$ABSF2= -2.255382
##$ABSG= 5
##$ABSL= 3
##$ALPHA= 0
##$AQORDER= 0
##$ASSFAC= 0
##$ASSFACI= 0
##$ASSFACX= 0
##$ASSWID= 0
##$AUNMP= <proc_1d>
##$AZFE= 0.1
##$AZFW= 0.1
##$BCFW= 0
##$BC_mod= 2
##$BYTORDP= 0
##$COROFFS= 0
##$CY= -3
##$DATMOD= 1
##$DC= 0
##$DFILT= <>
##$DTYPP= 0
##$F1P= 0
##$F2P= 0
##$FCOR= 1
##$FTSIZE= 16384
##$FT_mod= 6
##$GAMMA= 0
##$GB= 0
##$INTBC= 1
##$INTSCL= 3.70164e-10
##$ISEN= 128
##$LB= 0.24
##$LEV0= 0
##$LPBIN= 0
##$MAXI= 10000
##$MC2= 0
##$MEAN= 0
##$ME_mod= 0
##$MI= 1.114404
##$NCOEF= 0
##$NC_proc= -6
##$NLEV= 6
##$NOISF1= 3.799351
##$NOISF2= 2.8
##$NSP= 0
##$NTH_PI= 0
##$NZP= 0
##$OFFSET= 15.7546
##$PC= 1
##$PHC0= -20786.88
##$PHC1= 10.65272
##$PH_mod= 1
##$PKNL= yes
##$PPARMOD= 0
##$PSCAL= 0
##$PSIGN= 0
##$REVERSE= no
##$SF= 200.130003389213
##$SI= 16384
##$SIGF1= 3
##$SIGF2= 2
##$SINO= 5.538805
##$SIOLD= 16384
##$SREGLST= <1H.CDCl3>
##$SSB= 0
##$STSI= 16384
##$STSR= 0
##$SW_p= 3612.71676300578
##$SYMM= 0
##$S_DEV= 0
##$TDeff= 16384
##$TDoff= 0
##$TI= <>
##$TILT= no
##$TM1= 0
##$TM2= 0
##$TOPLEV= 0
##$USERP1= <user>
##$USERP2= <user>
##$USERP3= <user>
##$USERP4= <user>
##$USERP5= <user>
##$WDW= 1
##$XDIM= 16384
##$YMAX_p= 400039852
##$YMIN_p= -204433
$$ End of Bruker specific parameters
$$ ---------------------------------
##NTUPLES= NMR SPECTRUM
##VAR_NAME=  FREQUENCY,     SPECTRUM/REAL,   SPECTRUM/IMAG
##SYMBOL=    X,             R,               I
##VAR_TYPE=  INDEPENDENT,   DEPENDENT,       DEPENDENT
##VAR_FORM=  AFFN,          ASDF,            ASDF
##VAR_DIM=   16384,         16384,           16384
##UNITS=     HZ,            ARBITRARY UNITS, ARBITRARY UNITS
##FACTOR=    0.220516191357247, 1,           1
##FIRST=     3152.96806558556, 0,            0
##LAST=      -459.748697420222, 0,           0
##MIN=       -459.748697420222, -204433,     0
##MAX=       3152.96806558556, 400039852,    0
$$ Real data points
##PAGE= N=1
##DATA TABLE= (X++(R..R)), XYDATA
$$ [...]
$$ plain form
6503 -34218 -40257 -6382 -19510 -59684 -46353 -78228 -93525 -85413 -119154 -81893 -28923 -24223
6491 -24223 -56491 -126793 -170565 -127076 -109719 -51238 -44705 -20079 -74822 -95334 -72820 -70387
6479 -70387 -23774 -61475 -46393 -42820 -5799 -11210 -4824 -4989 -33872 -10554 -10001 -4351 -12627 -24338
6465 -24338 5804 -9481 11938 -1773 -16217 8939 32505 -16275 9141 5044 31994 4109
6453 4109 -40888 -22694 -12064 -13550 -20975 -3773 -41481 -96511 -78682 -44715 7382 -13689
6441 -13689 -585 -39427 -35732 -35917 -27677 -31103 -44033 -36221 -58200 7444 -541 13952 36580
6428 36580 30264 -20860 -4673 -13553 -47456 -13887 -37661 -40855 -44687 -26184 -44721 -90637 -56165
6415 -56165 -32407 -23598 -14601 21257 22167 14734 6017 -36373 -73244 -68505 -29300 -3920 -26398
$$ packed form
6503c4218o039L3875j3128m0174J3331l1875j5297Q112l3741L7261N2970M700
6491b4223l2268p0302m3772M3489J7357N8481O533K4626n4743k0512K2514K433
6479g0387M6613l7701J5082L573L7021n411O386j65k8883K3318N53N650q276j1711
6465b4338L0142j5285K1419j3711j4444K5156K3566m8780K5416m097K6950k7885
6453D109m4997J8194J0630j486p425J7202l7708n5030J7829L3967N2097k1071
6441a3689J3104l8842L695j85Q240l426j2930P812k1979O5644p985J4493K2628
6428C6580o316n1124J6187q880l3903L3569k3774l194l832J8503j8537m5916L4472
6415e6165K3758Q809Q997L5858R10p433q717m2390l6871M739L9205K5380k2478
$$ plain form
6402 -26398 -21039 -20035 -57571 -11972 -8838 -59617 -39378 -29787 -62013 -68040 -42442 -42702 -67774
6389 -67774 -33445 -13529 -117836 -118001 -76506 -79728 -19394 21099 8332 -5205 -15993 -49592
6377 -49592 -2221 13105 -65240 -68519 -54604 6073 -57213 -114951 -29543 -50957 -67926 -53516
6365 -53516 -43802 -45505 -27878 -14855 -13572 -17087 -68265 -94385 -124425 -91317 -32515 -4690 9126
6352 9126 11219 -36987 -46606 -105700 -70780 10333 -30108 -86390 -77812 -24580 -2137 -22015 -45284
6339 -45284 -37083 -88788 -76427 -34610 -44972 -51300 -38244 -35322 -50032 -101716 -30660 -43245
6327 -43245 -42854 -31049 -67331 -32228 -29606 -6692 -27390 -8508 38420 55259 68987 10214
6315 10214 -3180 -13832 -32471 -11682 -16001 -52084 25101 32649 11104 12590 11898 79515 63076
$$ packed form
6402b6398N359J004l7536M5599L134n0779K0239R591l2226o027K5598k60k5072
6389f7774L4329J9916j04307j65M1495l222O0334M0493j2767j3537j0788l3599
6377d9592M7371J5326p8345l279J3915O0677o3286n7738Q5408k1414j6969J4410
6365e3516R714j703J7627J3023J283l515n1178k6120l0040L3108N8802K7825J3816
6352I126K093m8206r619n9094L4920Q1113m0441n6282Q578N3232K2443j9878k3269
6339d5284Q201n1705J2361M1817j0362o328J3056K922j4710n1684P1056j2585
6327d3245L91J1805l6282L5103K622K2914k0698J8882M6928J6839J3728n8773
6315A0214j3394j0652j8639K0789m319l6083P7185P548k1545J486o92O7617j6439
$$ plain form
6302 63076 29338 2352 343 1973 35425 21365 46257 503 13669 116571 45532 4059
6290 4059 -1899 12030 8085 -3953 -3830 -52594 -35364 -32395 -21838 -69247 -62965 -59030 -41897
6277 -41897 -59999 -59854 -27602 -10391 -54054 -37860 -2218 -13494 -11323 -7940 -34047 -50888 -58262
6264 -58262 -65617 -30139 -29823 -92976 -51949 -17693 -21015 12288 12498 15012 27958 44553 40145
6251 40145 20873 906 -11683 -15251 -8636 -38447 8529 -27306 -49758 -55727 -65522 -71108 -61879
6238 -61879 -71818 -8658 -16681 10685 90456 47805 6926 -36511 -58962 -39803 -24901 -838
6226 -838 1696 -18354 -55627 -39940 -28997 9230 7122 13111 20457 43985 23686 16486 13343
6213 13343 -45980 -79103 -39685 12679 -8294 -18157 -44360 -75852 -74761 -45498 -57794 -62278
$$ packed form
6302F3076l3738k6986k009J630L3452j4060K4892m5754J3166J02902p1039m1473
6290D059n958J3929l945j2038J23m8764J7230K969J0557m7409O282L935J7133
6277d1897j8102J45L2252J7211m3663J6194L5642j1276K171L383k6107j6841p374
6264e8262p355L5478L16o3153M1027L4256l322L3303K10K514J2946J6595m408
6251D0145j9272j9967j2589l568O615k9811M6976l5835k2452n969r795n586R229
6238f1879r939O3160q023K7366P9771m2651m0879m3437k2451J9159J4902K4063
6226h38K534k0050l7273J5687J0943L8227k108N989P346K3528k0299p200l143
6213A3343n9323l3123L9418N2364k0973r863k6203l1492J091K9263j2296m484
$$ plain form
6201 -62278 -44752 -84854 -34825 545 -13564 -57823 -14370 -1123 -26687 2362 18907 -83498
6189 -83498 -39224 17554 -5171 -31918 -11830 19051 -43678 -16000 -51935 -76149 -70414 -79097
6177 -79097 -62133 -33332 -44047 -38850 -49535 -19876 -16474 -3518 -1912 -15914 -80217 -24671
6165 -24671 -740 -3191 -61689 4286 -22159 -77665 -77652 -72900 -19934 20968 18762 15567 23145
6152 23145 -2952 -31557 -42745 -67721 -69548 -63655 -116394 -117043 -37764 15654 -3218 -36055 -96340
6139 -96340 -61798 -35928 -58643 -29052 -69160 -95712 -47375 -66227 -50559 -44920 -120604 -110901
6127 -110901 -44915 -23100 -21800 23244 -9666 -41542 -56559 -63265 -41656 -54126 12504 28477
6115 28477 32026 25743 -42695 -65801 19389 -40224 -43496 -25992 -41007 -48270 -72828 -74087 8277
$$ packed form
6201f2278J7526m0102N0029L5370j4109m4259M3453J3247k5564K9049J6545j02405
6189h3498M4274N6778k2725k6747K0088L0881o2729K7678l5935k4214N735q683
6177g9097J6964K8801j0715N197j0685K9659L402J2956J606j4002o4303N5546
6165b4671K3931k451n8498O5975k6445n5506J3M752N2966M0902k206l195P578
6152B3145k6097k8605j1188k4976j827N893n2739o49P9279N3418j8872l2837o0285
6139i6340L4542K5870k2715K9591m0108k6552M8337j8852J5668N639p5684R703
6127a10901O5986K1815J300M5044l2910l1876j5017o706K1609j2470O6630J5973
6115B8477L549o283o8438k3106Q5190n9613l272J7504j5015p263k4558j259Q2364
$$ plain form
6102 8277 10797 -66985 -95175 -73455 -41949 -41856 -67946 -20500 -45300 -60383 -15673 -13103 -5267
6089 -5267 -20081 12930 33072 17093 -10973 15928 31495 15867 3226 12176 8398 28859
6077 28859 53375 47511 -40896 -8651 37934 44138 36473 -16915 -30983 -16286 -42463 18685
6065 18685 31025 24583 26900 -5838 -23158 -21546 -71010 -51279 26124 -7912 -25021 -27648 1091
6052 1091 35374 43955 32456 7600 -5010 1299 -2234 25292 -4130 11405 -8312 -37609 -41048
6039 -41048 -75383 -21902 -34999 -857 10565 9652 51489 8851 47779 77667 31941 1234
6027 1234 27061 -3907 -3636 -5839 13474 38964 9654 -40163 -55278 15297 50999 64487 20245
6014 20245 40172 33175 58361 83173 68650 57224 31328 12620 50209 73581 25748 18485
$$ packed form
6102H277K520p7782k8190K1720L1506R3k6090M7446k4800j5083M4710K570P836
6089e267j4814L3011K0142j5979k8066K6901J5567j5628j2641Q950l778K0461
6077B8859K4516n864q8407L2245M6585O204p665n3388j4068J4697k6177O1148
6065A8685J2340o442K317l2738j7320J612m9464J9731P7403l4036j7109k627K8739
6052A091L4283Q581j1499k4856j2610O309l533K7526k9422J5535j9717k9297l439
6039d1048l4335N3481j3097L4142J1422r13M1837m2638L8928K9888m5726l0707
6027A234K5827l0968K71k203J9313K5490k9310m9817j5115P0575L5702J3488m4242
6014B0245J9927o997K5186K4812j4523j1426k5896j8708L7589K3372m7833p263
$$ plain form
6002 18485 -19519 3169 69714 83897 59117 37699 7877 52762 28203 78475 15007 -20531
5990 -20531 64573 103692 105289 70250 10817 57610 19462 11538 47376 63574 27233 59167
5978 59167 46312 -14611 -7559 -31091 4917 -31112 12593 60661 28766 -2974 41070 -2707
5966 -2707 -388 48064 39417 59310 12233 8417 38801 72321 42785 55121 53215 60450 93227
5953 93227 48500 83844 24737 -26406 3260 58152 64031 15445 27802 68685 -6101 8714
5941 8714 12992 59255 92915 79483 79123 42310 39548 20075 3701 60359 35113 -21206 -45962
5928 -45962 -3801 67242 71822 113085 155561 87545 73757 92046 50954 63273 56558 25585
5916 25585 137241 155411 94290 67002 74447 56096 91122 134187 158358 152638 196873 223252
$$ packed form
6002A8485l8004K2688O6545J4183k4780k1418k9822M4885k4559N0272o3468l5538
5990b0531Q5104L9119J597l5039n9433M6793l8148p924L5838J6198l6341L1934
5978E9167j2855o0923P052k3532L6008l6029M3705M8068l1895l1740M4044m3777
5966b707K319M8452q647J9893m7077l816L0384L3520k9536J2336j906P235L2777
5953I3227m4727L5344n9107n1143K9666N4892N879m8586J2357M0883p4786J4815
5941H714M278M6263L3660j3432l60l6813k762j9473j6374N6658k5246n6319k4756
5928d5962M2161P1043M580M1263M2476o8016j3788J8289m1092J2319o715l0973
5916B5585J11656J8170o1121k7288P445j8351L5026M3065K4171n720M4235K6379
$$ plain form
5904 223252 211012 162980 184350 227082 197638 146606 164734 213106 184388 195529 168431 199745
5892 199745 217154 261270 274465 280586 290462 248084 197970 242620 241503 208764 221664 239712
5880 239712 264913 258961 222051 219554 231345 290941 299674 250439 228935 246984 224389 198292
5868 198292 189336 164350 167507 160758 149843 118972 161415 178187 167256 231502 169981 159624
5856 159624 165472 187131 258186 241736 199406 263424 278625 278048 343087 313492 236001 190530
5844 190530 193929 244968 267247 258818 224290 218074 295319 289181 260287 204380 149979 207204
5832 207204 228316 162444 154158 181460 175729 164127 178489 176863 174982 185305 192205 183227 206123
5819 206123 235047 282645 261198 271733 295837 321084 298072 240618 163657 137505 160755 202754
$$ packed form
5904B23252j2240m8032K1370M2732k9444n1032J8128M8372k8718J1141k7098L1314
5892A99745J7409M4116J3195O121R876m2378n0114M4650j117l2739J2900J8048
5880B39712K5201n952l6910k497J1791N9596Q733m9235k1504J8049k2595k6097
5868A98292q956k4986L157o749j0915l0871M2443J6772j0931O4246o1521j0357
5856A59624N848K1659P1055j6450m2330O4018J5201n77O5039k9595p7491m5471
5844A90530L399N1039K2279q429l4528o216P7245o138k8894n5907n4401N7225
5832B07204K1112o5872q286K7302n731j1602J4362j626j881J0323O900q978K2896
5819B06123K8924M7598k1447J0535K4104K5247k3012n7454p6961k6152K3250M1999
$$ plain form
5807 202754 159776 145083 216156 185126 154113 177878 198746 165228 215919 150906 102767 136990
5795 136990 191819 219448 239240 237392 214238 207087 290074 292083 259909 281918 331980 306200
5783 306200 274832 231033 198858 224231 181341 97304 93316 128458 140436 176023 171336 191589
5771 191589 195641 151853 103658 105929 111561 122062 139960 126527 123297 156751 160027 168040 175433
5758 175433 204678 235654 205757 152643 199593 223750 203144 241224 214996 144848 177716 219661
5746 219661 194288 108626 88226 136570 164178 159726 163205 133813 26880 80194 105266 99119
5734 99119 97168 114169 110993 140694 149983 140252 132314 168321 137663 173876 143271 107592 151923
5721 151923 124881 140305 116245 199226 238543 195525 148951 145595 118101 158408 150241 165249
$$ packed form
5807B02754m2978j4693P1073l1030l1013K3765K0868l3518N0691o5013m8139L4223
5795A36990N4829K7629J9792j848k3154p151Q2987K009l2174K2009N0062k5780
5783C06200l1368m3799l2175K5373m2890q4037l988L5142J1978L5587m687K0253
5771A91589M052m3788m8195K271N632J0501J7898j3433l230L3454L276Q013P393
5758A75433K9245L0976k9897n3114M6950K4157k0606L8080k6228p0148L2868M1945
5746B19661k5373q5662k0400M8344K7608m452L479k9392j06933N3314K5072o147
5734I9119j951J7001l176K9701R289r731p938L6007l0658L6213l0605l5679M4331
5721A51923k7042J5424k4060Q2981L9317m3018m6574l356k7494M0307q167J5008
$$ plain form
5709 165249 143858 167042 200113 148219 173779 241577 225637 261702 255530 247027 222681 178678
5697 178678 216705 235174 168038 158301 195374 215682 200389 135403 205274 255540 207781 234037
5685 234037 260857 286160 266720 216949 209382 193409 233657 275803 286365 254058 254094 274732
5673 274732 295293 331274 289984 275385 261016 242566 270331 292001 285225 259226 252357 331369
5661 331369 344753 348093 383541 373424 348897 366723 375783 363341 355001 404714 469383 430562
5649 430562 423090 435199 488634 450906 408966 492455 535661 546431 491534 479133 548083 527660
5637 527660 529382 551780 581698 629045 634038 601513 674145 627467 712404 722817 689132 731757
5625 731757 762285 803723 855581 871069 847395 930441 1022246 1061583 1019562 1079623 1182935
$$ packed form
5709A65249k1391K3184L3071n1894K5560O7798j5940L6065o172q503k4346m4003
5697A78678L8027J8469o7136r737L7073K0308j5293o4986O9871N0266m7759K6256
5685B34037K6820K5303j9440m9771p567j5973M0248M2146J0562l2307L6K0638
5673B74732K0561L5981m1290j4599j4369j8450K7765K1670o776k5999o869P9012
5661C31369J3384L340L5448j0117k4527J7826R060j2442q340M9713O4669l8821
5649D30562p472J2109N3435l7728m1940Q3489M3206J0770n4897j2401O8950k0423
5637E27660J722K2398K9918M7347M993l2525P2632m6678Q4937J0413l3685M2625
5625G31757L0528M1438N1858J5488k3674Q3046R1805L9337m2021O0061J03312
$$ plain form
5614 1182935 1253705 1290848 1350960 1445767 1594912 1727871 1887394 2042011 2209579 2431745
5604 2431745 2648771 2848826 2928402 3005531 2992073 2841818 2756172 2630030 2453383 2337786
5594 2337786 2216271 2142166 2047220 2054492 2043136 1975331 2044344 2109176 2171083 2194762 2266269
5583 2266269 2333028 2421944 2586235 2807539 2978303 3217368 3517570 3864042 4243371 4566965
5573 4566965 4930003 5162219 5191105 5174944 5092967 4905419 4635000 4320994 4001440 3675102
5563 3675102 3365318 3095730 2904568 2734441 2500085 2446715 2411786 2299989 2249256 2188679
5553 2188679 2140616 2110014 2131508 2181232 2239043 2281469 2367009 2484689 2574164 2720788 2884140
5542 2884140 3060283 3167983 3177670 3193044 3120283 2977006 2734541 2530986 2358598 2199728
$$ packed form
5614A182935P0770L7143O0112R4807J49145J32959J59523J54617J67568K22166
5604B431745K17026K00055P9576P7129j3458j50255q5646j26142j76647j15597
5594B337786j21515p4105r4946P272j1356o7805O9013O4832O1907K3679P1507
5583B266269O6759Q8916J64291K21304J70764K39065L00202L46472L79329L23594
5573D566965L63038K32216K8886j6161q1977j87548k70419l14006l19554l26338
5563C675102l09784k69588j91162j70127k34356n3370l4929j11797n0733o0577
5553B188679m8063l0602K1494M9724N7811M2426Q5540J17680Q9475J46624J63352
5542B884140J76143J07700R687J5374p2761j43277k42465k03555j72388j58870
$$ plain form
5532 2199728 2050288 1931838 1825843 1754900 1699040 1710754 1586482 1505327 1462342 1484404 1440303
5521 1440303 1401640 1344197 1262738 1214012 1194579 1085058 1009326 1018481 909892 909596 934528 920587
5509 920587 888422 908094 927813 884210 828839 857894 878482 902319 884040 848070 883062 966940
5497 966940 903258 909580 965325 968696 956964 942415 914200 883539 879906 901554 864923 868780
5485 868780 856167 791533 784162 785644 797203 751079 750615 799357 807365 842830 850251 877845 914488
5472 914488 962369 1002657 1060350 1073964 1111911 1213639 1308400 1368739 1473508 1479759 1470233 1499212
5460 1499212 1573806 1647208 1701109 1667721 1608672 1499790 1374533 1295732 1158325 1051372 1020288
5449 1020288 963807 967410 985433 975784 956894 942956 912790 891888 925147 931585 1003851 1036570
$$ packed form
5532B199728j49440j18450j05995p0943n5860J1714j24272q1155m2985K2062m4101
5521A440303l8663n7443q1459m8726j9433j09521p5732R155j08589k96K4932j3941
5509I20587l2165J9672J9719m3603n5371K9055K0588K3837j8279l5970L4992Q3878
5497I66940o3682O322N5745L371j1732j4549k8215l0661l633K1648l6631L857
5485H68780j2613o4634p371J482J1559m6124m64M8742Q008L5465P421K7594L6643
5472I14488M7881M0288N7693J3614L7947J01728R4761O0339J04769O251r526K8979
5460A499212P4594P3402N3901l3388n9049j08882j25257p8801j37407j06953l1084
5449A020288n6481L603J8023r649j8890j3938l0166k0902L3259O438P2266L2719
$$ plain form
5437 1036570 1075627 1093237 1146351 1166783 1210568 1267526 1401398 1650229 1841215 2032807 2332003
5426 2332003 2661648 2873580 2857811 2564569 2174983 1917615 1731319 1582619 1453081 1332875
5416 1332875 1270220 1190949 1123523 1137869 1059436 1044780 1053042 1077226 1021184 1001067 1072290 1097717
5404 1097717 1095619 1114595 1179327 1227372 1308099 1365123 1522147 1717814 1972275 2337761 2700268
5393 2700268 2872971 2799305 2486010 2166340 1896494 1644541 1486599 1412973 1287657 1203565
5383 1203565 1191112 1128415 1079143 1028742 988256 984767 980147 1013046 1003242 936377 940274 907075
5371 907075 929531 981227 1021435 1030299 1069864 1057634 1133151 1214710 1310561 1422501 1466295 1417672
5359 1417672 1330921 1213921 1081520 1011430 912327 932998 864209 823098 786706 802937 833704
$$ packed form
5437A036570L9057J7610N3114K0432M3785N6958J33872K48831J90986J91592K99196
5426B332003L29645K11932j5769k93242l89586k57368j86296j48700j29538j20206
5416A332875o2655p9271o7426J4346p8433j4656Q262K4184n6042k0117P1223K5427
5404A097717k098J8976O4732M8045Q0727N7024J57024J95667K54461L65486L62507
5393B700268J72703p3666l13295l19670k69846k51953j57942p3626j25316q4092
5383A203565j2453o2697m9272n0401m0486l489m620L2899r804o6865L897l3199
5371I07075K2456N1696M0208Q864L9565j2230P5517Q1559R5851J11940M3794m8623
5359A417672q6751j17000j32401p0090r9103K0671o8789m1111l6392J6231L0767
$$ plain form
5348 833704 783249 786524 805000 791157 759035 783917 830504 845456 847906 836024 859282 902357
5336 902357 882557 948525 999980 1000008 982448 975926 942527 908572 848814 890725 876889 828340
5324 828340 811053 754077 733106 726566 718720 699393 718855 785721 825937 834007 824277 826937 863257
5311 863257 908170 922957 1002879 1013700 975555 985563 1047331 1004571 1009080 1010319 1038688 1086795
5299 1086795 1119245 1104321 1080948 1070289 1023889 1085279 1093399 1136597 1131358 1146056 1168942 1144414
5287 1144414 1146201 1150309 1145529 1147073 1115997 1170278 1203117 1202344 1216520 1262253 1253390 1268256 1304603
5274 1304603 1358183 1388587 1410834 1482726 1588131 1558771 1593291 1612309 1619338 1646282 1736055
5263 1736055 1769293 1788305 1843571 1927095 2022488 2074158 2141313 2264738 2343330 2444115 2515547
$$ packed form
5348H33704n0455L275J8476j3843l2122K4882M6587J4952K450j1882K3258M3075
5336I02357j9800O5968N1455K8j7560o522l3399l3955n9758M1911j3836m8549
5324H28340j7287n6976k0971o540p846j9327J9462O6866M0216Q070r730K660L6320
5311H63257M4913J4787P9922J0821l8145J0008O1768m2760M509J239K8369M8107
5299A086795L2450j4924k3373j0659m6400O1390Q120M3198n239J4698K2886k4528
5287A144414J787M108m780J544l1076N4281L2839p73J4176M5733q863J4866L6347
5274A304603N3580L0404K2247P1892J05405k9360L4520J9018P029K6944Q9773
5263A736055L3238J9012N5266Q3524R5393N1670O7155J23425P8592J00785P1432
$$ plain form
5252 2515547 2553059 2623543 2653811 2677426 2764546 2847186 2913390 2914694 2986729 3044298 3074200 3173607
5240 3173607 3216913 3300109 3398947 3487401 3510649 3577050 3675972 3707218 3698338 3770827 3804955 3843959
5228 3843959 3898284 3957474 3983017 4081595 4168269 4216596 4344644 4477131 4603515 4726930 4918815
5217 4918815 5132162 5257723 5393885 5548705 5797190 6045092 6192782 6347090 6582511 6849998
5207 6849998 7086264 7305580 7550262 7787429 8059840 8371359 8709857 9028131 9453620 9934817
5197 9934817 10361518 10740333 11188833 11615522 12146553 12695894 13244461 13753401 14267888 14808883
5187 14808883 15397944 16060268 16715977 17531993 18480298 19505185 20739976 22165879 23801456
5178 23801456 25746190 28084063 30723265 33645433 36962242 40590620 44992542 50573147
$$ packed form
5252B515547L7512P0484L0268K3615Q7120Q2640O6204J304P2035N7569K9902R9407
5240C173607M3306Q3196R8838Q8454K3248O6401R8922L1246q880P2489L4128L9004
5228C843959N4325N9190K5543R8578Q6674M8327J28048J32487J26384J23415J91885
5217D918815K13347J25561J36162J54820K48485K47902J47690J54308K35421K67487
5207F849998K36266K19316K44682K37167K72411L11519L38498L18274M25489M81197
5197I934817M26701L78815M48500M26689N31031N49341N48567N08940N14487N40995
5187A4808883N89061O62324O55709Q16016R48305J024887J234791J425903J635577
5178B3801456J944734K337873K639202K922168L316809L628378M401922N580605
$$ plain form
5170 50573147 57687957 66717187 77418877 89353576 101912776 113850863 123217023 128224928
5162 128224928 128954408 126094350 119139828 107907884 94663243 81729225 69755332 58961777
5154 58961777 49936976 42806467 37205331 32665107 29019832 26054304 23607071 21488327
5146 21488327 19624800 18153858 16893705 15787268 14728367 13781267 12938046 12239985 11578712
5137 11578712 10978621 10404137 9898057 9465581 9049979 8644281 8305207 8009134 7655514
5128 7655514 7428928 7233858 7020621 6830481 6678264 6500739 6380696 6231675 6096556 5927505
5118 5927505 5730063 5562762 5344765 5161688 4989787 4823896 4682216 4551913 4475034 4313945
5108 4313945 4141234 4073200 4014391 3968270 3907086 3867048 3847418 3768393 3659303 3551205 3427157
$$ packed form
5170E0573147P114810R029230J0701690J1934699J2559200J1938087R366160N007905
5162A28224928P29480k860058o954522j1231944j3244641j2934018j1973893j0793555
5154E8961777r024801p130509n601136m540224l645275k965528k447233k118744
5146B1488327j863527j470942j260153j106437j058901r47100q43221o98061o61273
5137A1578712o00091n74484n06080m32476m15602m05698l39074k96073l53620
5128G655514k26586j95070k13237j90140j52217j77525j20043j49021j35119j69051
5118E927505j97442j67301k17997j83077j71901j65891j41680j30303p6879j61089
5108D313945j72711o8034n8809m6121o1184m0038j9630p9025j09090j08098j24048
$$ plain form
5097 3427157 3322523 3167429 3071995 2954977 2885696 2883271 2862114 2915803 2932416 2898732 2904299
5086 2904299 2901673 2906117 2986181 2976410 2930706 2914015 2865961 2865766 2792411 2741031 2665271 2590532
5074 2590532 2500515 2379714 2341437 2284004 2230920 2220690 2224781 2254339 2280271 2338889 2442250
5063 2442250 2476362 2504977 2573802 2549793 2497223 2489580 2519208 2514840 2496192 2443795 2302201 2266182
5051 2266182 2215478 2184946 2174752 2134059 2169929 2152929 2180368 2235676 2224788 2332062 2395338
5040 2395338 2365585 2314139 2274612 2229991 2223468 2135378 2041201 1984882 1948231 1893800 1796436 1823395
5028 1823395 1804928 1730363 1757045 1780116 1783154 1834861 1851486 1877248 1832122 1814249 1927376
5017 1927376 1854739 1705480 1606586 1552234 1510621 1466662 1395174 1339696 1333418 1327577 1306954 1277313
$$ packed form
5097C427157j04634j55094r5434j17018o9281k425k1157N3689J6613l3684N567
5086B904299k626M444Q0064r771m5704j6691m8054j95p3355n1380p5760p4739
5074B590532r0017j20801l8277n7433n3084j0230M091K9558K5932N8618J03361
5063B442250L4112K8615O8825k4009n2570p643K9628m368j8648n2397j41594l6019
5051B266182n0704l0532j0194m0693L5870j7000K7439N5308j0888J07274O3276
5040B395338k9753n1446l9527m4621o523q8090r4177n6319l6651n4431r7364K6959
5028A823395j8467p4565K6682K3071L038N1707J6625K5762m5126j7873J13127
5017A927376p2637j49259r8894n4352m1613m3959p1488n5478o278n841k0623k9641
$$ plain form
5005 1277313 1294839 1301387 1246006 1206610 1191767 1118608 1037856 976425 950117 926306 920264 901124
4993 901124 853533 860363 921846 852864 812235 839951 850822 815165 785505 772131 768879 793560
4981 793560 820258 852742 892913 902262 872986 888127 872407 851682 874928 807448 757371 759646
4969 759646 709022 705406 678306 672321 696623 692573 713078 666428 635290 617671 635106 627917
4957 627917 613413 642028 582158 621359 659682 620522 621115 658968 640485 642373 649856 657279 661841
4944 661841 694879 648026 589731 617784 561871 538641 574190 595552 561707 512497 489784 504405
4932 504405 568248 569637 594230 603791 594306 634987 641415 662544 627301 587513 555309 545990 553546
4919 553546 573420 542367 442779 462747 493282 475887 492190 513682 535356 506185 507714 504569
$$ packed form
5005A277313J7526O548n5381l9396j4843p3159q0752o1431k6308k3811o042j9140
4993I01124m7591O830O1483o8982m0629K7716J0871l5657k9660j3374l252K4681
4981G93560K6698L2484M0171R349k9276J5141j5720k0725K3246o7480n0077K275
4969G59646n0624l616k7100n985K4302m050K0505m6650l1138j7619J7435p189
4957F27917j4504K8615n9870L9201L8323l9160N93L7853j8483J888P483P423M562
4944F61841L3038m6853n8295K8053n5913k3230L5549K1362l3845m9210k2713J4621
4932E04405O3843J389K4593R561r485M0681O428K1129l5243l9788l2204r319P556
4919E53546J9874l1053r9588J9968L0535j7395J6303K1492K1674k9171J529l145
$$ plain form
4907 504569 530512 502649 479794 488130 532955 515553 466809 509957 549750 529778 532788 571830
4895 571830 547736 514832 549120 551866 526943 557190 517279 505708 534442 560701 523507 521978
4883 521978 513814 547501 518597 529491 590220 631177 654683 638394 663288 604799 641626 645433
4871 645433 637851 640542 660323 663157 721181 806067 796813 949582 1035519 1083068 1151671 1163979
4859 1163979 1183485 1221169 1250262 1214097 1142795 1090335 1041094 939450 861560 858958 819804
4848 819804 744884 670352 692662 642201 635973 614508 627811 678860 671908 601560 568297 578259
4836 578259 594978 620798 592797 623505 621426 642413 639859 646606 690573 694677 617111 619290 658784
4823 658784 651325 617449 684750 694485 692838 695179 667676 693519 710837 672192 657236 637678
$$ packed form
4907E04569K5943k7863k2855Q336M4825j7402m8744M3148L9793j9972L010L9042
4895E71830k4094l2904L4288K746k4923L0247l9911j1571K8734K6259l7194j529
4883E21978q164L3687k8904J0894O0729M0957K3506j6289K4894n8489L6827L807
4871F45433p582K691J9781K834N8024Q4886r254J52769Q5937M7549O8603J2308
4859A163979J9506L7684K9093l6165p1302n2460m9241j01644p7890k602l9154
4848H19804p4920p4532K2310n0461o228k1465J3303N1049o952p0348l3263R962
4836E78259J6719K5820k8001L0708k079K0987k554O747M3967M104p7566K179L9494
4823F58784p459l3876O7301R735j647K341k7503K5843J7318l8645j4956j9558
$$ plain form
4811 637678 720735 716579 724229 738443 715400 741799 707979 698834 707940 726813 736800 775030 740192
4798 740192 748165 773182 818491 814615 807283 830588 853734 867435 828824 852876 839493 831333
4786 831333 880475 946972 896090 909470 984183 1032700 1003219 1041555 1049775 1032147 1052831 1050849
4774 1050849 1125197 1140677 1177211 1199698 1158340 1205394 1318893 1341178 1340154 1401863 1471017
4763 1471017 1539553 1591594 1609943 1640593 1626328 1669445 1670203 1627490 1681987 1807641 1820400 1854964
4751 1854964 1873203 1992608 2114978 2142689 2273133 2382157 2457894 2569828 2653789 2794756
4741 2794756 2938401 3140563 3402159 3677910 3988981 4356184 4887909 5673112 6782255
4732 6782255 8240891 10063902 11873642 12904902 12836613 11652635 9826978 8022824 6640111
$$ packed form
4811F37678Q3057m156P650J4214k3043K6399l3820r145R106J8873R987L8230l4838
4798G40192P973K5017M5309l876p332K3305K3146J3701l8611K4052j3383q160
4786H31333M9142O6497n0882J3380P4713M8517k9481L8336Q220j7628K0684j982
4774A050849P4348J5480L6534K2487m1358M7054J13499K2285j024O1709O9154
4763A471017O8536N2041J8349L0650j4265M3117P58m2713N4497J25654J2759L4564
4751A854964J8239J19405J22370K7711J30444J09024P5737J11934Q3961J40967
4741B794756J43645K02162K61596K75751L11071L67203N31725P85203J109143
4732F782255J458636J823011J809740J031260o8289j183978j825657j804154j382713
$$ plain form
4723 6640111 5590915 4778079 4161402 3693598 3331033 3050232 2827861 2677379 2490603
4714 2490603 2342385 2322346 2242596 2177764 2139594 2084523 2018552 1908293 1928244 1948225 1911377
4703 1911377 1893658 1945831 1969069 1932636 1927689 1918611 1998955 1996424 2017929 1999321 1970693 1999983
4691 1999983 2027254 2027287 2086480 2105107 2118573 2128061 2187255 2278220 2337878 2366978 2416781 2497263
4679 2497263 2647683 2775127 2929153 3122166 3377361 3582374 3874696 4306155 4815339 5420236
4669 5420236 6376022 7761309 9440877 11029948 12041698 12288271 11863256 10709346 9029577
4660 9029577 7378965 6057063 5159761 4451331 3929009 3522289 3183415 2902965 2727890
4651 2727890 2524418 2361458 2283795 2222700 2165359 2104008 2080017 2000905 1938450 1908238 1891785
$$ packed form
4723F640111j049196q12836o16677m67804l62565k80801k22371j50482j86776
4714B490603j48218k0039p9750o4832l8170n5071o5971j10259J9951J9981l6848
4703A911377j7719N2173K3238l6433m947r078Q0344k531K1505j8608k8628K9290
4691A999983K7271L3N9193J8627J3466R488N9194R0965N9658K9100M9803Q0482
4679B497263J50420J27444J54026J93013K55195K05013K92322M31459N09184O04897
4669E420236R55786J385287J679568J589071J011750K46573m25015j153910j679769
4660I029577j650612j321902q97302p08430n22322m06720l38874k80450j75075
4651B727890k03472j62960p7663o1095n7341o1351k3991p9112o2455l0212j6453
$$ plain form
4640 1891785 1892659 1837521 1838516 1891542 1937867 1938697 1948049 1981254 2092780 2260016 2393917 2543934
4628 2543934 2696028 2815645 2922990 2951656 2836588 2662692 2478021 2333023 2173905 2020170
4618 2020170 1836321 1732316 1652332 1566841 1480098 1354343 1341455 1319742 1280498 1268856 1241810
4607 1241810 1192618 1181349 1167092 1168066 1178729 1199515 1197243 1164689 1124172 1146440 1137225 1134587
4595 1134587 1167918 1132430 1058606 1021556 1023846 1039823 1026626 1042706 1054847 1010975 1060074 1071824
4583 1071824 1031189 990042 977974 1005412 1018412 1012220 955054 949813 1006857 1072439 1033556 1036867
4571 1036867 1082554 1053949 1065782 1028259 1023648 1027385 1070702 1065372 1086773 1143591 1092138 1079557
4559 1079557 1070721 1074095 1077778 1106548 1138699 1104178 1111108 1148478 1152747 1154630 1112965 1124277 1174987
$$ packed form
4640A891785Q74n5138R95N3026M6325Q30R352L3205J11526J67236J33901J50017
4628B543934J52094J19617J07345K8666j15068j73896j84671j44998j59118j53735
4618B020170j83849j04005p9984q5491q6743j25755j2888k1713l9244j1642k7046
4607A241810m9192j1269j4257R74J0663K0786k272l2554m0517K2268r215k638
4595A134587L3331l5488p3824l7050K290J5977j3197J6080J2141m3872M9099J1750
4583A071824m0635m1147j2068K7438J3000o192n7166n241N7044O5582l8883L311
4571A036867M5687k8605J1833l7523m611L737M3317n330K1401N6818n1453j2581
4559A079557q836L374L683K8770L2151l4521O930L7370M269J883m1665J1312N0710
$$ plain form
4546 1174987 1224309 1206156 1209095 1186433 1248996 1255406 1259146 1275432 1230545 1243302 1259352 1280423
4534 1280423 1278348 1250085 1273531 1322975 1333598 1350997 1352126 1382936 1381339 1409189 1389761 1398787
4522 1398787 1383005 1380202 1406356 1416323 1430775 1413333 1416384 1437216 1429861 1517761 1541493 1533199
4510 1533199 1529719 1555970 1552669 1573765 1601775 1644014 1699743 1663714 1677179 1715117 1677408 1658156
4498 1658156 1699474 1728020 1780771 1809523 1822070 1792682 1842581 1876911 1882462 1865607 1906147 2004005
4486 2004005 2009765 1982692 1985095 2065335 2074202 2153128 2157165 2177307 2223960 2214234 2270666 2323214
4474 2323214 2357628 2341009 2408454 2406046 2454198 2500036 2508922 2534334 2611516 2576673 2616611 2633888
4462 2633888 2765379 2807317 2874246 2968549 2985010 3071543 3200847 3272651 3357599 3492843 3525390
$$ packed form
4546A174987M9322j8153K939k2662O2563O410L740J6286m4887J2757J6050K1071
4534A280423k075k8263K3446M9444J0623J7399J129L0810j597K7850j9428R026
4522A398787j5782k803K6154R967J4452j7442L051K0832p355Q7900K3732q294
4510A533199l480K6251l301K1096K8010M2239N5729l6029J3465L7938l7709j9252
4498A658156M1318K8546N2751K8752J2547k9388M9899L4330N551j6855M0540R7858
4486B004005N760k7073K403Q0240Q867P8926M037K0142M6653r726N6432N2548
4474B323214L4414j6619O7445k408M8152M5838Q886K5412P7182l4843L9938J7277
4462B633888J31491M1938O6929R4303J6461Q6533J29304P1804Q4948J35244L2547
$$ plain form
4451 3525390 3640519 3739070 3821584 3850209 3921841 4016381 4089832 4055296 4160002 4232126 4303085
4440 4303085 4391350 4445863 4518775 4567057 4644536 4726314 4833880 4972684 5127549 5222750 5385007
4429 5385007 5515940 5677791 5910688 6122594 6328756 6554866 6870977 7195350 7514418 7907191
4419 7907191 8343082 8808590 9388844 9956652 10509481 11163379 11900485 12574867 13088136 13546685
4409 13546685 13980182 14343712 14675726 15005489 15355189 15556905 15529405 15377257 15189870 15079326
4399 15079326 15151619 15286753 15528582 15864120 16404626 17001313 17668589 18467009 19232490 19892813
4389 19892813 20424335 20681845 20916249 20878681 20704961 20519632 20331821 20083549 19782281 19472090
4379 19472090 19091451 18670773 18243532 17963172 17910063 17974091 18221146 18622535 19068590 19591116
$$ packed form
4451C525390J15129R8551Q2514K8625P1632R4540P3451l4536J04706P2124P0959
4440D303085Q8265N4513P2912M8282P7479Q1778J07566J38804J54865R5201J62257
4429E385007J30933J61851K32897K11906K06162K26110L16111L24373L19068L92773
4419G907191M35891M65508N80254N67808N52829O53898P37106O74382N13269M58549
4409A3546685M33497L63530L32014L29763L49700K01716k7500j52148j87387j10544
4399A5079326P2293J35134K41829L35538N40506N96687O67276P98420P65481O60323
4389A9892813N31522K57510K34404l7568j73720j85329j87811k48272l01268l10191
4379A9472090l80639m20678m27241k80360n3109O4028K47055M01389M46055N22526
$$ plain form
4369 19591116 19935077 20031007 19953101 19762324 19439082 19097055 18920341 18889931 18991774 19366395
4359 19366395 19801803 20386939 20838837 21183581 21345048 21300690 21102653 20797008 20305079 19597179
4349 19597179 18706571 17691145 16545865 15474517 14498924 13563820 12782818 12089255 11513957
4340 11513957 11034090 10617928 10297510 10081635 9858980 9528165 9230524 8927667 8572358
4331 8572358 8279286 7939267 7664634 7408834 7192140 7049744 6918196 6811552 6684055 6611850
4321 6611850 6577270 6544881 6522516 6508821 6487196 6473820 6517666 6575254 6599173 6668670 6689237
4310 6689237 6796375 6955950 7081816 7171770 7333138 7399144 7418077 7411348 7522025 7655895
4300 7655895 7749126 7838438 7952668 8127503 8316800 8539048 8801456 9073213 9300982 9621740
$$ packed form
4369A9591116L43961R5930p7906j90777l23242l42027j76714l0410J01843L74621
4359A9366395M35408N85136M51898L44744J61467m4358j98037l05645m91929p07900
4349A9597179q90608j015426j145280j071348r75593r35104p81002o93563n75298
4340A1513957m79867m16162l20418k15875k22655l30815k97641l02857l55309
4331H572358k93072l40019k74633k55800k16694j42396j31548j06644j27497p2205
4321F611850l4580l2389k2365j3695k1625j3376M3846N7588K3919O9497K0567
4310F689237J07138J59575J25866Q9954J61368O6006J8933o729J10677J33870
4300G655895R3231Q9312J14230J74835J89297K22248K62408K71757K27769L20758
$$ plain form
4290 9621740 9912735 10213179 10591217 11048724 11498706 11964027 12516101 13168356 13867019 14624300
4280 14624300 15452282 16307086 17264656 18198845 19160649 20040342 20717920 21311483 21670969
4271 21670969 21900316 21998585 21866704 21577786 21169540 20694348 20258817 19839053 19497540 19334157
4261 19334157 19350055 19338024 19388185 19453814 19542449 19538447 19490276 19384314 19221947 19031174 18881953
4250 18881953 18812859 18808724 18857415 18997970 19225270 19439569 19709855 19982181 20260060 20550435
4240 20550435 20747607 20879283 20992153 20956858 20735125 20352413 19870179 19223577 18517154 17809049
4230 17809049 17151371 16521599 16000666 15612682 15302486 15140614 14942692 14837133 14709667
4221 14709667 14656398 14632546 14614284 14527378 14471341 14401392 14237849 14034583 13750724 13382217
$$ packed form
4290I621740K90995L00444L78038M57507M49982M65321N52074O52255O98663P57281
4280A4624300Q27982Q54804R57570R34189R61804Q79693O77578N93563L59486
4271B1670969K29347R8269j31881k88918m08246m75192m35531m19764l41513j63383
4261A9334157J5898j2031N0161O5629Q8635m002m8171j05962j62367j90773j49221
4250A8881953o9094m135M8691J40555K27300K14299K70286K72326K77879K90375
4240B0550435J97172J31676J12870l5295k21733l82712m82234o46602p06423p08105
4230A7809049o57678o29772n20933l87984l10196j61872j97922j05559j27466
4221A4709667n3269k3852j8262q6906n6037o9949j63543k03266k83859l68507
$$ plain form
4211 13382217 12868585 12315355 11770698 11237472 10648939 10055424 9617905 9156476 8861466
4202 8861466 8609306 8321114 8137455 7919515 7810798 7745695 7703145 7622782 7602203 7531490
4192 7531490 7523156 7551108 7514991 7446080 7384996 7371038 7349116 7315150 7288414 7220742 7180879 7155278
4180 7155278 7139170 7089654 7039195 6999181 6901243 6845369 6736362 6641558 6670603 6610623 6604813
4169 6604813 6595162 6577958 6562360 6537326 6601327 6641083 6597499 6755283 6835249 6924936 7042787
4158 7042787 7192344 7397010 7532347 7719330 7883286 8020383 8156031 8291733 8387693 8527235
4148 8527235 8623797 8790450 8946250 9065841 9198941 9397148 9654555 9960895 10309399 10770645
4138 10770645 11298286 11914215 12615385 13447950 14513563 15810505 17418164 19391773 21438575
$$ packed form
4211A3382217n13632n53230n44657n33226n88533n93515m37519m61429k95010
4202H861466k52160k88192j83659k17940j08717o5103m2550q0363k0579p0713
4192G531490q334K7952l6117o8911o1084j3958k1922l3966k6736o7672l9863k5601
4180G155278j6108m9516n0459m0014r7938n5874j09007r4804K9045n9980n810
4169F604813r651j7204j5598k5034O4001L9756m3584J57784P9966Q9687J17851
4158G042787J49557K04666J35337J86983J63956J37097J35648J35702R5960J39542
4148H527235R6562J66653J55800J19591J33100J98207K57407L06340L48504M61246
4138A0770645N27641O15929P01170Q32565J065613J296942J607659J973609K046802
$$ plain form
4129 21438575 23206917 24274642 24711537 24713112 24085349 22738118 20962731 19124115 17538706
4120 17538706 16345433 15398027 14657728 14068059 13680729 13330198 13123518 13055022 12979875 13008202
4110 13008202 13173107 13245836 13266652 13277012 13306216 13339304 13371895 13402226 13410801 13438389 13460965
4099 13460965 13522663 13625936 13795948 13969425 14190698 14412585 14718226 14979391 15310725 15665784
4089 15665784 15930924 16284744 16656162 17064189 17541766 18048025 18608162 19186143 19836301
4080 19836301 20533365 21307792 22165329 23009480 23901992 24920032 25921551 26905694 27996153
4071 27996153 29143080 30271684 31237483 32111650 32965539 33913070 34941943 36113686 37568340
4062 37568340 39314765 41330564 43614347 46277742 49405259 53039033 57275461 62190384
$$ packed form
4129B1438575J768342J067725M36895J575o27763j347231j775387j838616j585409
4120A7538706j193273r47406p40299n89669l87330l50531k06680o8496p5147K8327
4110A3008202J64905P2729K0816J0360K9204L3088L2591L0331Q575K7588K2576
4099A3460965O1698J03273J70012J73477K21273K21887L05641K61165L31334L55059
4089A5665784K65140L53820L71418M08027M77577N06259N60137N77981O50158
4080A9836301O97064P74427Q57537Q44151Q92512J018040J001519R84143J090459
4071B7996153J146927J128604R65799Q74167Q53889R47531J028873J171743J454654
4062C7568340J746425K015799K283783K663395L127517L633774M236428M914923
$$ plain form
4054 62190384 68039727 75183667 84150363 95652890 110808565 130066729 152330642 175164029
4046 175164029 196511157 214241884 224808193 223788154 210956336 192070146 171123403
4039 171123403 148821928 127139317 109029367 95227992 84859885 76933798 70927769
4032 70927769 66576223 63669621 62119390 61708349 62140604 63022486 63798989 64245836 64313220
4023 64313220 63948514 63137665 61974071 60658547 59262437 58016729 56898086 56123121 55879329
4014 55879329 56357687 57597959 59619303 62698338 66799969 72225889 79064109 86972458
4006 86972458 95076228 101495156 104132003 101670368 94843398 85730229 76414162 67996415
3998 67996415 60630482 54298713 48835930 44204435 40354134 37134837 34472789 32252438
$$ packed form
4054F2190384N849343P143940Q966696J1502527J5155675J9258164K2263913K2833387
4046A75164029K1347128J7730727J0566309j020039j2831818j8886190k0946743
4039A71123403k2301475k1682611j8109950j3801375j0368107p926087o006029
4032G0927769m351546k906602j550231m11041M32255Q81882P76503M46847O7384
4023F4313220l64706q10849j163594j315524j396110j245708j118643p74965k43792
4014E5879329M78358J240272K021344L079035M101631N425920O838220P908349
4006H6972458Q103770O418928K636847k461635o826970r113169r316067q417747
3998F7996415p365933o331769n462783m631495l850301l219297k662048k220351
$$ plain form
3990 32252438 30476949 28949545 27658872 26526107 25522554 24676919 23961411 23368433 22864039
3981 22864039 22584702 22445791 22500219 22617059 22554388 21953189 20817558 19470084 18256664
3972 18256664 17312820 16549983 15882046 15321374 14839844 14370250 13941573 13557843 13242655
3963 13242655 12932155 12688719 12451233 12211074 12018291 11836158 11698570 11525940 11425609
3954 11425609 11320279 11276310 11271665 11263880 11250668 11362428 11512596 11763984 12007303 12102580 12112170
3943 12112170 11978441 11815726 11726725 11716573 11682352 11674133 11643404 11517041 11348587 11142722
3933 11142722 10923150 10729212 10588242 10557999 10687293 10783151 10812295 10706849 10524162 10434056
3923 10434056 10416868 10338321 10283028 10180240 10120096 10019968 9976109 9958834 9967054 10055331 10061876
$$ packed form
3990C2252438j775489j527404j290673j132765j003553q45635p15508n92978n04394
3981B2864039k79337j38911N4428J16840o2671o01199j135631j347474j213420
3972A8256664r43844p62837o67937n60672m81530m69594m28677l83730l15188
3963A3242655l10500k43436k37486k40159j92783j82133j37588j72630j00331
3954A1425609j05330m3969m645p785j3212J11760J50168K51388K43319R5277R590
3943A2112170j33729j62715q9001j0152l4221q219l0729j26363j68454k05865
3933A1142722k19572j93938j40970l0243J29294R5858K9144j05446j82687r0106
3923A0434056j7188p8547n5293j02788o0144j00128m3859j7275Q220Q8277O545
$$ plain form
3912 10061876 10097065 10177760 10344067 10489677 10633342 10699479 10729586 10632535 10354708 10067726
3902 10067726 9673221 9215243 8818640 8451239 8205350 7982172 7814134 7649808 7589556 7502302
3892 7502302 7440835 7364480 7217194 7137710 7120390 7088677 7093069 7050262 6992925 6972495 6990475
3881 6990475 7075070 7161241 7290206 7486505 7674511 7749699 7682158 7484888 7179586 6852404
3871 6852404 6453381 6104906 5754930 5505136 5275397 5038870 4859541 4730703 4660761 4621479
3861 4621479 4535981 4493406 4431139 4448853 4487910 4437722 4482657 4534919 4527083 4545995 4436356
3850 4436356 4360506 4351202 4298949 4252831 4195039 4184609 4188095 4163929 4134423 4165405 4174006 4178181
3838 4178181 4110418 4074460 3993083 3983856 3988299 4005425 3974771 3961305 3920268 3813102 3725190 3699345
$$ packed form
3912A0061876L5189Q0695J66307J45610J43665O6137L0107r7051k77827k86982
3902A0067726l94505m57978l96603l67401k45889k23178j68038j64326o0252q7254
3892G502302o1467p6355j47286p9484j7320l1713M392m2807n7337k0430J7980
3881F990475Q4595Q6171J28965J96299J88006P5188o7541j97270l05302l27182
3871F852404l99023l48475l49976k49794k29739k36527j79329j28838o9942l9282
3861D621479q5498m2575o2267J7714L9057n0188M4935N2262p836J8912j09639
3850D436356p5850r304n2253m6118n7792j0430L486k4166k9506L0982Q601M175
3838D178181o7763l5958q1377r227M443J7126l0654j3466m1037j07166q7912k5845
$$ plain form
3826 3699345 3656276 3575538 3508518 3453618 3418979 3363885 3342544 3264911 3291927 3305887 3324052
3815 3324052 3435132 3433569 3458702 3455545 3483534 3484736 3494906 3437864 3377816 3351327 3402484 3288961
3803 3288961 3120928 3052399 2961599 2841789 2750981 2625417 2573168 2518522 2471512 2468499 2449168
3792 2449168 2588401 2633171 2586704 2586879 2597685 2542627 2561138 2533671 2557502 2544621 2509068 2495650
3780 2495650 2491810 2574528 2609555 2632667 2697255 2743526 2735655 2733463 2740542 2680214 2621748 2513625
3768 2513625 2444150 2444629 2440832 2422484 2433425 2444264 2393202 2340321 2385553 2445611 2423791 2397134
3756 2397134 2414391 2471491 2608753 2639012 2741564 2879443 2965729 2999623 2974415 2940964 2815936
3745 2815936 2765509 2703455 2658830 2633116 2668554 2691525 2678592 2686169 2695231 2652706 2647835 2573988
$$ packed form
3826C699345m3069q0738o7020n4900l4639n5094k1341p7633K7016J3960J8165
3815C324052J11080j563K5133l157K7989J202J0170n7042o0048k6489N1157j13523
3803C288961j68033o8529r0800j19810r0808j25564n2249n4646m7010l013j9331
3792B449168J39233M4770m6467J75J0806n5058J8511k7467K3831j2881l5553j3418
3780B495650l840Q2718L5027K3112O4588M6271p871k192P079o0328n8466j08123
3768B513625o9475M79l797j8348J0941J0839n1062n2881M5232O0058k1820k6657
3756B397134J7257N7100J37262L0259J02552J37879Q6286L3894k5208l3451j25028
3745B815936n0427o2054m4625k5714L5438K2971j2933P577R062m2525m871p3847
$$ plain form
3733 2573988 2455410 2374252 2258996 2218341 2131204 2069693 2018502 1971502 1926340 1911351 1947745
3722 1947745 1881765 1862601 1884700 1871869 1896485 1960314 2035964 1986286 2026120 2076695 2115908
3711 2115908 2089425 1998896 1955153 1887493 1850935 1818354 1821970 1737562 1716916 1670664 1694212 1679193
3699 1679193 1624835 1639086 1628868 1565149 1524920 1487814 1426099 1440555 1400161 1385486 1341290
3688 1341290 1276659 1239860 1198129 1244496 1288780 1247001 1287408 1373092 1348595 1355090 1367028 1378318
3676 1378318 1354698 1308790 1282182 1316021 1298613 1224900 1216216 1241685 1296790 1285546 1287667 1285527
3664 1285527 1211292 1199725 1158401 1168434 1216387 1181867 1204398 1201866 1203500 1181869 1160303 1139388
3652 1139388 1101363 1117024 1149110 1064949 1014999 1117928 1172798 1200847 1204565 1219005 1253117
$$ packed form
3733B573988j18578q1158j15256m0655q7137o1511n1191m7000m5162j4989L6394
3722A947745o5980j9164K2099j2831K4616O3829P5650m9678L9834N0575L9213
3711B115908k6483r0529m3743o7660l6558l2581L616q4408k0646m6252K3548j5019
3699A679193n4358J4251j0218o3719m0229l7106o1715J4456m0394j4675m4196
3688A341290o4631l6799m1731M6367M4284m1779M0407Q5684k4497O495J1938J1290
3676A378318k3620m5908k6608L3839j7408p3713q684K5469N5105j1244K121k140
3664A285527p4235j1567m1324J0033M7953l4520K2531k532J634k1631k1566k0915
3652A139388l8025J5661L2086q4161m9950J02929N4870K8049L718J4440L4112
$$ plain form
3641 1253117 1285249 1225177 1218732 1265223 1281788 1278329 1312066 1313115 1312403 1270807 1265592 1255492 1240768
3628 1240768 1265547 1217407 1174975 1143783 1129322 1127601 1189638 1210120 1257005 1295074 1342518 1338922
3616 1338922 1438931 1565430 1609275 1624652 1689333 1765402 1821513 1910119 2053970 2203905 2387246
3605 2387246 2573771 2736271 2836672 2820294 2690499 2582265 2427892 2289062 2139231 2028904
3595 2028904 1888394 1794583 1719129 1642595 1559236 1547351 1542158 1456999 1377103 1411464 1426792
3584 1426792 1397298 1499759 1543715 1507730 1527618 1592343 1589101 1556433 1609492 1593048 1625979
3573 1625979 1679517 1628794 1638873 1662034 1679256 1689429 1760008 1836538 1879433 1897583 1961830
3562 1961830 1938986 1921393 1894745 1846602 1778168 1729819 1717894 1728962 1759591 1778821 1761450
$$ packed form
3641A253117L2132o0072o445M6491J6565l459L3737J049p12m1596n215j0100j4724
3628A240768K4779m8140m2432l1192j4461j721O2037K0482M6885L8069M7444l596
3616A338922J00009J26499M3845J5377O4681P6069N6111Q8606J43851J49935J83341
3605B387246J86525J62500J00401j6378j29795j08234j54373j38830j49831j10327
3595B028904j40510r3811p5454p6534q3359j1885n193q5159p9896L4361J5328
3584A426792k9494J02461M3956l5985J9888O4725l242l2668N3059j6444L2931
3573A625979N3538n0723J0079K3161J7222J0173P0579P6530M2895J8150O4247
3562A961830k2844j7593k6648m8143o8434m8349j1925J1068L0629J9230j7371
$$ plain form
3551 1761450 1830364 1836044 1823525 1883238 1894419 1928343 1916559 1910848 1977427 1972887 2009512 2074865
3539 2074865 2149134 2189094 2183389 2159994 2221084 2262303 2349611 2438786 2524663 2586245 2700120
3528 2700120 2854023 2988629 3110361 3085959 3048912 2980151 2928963 2878686 2798062 2691975 2610085
3517 2610085 2577774 2573303 2572158 2479035 2407530 2381772 2365781 2335916 2271872 2154257 2181238 2205770
3505 2205770 2193142 2177578 2224100 2306952 2375622 2484934 2583971 2606124 2553167 2596790 2602120
3494 2602120 2549272 2516738 2551628 2530915 2531779 2563993 2570394 2580889 2591259 2580679 2554605 2473843
3482 2473843 2392441 2366718 2296686 2234528 2168355 2142156 2154476 2163929 2193936 2183489 2269436 2295178
3470 2295178 2331459 2438613 2595283 2700158 2740185 2832299 2913380 2969605 3017907 3079253 3082782
$$ packed form
3551A761450O8914N680j2519N9713J1181L3924j1784n711O6579m540L6625O5353
3539B074865P4269L9960n705k3395O1090M1219Q7308Q9175Q5877O1582J13875
3528B700120J53903J34606J21732k4402l7047o8761n1188n0277q0624j06087q1890
3517B610085l2311m471j145r3123p1505k5758j5991k9865o4044j17615K6981K4532
3505B205770j2628j5564M6522Q2852O8670J09312R9037K2153n2957M3623N330
3494B602120n2848l2534L4890k0713Q64L2214O401J0495J0370j0580k6074q0762
3482B473843q1402k5723p0032o2158o6173k6199J2320R453L0007j0447Q5947K5742
3470B295178L6281J07154J56670J04875M0027R2114Q1081N6225M8302O1346L529
$$ plain form
3459 3082782 3076701 3123985 3191803 3146013 3126235 3201097 3265080 3295512 3327867 3309095 3294889 3319980
3447 3319980 3394614 3407445 3398951 3421197 3450629 3547975 3592858 3655363 3680192 3671543 3678637 3688083
3435 3688083 3751436 3732573 3777222 3915101 3935611 4003500 4037251 4120918 4243473 4350194 4480561
3424 4480561 4576827 4716440 4874990 4901063 4954846 5121608 5243960 5411443 5538358 5710743
3414 5710743 5846214 6029724 6253516 6532939 6761842 6955989 7264164 7461839 7664974 7775074
3404 7775074 7800377 7793010 7849387 7932407 7970886 8123427 8269816 8332363 8503003 8780778 8989750
3393 8989750 9257868 9610973 9927927 10222081 10396342 10583891 10753089 10923133 11059978 11244035
3383 11244035 11392621 11516022 11612502 11765601 11999643 12209668 12379585 12708333 13037618 13453568
$$ packed form
3459C082782o081M7284O7818m5790j9778P4862O3983L0432L2355j8772j4206K5091
3447C319980P4634J2831q494K2246K9432R7346M4883O2505K4829q649P094R446
3435C688083O3353j8863M4649J37879K0510O7889L3751Q3667J22555J06721J30367
3424D480561R6266J39613J58550K6073N3783J66762J22352J67483J26915J72385
3414E710743J35471J83510K23792K79423K28903J94147L08175J97675K03135J10100
3404G775074K5303p367N6377Q3020L8479J52541J46389O2547J70640K77775K08972
3393H989750K68118L53105L16954K94154J74261J87549J69198J70044J36845J84057
3383A1244035J48586J23401R6480J53099K34042K10025J69917L28748L29285M15950
$$ plain form
3373 13453568 13913812 14323836 14715402 15120851 15506418 15900281 16374922 16864073 17371367
3364 17371367 17987307 18587341 19158910 19716543 20249127 20790430 21367249 22131485 22896635
3355 22896635 23773614 24735004 25682187 26793344 27909874 29055539 30141573 31294674 32659626
3346 32659626 34049017 35352739 36539954 37695166 38972304 40427558 41944408 43629114
3338 43629114 45466020 47528362 49878399 52611637 55924825 59898617 64514145 69860642
3330 69860642 76097319 83247635 91118470 99850853 109656793 121163528 135304006 153861056
3322 153861056 179540893 216323705 268144542 333423964 388207499 400039852 362824339
3315 362824339 300541833 243097243 201138382 170234451 146350370 127811862 113435876
$$ packed form
3373A3453568M60244M10024L91566M05449L85567L93863M74641M89151N07294
3364A7371367O15940O00034N71569N57633N32584N41303N76819P64236P65150
3355B2896635Q76979R61390R47183J111157J116530J145665J086034J153101J364952
3346C2659626J389391J303722J187215J155212J277138J455254J516850J684706
3338D3629114J836906K062342K350037K733238L313188L973792M615528N346497
3330F9860642O236677P150316P870835Q732383R805940J1506735J4140478J8557050
3322A53861056K5679837L6782812N1820837O5279422N4783535J1832353l7215513
3315C62824339o2282506n7444590m1958861l0903931k3884081j8538508j4375986
$$ plain form
3308 113435876 101992261 92635889 84987210 78879372 74233614 70861814 68562662 66666369
3300 66666369 64722117 62737222 60736110 59000369 57748372 56874886 56284875 55800065 55305974
3291 55305974 54911444 54709356 54856471 55412029 56227821 57329418 58645423 60080024 61776602
3282 61776602 63980818 67010057 71326322 77057393 83509116 87975175 88116303 84527538
3274 84527538 79624192 75718582 73273051 71648281 70291958 68897838 67575784 66466037
3266 66466037 65667075 65260551 65293778 65780535 66792439 68283209 70193703 72463743 75001697
3257 75001697 77855400 81135573 85012344 89661385 95095715 101229817 107969191 115355011
3249 115355011 123686512 133409077 145212246 160052115 178760750 202041616 229556856
$$ packed form
3308A13435876j1443615r356372p648679o107838m645758l371800k299152j896293
3300F6666369j944252j984895k001112j735741j251997q73486n90011m84810m94091
3291E5305974l94530k02088J47115N55558Q15792J101597J316005J434601J696578
3282F1776602K204216L029239M316265N731071O451723M466059J41128l588765
3274H4527538m903346l905610k445531j624770j356323j394120j322054j109747
3266F6466037p98962m06524L3227M86757J011904J490770J910494K270040K537954
3257G5001697K853703L280173L876771M649041N434330O134102O739374P385820
3249A15355011Q331501R722565J1803169J4839869J8708635K3280866K7515240
$$ plain form
3242 229556856 258654633 283168128 295081444 290004112 270185382 243066136 215528202
3235 215528202 191123947 170791641 154305543 141402257 131738496 125162143 121399901
3228 121399901 119840203 118841883 115827036 110051649 102823573 95935342 90529224 86669900
3220 86669900 84251073 83245568 84027159 86960307 92272033 99139224 104625624 105115965
3212 105115965 99939404 91325076 82362495 74559996 67711419 61520297 56000272 51335811
3204 51335811 47616420 44544635 41737447 39028301 36470478 34205693 32197717 30454549
3196 30454549 28952656 27577077 26392302 25298285 24383041 23540154 22778188 22061247 21381267
3187 21381267 20714166 20163386 19667182 19302359 18847562 18396136 17895625 17372323 16955335
$$ packed form
3242B29556856K9097777K4513495J1913316n077332j9818730k7119246k7537934
3235B15528202k4404255k0332306j6486098j2903286r663761o576353l762242
3228A21399901j559698r98320l014847n775387p228076o888231n406118l859324
3220H6669900k418827j005505P81591K933148N311726O867191N486400M90341
3212A05115965n176561q614328q962581p802499o848577o191122n520025m664461
3204E1335811l719391l071785k807188k709146k557823k264785k007976j743168
3196C0454549j501893j375579j184775j094017r15244q42887p61966p16941o79980
3187B1381267o67101n50780m96204l64823m54797m51426n00511n23302m16988
$$ plain form
3178 16955335 16552512 16163519 15842796 15623776 15531428 15655489 16028086 16392877 16338476 15771962
3168 15771962 14776942 13878165 13226593 12714309 12273039 11891099 11546449 11261712 11015135
3159 11015135 10762600 10467895 10182544 9854984 9546337 9212439 8912762 8651489 8357643
3150 8357643 8113707 8009654 7917434 7762956 7635848 7601667 7579297 7599237 7710481 7871627
3140 7871627 8103982 8280288 8182143 7865981 7420375 7056410 6765398 6568531 6358595 6200491
3130 6200491 6057665 5890403 5708534 5561193 5413272 5339556 5254285 5155232 5076573 5009473
3120 5009473 4822061 4690829 4700678 4656880 4596710 4540212 4418244 4303463 4261531 4138815 3982449
3109 3982449 3939454 3891236 3839660 3841041 3759979 3704770 3679335 3596088 3535781 3530485 3505465 3428728
$$ packed form
3178A6955335m02823l88993l20723k19020r2348J24061L72597L64791n4401n66514
3168A5771962r95020q98777o51572n12284m41270l81940l44650k84737k46577
3159A1015135k52535k94705k85351l27560l08647l33898k99677k61273k93846
3150H357643k43936j04053r2220j54478j27108l4181k2370J9940J11244J61146
3140G871627K32355J76306r8145l16162m45606l63965k91012j96867k09936j58104
3130F200491j42826j67262j81869j47341j47921p3716q5271r9053p8659o7100
3120E009473j87412j31232R849m3798o0170n6498j21968j14781m1932j22716j56366
3109C982449m2995m8218n1576J381q1062n5209k5435q3247o0307n296k5020p6737
$$ plain form
3097 3428728 3306375 3277838 3320208 3407862 3489711 3439387 3474059 3568666 3608965 3564818 3618205
3086 3618205 3600221 3515830 3492256 3418086 3297653 3199063 3123202 3011872 2957820 2876402 2763428
3075 2763428 2690912 2650880 2540710 2438121 2422726 2415037 2318226 2232209 2223065 2261064 2204957
3064 2204957 2194259 2236685 2191823 2183809 2153853 2172613 2167875 2199960 2259415 2226103 2236155 2309729
3052 2309729 2311914 2236179 2155672 2093049 2117589 2099774 2045461 2031315 1990334 1941830 1922474 1888432
3040 1888432 1927568 1932037 1926898 1994090 2055456 2117891 2284273 2469863 2593470 2789187 2967758
3029 2967758 3014038 2999876 2917056 2766589 2557797 2407443 2191554 2033464 1922677 1788908
3019 1788908 1617968 1578126 1546802 1557413 1558488 1500801 1461590 1450056 1483595 1433708 1362340
$$ packed form
3097C428728j22353k8537M2370Q7654Q1849n0324L4672R4607M0299m4147N3387
3086C618205j7984q4391k3574p4170j20433r8590p5861j11330n4052q1418j12974
3075B763428p2516m0032j10170j02589j5395p689r6811q6017r144L7999n6107
3064B204957j0698M2426m4862q014k9956J8760m738L2085N9455l3312J0052P3574
3052B309729K185p5735q0507o2623K4540j7815n4313j4146m0981m8504j9356l4042
3040A888432L9136M469n139O7192O1366O2435J66382J85590J23607J95717J78571
3029B967758M6280j4162q2820j50467k08792j50354k15889j58090j10787j33769
3019A788908j70940l9842l1324J0611J075n7687l9211j1534L3539m9887p1368
$$ plain form
3008 1362340 1362278 1389162 1369164 1353320 1380685 1363626 1317440 1284013 1314561 1295588 1262000 1212297
2996 1212297 1184073 1189463 1171947 1143227 1158881 1131066 1112897 1143946 1194439 1178323 1141402 1130855
2984 1130855 1140183 1134929 1034434 1062325 1059098 1088804 1072318 1076829 1094070 1087869 1101764 1116913
2972 1116913 1113379 1125673 1098905 1070649 1067519 1057826 1085050 1135121 1095528 1098854 1179109 1207258
2960 1207258 1244521 1318536 1324325 1370947 1542838 1648323 1780500 1830273 1917814 1929730 1874343
2949 1874343 1830701 1758402 1656601 1555147 1496203 1397291 1330703 1286107 1297893 1313692 1279159
2938 1279159 1246946 1216851 1151525 1184693 1125697 1142584 1103563 1108519 1125535 1076086 1099047 1059522
2926 1059522 1072293 1145854 1101487 1054837 1021498 1017158 983933 921501 923576 900926 884441 814198
$$ packed form
3008A362340o2K6884j9998j5844K7365j7059m6186l3427L0548j8973l3588m9703
2996A212297k8224N390j7516k8720J5654k7815j8169L1049N0493j6116l6921j0547
2984A130855R328n254j00495K7891l227K9706j6486M511J7241o201J3895J5149
2972A116913l534J2294k6768k8256l130r693K7224N0071l9593L326Q0255K8149
2960A207258L7263P4015N789M6622J71891J05485J32177M9773Q7541J1916n5387
2949A874343m3642p2299j01801j01454n8944r8912o6588m4596J1786J5799l4533
2938A279159l2213l0095o5326L3168n8996J6887l9021M956J7016m9449K2961l9525
2926A059522J2771P3561m4367m6650l3339m340l3225o2432K075k2650j6485p0243
$$ plain form
2914 814198 773941 757302 786573 794952 748157 738011 699745 707951 677869 669362 682348 643241
2902 643241 646506 661002 643431 687167 680759 663971 697152 732323 699500 711966 688857 731307
2890 731307 757472 710765 737496 747380 720180 687740 702584 635787 590936 629259 591817 570378
2878 570378 571947 605818 566381 518816 532108 503885 516523 538008 523727 516352 546449 536087
2866 536087 567445 537768 527152 524027 549760 535040 577834 597434 660452 601153 584228 568416
2854 568416 499594 490302 497799 458047 470002 436784 446435 459884 420578 447781 399616 394782
2842 394782 400148 371563 366075 386010 383847 377604 361735 327288 326701 296330 283614 299552 297929
2829 297929 332019 298324 294848 243965 241959 280635 247146 241828 228932 218962 232450 235892 216379
$$ packed form
2914H14198m0257j6639K9271Q379m6795j0146l8266Q206l0082q507J2986l9107
2902F43241L265J4496j7571M3736o408j6788L3181L5171l2823J2466k3109M2450
2890G31307K6165m6707K6731R884k7200l2440J4844o6797m4851L8323l7442k1439
2878E70378J569L3871l9437m7565J3292k8223J2638K1485j4281p375L0097j0362
2866E36087L1358k9677j0616l125K5733j4720M2794J9600O3018n9299j6925j5812
2854E68416o8822r292P497l9752J1955l3218R651J3449l9306K7203m8165m834
2842C94782N366k8585n488J9935k163o243j5869l4447n87l0371j2716J5938j623
2829B97929L4090l3695l476n0883k006L8676l3489n318j2896r970J3488L442j9513
$$ plain form
2816 216379 152730 183697 202539 274815 250488 250810 265913 263715 243328 260681 291341 236021
2804 236021 229186 200105 223789 187567 166108 155863 169638 137904 103609 111270 138048 184890
2792 184890 185052 142089 166101 156575 130536 121131 112944 104253 116442 183653 217445 193843 170780
2779 170780 168138 125138 155862 158988 184656 166136 174138 148557 147473 150191 117087 136061 135898
2766 135898 182487 117996 94443 97388 108342 134937 155376 189015 154418 152918 154243 153109
2754 153109 140231 130618 133725 91531 80681 126808 121572 95159 52542 102249 148759 142852
2742 142852 172799 170226 176031 146608 153834 119771 89643 105583 68088 57708 137550 110985
2730 110985 144139 128722 48127 118568 84721 27819 -25044 49552 103077 68185 82226 90723
$$ packed form
2816B16379o3649L0967J8842P2276k4327L22J5103k198k0387J7353L0660n5320
2804B36021o835k9081K3684l6222k1459j0245J3775l1734l4295P661K6778M6842
2792A84890J62m2963K4012r526k6039r405q187q691J2189O7211L3792k3602k3063
2779A70780k642m3000L0724L126K5668j8520Q002k5581j084K718l3104J8974j63
2766A35898M6589o4491k3553K945J0954K6595K0439L3639l4597j500J325j134
2754A53109j2878r613L107m2194j0850M6127n236k6413m2617M9707M6510n907
2742A42852K9947k573N805k9423P226l4063l0128J5940l7495j0380P9842k6565
2730A10985L3154j5417q0595P0441l3847n6902n2863P4596N3525l4892J4041Q497
$$ plain form
2718 90723 85317 74338 97652 96715 38027 41598 56564 13067 41724 100660 87585 113173 130628
2705 130628 115199 70080 50667 115244 97206 79765 101592 31339 13381 41280 75127 112031
2693 112031 115750 79437 47827 60672 40624 52336 104363 135347 111774 92591 113967 131155
2681 131155 124075 80588 28642 65212 103133 88012 90201 112100 63633 32913 60612 16647
2669 16647 20815 74259 59763 51112 48012 -1885 -26978 14369 42964 14890 28194 126785
2657 126785 95451 64039 51362 86922 60820 66177 84192 46145 13054 53045 57822 45327
2645 45327 63744 74561 112313 73286 31259 -36162 -24899 -8711 5967 65000 76296 71320
2633 71320 89242 51887 91451 81854 74805 49754 65247 114150 120828 85461 49153 54841 29976
$$ packed form
2718I0723n406j0979K3314r37n8688L571J4966m3497K8657N8936j3075K5588J7455
2705A30628j5429m5119j9413O4577j8038j7441K1827p0253j7958K7899L3847L6904
2693A12031L719l6313l1610J2845k0048J1712N2027L0984k3573j9183K1376J7188
2681A31155p080m3487n1946L6570L7921j5121K189K1899m8467l0720K7699m3965
2669A6647M168N3444j4496q651l100m9897k5093M1347K8595k8074J3304R8591
2657A26785l1334l1412j2677L5560k6102N357J8015l8047l3091L9991M777j2495
2645D5327J8417J0817L7752l9027m2027o7421J1263J6188J4678N9033J1296m976
2633G1320J7922l7355L9564r597p049k5051J5493M8903O678l5367l6308N688k4865
$$ plain form
2620 29976 26770 36745 76111 78088 126672 128358 119359 84628 60016 75833 19090 68281 86125
2607 86125 67108 78749 54359 59096 35767 10293 84056 84150 104771 84255 97806 91190 86809
2594 86809 89273 63758 67639 86451 66177 118470 144066 139514 107794 60888 54626 38870 76935
2581 76935 10597 -51447 -12913 62351 67573 56258 41006 31869 -20499 31749 46749 1221
2569 1221 -1781 27723 63811 41841 -5305 9626 -9017 -17403 25783 68950 30872 11563
2557 11563 24504 52341 83292 78408 79827 112953 98519 130253 86162 60462 36688 -2561
2545 -2561 29882 15547 41242 -3384 -23761 -2041 34530 98049 54688 -563 32301 60665
2533 60665 75347 30952 33462 56027 5898 -10185 5382 49899 73888 68359 77273 54862
$$ packed form
2620B9976l206R975L9366J977M8584J686q999l4731k4612J5817n6743M9191J7844
2607H6125j9017J1641k4390M737k3329k5474P3763R4K0621k0516J3551o616m381
2594H6809K464k5515L881J8812k0274N2293K5596m552l1720m6906o262j5756L8065
2581G6935o6338o2044L8534P5264N222j1315j5252r137n2368N2248J5000m5528
2569A221l002K9504L6088k1970m7146J4931j8643q386M3186M3167l8078j9309
2557A1563J2941K7837L0951m884J419L3126j4434L1734m4091k5700k3774l9249
2545b561L2443j4335K5695m4626k0377K1720L6571O3519m3361n5251L2864K8364
2533F0665J4682m4395K510K2565n0129j6083J5567M4517K3989n529Q914k2411
$$ plain form
2521 54862 48132 36789 75403 137794 158436 168637 140287 85528 103656 95481 81355 81437 85508
2508 85508 26306 -42258 -25235 14555 23384 -12325 7598 45673 37850 -9802 21796 117562
2496 117562 44851 9081 70567 38896 -20422 15155 44254 16292 45955 55788 19414 50037
2484 50037 54872 -3896 -16145 33441 -27486 -30113 38698 58482 26352 -6138 -11882 -43552
2472 -43552 -11425 -40068 -67975 -43368 -29128 -35990 -38313 49364 71112 1723 -19799 -2465
2460 -2465 36278 43401 28410 14927 6082 19024 -15317 -50584 -613 753 1806 20978 -25507
2447 -25507 -25088 -37248 -30054 52677 34354 2380 22005 19341 -19934 -15696 8260 -21252 -33298
2434 -33298 -52033 -28391 -20575 3461 37185 -40041 -18347 -18235 33546 12583 -20135 -13010 44744
$$ packed form
2521E4862o730j1343L8614O2391K0642J0201k8350n4759J8128q175j4126Q2M071
2508H5508n9202o8564J7023L9790Q829l5709J9923L8075p823m7652L1598R5766
2496A17562p2711l5770O1486l1671n9318L5577K9099k7962K9663R833l6374L0623
2484E0037M835n8768j2249M9586o0927k627O8811J9784l2130l2490n744l1670
2472d3552L2127k8643k7907K4607J4240o862k323Q7677K1748o9389k1522J7334
2460b465L8743P123j4991j3483q845J2942l4341l5267M9971J366J053J9172m6485
2447b5507M19j2160P194Q2731j8323l1974J9625k664l9275M238K3956k9512j2046
2434c3298j8735K3642P816K4036L3724p7226K1694J12N1781k0963l2718P125N7754
$$ plain form
2421 44744 28283 -3982 33849 14669 -43543 -21267 -47253 -54934 -11046 -26655 10493 -64378
2409 -64378 -55991 -40250 -18507 26572 12881 32299 5162 -42158 -61260 -48437 13738 -26925
2397 -26925 2239 -11935 -38442 49806 -10832 24631 24939 22855 38120 -10658 30304 32166 -2432
2384 -2432 22691 35462 5477 6910 -4695 -11386 22822 -13778 -69429 10137 785 13246 12904
2371 12904 -43766 -16074 35308 -8317 -8203 3344 35486 8145 74170 98786 43472 -1713
2359 -1713 8005 43427 38780 34969 96156 98362 80237 136681 48415 50115 81869 7790 1456
2346 1456 -15502 37635 10025 37431 29936 -17371 -2134 -66175 -21405 40097 76498 -9808
2334 -9808 -20043 31355 -2248 -3774 3457 -37950 -23862 21277 -11144 -8863 2864 -37660 -23402
$$ packed form
2421D4744j6461l2265L7831j9180n8212K2276k5986p681M3888j5609L7148p4871
2409f4378Q387J5741K1743M5079j3691J9418k7137m7320j9102J2823O2175m0663
2397b6925K9164j4174k6507Q8248o0638L5463L08k084J5265m8778M0962J862l4598
2384b432K5123J2771k9985J433j1605o691L4208l6600n5651P9566r352J2461l42
2371A2904n6670K7692N1382m3625J14J1547L2142k7341O6025K4616n5314m5185
2359a713R718L5422m647l811O1187K206j8125N6444q8266J700L1754p4079o334
2346A456j6958N3137k7610K7406p495m7307J5237o4041M4770O1502L6401q6306
2334i808j0235N1398l3603j526P231m1407J4088M5139l2421K281J1727m0524J4258
$$ plain form
2321 -23402 -81279 -72938 -75097 -67474 -66246 -37499 164 23307 50805 18957 -28049 19472 28774
2308 28774 49125 41877 11581 3653 -25614 8113 44142 41041 19235 -262 12952 55224
2296 55224 45513 47670 26034 -1150 20586 3741 6528 42551 37626 -1880 2860 3585 30172
2283 30172 22060 1734 -1336 -10108 -38016 4337 -2948 -44666 -85889 -62036 -42169 -18638 -25753
2270 -25753 -17575 7858 5108 -10264 -34328 -15089 21849 28232 60414 98558 19979 2195
2258 2195 28229 52156 6495 23191 59510 54130 32415 18596 3058 -50537 -13037 5808
2246 5808 9867 12806 -12230 8444 40241 55411 32979 17427 -3491 20663 20564 45468 -24186
2233 -24186 4722 -4595 -9284 -13113 -9016 2592 17848 52545 7866 5284 39874 13892 4274
$$ packed form
2321b3402n7877Q341k159P623J228K8747L7663K3143K7498l1848m7006M7521R302
2308B8774K0351p248l0296p928k9267L3727L6029l101k1806j9497J3214M2272
2296E5224r711K157k1636k7184K1736j6845K787L6023m925l9506M740P25K6587
2283C0172q112k0326l070q772k7908M2353p285m1718m1223K3853J9867K3531p115
2270b5753Q178K5433k750j5372k4064J9239L6938O383L2182L8144p8579j7784
2258B195K6034K3927m5661J6696L6319n380k1715j3819j5538n3595L7500J8845
2246E808M059K939k5036K0674L1797J5170k2432j5552k0918K4154r9K4904o9654
2233b4186K8908r317m689l829M097J1608J5256L4697m4679k582L4590k5982r618
$$ plain form
2220 4274 52155 61319 -38343 -37176 -13593 39574 9950 36945 100301 34890 58350 32412
2208 32412 9844 51989 106964 149595 135563 108454 92891 74706 83639 90350 36694 26456
2196 26456 59043 82738 25209 6811 72072 92373 89987 120351 73524 35870 67927 63033
2184 63033 41921 101834 121153 126779 109891 100298 115595 122511 167709 150428 156728 174525 158577
2171 158577 153811 168841 178195 178339 208195 204180 146191 189310 240559 258574 241147 224999 236420
2158 236420 263248 245708 272725 263235 298931 289514 307236 296872 284238 260046 310292 249561
2146 249561 270054 286577 270172 305538 317294 304252 335771 368608 408221 377657 375592 368958
2134 368958 381848 440880 421644 450747 519110 517428 529873 559950 553809 589917 637676 635765
$$ packed form
2220D274M7881R164r9662J167K3583N3167k9624K6995O3356o5411K3460k5938
2208C2412k2568M2145N4975M2631j4032k7109j5563j8185Q933O711n3656j0238
2196B6456L2587K3695n7529j8398O5261K0301k386L0364m6827l7654L2057m894
2184F3033k1112N9913J9319N626j6888r593J5297O916M5198j7281O300J7797j5948
2171A58577m766J5030R354J44K9856m015n7989M3119N1249J8015j7427j6148J1421
2158B36420K6828j7540K7017r490L5696r417J7722j0364j2634k4192N0246o0731
2146B49561K0493J6523j6405L5366J1756j3042L1519L2837L9613l0564k065o634
2134C68958J2890N9032j9236K9103O8363j682J2445L0077o141L6108M7759j911
$$ plain form
2122 635765 640420 672304 722843 815511 764178 793559 893750 935201 953433 1055237 1131887
2111 1131887 1125393 1131872 1146122 1162746 1301490 1424663 1431147 1488096 1532829 1733113 1945113
2100 1945113 2143688 2313721 2386222 2528981 2648260 2860826 3148566 3493561 3936327 4514715
2090 4514715 5280377 6355583 8028959 10507687 14002717 16627564 15936257 13249580 10222200
2081 10222200 7982667 6567550 5406318 4469877 3773096 3220149 2769430 2459338 2258032
2072 2258032 2170295 2108111 2002191 1790354 1609201 1516508 1386182 1272096 1183920 1084583
2062 1084583 1021693 944078 852809 775711 760955 778277 760984 710641 655116 668158 628412
2051 628412 570157 581906 564317 507632 490884 440144 432650 366574 365203 413569 356309 319149
$$ packed form
2122F35765M655L1884N0539R2668n1333K9381J00191M1451J8232J01804P6650
2111A131887o494O479J4250J6624J38744J23173O484N6949M4733K00284K12000
2100A945113J98575J70033P2501J42759J19279K12566K87740L44995M42766N78388
2090D514715P65662J075206J673376K478728L495030K624847o91307k686677l027380
2081A0222200k239533j415117j161232r36441o96781n52947m50719l10092k01306
2072B258032q7737o2184j05920k11837j81153r2693j30326j14086q8176r9337
2062A084583o2890p7615r1269p7098j4756J7322j7293n0343n5525J3042l9746
2051F28412n8255J1749j7589n6685j6748n0740p494o6076j371M8366n7260l7160
$$ plain form
2039 319149 341385 320912 310984 344474 321307 293413 262698 237363 258255 281045 244639 249569
2027 249569 235143 222020 254974 265094 236748 229018 233814 221250 219273 189006 139850 99105
2015 99105 133590 113797 66269 76508 68210 116757 131716 101996 76343 153648 142655 103158
2003 103158 64721 45998 79680 75639 102518 112260 24602 43721 39006 68144 84989 33966
1991 33966 91726 73365 87963 40056 47731 136207 93789 58376 75894 93024 117394 78714
1979 78714 77165 11571 3870 72710 119694 108081 15205 -4484 37594 64722 64735 80043 58288
1966 58288 42600 34075 -4652 4030 71105 31227 11774 -6670 -1444 -6771 -21417 10044 68539
1953 68539 27042 12079 -23650 4305 16388 -16416 5074 44314 12021 -17494 1986 12586
$$ packed form
2039C19149K2236k0473r928L3490k3167k7894l0715k5335K0892K2790l6406M930
2027B49569j4426j3123L2954J0120k8346p730M796j2564j977l0267m9156m0745
2015I9105L4485j9793m7528J0239q298M8547J4959k9720k5653P7305j0993l9497
2003A03158l8437j8723L3682m041K6879R742q7658J9119m715K9138J6845n1023
1991C3966N7760j8361J4598m7907P675Q8476m2418l5413J7518J7130K4370l8680
1979G8714j549o5594p701O8840M6984j1613r2876j9689M2078K7128J3J5308k1755
1966E8288j5688q525l8727Q682O7075l9878j9453j8444N226n327j4646L1461N8495
1953F8539m1497j4963l5729K7955J2083l2804K1490L9240l2293k9515J9480J0600
$$ plain form
1941 12586 19831 76001 34606 57091 85385 65577 88938 80449 41462 46683 70002 44602
1929 44602 55678 23897 21289 5296 -6554 10968 32390 10214 -43531 24330 -12396 -12767
1917 -12767 -2455 29058 42150 9340 14099 38517 77737 -4288 3604 -63919 -73211 -1777
1905 -1777 7236 38985 63805 57382 50062 -19041 23318 54306 6456 -16246 -28386 -1339 -6434
1892 -6434 -35949 20488 -9766 40593 79781 26779 5832 19276 25450 -21046 -14031 -18871 -26426
1879 -26426 -1391 3434 -34626 3967 28635 -34961 -27462 -42011 -13967 -67886 -78012 -93301
1867 -93301 -33326 -32803 -4029 -6734 -12389 16156 -11565 -42779 -40850 -44657 -53845 -21122 -13561
1854 -13561 -58051 -77237 -105084 -51634 -41056 -69623 -11215 -11714 10256 33792 33177 60181 43670
$$ packed form
1941A2586P245N6170m1395K2485K8294j9808K3361q489l8987N221K3319k5400
1929D4602J1076l1781k608j5993j1850J7522K1422k2176n3745O7861l6726l71
1917a2767J0312L1513J3092l2810M759K4418L9220q2025P892o7523r292P1434
1905a777R013L1749K4820o423p320o9103M2359L0988m7850k2702j2140K7047n095
1892f434k9515N6437l0254N0359L9188n3002k0947J3444O174m6496P015m840p555
1879b6426K5035M825l8060L8593K4668o3596P499j4549K8044n3919j0126j5289
1867i3301N9975N23K8774k705n655K8545k7721l1214J929l807r188L2723P561
1854a3561m4490j9186k7847N3450J0578k8567N8408m99K1970K3536o15K7004j6511
$$ plain form
1841 43670 -7203 -29773 -34181 -20254 -50007 -20110 -12954 -45880 -70393 -38733 -55832 -12270
1829 -12270 -15509 -44198 -52927 -36532 -37708 -55033 -54492 -18701 -9490 -890 11563 14656 -7618
1816 -7618 35407 34950 70742 65441 57110 79713 6920 -4630 24290 11253 -29982 -48714 -47824
1803 -47824 -2394 -22314 -40333 -24487 -17112 11238 -125 2805 -12094 -17969 -57652 -84072
1791 -84072 -62545 -64371 -100782 -88641 -85507 -60880 -25791 -57368 -63591 -45386 -31497 318
1779 318 39023 31529 30096 -19104 -34036 -27823 -31135 -10536 10498 -6213 -30698 -78742 -42059
1766 -42059 -30558 -40086 -39011 -37927 -36929 -73270 -53781 -29510 7311 -9628 -36278 -40118 -86530
1753 -86530 -99440 -64616 -79247 -67135 -32324 -11540 -47998 12456 -13077 -51081 -33938 41932
$$ packed form
1841D3670n0873k2570m408J3927k9753K9897P156l2926k4513L1660j7099M3562
1829a2270l239k8689q729J6395j176j7325N41L5791R211Q600J2453L093k2274
1816g618M3025m57L5792n301q331K2603p2793j1550K8920j3037m1235j8732Q90
1803d7824M5430j9920j8019J5846P375K8350j1363K930j4899n875l9683k6420
1791h4072K1527j826l6411J2141L134K4627L5089l1577o223J8205J3889L1815
1779C18L8705p494j433m9200j4932O213l312K0599K1034j6711k4485m8044L6683
1766d2059J1501r528J075J084R98l6341J9489K4271L6821j6939k6650l840m6412
1753h6530j2910L4824j4631J2112L4811K0784l6458O0454k5533l8004J7143P5870
$$ plain form
1741 41932 -5759 -28781 -14424 -26694 17809 -21089 3715 14530 -11851 -2251 -2489 8501
1729 8501 34947 15522 -10378 -75205 -65469 -86149 -53444 -8261 -19513 -24853 33901 -518
1717 -518 -41091 -48699 -20399 18415 9019 -45241 -29447 -16364 -34303 -110125 -146539 -86174 -64752
1704 -64752 -37397 -41718 -53283 -2129 -44828 -46317 -10465 -19500 -12698 -45284 -18187 -36505 -57300
1691 -57300 -67763 -63958 -38044 -52909 -56873 -67270 -45592 -20713 -27865 -13493 -30536 -6999
1679 -6999 -20200 15483 14042 -19336 -8124 19257 -52144 -87567 -21827 -5960 -20737 -65103
1667 -65103 -61711 -51788 -77243 -50929 -74193 -63519 -16192 2343 38221 15508 28774 18576
1655 18576 -14640 -38897 -14256 25202 913 23758 -233 -39713 -43039 -6189 42825 40747
$$ packed form
1741D1932m7691k3022J4357j2270M4503l8898K4804J0815k6381R600k38J0990
1729H501K6446j9425k5900o4827R736k0680L2705M5183j1252n340N8754l4419
1717e18m0573p608K8300L8814r396n4260J5794J3083j7939p5822l6414O0365K1422
1704f4752K7355m321j1565N1154m2699j489L5852r035O802l2586K7097j8318k0795
1691e7300j0463L805K5914j4865l964j0397K1678K4879p152J4372j7043K3537
1679f999j3201L5683j441l3378J1212K7381p1401l5423O5740J5867j4777m4366
1667f5103L392R923k5455K6314k3264J0674M7327J8535L5878k2713J3266j0198
1655A8576l3216k4257K4641L9458k4289K2845k3991l9480l326L6850M9014k078
$$ plain form
1643 40747 -39777 -70107 -30897 -63156 -34197 -35865 -22993 -20373 10388 2856 -45464 -53401 -52301
1630 -52301 -9266 -39308 -54516 -67771 -42584 -55676 -68556 -31494 -40828 -50176 -22997 -6872
1618 -6872 -17014 -22451 -45282 -16267 -66851 -73350 -37065 -44647 -60002 -54926 -49230 -101183 -158621
1605 -158621 -68131 -46828 -75163 -58807 -26847 -30801 -2407 -14444 -48996 -20510 -80070 -44854
1593 -44854 -15378 -16919 -22275 -40654 -28594 -74846 -39978 -59517 -44044 3139 -79922 -91377
1581 -91377 -35883 -48100 -37399 -49238 -10882 -30208 -88130 -75763 -8409 -22028 -34983 -23641
1569 -23641 -8809 18583 -40873 -62777 -26005 12873 -20865 31105 24200 11984 -38436 -24593
1557 -24593 3837 23928 -24918 -41434 -50128 -88388 -43436 -22301 -25053 -3843 -43679 -7978
$$ packed form
1643D0747q0524l0330L9210l2259K8959j668J2872K620L0761p532m8320p937J100
1630e2301M3035l0042j5208j3255K5187j3092j2880L7062r334r348K7179J6125
1618f872j0142n437k2831K9015n0584o499L6285p582j5355N076N696n1953n7438
1605a58621R0490K1303k8335J6356L1960l954K8394j2037l4552K8486n9560L5216
1593d4854K9476j541n356j8379J2060m6252L4868j9539J5473M7183q3061j1455
1581i1377N5494j2217J0701j1839L8356j9326n7922J2367O7354j3619j2955J1342
1569b3641J4832K7392n9456k1904L6772L8878l3738N1970o905j2216n0420J3843
1557b4593K8430K0091m8846j6516q694l8260M4952K1135k752K1210l9836L5701
$$ plain form
1545 -7978 -50467 -19751 -38613 -63706 -50548 -29440 -37681 -39925 6449 -13316 -30576 -299
1533 -299 12819 -37077 -26011 -33961 -32184 -48578 -61755 -38324 -16021 -26954 1164 -38596 -4762
1520 -4762 14691 25382 -846 -41382 -40126 -12122 14408 13654 -18673 -23550 -46513 -64577 -15116
1507 -15116 -68334 -12378 30626 -23995 -76945 -78037 -82429 -8355 10244 16084 -12402 -43996
1495 -43996 7339 -34717 -36773 -38911 -61257 -71356 -28443 -6651 -15588 -57431 -43588 -41919 -21074
1482 -21074 10204 -44455 -37857 -61950 -95372 -30069 -43001 -73736 -42937 -17968 -9229 -2328
1470 -2328 -12609 -56558 -48111 -7697 14837 -19616 4907 -4393 -22650 -10527 -44617 -48109 -33222
1457 -33222 -17010 -25901 25617 22179 -32488 -21909 -90914 -94020 -72259 -61486 -18644 -68959
$$ packed form
1545g978m2489L0716j8862k5093J3158K1108q241k244M6374j9765j7260L0277
1533b99J3118m9896J1066p950J777j6394j3177K3431K2303j0933K8118l9760L3834
1520d762J9453J0691k6228m0536J256K8004K6530p54l2327m877k2963j8064M9461
1507a5116n3218N5956M3004n4621n2950j092m392P4074J8599N840k8486l1594
1495d3996N1335m2056k056k138k2346j0099M2913K1792q937m1843J3843J669K0845
1482b1074L1278n4659O598k4093l3422O5303j2932l0735L0799K4969Q739O901
1470b328j0281m3949Q447M0414K2534l4453K4523r300j8257J2123l4090l492J4887
1457c3222J6212q891N1518l438n4667J0579o9005l106K1761J0773M2842n0315
$$ plain form
1445 -68959 -50929 -22024 -27599 -60406 -7909 -24123 -37602 -60266 -67890 -10904 -54648 -96008
1433 -96008 -99610 -87765 -19463 18014 -20509 -77495 -55416 -5155 -12684 15571 -12164 -11766 -5483
1420 -5483 -2703 47746 13209 -38697 -78273 -76517 -64759 -70040 -48788 -8147 -8598 -10678 -17163
1407 -17163 -42190 -12987 -3950 23093 -9641 -25306 -33681 -20962 -3472 -33923 -28118 -7903
1395 -7903 -1933 -44022 -41505 -42437 -2498 -20870 -18725 -19083 -9886 -42964 -62158 -68074 -88415 -46471
1381 -46471 -30266 -17973 -35387 -32692 -36217 -16038 888 -12872 -39879 -35025 6605 -65919
1369 -65919 -34256 4800 4308 22007 -41278 -32827 -56058 -63725 -15880 30522 26452 -30731 -2808
1356 -2808 31910 -26003 -7964 142 -36484 -18297 -44394 -16797 -54146 -62462 -16176 -50123
$$ packed form
1445f8959J8030K8905n575l2807N2497j6214j3479k2664p624N6986m3744m1360
1433i6008l602J1845O8302L7477l8523n6986K2079N0261p529K8255k7735L98O283
1420e483K780N0449l4537n1906l9576J756J1758n281K1252M0641m51k080o485
1407a7163k5027K9203R037K7043l2734j5665q375J2719J7490l0451N805K0215
1395g903N970m2089K517r32L9939j8372K145l58R197l3078j9194n916k0341M1944
1381d6471J6205J2293j7414K695l525K0179J6926j3760k7007M854M1630p2524
1369f5919L1663L9056m92J7699o3285Q451k3231p667M7845M6402m070n7183K7923
1356b808L4718n7913J8039Q106l6626J8187k6097K7597l7349q316M6286l3947
$$ plain form
1344 -50123 -21282 29126 10705 -18787 -35362 -63481 -68800 -69455 -5634 -5315 -25296 3199 45684
1331 45684 39671 -6794 -88771 -18129 -2218 -53293 -58873 -78893 -32426 -34418 -30961 31112 26255
1318 26255 27126 1155 38057 65007 66848 19782 -41870 -28303 -39823 -55816 -11616 -2009 -8929
1305 -8929 -36927 -77776 -46642 -50864 -59226 -58902 -25811 -24261 -6038 19446 -10634 31066 29975
1292 29975 11767 -26049 -46698 -47189 -54635 -49967 15230 -11566 2531 75239 13334 -1071 -1928
1279 -1928 5127 -936 -47712 -33571 20368 25736 15667 -5957 -43288 -4212 -415 -48702 -21948
1266 -21948 -53419 9439 50364 49770 19793 2841 17763 -31462 -11418 -25671 -51870 -28537
1254 -28537 10049 -16605 1237 7728 -22821 -11583 64687 64380 602 -3742 -11601 -33466 -65820
$$ packed form
1344e0123K8841N0408j8421k9492j6575k8119n319o55O3821L19j9981K8495M2485
1331D5684o013m6465q1977P0642J5911n1075n580k0020M6467j992L457O2073m857
1318B6255Q71k5971L6902K6950J841m7066o1652J3567j1520j5993M4200R607o920
1305h929k7998m0849L1134m222q362L24L3091J550J8223K5484l0080M1700j091
1292B9975j8208l7816k0649m91p446M668O5197k6796J4097P2708o1905j4405q57
1279a928P055o063m6776J4141N3939N368j0069k1624l7331L9076L797m8287K6754
1266b1948l1471O2858M0925n94k9977j6952J4922m9225K0044j4253k6199K3333
1254b8537L8586k6654J7842O491l0549J1238P6270l07o3778m344p859k1865l2354
$$ plain form
1241 -65820 -26452 -56002 -52434 -20101 4522 -11884 -2752 14908 16140 41328 46769 -43734 -48294
1228 -48294 7899 56005 74558 62088 -688 -8087 44813 38224 -44674 -106382 -68073 -44110
1216 -44110 -41363 -49861 7315 30803 -24431 -3586 19760 -6004 -43066 -54119 -56367 -15234
1204 -15234 -32669 -48138 -193 -52406 -115208 -60894 -59060 -73615 -32868 -21020 -8151 -41747
1192 -41747 39774 38775 29910 -8269 -55630 12767 -16716 -902 -54660 -36121 11021 -26483
1180 -26483 -17350 -8389 27009 5624 6096 -10343 -65267 -38919 -32570 36166 -8921 -21492 -27892
1167 -27892 9956 3297 28921 52850 -5831 -50720 -64804 -26061 6557 -20123 -20776 23997
1155 23997 26004 54204 7722 2876 23841 66524 14532 26157 83439 90640 50180 -15000
$$ packed form
1241f5820L9368k9550L568L2333K4623j6406R132J7660J232K5188N441r0503m560
1228d8294N6193M8106J8553j2470o2776p399N2900o589q2898o1708L8309K3963
1216d4110K747q498N7176K3488n5234K0845K3346k5764l7062j1053k248M1133
1204a5234j7435j5469M7945n2213o2802N4314J834j4555M0747J1848J2869l3596
1192d1747Q1521r99q865l8179m7361O8397k9483J5814n3758J8539M7142l7504
1180b6483R133Q961L5398k1385M72j6439n4924K6348O349O8736m5087j2571o400
1167b7892L7848o659K5624K3929n8681m4889j4084L8743L2618k6680o53M4773
1155B3997K007K8200m6482m846K0965M2683n1992J1625N7282P201m0460o5180
$$ plain form
1143 -15000 -42866 -14367 -26759 -22935 -56288 -80862 -27880 7082 53620 29624 -59 -13716
1131 -13716 -39885 -7739 -36173 -69460 -56140 6298 1303 -57881 -82236 -80325 -29495 15355
1119 15355 -55119 -26057 12018 -16402 1647 -22838 -17743 -9519 8371 -35349 -39166 13394
1107 13394 -10043 -68098 -24844 74301 1535 -3783 -28965 -57783 -30532 -25024 -38573 -3545
1095 -3545 -19746 -26062 -25859 -17358 -27524 -21933 -38141 -33740 -42393 -27302 -43364 -66100 -13756
1082 -13756 -24309 3308 71485 26480 3298 56472 58077 -18344 -50668 -9801 -9074 -47388
1070 -47388 -34817 -10297 11724 -6068 28288 26389 -8247 9984 -12955 6040 -22200 -6251
1058 -6251 -6537 10349 -7741 -13730 -12155 -7414 8348 2268 -24879 -48238 -61098 40201 26487
$$ packed form
1143a5000k7866K8499j2392L824l3353k4574N2982L4962M6538k3996k9683j3657
1131a3716k6169L2146k8434l3287J3320O2438m995n9184k4355J911N0830M4850
1119A5355p0474K9062L8075k8420J8049k4485N095Q224J7890m3720l817N2560
1107A3394k3437n8055M3254R9145p2766n318k5182k8818K7251N508j3549L5028
1095c545j6201o316K03Q501j0166N591j6208M401q653J5091j6062k2736N2344
1082a3756j0553K7617O8177m5005k3182N3174J605p6421l2324M0867P27l8314
1070d7388J2571K4520K2021j7792L4356j899l4636J8231k2939J8995k8240J5949
1058f251k86J6886j8090n989J575M741J5762o080k7147k3359j2860J01299j3714
$$ plain form
1045 26487 49991 24721 104 37334 35499 27628 3211 -24580 4923 -7277 -30509 -36288
1033 -36288 -27365 -16509 -37028 -23385 -17899 -46493 9544 34597 14266 -12545 -37354 6851
1021 6851 -3237 -10754 -20790 -3550 -17746 -29308 -20549 -19052 -5723 -8286 -29321 -65385 -32001
1008 -32001 1040 -24706 -19572 -86995 -41651 43111 -14129 -51445 -47148 -21581 -51788 -9719
996 -9719 44575 4130 -15004 -57235 -42427 -10051 -8585 -11386 -6810 492 20039 62829 41552
983 41552 14758 -24709 -27050 -34516 -36522 -74539 -46127 -31008 -81207 -87144 -75292 -98041 -55200
970 -55200 -28888 -680 20749 45955 31853 17485 -11191 -13159 8354 -2720 16386 -11172
958 -11172 -59884 -69756 -58954 -50000 -29178 -53337 -25388 -23380 -44295 -15055 24289 4597 -28825
$$ packed form
1045B6487K3504k5270k4617L7230j835p871k4417k7791K9503j2200k3232n779
1033c6288Q923J0856k0519J3643N486k8594N6037K5053k0331k6811k4809M4205
1021F851j0088p517j0036J7240j4196j1562Q759J497J3329k563k1035l6064L3384
1008c2001L3041k5746N134o7423M5344Q4762n7240l7316M297K5567l0207M2069
996i719N4294m0445j9134m2231J4808L2376J466k801M576P302J9547M2790k1277
983D1552k6794l9467k341p466k006l8017K8412J5119n0199n937J1852k2749M2841
970e5200K6312K8208K1429K5206j4102j4368k8676j968K1513j1074J9106k7558
958a1172m8712r872J0802Q954K0822k4159K7949K008k0915K9240L9344j9692l3422
$$ plain form
945 -28825 -21607 -14575 -13175 15519 -16701 -28781 -11659 52021 73692 61681 10262 1776 -22064
932 -22064 -67029 -55824 -40422 -42153 -28762 -1321 -45013 -8637 -43823 -35347 -14621 -72812
920 -72812 -72152 -89708 -13984 -39473 -5469 -51177 -40827 -14707 -1746 -35990 -62592 -16027
908 -16027 38095 24442 -6996 17530 47432 78828 -18362 -105528 -100963 -72257 -37498 -31235
896 -31235 -8598 19839 -16248 -7102 -15694 -9024 -55306 -75499 6720 -11068 -14230 6909 14079
883 14079 27653 33274 27885 23773 22971 6130 -38738 -24100 20924 -7482 -17251 -4785 -26236
870 -26236 -34262 -32004 -41307 1348 32362 -12200 -59758 -75600 -65449 6231 -43010 -43910 -29645
857 -29645 48080 56651 23433 45809 8044 -6351 5898 9052 9282 -49711 -25767 -27477 -8584
$$ packed form
945b8825P218P032J400K8694l2220j2080J7122O3680K1671j2011n1419q486k3840
932b2064m4965J1205J5402j731J3391K7441m3692L6376l5186Q476K0726n8191
920g2812O60j7556P5724k5489L4004m5708J0350K6120J2961l4244k6602M6565
908a6027N4122j3653l1438K4526K9902L1396r7190q7166M565K8706L4759O263
896c1235K2637K8437l6087R146q592O670m6282k0193Q2219j7788l162K1139P170
883A4079J3574N621n389m112q02j6841m4868J4638M5024k8406r769J2466k1451
870b6236q026K258r303M2655L1014m4562m7558j5842J0151P1680m9241r00J4265
857b9645P7725Q571l3218K2376l7765j4395J2249L154K30n8993K3944j710J8893
$$ plain form
844 -8584 4610 -32353 -20995 -12989 1532 -55829 -25527 3907 32127 20640 -38563 -20542
832 -20542 -12597 20590 9811 -11429 -30435 -29044 -35127 -74157 -83206 -24731 32218 53020 80289
819 80289 93115 27775 -26271 15294 -15127 -11781 13543 -10345 -8272 -7375 -17942 -17713 -38352
806 -38352 -27306 3955 60743 38661 30834 31489 10695 -21753 1160 -31990 -26226 1568 -9375
793 -9375 20426 -23997 -106888 4882 34395 22173 31108 -15667 40763 46486 55578 42891 14682
780 14682 24367 -26217 -62672 -21366 6272 -11698 -21052 7431 10048 25845 -8639 -59082 -59837
767 -59837 -53821 -54769 -18709 -3560 -53350 -24732 45978 24020 -21892 -42338 15938 -4171 54670
754 54670 84653 58900 43451 -1157 -24031 -15016 -37510 16160 -14117 -7622 -31112 -38765 -26586
$$ packed form
844h584J3194l6963J1358Q006J4521n7361L0302K9434K8220j1487n9203J8021
832b0542P945L3187j0779k1240j9006J391o083l9030r049N8475N6949K0802K7269
819H0289J2826o5340n4046M1565l0421L346K5324k3888K073Q97j0567K29k0639
806c8352J1046L1261N6788k2082p827O55k0794l2448K2913l3150N764K7794j0943
793i375K9801m4423q2891J11770K9513j2222Q935m6775N6430N723R092j2687k8209
780A4682R685n0584l6455M1306K7638j7970r354K8483K617J5797l4484n0443p55
767e9837O016r48L6060J5149m9790K8618P0710k1958m5912k0446N8276k0109N8841
754E4670K9983k5753j5449m4608k2874R015k2494N3670l0277O495k3490p653J2179
$$ plain form
741 -26586 -16320 -12904 -8772 -12945 -23054 9027 31691 -24564 36202 41322 19297 -10007 24045
728 24045 48053 6724 8000 24090 44098 -4677 -10294 15935 23072 446 -39833 -72924 -81904
715 -81904 -104510 -5585 3391 -44680 -111768 -50648 -5935 19651 35923 26801 30027 54023 52737
702 52737 38581 -35510 -28588 5232 -4898 -55512 -35101 -34558 -61778 -67796 -37570 -31524 36637
689 36637 23035 -30483 -50196 5404 -13913 22075 63262 25434 52538 82052 49627 33711
677 33711 8785 -4939 38923 9750 -31562 677 33669 39570 -25418 -10394 13556 -286
665 -286 -31065 4949 63475 -30993 23628 18178 -20616 14477 40115 8818 -4012 7977 11336
652 11336 -20674 6553 9595 -1283 29524 17597 14390 51188 38166 -6907 -8661 53861 47598
$$ packed form
741b6586J0266L416M132m173j0109L2081K2664n6255O0766N120k2025k9304L4052
728B4045K4008m1329J276J6090K0008m8775n617K6229P137k2626m0279l3091q980
715h1904k2606R8925Q976m8071o7088O1120M4713K5586J6272r122L226K3996j286
702E2737j4156p4091O922L3820j0130n0614K0411N43k7220o018L0226O046O8161
689C6637j3602n3518j9713N5600j9317L5988M1187l7828K7104K9514l2425j5916
677C3711k4926j3724M3862k9173m1312L2239L2992N901o4988J5024K3950j3842
665b86l0779L6014N8526r4468N4621n450l8794L5093K5638l1297j2830J1989L359
652A1336l2010K7227L042j0878L0807j1927l207L6798j3022m5073j754O2522o263
$$ plain form
639 47598 17486 14261 31395 39412 43638 51158 34095 10592 -18493 28443 26234 43997 -9109
626 -9109 28883 31583 -2349 40877 18049 24378 -15981 4232 5861 -27350 -6531 41527 23313
613 23313 26521 -25191 5878 34872 47394 10137 -22033 -3566 12417 -615 23424 17573
601 17573 37850 31737 -18383 760 -14684 21817 69201 33722 874 -27937 -44929 -8873
589 -8873 -19293 -31858 -43146 -18692 2378 30804 -8686 -21977 42745 17117 -11200 30701
577 30701 44449 39377 55980 68102 25282 -12541 -48374 48460 44446 -40466 -42629 5582 27253
564 27253 -9396 -3802 14333 9395 32145 34854 -4954 -5016 7927 54432 92734 95057 -7567
551 -7567 -9066 4746 4679 -14071 20242 -21419 -46635 -50033 -28719 -38708 -43668 4442 -53401 -49624
$$ packed form
639D7598l0112l225J7134Q017M226P520j7063k3503k9085M6936k209J7763n3106
626i109L7992K700l3932M3226k2828O329m0359K0213J629l3211K0819M8058j8214
613B3313L208n1712L1069K8994J2522l7257l2170J8467J5983j3032K4039n851
601A7573K0277o113n0120J9143j5444L6501M7384l5479l2848k8811j6992L6056
589h873j0420j2565j1288K4454K1070K8426l9490j3291O4722k5628k8317M1901
577C0701J3748n072J6603J2122m2820l7823l5833R6834m014q4912k163M8211K1671
564B7253l6649N594J8135m938K2750K709l9808o2J2943M6505L8302K323j02624
551g567j499J3812o7j8750L4313m1661k5216l398K1314r989m960M8110n7843L777
$$ plain form
537 -49624 16054 17077 48183 55592 50286 -13300 31404 3488 -36487 -32002 -62298 -57659 33734
524 33734 -9627 5064 22715 9753 7681 -46827 40885 -4728 29155 22992 -11405 -32501
512 -32501 10274 -17686 -31221 43805 53707 60260 33804 -19937 43454 69893 67704 51739 44334
499 44334 49247 -1056 7937 46669 42454 11576 -46577 7384 21347 16999 14836 -4780 -33059
486 -33059 20504 -8559 -19132 -33399 30019 36577 34485 89394 98685 76051 65154 63288 103122
473 103122 74656 29227 18579 47055 108264 81711 7978 -28090 -13211 14317 -7337 -17347
461 -17347 -21878 -14400 -17911 12723 17553 -3182 38008 12173 58849 59826 65438 43066 59877
448 59877 47410 48612 50194 37877 72315 10297 -39855 12750 20942 28157 32043 20759 53500
$$ packed form
537d9624O5678J023L1106P409n306o3586M4704k7916l9975M485l0296M639R1393
524C3734m3361J4691J7651j2962k072n4508Q7712m5613L3883o163l4397k1096
512c2501M2775k7960j3535P5026R902O553k6456n3741O3391K6439k189j5965p405
499D4334M913n0303Q993L8732m215l0878n8153N3961J3963m348k163j9616k8279
486c3059N3563k9063j0573j4267O3418O558k092N4909R291k2634j0897j866L9834
473A03122k8466m5429j0648K8476O1209k6553p3733l6068J4879K7528k1654j0010
461a7347m531P478l511L0634M830k0735M1190k5835M6676R77N612k2372J6811
448E9877j2467J202J582j2317L4438o2018n0152N2605Q192P215L886j1284L2741
$$ plain form
435 53500 20686 65407 67933 25208 56873 22030 38093 38226 24772 24830 49974 76298 29458
422 29458 20493 89871 89905 97751 73095 62600 70342 76227 -3348 -459 20655 27214 43574 93590
408 93590 72300 34875 46075 47572 107746 66897 21086 -4618 -12233 -16324 17290 44893 16549
395 16549 61158 55890 23775 -1742 38549 63788 41253 50068 82697 101146 42359 32652 52759
382 52759 43531 15271 6509 48192 49461 12761 -5963 13209 40425 69659 36921 40629 74900
369 74900 48651 54020 65136 75534 68928 35855 -7193 24935 39060 87079 86338 110999 21482
356 21482 -42078 23504 5728 42536 78880 66733 23221 46950 57478 15220 22714 56388
344 56388 19810 16719 49562 98607 28656 -16893 33465 29010 25420 21222 6573 29585 36386
$$ packed form
435E3500l2814M4721K526m2725L1665l4843J6063J33j3454N8K5144K6324m6840
422B9458q965O9378L4P846k4656j0495P742N885p9575K889K1114O559J6360N0016
408I3590k1290l7425J1200J497O0174m0849m5811k5704p615m091L3614K7603k8344
395A6549M4609n268l2115k5517M0291K5239k2535Q815L2629J8449n8787r707K0107
382E2759r228k8260q762M1683J269l6700j8724J9172K7216K9234l2738L708L4271
369G4900k6249N369J1116J0398o606l3073m3048L2128J4125M8019p41K4661q9517
356B1482o3560O5582j7776L6808L6344j2147m3512K3729J0528m2258P494L3674
344E6388l6578l091L2843M9045o9951m5549N0358m455l590m198j4649K3012O801
$$ plain form
331 36386 63615 17040 8163 37673 11251 41861 28814 90296 136980 122138 110331 104727
319 104727 57453 54380 41060 72963 27111 46288 -5802 -19366 2658 36432 67793 40294
307 40294 109082 77889 12778 17659 34565 91602 75526 51912 97421 91262 100670 67458 57626
294 57626 71302 116018 116680 78924 38204 34087 15436 34768 9009 21321 87829 92160 36739
281 36739 90989 92082 44239 8190 29235 57975 39576 -20122 -24795 69352 94427 34737
269 34737 22270 58615 70127 31245 36636 98755 111066 79793 61337 51499 44178 59785 38180
256 38180 51751 22943 73730 81167 58768 37244 41488 26535 86461 104175 77367 110479
244 110479 74841 44906 53861 5629 50306 29348 -11111 -9413 40014 89344 50472 16804
$$ packed form
331C6386K7229m6575q877K9510k6422L0610j3047O1482M6684j4842j1807n604
319A04727m7274l073j3320L1903m5852J9177n2090j3564K2024L3774L1361k7499
307D0294O8788l1193o5111M881J6906N7037j6076k3614M5509o159R408l3212r832
294E7626J3676M4716O62l7756m0720m117j8651J9332k5759J2312O6508M331n5421
281C6739N4250J093m7843l6049K1045K8740j8399n9698m673R4147K5075n9690
269C4737j2467L6345J1512l8882N391O2119J2311l1273j8456r838p321J5607k1605
256C8180J3571k8808N0787P437k2399k1524M244j4953N9926J7714k6808L3112
244A10479l5638k9935Q955m8232M4677k0958m0459J698M9427M9330l8872l3668
$$ plain form
232 16804 30240 13325 10758 70763 61055 98293 81552 100421 43383 23189 55583 29697
220 29697 49732 70155 110801 89487 63418 23060 41183 68027 67870 50913 40561 103074
208 103074 112707 132408 164079 129334 47284 24876 78545 41624 20302 7912 26799 74020
196 74020 93361 74230 20589 47897 33676 56257 92382 36495 60203 117894 100137 41407
184 41407 41499 33318 -12684 5510 40630 67236 76658 69310 45290 32252 68623 13268 25846
171 25846 99375 116032 99399 96846 65276 26913 49179 53374 65382 72674 134155 102166 122838
158 122838 106107 111297 83513 44434 28534 81628 49621 13605 33466 46623 20936 -6577
146 -6577 60245 68613 114542 129884 84024 11746 66256 65074 13558 44072 63102 69744 57575
$$ packed form
232A6804J3436j6915k567O0005r708L7238j6741J8869n7038k0194L2394k5886
220B9697K0035K0423M0646k1314k6069m0358J8123K6844j57j6957j0352O2513
208A03074R633J9701L1671l4745q2050k2408N3669l6921k1322j2390J8887M7221
196G4020J9341j9131n3641K7308j4221K2581L6125n5887K3708N7691j7757n8730
184D1407R2q181m6002J8194L5120K6606R422p348k4020j3038L6371n5355J2578
171B5846P3529J6657j6633k553l1570l8363K2266M195J2008P292O1481l1989K0672
158A22838j6731N190k7784l9079j5900N3094l2007l6016J9861J3157k5687k7513
146f577O6822Q368M5929J5342m5860p2278N4510j182n1516L0514J9030O642j2169
$$ plain form
133 57575 85620 73424 45304 24111 51542 39665 74865 109960 114744 91947 56947 83879
121 83879 73199 50304 93525 75958 68081 56403 62948 75054 102786 119398 76376 58040
109 58040 27642 32921 66895 99566 92218 91486 67714 64625 6261 61597 87223 97656 139975
96 139975 98025 60979 45831 22688 62125 74162 43043 37688 54614 76088 90984 101559
84 101559 56159 46987 59146 55348 64861 70612 101519 77910 23379 98577 87874 34869 62362
71 62362 37570 55074 75646 69749 63546 61259 85733 96403 71591 53675 37580 13037 48412
58 48412 87077 80087 56201 66286 69635 83544 100373 110220 128776 99675 95510 99962 114975
45 114975 92714 80081 75535 75716 107925 123933 106707 100976 74142 88084 110266 73329 43855
$$ packed form
133E7575K8045j2196k8120k1193K7431j1877L5200L5095M784k2797l5000K6932
121H3879j0680k2895M3221j7567p877j1678O545J2106K7732J6612m3022j8336
109E8040l0398N279L3974L2671p348p32k3772l089n8364N5336K5626J0433M2319
96A39975m1950l7046j5148k3143L9437J2037l1119n355J6926K1474J4896J0575
84A01559m5400r172J2159l798R513N751L0907k3609n4531P5198j0703n3005K7493
71F2362k4792J7504K0572n897o203k287K4474J0670k4812j7916j6095k4543L5375
58D8412L8665o990k3886J0085L349J3909J6829R847J8556k9101m165M452J5013
45A14975k2261j2633m546J81L2209J6008j7226n731k6834J3942K2182l6937k9474
$$ plain form
32 43855 64015 105737 87171 67812 76459 104653 107895 71984 70478 56006 70628 50251 73366
19 73366 74493 35494 34910 88648 80144 61690 70244 65768 35424 73066 83515 78068 98514 74299
5 74299 72871 81934 99856 87157 70763
0 70763
$$ packed form
32D3855K0160M1722j8566j9359Q647K8194L242l5911j506j4472J4622k0377K3115
19G3366J127l8999n84N3738q504j8454Q554m476l0344L7642J0449n447K0446k4215
5G4299j428R063J7922j2699j6394
0G0763
$$ Imaginary data points
##PAGE= N=2
##DATA TABLE= (X++(I..I)), XYDATA
$$ plain form
16383 -1032668 -1002351 -994123 -958716 -933004 -931259 -898653 -898466 -866516 -869217 -847403 -821851 -795095
16371 -795095 -785764 -757523 -726592 -693351 -673140 -685036 -643009 -605882 -637267 -590419 -577214 -578215
16359 -578215 -531710 -519258 -500972 -467873 -480906 -481834 -443697 -438776 -418837 -354858 -376614 -385465
16347 -385465 -352817 -280591 -239008 -267776 -283390 -254217 -219614 -190396 -173146 -171027 -139278 -134437
16335 -134437 -98269 -110740 -74820 -54229 -38447 -38058 -31931 16660 46125 48032 97602 116035
16323 116035 77889 83762 120541 148191 177333 183763 183007 189002 224677 221614 246226 262976 300908
16310 300908 325145 302864 321920 319383 320463 349486 383451 409104 438048 451138 420907 428088
16298 428088 451031 485307 526767 513446 548099 562556 611279 647349 603903 621562 655631
$$ packed form
16383a032668L0317Q228L5407K5712J745L2606J87L1950k701K1814K5552K6756
16371g95095R331K8241L0931L3241K0211j1896M2027L7127l1385M6848J3205j001
16359e78215M6505J2452J8286L3099j3033r28L8137M921J9939O3979k1756q851
16347c85465L2648P2226M1583k8768j5614K9173L4603K9218J7250K119L1749M841
16335a34437L6168j2471L5920K0591J5782L89O127M8591K9465J907M9570J8433
16323A16035l8146N873L6779K7650K9142O430p56N995L5675l063K4612J6750L7932
16310C00908K4237k2281J9056k537J080K9023L3965K5653K8944J3090l0231P181
16298D28088K2943L4276M1460j3321L4653J4457M8723L6070m3446J7659L4069
$$ plain form
16287 655631 668610 630409 626230 631589 720941 734795 727431 762812 734795 716910 792014 804267
$$ packed form
16287F55631J2979l8201m179N359Q9352J3854p364L5381k8017j7885P5104J2253
$$ [...]
##END NTUPLES=NMR SPECTRUM
##END=
