##TITLE=1H_EC-3296(XI-2)
 CDCl3
 8 sc, 
 6.7.2023
##JCAMPDX= 6.0         $$ Bruker NMR JCAMP-DX V2.0
##DATA TYPE= NMR SPECTRUM
##DATA CLASS= NTUPLES
##ORIGIN= UXNMR, Bruker Analytische Messtechnik GmbH
##OWNER= root
$$ XWIN-NMR		Version 3.5
$$ Thu Jul  6 14:47:37 2023 Russian Standard Time (UT+4h)  she@DPX200
##.OBSERVE FREQUENCY= 200.13135
##.OBSERVE NUCLEUS= ^1H
##.ACQUISITION MODE= SIMULTANEOUS
##.ACQUISITION SCHEME= undefined
##.AVERAGES= 8
##.DIGITISER RES= 18
##SPECTROMETER/DATA SYSTEM= spect
##.PULSE SEQUENCE= zg30
##.SOLVENT NAME= CDCl3
##.SHIFT REFERENCE= (INTERNAL, CDCl3, 0, 15.7568)
##AUDIT TRAIL= $$ (NUMBER, WHEN, WHO, WHERE, WHAT)
$$ ##TITLE= Audit trail, XWIN-NMR		Version 3.5
$$ ##JCAMPDX= 5.01
$$ ##ORIGIN= Bruker BioSpin GmbH
$$ ##OWNER= she
$$ F:/spectra/data/she/nmr/H-F/1/pdata/1/auditp.txt
$$ ##AUDIT TRAIL=  $$ (NUMBER, WHEN, WHO, WHERE, WHAT)
(   1,<2023-07-06 14:46:23.64 +0400>,<she>,<DPX200>,
      <created by zg, POWCHK disabled, PULCHK disabled
       configuration hash MD5:
       00 E9 B6 7A A2 85 ED C7 34 08 36 98 17 FE 4E 26
       data hash MD5: 16K
       0E F5 EF AC 6E A3 F3 3E CD 3C C0 18 A3 4D 2D 52>)
(   2,<2023-07-06 14:46:26.23 +0400>,<she>,<DPX200>,
      <Start of raw data processing
       efp BC_mod = 2 LB = 0.24 FT_mod = 6 PKNL = 1 PHC0 = -20786.13 PHC1 = 9.452721 SI = 16K 
       data hash MD5: 16K
       97 FE 0C 81 FB 27 8F 5B 2D 50 9A 1F 99 55 40 23>)
(   3,<2023-07-06 14:46:42.71 +0400>,<she>,<DPX200>,
      <pk PHC0 = -0.2090126 PHC1 = 0.6 
       data hash MD5: 16K
       4F 43 5D 1A B7 7B 11 54 3A BE 4D C3 11 74 B2 58>)
(   4,<2023-07-06 14:46:45.90 +0400>,<she>,<DPX200>,
      <abs ABSG = 5 
       data hash MD5: 16K
       20 2D 0E 72 D9 36 A3 5E 06 CB 4E BB 68 18 6B 55>)
$$ ##END=
$$ 
$$ hash MD5
$$ B2 0A EA E4 5B 64 B5 19 5F 45 7C C4 9C DF 35 B2
##$RELAX= 
##$RELAX= 
##$RELAX= 
##$RELAX= 
##$RELAX= 
##$RELAX= 
$$ Bruker specific parameters
$$ --------------------------
##$DU= <F:/spectra>
##$EXPNO= 1
##$NAME= <H-F>
##$PROCNO= 1
##$TYPE= <nmr>
##$USER= <she>
##$AMP= (0..31)
100 100 100 100 100 100 100 100 100 100 100 100 100 100 100 100 100 100 
100 100 100 100 100 100 100 100 100 100 100 100 100 100 
##$AQSEQ= 0
##$AQ_mod= 1
##$AUNM= <au_zg>
##$AUTOPOS= <>
##$BF1= 200.13
##$BF2= 200.13
##$BF3= 200.13
##$BF4= 200.13
##$BF5= 200.13
##$BF6= 200.13
##$BF7= 200.13
##$BF8= 200.13
##$BYTORDA= 1
##$CFDGTYP= 0
##$CFRGTYP= 5
##$CHEMSTR= <none>
##$CNST= (0..31)
1 1 145 1 1 1 1 1 1 1 1 1 1 1 1 1 1 1 1 1 1 1 1 1 1 1 1 1 1 1 1 1 
##$CPDPRG= <>
##$CPDPRG1= <>
##$CPDPRG2= <>
##$CPDPRG3= <>
##$CPDPRG4= <mlev>
##$CPDPRG5= <mlev>
##$CPDPRG6= <mlev>
##$CPDPRG7= <mlev>
##$CPDPRG8= <mlev>
##$CPDPRGB= <>
##$CPDPRGT= <>
##$D= (0..31)
0 1.2 0 0 0 0 0 0 0 0.06 0 0.03 0 0 0 0 0.0002 0 0 0 0 0 0 0 0 0 0 0 0 
0 0 0 
##$DATE= 1688640383
##$DBL= (0..7)
120 120 120 120 120 120 120 120 
##$DBP= (0..7)
150 150 150 150 150 150 150 150 
##$DBP07= 0
##$DBPNAM0= <>
##$DBPNAM1= <>
##$DBPNAM2= <>
##$DBPNAM3= <>
##$DBPNAM4= <>
$$ [...]
##$SUBNAM3= <"">
##$SUBNAM4= <"">
##$SUBNAM5= <"">
##$SUBNAM6= <"">
##$SUBNAM7= <"">
##$SUBNAM8= <"">
##$SUBNAM9= <"">
##$SW= 18.05172834244
##$SWIBOX= (0..15)
0 0 2 0 0 0 0 0 0 0 0 0 0 0 0 0 
##$SW_h= 3612.71676300578
##$TD= 16384
##$TD0= 1
##$TE= 0
##$TE2= 300
##$TE3= 300
##$TEG= 300
##$TL= (0..7)
0 120 120 120 120 120 120 120 
##$TP= (0..7)
150 150 150 150 150 150 150 150 
##$TP07= 0
##$TPNAME0= <>
##$TPNAME1= <>
##$TPNAME2= <>
##$TPNAME3= <>
##$TPNAME4= <>
##$TPNAME5= <>
##$TPNAME6= <>
##$TPNAME7= <>
##$TPOAL= (0..7)
0.5 0.5 0.5 0.5 0.5 0.5 0.5 0.5 
##$TPOFFS= (0..7)
0 0 0 0 0 0 0 0 
##$TUNHIN= 0
##$TUNHOUT= 0
##$TUNXOUT= 0
##$USERA1= <user>
##$USERA2= <user>
##$USERA3= <user>
##$USERA4= <user>
##$USERA5= <user>
##$V9= 5
##$VALIST= <valist>
##$VCLIST= <CCCCCCCCCCCCCCC>
##$VD= 0
##$VDLIST= <DDDDDDDDDDDDDDD>
##$VPLIST= <PPPPPPPPPPPPPPP>
##$VTLIST= <TTTTTTTTTTTTTTT>
##$WBST= 1024
##$WBSW= 4
##$XGAIN= (0..3)
0 0 0 0 
##$XL= 0
##$YL= 0
##$YMAX_a= 256066
##$YMIN_a= -257879
##$ZGOPTNS= <>
##$ZL1= 120
##$ZL2= 120
##$ZL3= 120
##$ZL4= 120
##$ABSF1= 15.7579
##$ABSF2= -2.293949
##$ABSG= 5
##$ABSL= 3
##$ALPHA= 0
##$AQORDER= 0
##$ASSFAC= 0
##$ASSFACI= 0
##$ASSFACX= 0
##$ASSWID= 0
##$AUNMP= <proc_1d>
##$AZFE= 0.1
##$AZFW= 0.1
##$BCFW= 0
##$BC_mod= 2
##$BYTORDP= 0
##$COROFFS= 0
##$CY= -3
##$DATMOD= 1
##$DC= 0
##$DFILT= <>
##$DTYPP= 0
##$F1P= 0
##$F2P= 0
##$FCOR= 1
##$FTSIZE= 16384
##$FT_mod= 6
##$GAMMA= 0
##$GB= 0
##$INTBC= 1
##$INTSCL= 3.70164e-10
##$ISEN= 128
##$LB= 0.24
##$LEV0= 0
##$LPBIN= 0
##$MAXI= 10000
##$MC2= 0
##$MEAN= 0
##$ME_mod= 0
##$MI= 1.114404
##$NCOEF= 0
##$NC_proc= -5
##$NLEV= 6
##$NOISF1= 3.799351
##$NOISF2= 2.8
##$NSP= 0
##$NTH_PI= 0
##$NZP= 0
##$OFFSET= 15.75681
##$PC= 1
##$PHC0= -20786.34
##$PHC1= 10.05272
##$PH_mod= 1
##$PKNL= yes
##$PPARMOD= 0
##$PSCAL= 0
##$PSIGN= 0
##$REVERSE= no
##$SF= 200.130002948349
##$SI= 16384
##$SIGF1= 3
##$SIGF2= 2
##$SINO= 5.538805
##$SIOLD= 16384
##$SREGLST= <1H.CDCl3>
##$SSB= 0
##$STSI= 16384
##$STSR= 0
##$SW_p= 3612.71676300578
##$SYMM= 0
##$S_DEV= 0
##$TDeff= 16384
##$TDoff= 0
##$TI= <>
##$TILT= no
##$TM1= 0
##$TM2= 0
##$TOPLEV= 0
##$USERP1= <user>
##$USERP2= <user>
##$USERP3= <user>
##$USERP4= <user>
##$USERP5= <user>
##$WDW= 1
##$XDIM= 16384
##$YMAX_p= 398982928
##$YMIN_p= -77522
$$ End of Bruker specific parameters
$$ ---------------------------------
##NTUPLES= NMR SPECTRUM
##VAR_NAME=  FREQUENCY,     SPECTRUM/REAL,   SPECTRUM/IMAG
##SYMBOL=    X,             R,               I
##VAR_TYPE=  INDEPENDENT,   DEPENDENT,       DEPENDENT
##VAR_FORM=  AFFN,          ASDF,            ASDF
##VAR_DIM=   16384,         16384,           16384
##UNITS=     HZ,            ARBITRARY UNITS, ARBITRARY UNITS
##FACTOR=    0.220516191357247, 1,           1
##FIRST=     3153.41046943974, 0,            0
##LAST=      -459.306293566035, 0,           0
##MIN=       -459.306293566035, -77522,      0
##MAX=       3153.41046943974, 398982928,    0
$$ Real data points
##PAGE= N=1
##DATA TABLE= (X++(R..R)), XYDATA
$$ [...]
8918 1685094 1697147 1707297 1739780 1762815 1778705 1777421 1778744 1776978 1804986 1816450 1835784 1856586
8906 1856586 1882770 1934923 1947266 1966583 2001132 2018694 2054045 2062483 2107088 2140089 2157880 2181269
8894 2181269 2218736 2221557 2242903 2286176 2316557 2349671 2379392 2441488 2503630 2565664 2611315 2654692
8882 2654692 2711606 2793739 2846782 2880762 2933706 3000611 3039870 3120352 3179201 3247140 3294569
8871 3294569 3293879 3343201 3404499 3448983 3507561 3597104 3661714 3718771 3788551 3832970 3916477 4007329
8859 4007329 4084735 4182887 4248137 4348043 4473808 4573062 4673484 4782118 4898510 5020372
8849 5020372 5165807 5298335 5437764 5623018 5795355 5962750 6155344 6345932 6574403 6807985
8839 6807985 7051091 7319661 7580837 7889968 8230740 8632320 9091027 9630412 10258846 11007459
8829 11007459 11867138 12935038 14239093 15640523 16736914 17593867 18754529 20591747
8821 20591747 23168391 26507433 29635375 31478994 32662077 33090493 31503016 28536440
8813 28536440 25283207 22621974 21128719 20528553 20606645 21005999 20953248 19870183 18456497
8804 18456497 17438593 16889949 16665396 16759684 17107246 17649504 18343301 19259371 20449370
8795 20449370 22029535 23786420 25284571 26630705 28407695 30987498 34511140 38734967
8787 38734967 43216726 48080052 52971998 56487018 58431870 58030874 56047817 53305140
8779 53305140 49180141 45059155 42402931 41097047 38810530 34301155 29603355 26143899
8771 26143899 23862253 22428671 21152929 19779041 18620261 17831488 17353765 17095418 16995690
8762 16995690 17110654 17421041 17910885 18599214 19555724 20781892 22355749 24325023 26580706
8753 26580706 28461567 29065676 29008000 29779030 31654055 34161116 36494143 38762558 39671391
8744 39671391 37601438 33578408 28288848 23439658 20019240 17725706 16194209 15148240
8736 15148240 14535369 14076108 13414743 12417724 11500737 10804584 10297542 9948392 9668079
8727 9668079 9476277 9329703 9236609 9177460 9101108 9055366 8991097 8999854 9094964 9199628 9303425
8716 9303425 9373062 9461154 9530942 9627229 9759044 9931150 10221961 10637385 11283858 12223465
8706 12223465 13570544 15300852 17517294 20629447 24953119 29735738 31862192 30264888
8698 30264888 26741559 21601806 17265287 14278524 11971140 10374662 9193380 8319424
8690 8319424 7603786 7055817 6639999 6300181 6022302 5803792 5587640 5396780 5229425 5109821
8680 5109821 4975565 4879943 4775110 4653457 4569955 4497046 4417774 4347500 4298471 4255137 4184237
8669 4184237 4132395 4128327 4105096 4090468 4106190 4080771 4082876 4070494 4059845 4076326 4087484 4117142
8657 4117142 4136927 4152564 4152281 4116808 4137194 4182165 4256334 4296522 4367505 4421569 4498956 4581482
8645 4581482 4704770 4830767 4934863 5047074 5212168 5386986 5620653 5858198 6155794 6495525
8635 6495525 6846628 7228738 7718493 8311117 9069282 9890551 10913884 12144633 13699505
8626 13699505 15713470 17703741 18702424 18875887 19556604 21086878 23316079 24360152 22709937
8617 22709937 20232004 18753491 18279234 18164674 17095028 15040740 13168448 11887190
8609 11887190 11050078 10455847 10095912 9902555 9808555 9839154 9996187 10217303 10553935 11045867
8599 11045867 11684032 12507104 13575882 14913771 16544878 18061068 18722968 19214205 20369004
8590 20369004 22413737 25251311 28147077 30390992 31436065 30657958 28172918 24740324
8582 24740324 21118156 18357594 16670364 15759564 15256897 14622470 13285261 11647774 10289988
8573 10289988 9334861 8643216 8160897 7860258 7623414 7442114 7276752 7209402 7197605 7332760
8563 7332760 7543780 7880930 8336015 8928764 9787822 10698887 11040691 10925737 11038148 11669662
8553 11669662 12662288 12950818 11861888 10467708 9559540 9177837 8939967 8156889 6996720
8544 6996720 5998000 5230386 4662230 4225262 3870326 3584480 3365429 3164035 2966321 2798595
8534 2798595 2624629 2524900 2435017 2331958 2233774 2149044 2070698 1967173 1873270 1799914 1750155
8523 1750155 1703733 1651227 1599439 1514685 1508032 1485625 1414676 1365523 1348066 1307449 1266803 1233341
8511 1233341 1180900 1140896 1097008 1054516 1024486 1023240 964818 908550 868835 839761 832383 800118
8499 800118 802509 801905 779507 747389 737178 709027 664033 652695 647555 625303 628859 629933 623813
8486 623813 610371 596133 569426 551631 564955 548296 551364 550768 560260 547316 544753 548031 544652
8473 544652 535100 520914 501269 494896 498741 484195 457636 469209 468976 471502 481509 469353 465451
8460 465451 470056 454689 476122 491272 493843 480918 489663 496741 468513 466215 508968 512951 521097
8447 521097 482711 464060 453370 421606 404665 391986 379232 366905 381659 387373 396188 363283
8435 363283 362528 368434 351388 318396 317387 341986 335069 340383 346239 338966 342874 357632 365620 355710
8421 355710 412039 448925 445012 442635 431856 440149 442819 444303 433195 413967 379028 372889 354362
8408 354362 353593 338890 339788 310106 289240 309364 281014 264422 242834 265103 242112 215484
8396 215484 220047 240213 205581 214529 236266 227160 212566 211623 219531 199228 214266 222169 226634
8383 226634 240338 231323 267343 251488 214773 201804 160832 161028 185685 187396 182601 172126 160370
8370 160370 149740 145904 108555 79245 97684 126637 105405 118107 128131 102365 100062 85374
8358 85374 92899 109651 109434 97927 79438 110458 105488 85679 71537 68475 79743 78260 67122
8345 67122 72550 73083 75261 82925 80925 75981 59119 60226 80209 71430 64700 87231 83266 87574
8331 87574 64702 62505 90273 96287 79479 80734 61936 54877 55304 39281 51315 48048 59900
8318 59900 67137 59771 65909 62943 56552 46114 51390 46517 66499 24440 17750 34037 45657
8305 45657 40496 56170 62453 37035 42631 57290 60781 44433 66357 59667 75784 57900 53033
8292 53033 52068 24633 58646 46085 37884 56452 45988 19422 45241 56733 54244 62189 52265
8279 52265 52377 65298 80292 72465 47964 26272 49213 54844 63635 65804 74475 77446 78924 66148
8265 66148 70188 90418 77481 121275 146447 156907 157772 132866 129050 130664 136600 117689 105396
8252 105396 107773 125314 107593 118006 130641 110358 81837 78113 73679 66334 75772 60724 85309
8239 85309 82386 81947 108166 120732 120545 108692 98812 99670 118036 136177 144831 162731 219273 258954
8225 258954 240532 259294 288526 329289 336874 310845 279228 239844 217660 208139 144819 123520
8213 123520 113326 83533 74310 89920 85835 93850 63976 80930 71919 73773 70319 59088 29725
8200 29725 42818 29651 49735 52607 26769 36034 30878 -51185 -74259 141203 107596 101184
8188 101184 128273 133205 110458 92640 74237 85710 92977 82610 46335 62702 69898 49683
8176 49683 33453 40830 39375 10861 20818 47223 45080 51041 33923 10428 30207 49209 32746
8163 32746 17373 44262 54824 40684 26883 58664 50821 61971 38061 9692 35645 30128
8151 30128 10174 10789 9055 25538 49759 54109 38283 39153 48170 47648 36059 43765 36104 9637
8137 9637 30268 42710 24882 52855 19509 13844 35360 7224 8063 41754 50596 54090 52025
8124 52025 46931 56259 74075 70779 75811 84092 62701 88327 93751 96906 78474 72799 78497 63208
8110 63208 60327 102829 94638 86011 61137 41082 31969 31453 -1893 -12359 32089 33083 31776 32360
8096 32360 46883 45903 53140 51089 37762 16033 31171 50930 55531 54860 71956 65371 49809
8083 49809 53407 61886 47010 23097 20370 64363 68443 47154 40118 23018 13922 28851 60922
8070 60922 62866 53307 69698 56602 29057 41296 67786 61727 67272 79581 84239 65319 53758
8057 53758 63270 69519 79110 67232 71805 64361 93307 94880 103941 107084 131249 130485 115300 124105
8043 124105 109668 122004 134131 138106 113501 122900 144955 176321 163562 136185 119262 103594
8031 103594 99145 98959 82652 74821 94582 90041 92660 114494 94532 90447 96627 94376 84538 78920
8017 78920 81619 73715 66749 62439 81121 86599 73288 67665 81389 98423 106198 101120 90865
8004 90865 101711 107689 102126 119446 120455 97526 97811 99153 91338 99053 75640 74759 72985 81734
7990 81734 81943 94635 97368 74790 34527 55501 83100 106090 83283 89517 113263 110998 82092
7977 82092 88486 117597 113992 124363 117768 117936 129560 128920 123818 128468 116823 137808 133804 148303
7963 148303 169049 132607 133489 147317 158378 159494 155271 152751 132685 124857 121868 150392 156832
7950 156832 111274 112405 162737 147970 130393 128844 150588 150302 146776 169457 172237 176059 176853
7937 176853 159787 172943 186971 188832 170404 178896 176095 193830 205379 241748 243090 240758 222735
7924 222735 201369 186358 170054 203344 201389 189330 199820 209787 197093 207594 222952 231808
7912 231808 233142 217085 218319 201169 193754 214461 231297 241718 256402 251883 266623 284648
7900 284648 260684 254829 254581 276811 283294 260908 259443 275306 279850 271158 248490 263500 304171
7887 304171 291996 322835 316978 316619 330973 360494 369162 357942 373524 374195 373731 355262 362510
7874 362510 354490 343268 325949 337191 373663 362544 351375 379804 354289 362893 367916 358448
7862 358448 350889 363095 405846 391899 410659 432799 434479 430878 437353 436413 428454 429763 422346
7849 422346 426237 442881 467191 489136 497306 504286 489902 493597 498949 500285 495275 499225 513807
7836 513807 524765 548124 538231 545987 545734 581179 591729 593285 595615 621839 623623 637072 645295
7823 645295 671909 694642 669242 674173 720104 712031 749262 738267 793940 789094 831647 709654
7811 709654 699165 815314 837613 892129 905708 936503 934640 971153 997883 1010444 1053832 1100607
7799 1100607 1121971 1156727 1183494 1230176 1281085 1321522 1357786 1391557 1439907 1493929 1542502
7788 1542502 1598026 1680305 1798928 1855996 1925723 2023569 2161423 2290425 2445613 2623852
7778 2623852 2846336 3152790 3508487 3938722 4520376 5277557 6194736 7134469 7784041 7379064
7768 7379064 6407782 5802796 5577772 5692153 6089963 6787697 7637484 8325679 8166898 6801047
7758 6801047 5382753 4437727 3800284 3376391 3068596 2862958 2706207 2555870 2462470 2368016
7748 2368016 2324594 2303998 2291227 2305552 2269744 2253082 2242852 2217656 2220220 2202083 2198510 2185613
7736 2185613 2201212 2216674 2251496 2284366 2287932 2308987 2338800 2361093 2375304 2396134 2440829 2493185
7724 2493185 2538639 2561106 2662746 2724027 2796539 2866060 2953608 2995981 3062718 3161229 3233751
7713 3233751 3371176 3524770 3747520 3937675 4145929 4370755 4615509 4917903 5243274 5650833
7703 5650833 6168164 6790560 7525780 8493071 9716765 11265076 13207730 15726917 18740819
7694 18740819 21553714 22135241 19429087 16494775 14901558 14376439 14773358 15974505 17903661
7685 17903661 19946746 20926373 18800660 14815414 11671473 9562344 8132571 7126874
7677 7126874 6422234 5830569 5358493 4976333 4695244 4444532 4279111 4126802 3986070 3874760
7667 3874760 3763682 3653543 3573166 3473300 3385197 3320925 3267262 3205267 3144719 3078259 3020982
7656 3020982 3016017 3040507 3037465 3043069 3040895 3056336 3115859 3196914 3237258 3305648 3434225 3566649
7644 3566649 3740169 3940840 4158817 4389047 4639565 4961964 5351081 5863611 6534222 7399876
7634 7399876 8488037 9916618 11734262 13653627 14896355 14895252 13965550 12420547 10500858
7625 10500858 8808674 7524733 6529010 5746325 5144560 4748727 4429852 4202768 4016006
7616 4016006 3849234 3709190 3603424 3511451 3418493 3370711 3323569 3313993 3315804 3324563 3332119 3359843
7604 3359843 3446047 3510506 3582305 3702639 3887091 4073094 4316172 4530932 4781564 5098252
7594 5098252 5493515 6020664 6738826 7616446 8729459 10208538 12098685 14206226 15759630
7585 15759630 15897277 14966390 13496851 11433793 9404046 7902119 6704522 5783811 5103465
7576 5103465 4616406 4258771 3970474 3742335 3577875 3407330 3270648 3180505 3118129 3074955
7566 3074955 3051404 3018045 2994208 3021690 3082984 3128047 3217691 3372017 3596967 3904349 4308592
7555 4308592 4837030 5330281 5512151 5361016 4984253 4470860 3900314 3423918 3100866 2853295
7545 2853295 2645451 2475095 2356189 2259237 2196907 2132696 2081976 2018582 1983461 1963125 1914347
7534 1914347 1893608 1901740 1907320 1912666 1913624 1939970 1957513 1980965 2025462 2094203 2201800 2264218
7522 2264218 2353437 2442070 2553237 2666859 2807645 3019159 3258027 3577801 3959148 4425917
7512 4425917 5109402 5944590 6726924 7150805 6994932 6524457 5788756 4910055 4186979 3634902
7502 3634902 3180870 2845718 2600656 2424542 2280937 2182618 2065288 1971635 1918739 1888870
7492 1888870 1857299 1837584 1789102 1744765 1712014 1654216 1658132 1626398 1640392 1640021 1626349 1628190
7480 1628190 1621550 1605978 1574649 1560014 1541373 1528974 1495724 1480870 1503073 1534023 1547028 1556231
7468 1556231 1553341 1532327 1520338 1525288 1522044 1517635 1539625 1553965 1569954 1582970 1593504 1578644
7456 1578644 1587950 1598033 1595589 1598930 1622029 1643962 1654782 1687052 1685403 1698502 1735080 1756723
7444 1756723 1783868 1808646 1853429 1874695 1896573 1923084 1887476 1901135 1940561 1972591 1996675
7433 1996675 2049998 2057596 2048710 2048423 2070433 2126409 2170082 2189685 2210941 2227557 2282320 2300840
7421 2300840 2318650 2315570 2352609 2396594 2399319 2465386 2537037 2557300 2598798 2635193 2664996 2698692
7409 2698692 2739272 2789236 2857329 2914187 2931424 2952910 3023953 3074054 3102600 3164274 3245877
7398 3245877 3308774 3344533 3415751 3468509 3515847 3590296 3646376 3699780 3729872 3786967 3830487
7387 3830487 3856332 3937111 3983666 4053551 4093625 4125975 4180865 4212224 4254662 4286947 4311544
7376 4311544 4383426 4417038 4451821 4500732 4554090 4613487 4641151 4660317 4686078 4708328 4747989
7365 4747989 4745822 4792293 4813553 4813426 4830464 4841596 4854783 4856914 4845774 4866653 4909122 4885601
7353 4885601 4862589 4866606 4850477 4836924 4845059 4836247 4812516 4767681 4735734 4714988 4637756 4608931
7341 4608931 4594867 4583161 4523221 4492179 4428639 4389024 4379008 4323097 4246729 4200945 4157317
7330 4157317 4116655 4060334 3981478 3937552 3880584 3805445 3743152 3701731 3647805 3617216 3556437
7319 3556437 3517060 3467460 3404142 3362829 3326360 3273770 3212871 3139198 3074162 3018144 2978869
7308 2978869 2943016 2908788 2845300 2798294 2745635 2676411 2623182 2561699 2509762 2472434 2444442
7297 2444442 2404156 2367046 2319280 2272436 2257042 2211914 2165682 2142471 2097522 2069326 2063612 2035194
7285 2035194 1984974 1959683 1967645 1935303 1897556 1853369 1811923 1790477 1759800 1745712 1720351 1695054
7273 1695054 1667947 1630017 1600384 1588675 1585585 1578555 1572233 1573384 1569230 1553177 1522246 1507972
7261 1507972 1501891 1479371 1435886 1401162 1361039 1315382 1298390 1305824 1304155 1274564 1249336 1249254 1278287
7248 1278287 1251929 1235778 1216865 1214877 1209348 1190982 1166822 1171941 1178621 1179386 1194904 1205490 1201272
7235 1201272 1193333 1207304 1203782 1188993 1158212 1148971 1165052 1166440 1158524 1142492 1138071 1139195 1141968
7222 1141968 1165853 1154417 1127107 1115785 1114412 1112542 1119563 1136694 1118624 1103426 1106139 1106769 1124445
7209 1124445 1151659 1123577 1098428 1106742 1103358 1107797 1085936 1090297 1113255 1114640 1105841 1099759 1095150
7196 1095150 1126695 1129346 1135064 1128817 1134093 1176815 1195884 1212078 1209090 1231973 1244086 1238841 1269989
7183 1269989 1332818 1371941 1372911 1368711 1367390 1408584 1434632 1451871 1497625 1503950 1534395 1570248
7171 1570248 1571659 1605729 1644204 1702302 1738937 1768466 1807555 1840152 1901067 1944798 2012779 2084695
7159 2084695 2151671 2217500 2257461 2279325 2306260 2366621 2415496 2484992 2545300 2645128 2743805
7148 2743805 2817257 2958707 3113710 3308408 3492865 3688882 3917103 4237789 4594986 4981041
7138 4981041 5496364 6133035 6927877 7963603 9271712 10934401 12955397 14982049 16309891
7129 16309891 15942897 14113678 12360676 11419625 11267886 11771721 12826562 14146081 15212080
7120 15212080 15115952 13344443 10872462 8834460 7388664 6441430 5765257 5276862 4887371
7111 4887371 4584544 4339330 4158099 4056770 3937713 3865528 3824301 3813819 3836092 3859770
7101 3859770 3890771 3926874 3991495 4122819 4272229 4482888 4743639 5102909 5534304 6126349
7091 6126349 6878632 7811520 9058238 10625206 12232891 13474134 13434543 12020787 10503858
7082 10503858 9579150 9278986 9557127 10315976 11400756 12366015 12507023 11115914 8858659
7073 8858659 6981087 5635221 4760032 4157417 3704407 3370457 3049178 2781558 2559237
7064 2559237 2442556 2309928 2182893 2061144 1965156 1867649 1781251 1722627 1657085 1592286 1549219
7053 1549219 1495448 1431948 1353459 1322061 1282892 1218012 1184333 1158559 1131535 1061157 1011253
7042 1011253 927467 909403 897453 861514 819262 798742 782268 751803 722157 701103 664647
7031 664647 638994 628585 615808 582453 581961 578269 557197 551318 497010 489970 488055 447398 467144
7018 467144 484806 491420 473396 463659 479533 466894 450048 427851 432631 399320 394154 419412
7006 419412 411096 424610 437966 398258 361832 371370 369778 352683 333722 323392 345113 322742
6994 322742 322290 338776 338268 344051 323338 312885 317585 311893 316259 324705 319368 306138 298251 305030
6980 305030 292748 324712 334144 315415 282577 288371 307224 310272 324304 318489 300260 298431 293829
6967 293829 309750 296075 299950 300965 295252 338630 352229 342709 325264 337000 346312 355663 362262
6954 362262 369206 365489 379773 395851 387530 389516 409045 423401 420991 416350 423550 440567 469407
6941 469407 476364 476399 495453 517426 526052 533309 565576 595352 648922 694121 752407 808257 852902
6928 852902 893503 952375 1035838 1145240 1265634 1382205 1526415 1723881 1922739 2157728
6918 2157728 2350349 2558990 2744655 2874131 2920248 2867421 2759032 2578179 2350132 2077212
6908 2077212 1841262 1633579 1448874 1282856 1116979 1003139 922287 817662 748038 688206
6898 688206 634420 600382 553821 509905 486562 475180 434888 410001 389411 385441 357582 347479
6886 347479 316716 278017 295791 276957 270086 259734 249528 231769 208661 195095 190188 198060
6874 198060 192140 154493 159702 183090 181755 164342 149856 136017 146892 124266 119149 139299
6862 139299 156391 131757 110159 95270 84668 106008 90103 60067 77236 90462 88878 83019
6850 83019 97821 97472 111159 94277 101592 89793 74165 86886 88605 76862 80452 53753 63819
6837 63819 74633 94493 79025 59826 81166 75050 82742 95209 112207 82392 75001 56735
6825 56735 61488 49802 45095 30549 15315 36788 43954 37574 25751 36649 41689 30427 6660
6812 6660 2271 46536 34387 24026 16071 42469 59527 55770 37315 33718 38358 24292 50187
6799 50187 17773 16110 -4923 -1216 37414 58040 34444 8494 9862 15916 23603 6719 -2568
6786 -2568 23302 27825 6908 2168 16353 24595 12151 18231 37508 36785 32188 47978 37861
6773 37861 -3351 963 37182 48356 57515 59485 60002 74954 116835 104175 110496 112663 102943
6760 102943 109032 99928 64891 58463 38451 71936 66561 51398 43379 52242 32172 34790 61176
6747 61176 22357 498 8272 24505 17798 10009 -119 8174 27651 34576 22060 -12688 -15615
6734 -15615 8932 -12006 -18175 2823 14615 35480 37604 37545 32665 34112 46770 35940 38366
6721 38366 47025 47755 56473 41360 70568 77906 63784 65236 49699 52104 51165 23188 22219 19200
6707 19200 8322 40844 2864 -30495 -25087 -11614 30754 15468 14447 -16977 637 -16320
6695 -16320 -24666 1312 12341 861 -19027 3517 -5563 -4011 -6685 -6028 -30970 -6521 -19408
6682 -19408 -28211 -30338 -22806 -27597 -16942 -13851 -24709 -18110 -28574 7267 -5382 -10069 4099
6669 4099 -24825 -8729 -22232 -32634 -30263 -46591 -25875 -9562 -20248 2377 3029 20486 7853
6656 7853 9390 -27691 -48744 -53066 -33955 -19440 -12014 -12441 -46074 -60344 -63352 -57510 -31116
6643 -31116 -9725 5784 -4170 -7 -35732 -76441 -63716 -42362 -17377 -5287 -30693 -21118
6631 -21118 -31278 -33797 -45847 -24990 -6112 -31285 -37174 -35099 -36450 -45937 -20621 -40787 -50964
6618 -50964 -53300 -43589 -44400 -26411 -44600 -40663 -43494 -71721 -47387 -46962 -37899 -10097 -11281 22879
6604 22879 30496 7171 -47282 -50171 -31340 -5858 14638 -2668 -36064 -40570 -34240 -11735 -36342
6591 -36342 -31973 1960 387 -6593 -35715 -53990 -31117 -17111 -8702 -24948 -45319 -47280 -22412
6578 -22412 -16797 -1328 -19902 -45340 -55994 -37215 -58146 -61241 -39431 -46792 -25338 -4884
6566 -4884 -17613 -14362 -35869 -31899 -21503 -39498 -12391 -30683 -55663 -60050 -32049 -50133 -37307
6553 -37307 -23108 -11372 -39992 -38570 -46059 -49459 -29849 -44925 -21467 -18800 -44991 -45532 -37527
6540 -37527 -25305 -54129 -30736 -62020 -70583 -62982 -41649 -32262 -35268 -43703 -48186 -45625 -51599
6527 -51599 -34644 -19298 2964 1251 -8731 -36787 -34424 -33360 -4306 -33288 -54538 -47080 -29797
6514 -29797 -26748 -30958 -26573 -16408 1242 -22866 -3241 4559 5217 -31301 -23549 -29242 -38925 -37524
6500 -37524 -31938 -35139 -73913 -48893 -27801 -5507 959 9573 2932 -11413 -24230 -28023 -12942
6487 -12942 -8462 -23706 -24008 -12188 7249 -38382 -35257 -25137 -15091 -3754 -22424 -7861 12965
6474 12965 3026 -15200 -18623 -18079 -12723 -7684 -21162 -47098 -41324 -22108 -48057 -53506 -45505 -20815
6460 -20815 -12798 -36763 -64620 -35303 -16969 -56727 -48601 -55405 -52531 -35465 -21712 -9933 -6877
6447 -6877 712 -13268 -32568 -32087 -45719 -41404 -35916 -45913 -41718 -45874 -41696 -34708 -16860 -8580
6433 -8580 -8273 -24352 -33061 -40738 -43990 -36402 -44320 -48953 -31331 -35272 -32969 -49347 -43786 -21299
6419 -21299 -7348 -9028 -12236 -16829 -25230 -46432 -43631 -38105 -53512 -40992 -27732 -28815 -40154
6406 -40154 -25988 -29355 -17219 -39430 -23695 -20193 -25469 -14849 -1327 -20335 -33206 -53194
6394 -53194 -29369 -30409 -61491 -53763 -17513 -15831 -14813 -17670 -12756 -23524 6696 -7748 -20630
6381 -20630 -772 -11911 -26010 -32588 -3362 -10070 -10107 -17665 -43434 -13359 29535 -21039 -23722
6368 -23722 -40182 -43183 -34444 -45443 -43749 -38331 -39892 -50910 -46378 -51187 -35899 -34970 -22545 -408
6354 -408 -29415 -56427 -43447 -54095 -45801 -57117 -63596 -60124 -40944 -36001 -40222 -19958 -32825
6341 -32825 -29823 -34930 -39920 -45951 -64812 -57501 -25994 -25514 -4900 -24077 -50105 -43944 -23322
6328 -23322 -44446 -37820 -59513 -60143 -56113 -64199 -45518 -27769 -24255 -23581 -1340 -37199 -12266
6315 -12266 -23247 -34089 -44501 -26738 -20308 -17891 -29643 -45027 -19487 -20955 -35494 -29569 -16913
6302 -16913 -42560 -56174 -53634 -42983 -47966 -15738 -14597 -4136 8785 -139 -10785 -4138 -4580
6289 -4580 -31665 -58309 -46799 -3431 -31663 -56644 -42816 -43598 -34337 -35552 -40352 -52464 -38249
6276 -38249 -43629 -16958 -20811 -46730 -44403 -36018 -7761 -21588 -41674 -61627 -37683 -30070 -49963
6263 -49963 -36054 -45588 -49337 -59101 -39956 -30549 -23439 -11545 -1106 -12385 -12851 -26705 -60250
6250 -60250 -48992 -46310 -35333 -23036 -42911 -54472 -49107 -46364 -20997 -9066 -3759 1194 -20653
6237 -20653 -50118 -67529 -18337 -24426 -30386 -11448 -24535 -24499 -55414 -43253 -38504 -32151 -36321
6224 -36321 -51322 -54774 -23143 -41890 -44257 -61136 -55624 -52225 -47206 -24739 -27540 -10201 -929
6211 -929 -30717 -42381 -14014 -10880 -3536 -26749 -35129 -38707 -43411 -53794 -58231 -64403 -35274 -1829
6197 -1829 -17032 -13143 -28805 -43665 -16780 -27522 -46041 -29741 -35439 -49820 -25142 -10334
6185 -10334 -24494 -41061 -17448 5910 -35240 -14264 -25234 -38055 -36609 -34789 -24019 -21240
6173 -21240 -33268 -59398 -49684 -20318 -32856 -42430 -20818 -21541 -46480 -40560 -30426 -49532 -37258
6160 -37258 -40139 -27626 -9023 -14184 -13885 -20589 -12942 -29013 -43997 -29769 -23885 -27047 -21620 -35019
6146 -35019 -29749 -27795 -43482 -50156 -39347 -23532 -53886 -51425 -66559 -30383 -27620 -73658 -77522
6133 -77522 -41799 -36110 -39100 -26608 -56402 -66276 -40270 -30061 -31083 -65955 -77016 -53871 -23995
6120 -23995 -8266 -31037 -56765 -32200 -36674 -50346 -54890 -55171 -58724 -58832 -45101 -42783 -26980
6107 -26980 -18627 -4986 -51928 -23262 -7378 -19395 -23822 -13225 -18466 -24305 -43472 -49558 -34271
6094 -34271 -47596 -34932 -53392 -66124 -47232 -30465 -32974 -50927 -25364 -7349 -25743 -28711
6082 -28711 -24708 -37172 -47360 -34750 -38331 -33331 -27643 -9368 -19725 -35552 -48065 -39629 -29249
6069 -29249 -31690 -23788 -35110 -38361 -17907 -31482 -31672 5614 18608 -10025 -32917 -4041 -14400
6056 -14400 -15889 -27862 -30035 -32723 -21604 -19788 -29492 -27648 -30493 -18660 -32180 -25894 -29579 -35703
6042 -35703 -28614 -16231 -6873 -17002 -15836 -19163 -20167 -41939 -69727 -52013 -29997 -27900 -35379
6029 -35379 -29112 -821 11492 -13 -22020 -24438 -8727 -9827 -9204 -16029 -35493 -29423 -30746
6016 -30746 -42549 -45102 -39955 -36225 -32341 -15706 -27125 -54119 -48259 -42255 -33715 97 564 -16040
6002 -16040 -47557 -23320 -35305 -46404 -55721 -50851 -26270 -43158 -21575 -858 -26861 -23667
5990 -23667 -19057 -17912 -30578 -45380 -52997 -46491 -36093 -42070 -42492 -39268 -54765 -17841 3221
5977 3221 -2762 -2102 -14699 -24525 -41139 -25416 -1648 11080 -6389 -25613 -20626 -5915 -4381
5964 -4381 -10265 -18438 -1592 2308 -5638 -10127 -14869 -3446 -4457 -27892 -37365 -34524 -45271 -32839
5950 -32839 -2532 -12415 -21434 -15153 -29874 -37013 -10415 -8622 -2205 -10638 27615 11803 -4528
5937 -4528 -24222 -12862 4814 6939 -14762 -39000 -22449 -23878 -13754 -8765 -4043 -8808 -33033
5924 -33033 -40075 -7860 -1697 -17387 -25331 993 11986 4974 -18053 -23451 -25069 -8820 -24913
5911 -24913 -28020 -33246 -10002 -6915 -36185 -27176 -26076 811 -16046 -25047 -21141 -27373 6246
5898 6246 -22860 -37183 -8274 -14334 -24027 -9592 -4885 -7914 -5067 -7609 5230 40923 39353
5885 39353 26888 23897 10664 -2049 -11329 -14165 -19777 -17839 -12029 182 9790 26518 -2547
5872 -2547 17799 40451 24809 26139 22491 17733 3374 14912 14061 3368 14486 -3575 -8913
5859 -8913 -4873 12039 23610 -17080 -33475 -7925 4661 13814 -6958 -16663 -23354 -5199 -3689
5846 -3689 -2106 3915 10849 21913 17537 -25224 -3891 -9982 -13313 -20184 -21772 10831 7026 5972
5832 5972 -4896 -11035 18422 28009 35669 16290 -13035 7342 22067 35748 22523 6306 -4253
5819 -4253 3331 5300 12561 1161 -6422 9812 3129 13420 9150 11008 13620 2143 10186 11877
5805 11877 23684 22651 -18665 -42826 -39999 -25525 -12081 -19663 11482 -3344 33866 44586
5793 44586 39697 50815 66305 51271 39420 -1897 7137 4025 11724 32903 8997 3875 15982
5780 15982 12277 1136 18000 5389 15185 10477 -2194 1975 -21311 -9914 -28015 -16599 -322
5767 -322 7584 4665 -19251 -17664 -13392 -483 32522 -2008 12255 -5987 7830 26707 -3486
5754 -3486 -11535 -8419 24663 31401 7940 4228 20337 2991 24207 7661 10596 12099 5381
5741 5381 -10519 -13413 15163 29453 14852 25500 19524 19060 32057 53338 56385 28525 26943
5728 26943 28043 8705 25550 -4634 -51904 -8340 25207 42463 31189 11559 15742 17902
5716 17902 21902 14876 32488 33854 25776 12813 14478 4730 1657 9133 13896 21935 23890 17102
5702 17102 13897 9749 33922 26445 -7601 11736 30510 27881 41529 11458 11970 23447 10880
5689 10880 21768 -163 -23754 -13854 -14732 23632 34262 41934 19264 11835 20423 17099 21521
5676 21521 -5780 2820 43641 36013 25460 12054 21633 18497 -1899 -978 -5327 7141 -6616
5663 -6616 11621 20603 4392 -6848 -8324 -9246 3056 37897 44855 71096 64215 42091 49526
5650 49526 44580 37094 48369 26914 22303 44650 45289 54322 26146 2674 17503 50622 55466
5637 55466 72359 64123 59485 75785 64758 69068 70292 66772 87068 70667 68361 58116 64517
5624 64517 70020 61678 67689 67084 65617 87626 92351 68339 56498 39340 36174 42450 43309 37725
5610 37725 33377 40012 70118 58629 28168 45868 66499 92318 65544 64991 56241 42009 19342
5597 19342 34520 64215 47653 86839 94703 69291 67346 78903 85381 76884 90448 87910 94419
5584 94419 79604 57864 53120 70982 83227 93750 96048 94783 117553 88641 96400 114974 127084
5571 127084 135472 83532 80438 108356 111375 121536 108730 135070 107809 116244 130784 116509
5559 116509 123225 135481 147278 140159 133926 115596 119569 123498 120176 133001 150995 125773 118571
5546 118571 120351 119310 127517 134767 145895 116239 84366 93939 121113 108096 106484 119143 129293
5533 129293 130881 140801 149124 172977 176096 162378 158829 151166 142582 130611 152180 133742 119610
5520 119610 110429 126863 156650 175393 192914 196335 167801 186875 185574 166819 162570 175717
5508 175717 181252 180576 209732 216521 193794 181386 220793 242770 229702 222838 197554 186604 199471
5495 199471 219005 235518 240006 252796 248246 235830 246189 235740 231555 235697 260531 218689
5483 218689 200211 227737 256680 266248 269093 287856 299835 301901 296845 322530 333264 376592
5471 376592 391882 414936 448673 476480 538634 586182 615923 673664 749214 820840 857334 853951
5459 853951 837350 807111 747649 670891 647306 600931 530840 482530 424843 377697 357097 387829
5447 387829 341522 341527 383659 386116 398912 400753 380722 364023 366932 376621 331241 328154 344291
5434 344291 364151 355777 339719 333810 338488 344324 337030 332789 347050 351150 349692 358538 361607 343567
5420 343567 350690 364149 377091 354284 364968 384851 396424 392740 400143 424844 400347 422528
5408 422528 424643 420782 383837 370715 397533 400575 421146 396567 382433 359213 370082 383041
5396 383041 391800 384752 363805 326238 344171 364734 329234 337391 332247 334807 348630 364970 354169
5383 354169 362839 371746 400899 446822 467714 478764 511585 509517 517013 527307 526036 536625 514278
5370 514278 556707 558681 532245 543041 525763 539956 524486 557613 574154 586276 575440 558518
5358 558518 548184 539027 567937 540877 530757 552899 530055 515575 517853 536674 552231 555752
5346 555752 556370 528002 538173 535235 540391 578177 604537 621579 615446 628474 635760 661559 658657
5333 658657 679006 662817 663659 652014 665122 660743 681705 669926 680549 698813 703249 710141 707223
5320 707223 762026 778906 790138 824593 829239 798443 812510 823409 850884 868008 876227 869754
5308 869754 873285 889569 906675 938802 938877 951794 960286 958046 1009184 1031084 1059795 1086331 1112745
5295 1112745 1138660 1137237 1161721 1167481 1166062 1171706 1200247 1224016 1236822 1261642 1291415 1307072
5283 1307072 1327427 1365243 1377084 1391694 1415081 1439334 1473830 1494373 1529875 1550549 1601400
5272 1601400 1636782 1691216 1704427 1734408 1775004 1807127 1877814 1940372 1984827 2026030 2099067
5261 2099067 2162294 2219551 2278628 2327258 2374618 2425772 2454068 2510816 2564255 2606804 2668420
5250 2668420 2689498 2663469 2677049 2698940 2728155 2729985 2745190 2768145 2819045 2855976 2870946 2896165
5238 2896165 2951708 3016584 3057185 3058198 3091614 3139771 3149544 3192113 3267597 3301087 3374519 3447477
5226 3447477 3548663 3616946 3723449 3822191 3908817 4038630 4142615 4264440 4400216 4490794
5216 4490794 4638508 4775819 4914490 5047723 5157234 5268354 5416019 5594388 5725032 5841077
5206 5841077 5971184 6105742 6261030 6418053 6603921 6805009 7049874 7305553 7592032 7878435
5196 7878435 8204839 8537006 8875814 9228470 9601647 9961081 10337360 10712504 11081647 11463713
5186 11463713 11845405 12269359 12710720 13192199 13741214 14399283 15168311 16078818 17174297
5177 17174297 18480956 20011556 21775076 23797912 26122557 28780230 31896374 35535849
5169 35535849 39918835 45268241 51918137 60009011 69677803 80796202 92473196 103450514
5161 103450514 113489853 121017505 123203303 120599470 115526538 107048819 94496746 80738171
5153 80738171 68269940 57226507 47673291 40096777 34456079 30228190 26946787 24329458
5145 24329458 22194647 20383650 18815864 17439863 16261483 15223403 14276565 13432322
5137 13432322 12652041 11937015 11296329 10700404 10154140 9652262 9171286 8717202 8286199
5128 8286199 7910299 7559601 7199877 6857804 6561584 6303721 6043896 5811936 5576867 5322161
5118 5322161 5124547 4911922 4699319 4489564 4276509 4114686 3950316 3742541 3590186 3462916
5108 3462916 3337458 3208367 3104543 3037271 2952204 2854397 2792089 2697005 2634696 2598092 2524516
5097 2524516 2488754 2424251 2369172 2342826 2352190 2332340 2301855 2260990 2217099 2176688 2095444 2025775
5085 2025775 1990778 1945073 1855824 1818894 1774665 1723876 1668222 1614496 1577323 1526375 1487916
5074 1487916 1433213 1386799 1373917 1309933 1252196 1192076 1140729 1139826 1083820 1040646 1013384 951425
5062 951425 900940 889430 889889 850289 815542 786582 764486 752473 728821 736397 723899 732474
5050 732474 726125 682836 679625 683864 681146 673564 653960 645094 636027 624385 595757 581838 585460
5037 585460 593542 574570 564313 574235 578080 551989 538911 525622 508535 533458 528167 514581
5025 514581 488607 500706 491062 485381 491324 476689 493030 500294 478558 484397 502775 521752 502129
5012 502129 488010 492545 493447 466501 445601 415933 415624 413916 407811 424135 460052 422037 391328
4999 391328 397162 406795 442564 423524 430079 412177 420390 426143 424201 430333 401492 379745 359419
4986 359419 345349 330204 311303 319101 355386 343974 351175 350696 352553 347494 360792 343871 318263
4973 318263 329863 348986 325856 317916 300297 271688 286961 293000 245488 228444 254376 253408
4961 253408 229065 194185 175015 156955 161996 145965 154725 185860 167940 162445 177691 167119
4949 167119 165194 153501 135913 166500 168382 144099 138725 145768 173614 177867 182965 186514 212725
4936 212725 251368 265660 256507 271839 284285 252507 250623 272442 262240 245686 230463 253911
4924 253911 209983 183305 209161 197182 196822 196336 198420 179174 204134 215307 182789 190031 149831
4911 149831 144939 160049 159115 145899 155533 150858 145602 167390 137032 140871 130950 133911 160807
4898 160807 159827 145342 172760 178494 162149 160745 150397 148185 171002 195385 178953 164977 154795
4885 154795 180494 159556 167571 171166 176542 155416 149055 165560 153514 191786 204408 224378
4873 224378 255158 252046 291303 286155 290967 297082 279332 294260 308606 306520 348307 412748 483822
4860 483822 539425 603275 642665 701434 711268 721756 729896 724686 684221 637405 569773 494143
4848 494143 423718 360332 329458 298545 272193 259150 250749 249356 235025 235295 225223 214893
4836 214893 216908 171350 191071 180684 181619 165449 160669 176944 170165 137920 120060 105068 111971
4823 111971 121690 102202 97745 114920 130168 149241 148152 119660 99244 119072 116802 119251 105185
4810 105185 81328 62554 66574 66973 83500 72631 86543 96498 82036 68375 71969 86274 94928
4797 94928 97532 100519 105939 79534 84474 94690 79986 93720 81137 91457 81971 75168 95615
4784 95615 84145 74892 62137 65745 63733 54001 65789 53985 71622 73545 77718 68794 58913
4771 58913 50507 55732 65601 55868 51278 54608 46679 44151 52216 41213 30660 61036 69199 37565
4757 37565 66339 94386 81770 87221 73453 78216 81097 83284 105049 114044 77844 98284 136036
4744 136036 137311 108691 133734 143084 103436 107620 93199 69239 79529 81088 68423 99400
4732 99400 72268 67163 81219 99930 66947 80065 91536 83772 90366 79513 67259 93595
4720 93595 84394 87910 79432 78075 74584 101086 96798 93577 97594 86923 87931 98797 68470 63762
4706 63762 90526 63389 53939 60960 48751 50203 65404 68390 72013 83232 70284 79500 67178
4693 67178 73460 90513 86990 83237 69161 80046 69238 67980 61746 73766 73260 74579 58829
4680 58829 78451 85359 85936 75777 56363 90756 109030 104603 113077 108475 104148 80892 61247
4667 61247 91791 81249 106132 117422 111020 114787 96934 108059 112101 81628 116638 95126
4655 95126 88072 100234 76085 105872 93307 78798 87040 97285 101124 116208 106177 89768
4643 89768 110765 104172 88056 81340 86988 87533 78891 103031 96308 111493 108739 115632 106933 70695
4629 70695 102053 167154 170539 167858 146057 128967 119384 144935 152829 146577 147781 140413 131760
4616 131760 112617 123613 136157 119961 140731 159404 133729 127731 108027 109865 117040 125998
4604 125998 101208 98142 126605 142936 154456 163320 147116 123862 118899 116431 131760 159625
4592 159625 150611 138310 122896 141178 162351 125165 144179 154018 147889 133736 152590 147298
4580 147298 133909 136044 140891 153569 135357 133222 126190 98781 97247 113164 127388 123475 120301
4567 120301 133613 130473 134244 141851 140865 129619 141709 142663 171553 159842 168645 177646 160868
4554 160868 138017 171564 173878 155603 159573 149987 156183 151312 157560 148722 142874 139770 180834
4541 180834 198407 180771 194390 208442 190388 169645 194057 192196 171370 196548 183928 179869
4529 179869 233823 242606 204576 177705 177181 209074 207628 203843 206587 182935 202332 197717 203994
4516 203994 223201 215842 218178 223847 225824 249669 227647 240104 244791 236090 231551 208952 223196
4503 223196 235803 232551 214833 217102 211241 196761 198353 223227 230332 234178 241535 248036 241640
4490 241640 256405 252177 250385 262980 257820 232715 230958 225342 230654 253081 234520 226791 231807
4477 231807 213121 229714 235752 270572 277803 281231 273783 266348 277691 292320 289250 294495 287778
4464 287778 287830 295832 318493 325613 309926 310977 324834 304243 315689 317827 329062 317857 332242
4451 332242 371218 338709 329269 359803 360502 361379 384262 413740 417216 387603 414723 405628 384547
4438 384547 406347 405126 411205 433727 464108 478190 483800 500751 479586 490372 496179 494902 478362
4425 478362 450454 414420 413008 401901 411324 427844 445789 439002 436406 436405 435102 444951 440480 471210
4411 471210 460895 463797 461480 439249 453405 491815 490151 481096 476645 445723 452178 463984 461535
4398 461535 451104 481888 492965 487953 490537 506546 482038 488191 497061 507308 522891 553295
4386 553295 554859 554445 554663 568063 558375 575736 599920 627369 615611 604759 598603 616924 623602
4373 623602 609807 610584 638859 623465 634686 636504 653673 664627 660955 664828 663323 680243 692766
4360 692766 694232 682928 688617 689116 693245 689591 692259 714258 742347 748854 739581 748612 778397 757420
4346 757420 774700 774695 812063 830322 849263 884427 896543 940829 1007332 1027808 1035724 1099214 1179672
4333 1179672 1265342 1366576 1500714 1598157 1684863 1724452 1711444 1697040 1639194 1547699 1440951
4322 1440951 1321628 1238759 1168493 1103837 1073623 1043421 1048098 1037841 1035132 1015460 998007 1000365
4310 1000365 1039605 1013393 1001423 990736 1008516 1000317 1001079 1004209 1003267 979120 1010885 1035585 1035761
4297 1035761 1036549 1050511 1069458 1085135 1106017 1101091 1110531 1099555 1124642 1159176 1140785 1128288
4285 1128288 1144912 1165711 1163557 1186030 1181119 1160163 1132862 1141490 1149829 1174163 1169431 1166239 1179385
4272 1179385 1184470 1177215 1183695 1202535 1205981 1222133 1212032 1206599 1196228 1202141 1194611 1232964 1252432
4259 1252432 1300296 1361610 1379846 1410901 1444522 1508940 1525244 1518756 1545798 1542864 1547277 1581134
4247 1581134 1586950 1629991 1640817 1617775 1638320 1655201 1665172 1681029 1701589 1703141 1713552 1727155
4235 1727155 1748116 1742138 1762028 1741410 1714129 1713317 1714846 1755588 1789163 1795091 1818244 1833320
4223 1833320 1854097 1880118 1937881 1970778 2011082 2051112 2097940 2144567 2232563 2331881 2465051
4212 2465051 2593602 2722112 2863303 2977649 3012360 2998286 2936849 2840872 2738256 2622211
4202 2622211 2574350 2538745 2502292 2466287 2465867 2442606 2424411 2448272 2486382 2502737 2561113 2587396
4190 2587396 2572707 2595791 2606443 2639374 2645467 2632938 2684574 2688588 2699550 2737510 2764075 2778547
4178 2778547 2839540 2893936 2944999 2987673 3017024 3077581 3109097 3144647 3158655 3164415 3159473 3196838
4166 3196838 3221459 3257748 3283733 3335672 3365050 3417583 3441959 3484060 3535446 3582338 3609705
4155 3609705 3637237 3667290 3701887 3735531 3789598 3863645 3916331 3986090 4020242 4090148 4173786
4144 4173786 4247958 4341488 4398149 4482305 4571207 4668721 4739287 4818347 4931790 5023275 5114657
4133 5114657 5185686 5294549 5376352 5446047 5518784 5550843 5596119 5640403 5652966 5677569 5668093
4122 5668093 5702968 5741976 5777400 5838099 5892207 5949431 6020498 6083969 6151125 6212797 6262622
4111 6262622 6339318 6417144 6509418 6585085 6688466 6808457 6944805 7090532 7211055 7388072
4101 7388072 7566308 7750984 7941529 8136740 8331619 8511150 8709846 8941396 9171606 9434502
4091 9434502 9709428 9997733 10324295 10693262 11064031 11436424 11860662 12315859 12816934 13351299
4081 13351299 13952026 14659089 15528748 16576171 17841612 19373038 21024062 22603511 23801959
4072 23801959 24385847 24397768 23909180 23082123 22273297 21731593 21408966 21280049 21319484 21517644
4062 21517644 21816788 22249914 22804903 23491422 24364773 25438327 26778832 28372651 30236068
4053 30236068 32371460 34850380 37682353 40925755 44761531 49279055 54701364 61291817
4045 61291817 69450612 79605128 92515626 108463088 127142711 147922488 168115927
4038 168115927 183556416 193979989 199021235 192886464 175161260 153470117 132096491
4031 132096491 110225356 89625843 73197946 61311759 52613902 46075842 40993677
4024 40993677 37006109 33746523 31125522 28958487 27145647 25594664 24194841 22867564
4016 22867564 21610826 20398073 19225694 18163334 17183315 16271615 15437727 14672899 13951162
4007 13951162 13286922 12680685 12107701 11579492 11078292 10599142 10163153 9754624 9390192
3998 9390192 9023208 8688506 8342202 8030977 7700534 7373355 7106387 6809326 6481721 6195081
3988 6195081 5979613 5749233 5525603 5339266 5153064 5017514 4913829 4812700 4704851 4583186
3978 4583186 4464804 4353011 4235135 4160470 4085495 4004008 3937347 3921690 3854459 3819769 3784515
3967 3784515 3735009 3672680 3592582 3500502 3410086 3321722 3231751 3119175 3030596 2939198 2889860
3956 2889860 2824552 2747570 2653600 2566505 2508841 2449864 2370049 2326637 2234996 2145735 2065747
3945 2065747 1998929 1964600 1892211 1797395 1755081 1707497 1655098 1596249 1545556 1497538 1483838
3934 1483838 1437446 1417425 1395336 1412704 1408531 1416056 1444124 1436719 1407450 1416543 1378161 1350825
3922 1350825 1332897 1327508 1299208 1285674 1287712 1283365 1255069 1235105 1200153 1186205 1173083 1154051
3910 1154051 1160385 1155984 1135527 1091470 1066792 1058556 1053760 1050820 1017292 994502 981683 981575 991474
3897 991474 975575 981662 970515 960184 960590 986191 969595 990299 1001374 959892 957941 946309
3885 946309 910817 884770 878375 873167 851494 826653 815579 844684 806006 816777 811214 814646
3873 814646 821713 794118 797196 806451 790652 780740 771445 751128 701529 711987 700376 683301 678795
3860 678795 687647 693228 729313 733912 725645 717911 699731 703299 701568 694841 696111 662438 665844 631868
3846 631868 616841 628697 635930 597159 589682 541292 532830 518081 488099 504853 500443 470007
3834 470007 467856 428964 418163 441144 463109 462160 439746 427887 449926 453035 469692 487180
3822 487180 481114 462773 449054 454823 461038 500724 546493 576655 574686 576309 624634 626877 614514
3809 614514 609598 609378 606389 591588 586425 594388 583188 584845 585394 576375 543875 540080 532745 538312
3795 538312 530554 537503 517935 504182 479101 475559 503877 487552 467934 471851 485875 495651 509329
3782 509329 521268 525732 512855 535776 553900 563694 512795 498775 515931 534908 509215 507701
3770 507701 488162 494420 502230 500587 525834 546026 557765 590041 562412 560704 575716 585251 599596
3757 599596 624837 623357 656258 687482 703243 762806 826929 864137 914609 980019 1082540 1163766
3745 1163766 1280498 1365771 1431848 1487174 1479886 1389509 1274265 1170459 1089105 994987 903795
3734 903795 840291 786898 730083 696756 653110 662746 661403 655312 665439 650542 615764 619246
3722 619246 592645 595400 618739 621295 611197 622720 602367 581291 582503 581887 560019 575601 568502
3709 568502 568513 550332 543668 549013 513095 528314 530210 524870 514283 503567 490978 472472 492575
3696 492575 471103 487103 474292 487693 484164 474451 499481 480751 494970 520961 531252 540776
3684 540776 532212 521750 535715 527844 518665 535006 559719 583640 572149 552365 592445 606438
3672 606438 588024 570294 580920 569154 582892 590370 591562 576514 586876 552144 551731 566829
3660 566829 555864 569326 552970 568431 541998 513978 511472 491893 511495 527575 568498 572937
3648 572937 564866 602416 606917 569895 577680 621746 666596 660126 647597 661561 683149 664966
3636 664966 665808 688619 717846 773544 800772 825769 861006 862427 901356 949911 1000441 1036319
3624 1036319 1090664 1133928 1180969 1254400 1369506 1497636 1612780 1773018 1987642 2151624
3614 2151624 2267932 2331537 2306229 2151810 1983412 1809080 1645639 1474257 1355537 1280981
3604 1280981 1208694 1131712 1080815 1051415 1026720 1002302 996696 995325 994973 959147 956951 927698
3592 927698 909928 951115 963305 961179 957244 933542 941005 919185 929397 961667 976947 989338
3580 989338 998947 997871 1002187 989124 987135 973436 975901 983139 995591 953736 954803 925254 915883
3567 915883 923250 901502 887579 865644 851458 891939 889321 857690 857260 835680 818862 814037 811274
3554 811274 811644 820318 849520 904078 1010670 1060014 1155939 1230444 1291202 1298720 1265404 1241090
3542 1241090 1219843 1237817 1256990 1280131 1302287 1328648 1324460 1331157 1340893 1367174 1375427 1429568
3530 1429568 1436342 1425345 1437543 1436687 1389917 1361538 1348583 1342018 1305732 1284965 1279542 1294462
3518 1294462 1310033 1334149 1331607 1314762 1267029 1254745 1268177 1333234 1368287 1374064 1409861 1444922
3506 1444922 1471165 1536483 1543727 1588687 1622369 1684369 1705149 1676785 1562212 1528895 1501655
3495 1501655 1537389 1581301 1656752 1710742 1787891 1818686 1866502 1905165 1941962 1947242 1962426 1979846
3483 1979846 2021215 2029492 2049169 2044797 2088902 2093045 2150217 2137047 2125103 2107402 2104218 2185622
3471 2185622 2291153 2368382 2430684 2500909 2571171 2629217 2706458 2731924 2767507 2800897 2837624
3460 2837624 2831184 2842358 2905326 2987955 2996171 3012720 3052385 3118165 3206392 3289843 3325273 3409784
3448 3409784 3479203 3561767 3600155 3642657 3676121 3727097 3811936 3885455 4019115 4156627 4313274
3437 4313274 4432792 4563563 4650957 4782286 4950892 5093014 5242935 5426631 5624553 5808920
3427 5808920 5936656 5988909 6011155 6071104 6143737 6271116 6376622 6514546 6581263 6591872 6564139
3416 6564139 6541154 6519523 6530250 6529964 6583384 6687568 6817700 6929005 7062323 7130270 7172205
3405 7172205 7195104 7282652 7340748 7462547 7536054 7630295 7649748 7732676 7896784 8150111 8378284
3394 8378284 8637412 8862198 9107438 9311287 9609670 9863844 10148517 10423260 10709955 10926070
3384 10926070 11180385 11425712 11786431 12108874 12469754 12774933 13154513 13455081 13792701
3375 13792701 14107816 14522051 14896429 15273709 15568159 16044518 16608488 17314624 17968244
3366 17968244 18778648 19565114 20371316 21030932 21719216 22407000 23293639 24212352 25178754
3357 25178754 25989787 26903220 27825952 28868277 29884063 31049987 32097961 33377322 34867840
3348 34867840 36819813 39135709 42071477 45409587 49294876 53620957 58868181 64866510
3340 64866510 71752834 79281940 87995304 97904246 109385600 123147767 141655247 165406852
3332 165406852 196042020 235378130 286163194 346370772 398570515 398982928 328934797
3325 328934797 249615734 192038212 152996449 126420861 107524791 93800946 83118892
3318 83118892 74469481 67106379 60484299 54672693 49990084 46058738 42879975 40179557
3310 40179557 37806535 35561497 33587410 31673414 29962968 28323371 26883870 25495495
3302 25495495 24246126 23060259 22008263 20944642 20017558 19092873 18344098 17631178 16908322
3293 16908322 16014943 15284869 14617518 14125437 13658359 13252325 12704029 12177806 11633506
3284 11633506 11141250 10516846 9995398 9530646 9165225 8817409 8525055 8132629 7882267
3275 7882267 7651729 7484323 7297068 7154645 6972194 6861598 6711531 6597835 6426976 6319723
3265 6319723 6194426 6099706 6019971 5977952 5927061 5926670 5852674 5807714 5672800 5514685 5276469
3254 5276469 5117526 4967513 4873173 4738568 4587124 4408223 4307619 4210469 4148839 4049331
3244 4049331 3995615 3900522 3811154 3627394 3513482 3383072 3237167 3063959 2991704 2964155
3234 2964155 2995467 2999563 3018639 3005177 2947429 2827455 2692749 2541046 2460039 2373770 2376852
3223 2376852 2366400 2324819 2260045 2212965 2161080 2110697 2097806 2108078 2148420 2125285 2047401
3212 2047401 1984259 1906402 1865938 1789127 1713124 1694450 1661693 1652681 1626522 1645028 1648856 1646861
3200 1646861 1639775 1586106 1568898 1531881 1518592 1524109 1465594 1403411 1366190 1358197 1334727 1340850
3188 1340850 1352035 1391589 1406055 1461635 1497456 1514810 1509495 1448875 1391513 1310401 1237494 1231777
3176 1231777 1228806 1196473 1163032 1141225 1105414 1098052 1099544 1098692 1088497 1089429 1090878 1118140 1075097
3163 1075097 1102764 1158246 1185277 1164492 1150136 1085348 1012604 913850 832126 818517 877697
3152 877697 917983 984248 1004000 955986 911870 903007 916840 970982 959441 942489 920791 906735
3140 906735 881018 819196 749612 768733 776891 806884 742973 654226 598886 566193 518352 498795
3128 498795 472359 468480 436680 447852 453952 466793 450177 445162 469321 482571 464871 477558
3116 477558 495755 508920 453074 419639 404402 428682 396756 359547 396991 468709 561662 663823
3104 663823 731005 773903 755596 745460 685719 641417 630509 621327 588202 565010 560545 580142
3092 580142 558861 539912 554492 544835 528447 454392 451554 447732 415618 386648 376956 384545 383843
3079 383843 410441 398589 406590 405986 388174 408900 418377 431311 446748 445900 434684 423860 404639
3066 404639 408164 426490 451873 464156 472673 486390 509516 520477 511999 522017 565053 548788
3054 548788 574847 601041 618058 656857 714292 763195 845030 923548 1052812 1170502 1329191
3043 1329191 1498074 1709131 1892424 2006571 2038724 1980890 1822877 1609639 1379625 1176408
3033 1176408 999254 888948 809755 728824 634358 576270 553408 541822 490059 445439 416199
3022 416199 457240 458549 453650 419696 411195 363916 353502 358664 372882 369736 345900 357756 377958
3009 377958 336132 341430 344957 362270 349971 363587 376028 346588 325369 303096 285189 252347
2997 252347 235454 245451 232531 198924 179155 159683 169357 184444 158268 145527 141675 142450 151851
2984 151851 157013 155944 152505 150007 155536 161125 147849 162554 132969 125665 130832 131206 129774 123838
2970 123838 132409 111731 120990 142577 143689 140175 148284 148523 167408 178457 168877 172818 155152
2957 155152 129364 142192 151119 113828 100540 103809 107213 100455 118678 137548 139038 104911 89206
2944 89206 95133 76092 62075 81429 93214 120935 117465 98218 78624 31701 18699 65580
2932 65580 75775 58279 27885 39456 49095 48164 44263 69602 70260 82640 98877 97056 82466
2919 82466 119211 136638 127260 120365 137433 130459 131325 135336 129197 119671 141262 138440 162519 166190
2905 166190 141771 103758 115331 105273 84533 77788 101342 106096 90988 100521 107780 106243 141087
2892 141087 154211 129251 159935 159639 183851 167208 154562 157881 160585 134526 158396 179561
2880 179561 159090 166194 148663 132935 138727 103381 72637 83050 81285 82783 71425 90323
2868 90323 87934 107554 107461 97133 98975 120749 130609 124000 118229 107667 88518 75893 69342 65167
2854 65167 90963 92080 84394 94466 107437 110505 114232 133705 133901 122926 120395 81282 49254
2841 49254 55747 60734 60440 33227 37970 36306 38653 37308 41608 65239 92077 119387 72074 69844
2827 69844 57629 62473 59629 45221 61912 57512 51297 37128 55104 62421 64113 68767 78653
2814 78653 88679 61435 72072 62773 46586 30976 38387 35447 29592 45347 54492 35328 41765
2801 41765 27519 7862 8797 15232 31966 40063 70288 92670 76378 82551 100306 81335 58787
2788 58787 50313 41126 49660 38187 33932 69766 64297 46281 41926 29708 61451 47284 24941
2775 24941 13051 18947 -78 -13032 -19423 7681 3686 5911 3804 -16194 -19821 -1243 15879
2762 15879 6442 12658 1247 -20427 -3856 10954 29935 16548 -10436 -4297 -15695 955
2750 955 6968 19534 16737 15298 26646 11962 2709 -17459 -16857 13458 2851 -25174 -10317
2737 -10317 -5745 -1513 4770 17282 20207 9949 13960 19603 38889 49486 42784 32495 10031
2724 10031 30194 47921 39632 24357 25485 11444 14389 21103 3872 -3194 -4303 -21069 -1945
2711 -1945 -2163 10891 3925 -8911 -2426 -9620 681 9560 -6331 -5760 28139 14781 13068 -9004
2697 -9004 -12281 -17591 -48685 -40947 -11355 -29571 -20880 -23315 -27984 -9928 -6168 14375 13445 -4845
2683 -4845 -22091 -7665 5297 -6074 6782 5608 -14893 -33285 -17531 2283 20662 915
2671 915 2245 -30393 -13532 -5386 7921 -3013 -20943 12379 -10245 -11686 -11251 -847 14800
2658 14800 642 6289 17267 9302 -3311 -10900 -9406 -16297 -4737 13513 1972 17749 -11183
2645 -11183 -4015 -5389 -17299 -1499 12230 -13409 -15293 -5698 2457 13263 3427 -24939 -17166
2632 -17166 -7235 -2699 -16527 15352 17329 13565 5810 -27915 -37523 21025 49466 51521 57496
2619 57496 45273 25727 4747 -21904 7095 -5576 -30714 -13023 -37829 -10976 7112 18861
2607 18861 9178 1962 -9400 -14500 17747 27343 18919 -18797 -12410 16082 5326 17598 6161
2594 6161 -4073 -15269 -30379 -36270 -26112 -6671 -11468 -20374 -11327 -22885 -12195 6050 16895
2581 16895 -1812 -3486 -21385 -36393 -45553 -34101 -32170 -19487 -8955 -5419 -24300 -18762 -21439
2568 -21439 -30072 -6058 -15620 -28539 -2163 -11764 -26500 -33737 -22614 -15491 -14677 -3429 -2735 6041
2554 6041 1687 6334 6143 -3084 -9818 -31005 -19444 -14341 3684 -17429 -48112 -38607 -57135 -58585
2540 -58585 -21399 -16232 -17135 -21729 393 5521 6541 -15818 -19767 -52481 -39679 -29812 -37171 -35171
2526 -35171 -19071 2839 3626 -6320 -17091 -16922 -21342 -30970 -38527 -35857 -26519 -29292 -693 24879
2512 24879 25631 -6849 -33730 -43883 -45489 -65479 -47199 -34246 -7435 -2686 -31216 -38400 -44757
2499 -44757 -7720 -14140 -24966 -42955 -36788 -2960 2096 10720 7734 1515 -4442 -41 21677
2486 21677 -5929 -18058 -11003 15599 1170 -200 6423 9844 -10109 -31179 -20910 -20899 -29647
2473 -29647 -11118 8882 16321 -24130 -21311 -1119 -1871 -5344 -2167 -4841 -8080 -13669 6106 19082
2459 19082 14375 15018 7192 -13974 10654 -33285 -36080 -13972 -17509 -21395 -1872 -13341 -16869
2446 -16869 -16379 -16039 -34667 -39552 -19920 -49145 -46501 -46514 -25831 -24379 -31092 -43437 -42022 -39871
2432 -39871 -52362 -19483 -9461 12043 8133 -131 432 5573 1803 -2522 -7670 1993 12716 5056
2418 5056 7755 -4573 21974 10344 18281 -11979 -15293 -19592 1381 -7122 -17248 -11949 2071
2405 2071 -4874 14001 18391 143 12476 -11440 8240 -15628 -4345 -1720 -2369 738 11816
2392 11816 -10348 9909 -14459 -23548 -17275 -31853 -18430 -5037 -3124 -23242 -10267 -26982
2380 -26982 -33177 -34027 -39029 4389 6926 9218 -2425 -9415 -9656 -7812 312 7925 1455 29233
2366 29233 11508 -3438 -5555 518 6801 -17529 4778 28165 12807 10239 -12518 -11998 11709
2353 11709 -3965 5647 38992 49244 20878 19406 6747 -5057 -24286 -24491 -21653 -21412 -34453
2340 -34453 -36636 -23813 -1719 31369 17016 -186 -5372 -6847 -15240 -32852 16284 -969 4934
2327 4934 -13065 10872 13484 -6767 -20209 8716 -1011 -503 17474 -4659 -25513 8382 -7082
2314 -7082 1366 -6821 -425 8524 -1429 -8152 -4783 29326 18438 6116 31910 35996 -12474 -15113
2300 -15113 -141 1823 17479 -4537 -5404 15761 14999 29744 -6083 -26521 5558 -1244 -36063
2287 -36063 -34440 -14719 8902 2911 8067 -2110 11504 -14463 -16778 -9923 -27335 -5983 -12872
2274 -12872 -3586 12973 18322 21312 12183 7082 25422 20371 6995 3752 18695 4557 661
2261 661 -3343 -10362 -7261 -8517 5980 1005 -7781 1453 3921 9195 -1839 16851 3064 770
2247 770 30558 37349 42404 26325 23438 32261 41026 -3702 -26996 -8795 37227 47126 26373
2234 26373 24646 21882 19437 28305 8207 24209 24747 32177 20503 17313 18092 1690 10933 2377
2220 2377 -27190 -6486 -11197 3237 15415 11529 -2479 16384 29012 15906 39410 71924
2208 71924 71925 80356 65756 70085 73441 60352 61013 44818 20443 58396 41417 54169 58384 37517
2194 37517 16613 52606 69688 68969 85563 76591 66232 77080 89436 72525 100593 67919
2182 67919 51985 59405 86752 80713 51821 67662 83482 98672 106389 100575 89568 90966 110082
2169 110082 106577 96145 83954 99080 93075 83440 96716 112918 109996 93788 87572 87334 92166
2156 92166 87799 82290 50267 61949 60954 84993 116242 98401 131785 122022 129318 146731 150560
2143 150560 145880 115091 146220 177488 143461 123715 184745 197248 171973 170742 181015 198656
2131 198656 196286 225003 216864 237195 242096 223457 250696 256419 286371 307437 303299 308792 339498
2118 339498 377854 350605 353121 357984 381361 392760 429273 425425 435396 451146 504902 549668
2106 549668 567063 578967 619084 672569 735638 789622 886065 978518 1079056 1149707 1208442
2095 1208442 1286060 1392905 1502675 1682621 1890421 2186687 2555663 3054970 3689821 4472193
2085 4472193 5560282 7099702 8163127 7301913 5576300 4146306 3182241 2567855 2135102
2076 2135102 1780696 1519919 1363758 1206011 1096435 1015617 966816 942718 915413 848042
2066 848042 774903 707018 654352 606447 548113 526709 491586 455652 430089 402654 389940 380364
2054 380364 371258 321376 287497 276425 259056 285631 290280 295968 246027 218504 222258 235921
2042 235921 215540 182941 152634 147786 164672 156466 161234 133959 123724 108207 88758 102331
2030 102331 101118 96606 119197 121147 101803 106074 96500 92941 100436 78516 61391 74010 64669
2017 64669 82218 75395 89666 97147 84944 74105 85838 81977 68226 29286 34703 66373 79137
2004 79137 61131 39665 30636 26516 52450 42524 47157 54532 58367 62986 62721 51149 44783 51447
1990 51447 31353 31217 16418 46286 41339 14834 23774 7385 23350 27287 33810 38759 24988
1977 24988 22807 20262 17180 15681 -7437 -4191 24379 30270 30288 -3260 3880 13476 33042 37072
1963 37072 17546 12645 -4087 -4654 13554 44535 23350 15796 9090 24089 17699 9263 -6220
1950 -6220 3606 -11688 1608 -4751 -3946 -15062 -13291 -9532 16990 11830 3201 4158 -9656 -4711
1936 -4711 -25268 -2930 4439 6591 9938 -8838 5596 18506 28070 27798 -4661 -29437 -49252
1923 -49252 -1548 19066 -11083 -7710 -1270 -12021 -4366 -31352 5368 -3682 -19865 -1849 -32365
1910 -32365 -12502 1441 -14469 -784 -16391 -24499 -11377 -12006 -6057 -3048 -7853 19545 9324
1897 9324 -13266 -18333 -9127 -7877 -7395 -16845 -39143 -58324 -28453 -8656 -26891 -26886 -40975 -27430
1883 -27430 -29368 -22501 -12338 -9364 -14370 -19940 -22818 -27675 3294 32661 18265 -721 -15710
1870 -15710 13037 -6306 16717 -4643 -22146 -9507 16737 -12364 -17586 -2558 -5536 -14747
1858 -14747 -5752 -4923 244 15668 9862 5381 19393 -428 -26143 -23217 -37879 -20817 -19278
1845 -19278 -28572 -34532 -24357 -23437 -7753 -7297 2913 -27922 -27465 -17848 -4960 7310 -18491 -21111
1831 -21111 6462 -2068 -9317 -32708 21100 44766 24869 -17986 -30247 7694 6314 20937
1819 20937 13579 18051 17114 -5944 40655 45238 32955 12628 -6836 1742 -4875 -3178 494 4975
1805 4975 8333 5000 8267 -11205 7216 38424 30586 24788 22190 22210 1997 -9179 -1625 -9908
1791 -9908 -15273 -26603 -29220 -13843 -24080 -31679 -30019 -30601 -14554 -13396 16146 26486 862
1778 862 -206 11499 -7337 -38532 -22932 -1046 14379 9222 -23724 -26153 -15953 -33767 -50959
1765 -50959 -18908 -9814 -48329 -25249 -11685 8455 -1335 -8697 -4483 32318 38383 26587 6474
1752 6474 -19770 -20421 -11768 -16511 -42040 -42501 -11559 -16928 -2483 -9914 -28506 -40470 -35401 -48975
1738 -48975 -25561 8833 -3833 -19552 -20500 -13815 8846 -4738 -3553 -23805 -13309 5143 -9148
1725 -9148 -1776 -10605 -20991 -1774 3367 -15240 -18729 -29003 -29713 -31747 -9572 2018 -1999 3568
1711 3568 6854 3071 -667 -16714 7879 -11144 3140 -1722 3191 7576 15839 3667 15531
1698 15531 2460 2913 2371 836 -3425 -13330 2571 -7104 -20584 -46913 -43495 -30409 -19659 -12355
1684 -12355 6909 -769 -4844 -30905 -26405 -13424 -9538 21808 24591 21329 360 -29290 -35537
1671 -35537 -27551 -15108 -3879 -10427 -45777 -71312 -25146 -27009 -34955 -11055 -9115 -18210 -24044
1658 -24044 562 9595 -16498 -35659 -53909 -47591 -22246 -17707 -9861 -10117 -5898 16263 -328
1645 -328 9053 4783 -855 -10834 -15823 -17243 -12294 -4883 -27167 -26461 -24685 -24331 -9732 -26564 -5388
1630 -5388 3082 -13677 -40537 -44617 669 -638 6741 19980 21890 -2205 -24464 -33630 -53004
1617 -53004 -47063 -20288 -6352 12888 -24876 -29311 -27836 -15946 30477 9890 18687 12810 15508
1604 15508 23562 -940 10043 -1698 -9240 -38329 -22923 -24628 -14757 -16946 -9493 -2096 -20681
1591 -20681 -31785 -14026 -22463 -35030 -61747 -60149 -40390 -20233 -2051 -92 17372 -2262
1579 -2262 -1866 -5098 -12201 -6920 -19604 -2596 -34911 -34887 -9886 -11208 -22655 -11404 -1944 -7545
1565 -7545 2033 -10327 -30063 -19999 -39269 -9543 14856 6625 5655 -43439 -29799 -32533 -21024
1552 -21024 -42098 -37554 -35564 -2068 8065 -1170 -20005 -8609 -1923 15202 8711 5785 5811 4951
1538 4951 22097 -9056 -23704 -37828 -26314 -12744 -10198 2698 -28265 -33514 -38144 -24937 -17479
1525 -17479 -18750 1867 -9984 -42293 -68261 -44786 -60559 -24973 -11619 -2827 7285 -1492
1513 -1492 -25030 -51499 -31646 -37112 -36379 -24226 -29996 -15569 -23748 -20631 -16147 9177 -8990
1500 -8990 -9960 -8171 -8876 6811 18961 4220 -599 11448 -10377 -15011 2695 -11154 -4480 -9667
1486 -9667 -19191 -8423 -13649 -8130 -24529 -32317 -19225 -17321 -27790 4849 -15647 -10506 -26487
1473 -26487 -35804 -30989 -33939 -40706 -52950 -34682 17130 -2312 -34130 -30208 -19230 -30756 -12634
1460 -12634 -14862 -17223 2419 8996 -9234 -17563 3810 1745 8526 25803 15136 -2117 -9155
1447 -9155 -4872 16852 5655 3871 9315 -1311 -6593 -1883 11904 5299 -5664 -176 -4525 -12926
1433 -12926 -17715 -25549 -27900 -11800 -7660 -30422 -26038 -28652 -3525 -16111 -15928 -31932 -4433
1420 -4433 7489 -26677 7518 3570 1498 -20121 -25643 -17053 5940 3064 -1977 -12485 -11768 -13611
1406 -13611 -10017 -5603 -35623 -21553 -26838 -28764 11864 -20385 -25595 -42779 -35020 -27567 -33123
1393 -33123 -7660 2769 -22461 2821 26700 -2289 -14712 -6318 -7216 -23135 -23196 -19320 -3996
1380 -3996 -14875 11655 40993 9584 12450 -8143 -21448 -9764 -1477 1091 -9087 -5116 9750
1367 9750 -10554 -8807 6748 11545 -2135 -22252 -16866 -31776 -29216 -10710 -33079 -31389 -11297
1354 -11297 -44336 -39552 -25885 -22563 -29600 2998 12701 -1003 11458 23989 -19381 -25550 -17739
1341 -17739 -12838 463 -11302 -9341 -14244 -1565 1428 29397 30016 3007 -18243 -16895 -10745
1328 -10745 -9408 1963 -15322 9771 3172 4503 15121 -6258 -645 -14984 -839 3960 -1115
1315 -1115 -3449 1424 -24389 -19212 6997 -5617 -29458 -13891 -39824 -17305 2069 -5405 -3470
1302 -3470 -7958 9167 3318 -9414 -3851 2951 -5454 -3579 -5546 18982 12501 -3913 -17761 -17715
1288 -17715 -22241 -48152 -27065 -23696 -19512 15350 8082 16688 11343 -12385 -12170 -19503 -16390 -26718
1274 -26718 -34364 -34646 -25946 -29940 -24165 -11434 -14336 3962 8095 13156 -4929 -56 25980 26705
1260 26705 7131 725 17934 15323 -4311 -8252 1940 20619 10369 3818 520 -19328 -13172
1247 -13172 8234 2697 -30287 -44305 -28966 -10663 -7925 -33256 -9262 -15535 -22511 -19447 3456
1234 3456 11865 2393 -19337 -6275 8790 8453 15952 9795 6741 7207 -10628 -2148 -2543 -22843
1220 -22843 7739 12687 -21095 -30695 -15955 -7848 2547 4885 -20865 -49037 -13203 16941 13731
1207 13731 12147 -14599 -11455 -1257 -1136 7180 9652 14592 1864 4261 19037 -5753 -37973
1194 -37973 -9475 4542 7234 21644 -3568 -14321 -1231 -4466 -12073 -865 -21125 -15401 -10787
1181 -10787 -21306 -28406 -27480 -4477 -5124 9590 5266 11387 50342 21203 5327 205 14479
1168 14479 25005 19001 22636 15664 19998 -13359 -6643 -6241 16937 -9845 7808 11489 8914 -2988
1154 -2988 -20850 -3388 7878 -4205 3928 203 -8205 -8625 1073 -13381 1057 15548 -434
1141 -434 28710 11281 -7104 16329 23284 2553 8497 -12375 -5276 6641 -29828 -42278 -30197
1128 -30197 931 -2498 -27434 -44621 -37254 5825 -9223 -16316 -15041 -11187 1880 -17254 -14596
1115 -14596 -6186 15025 1452 -1196 1135 -32399 -24793 -17543 -22008 -26208 -2576 23754 1975
1102 1975 -8406 -20329 -6172 -15442 -53591 -49769 -18975 21189 10407 9422 13789 -5559 -8010
1089 -8010 -351 -8452 16224 15116 7909 19169 17435 19964 -4919 -25773 20989 13139 3357 12487
1075 12487 3105 -9669 640 26582 24050 39401 -9513 -2583 22960 2324 -9616 -19978
1063 -19978 -28379 -27595 -16771 -20286 -17113 -20439 -23326 3103 13630 21812 21793 12503 11304 9100 8341
1048 8341 -8646 -4374 17058 20704 9041 122 -9144 -8485 15714 11165 -19357 -2062 -10321 -10432
1034 -10432 -8797 -7020 8535 13529 -13168 -13578 4192 -7989 -34204 -22781 -20874 -38165 1870
1021 1870 17601 19154 -12707 -10455 11816 -4561 -16418 -25175 -10929 -15146 10109 21754 15124
1008 15124 -940 9012 -1060 8930 13696 1110 10 -14874 -24988 -17428 -2669 -21891 -42367
995 -42367 -44542 -22916 -5333 -15257 -22090 -11315 15091 36940 39084 30185 6180 -9979 -5109
982 -5109 -11559 -19799 -26115 -12276 -3563 6074 -3209 -15291 12289 41812 29338 -16505 -5989
969 -5989 -10929 -9605 -7101 2864 8321 16151 13707 16144 25886 6942 -7411 37250 14174 1721
955 1721 26774 4489 -548 513 -12513 -20635 -26282 -13722 -9472 -7043 -23757 -4337 3941 -31339
941 -31339 -1857 -15430 -13666 -18136 -18890 207 3041 1744 -12175 -4377 -17211 10831 11606 5090
927 5090 14610 17196 14878 -25668 -11512 -7394 -11289 12202 7694 11833 6530 -16746 -8107 -1383
913 -1383 8715 11823 -26892 -24035 2875 330 -11996 -23023 -10973 -27 10414 -5598 1151
900 1151 14763 10169 -8635 -17826 -18235 -24770 -10219 -2646 -1250 10183 1182 -816 -816 -11272 -21235
885 -21235 -27870 -43973 -30008 365 -13552 -23034 -13586 6511 -22739 -37088 -18962 -6697 -14273
872 -14273 -15331 -7600 31976 33903 13771 -10131 1872 -11063 -25112 -2199 -7906 -15988 -27198
859 -27198 -29343 -541 17318 9910 13459 -10990 13256 5067 -559 -1372 -10529 -18545 -4284 13859
845 13859 -8936 18047 -571 -16851 -12192 2096 9187 -3175 -9952 -21625 -7904 13465 2110
832 2110 -12990 1233 -16897 -7525 1682 -17228 -14793 20061 24403 2163 8011 10306 24101
819 24101 8900 2876 18907 13118 12151 16350 15810 4265 -5302 -9937 -19630 -29514 -16223 6609
805 6609 14502 -3868 -4863 -14624 -17826 -13924 -2018 10116 14765 11863 2283 2030 -16420 -26070 -19739
790 -19739 -9724 -20705 -14057 -21458 -26057 -43572 -50185 -12638 -12843 6205 6595 16949 5332 8427
776 8427 -20658 -7496 39193 221 12042 11489 5522 5229 -11852 591 17425 24131 27552 1727
762 1727 -9979 11987 18490 18758 -2657 -14779 5293 1198 -1605 -5974 -17629 8232 26187
749 26187 -766 2342 16694 10343 21167 12166 4378 1327 36463 37229 37934 12923 8007 1731
735 1731 13703 19021 -17220 -2290 -16166 -10442 6795 36345 64971 36960 30125 11218 -24841
722 -24841 -31019 -3433 11803 11597 20999 13752 8938 -6287 7193 5592 -4039 1594 8709 8735 12997
707 12997 -6955 -4376 -3608 -17036 -19768 -10632 -11979 2209 682 -23968 -31937 -7710 13993 27692
693 27692 22266 26468 24853 39188 15439 -6629 -8807 -24892 -25238 -15910 -14257 -16936 2299 13141
679 13141 -7043 -1831 -2838 -4912 6917 -15665 -2033 28682 27349 32783 18312 3524 39655
666 39655 49732 31380 19144 18741 27512 13346 22480 13404 2951 20724 7412 28388 13663
653 13663 14446 -5898 -5606 15588 11963 21128 11220 10047 21290 30277 19653 1105 -11926 -1424
639 -1424 9725 9497 14782 43267 28343 -989 -6713 -2255 33070 18724 20935 16401 12337 -968
625 -968 -19954 -4756 20527 26820 669 -31554 -6116 19420 9124 9346 -9939 -38541 -10119
612 -10119 4784 110 29359 33074 21465 29982 29207 8958 18335 31156 34947 27626 34608 27009
598 27009 22013 23121 20468 -8183 -8958 20311 57762 57749 24865 20138 29419 6250 -8212 14770
584 14770 7705 10608 3518 15856 20709 -5087 4854 4012 -13715 -21643 -9686 11354 21768 11460
570 11460 29189 30775 19676 29661 36930 53340 55682 5496 -11161 -5664 -1130 -8074 -2323 2339
556 2339 -17820 -16564 -2648 -888 -35714 -32499 -18686 -259 1315 28650 49160 53147 34944
543 34944 28181 46827 45605 40848 12601 25710 38214 27117 35248 27552 23191 6349 -9623
530 -9623 -14786 12118 14833 10181 29702 74 13745 14402 -6825 12752 -13797 -22708 11036
517 11036 -3933 -41087 -38846 -30672 15223 23051 26344 12935 33734 22028 13307 5430 20636
504 20636 31453 -10200 -4102 11345 40357 21187 6024 21659 26278 2585 16090 6882 7637
491 7637 3334 18039 3211 -1056 2325 -3608 -16257 929 -187 22146 33519 31354 41581
478 41581 -9624 -19837 -39959 -29520 -46513 -8275 -2312 6414 27866 4752 -14384 -12390 -17319
465 -17319 -1924 26724 41977 52905 32699 41845 26156 15952 38183 16415 -2761 19097
453 19097 28477 33342 4121 15117 -11433 -14760 7365 1876 24804 10937 14995 -102 -9666
440 -9666 17494 1976 10873 18436 31248 20490 22455 28314 -9657 -25550 -33707 -23630 7777
427 7777 11190 660 6118 2604 -6056 -5651 17762 6348 12078 35457 36972 19436 146 35403
413 35403 14575 -13766 -447 1679 1285 19254 41516 18285 -4958 -4612 -6347 -4555 -13532 13074
399 13074 1339 -17390 25788 11065 8307 7813 -9632 -14276 -30418 -15430 -24752 23124 35602
386 35602 45241 25884 3451 24245 4468 -2219 -8930 -9014 -6577 -2786 5296 -3575 -23894 -21914
372 -21914 -6829 19578 2902 3612 -9164 6613 -4935 -10818 -9838 -22301 -97 24626 20443
359 20443 12679 26103 29857 20576 10768 -11566 -17067 -8966 7239 22523 21644 18056 27104 30267
345 30267 40514 50295 28186 40516 34095 17300 -14008 -15481 -6062 -1731 -11912 6500 11076
332 11076 -15722 -10400 281 -19162 -17740 878 12777 42263 39141 22082 -2946 -14983 489
319 489 8229 2815 -13738 -532 -4252 26812 28260 29907 24298 14044 22312 5133 -3539 -17422
305 -17422 -2585 18721 28217 3203 -4570 15439 23472 4740 14603 -27710 -5858 14862 3587
292 3587 -19609 7789 5672 -16543 -24561 -18108 -9418 -6800 6982 -17434 -1352 27717 11463
279 11463 -29852 -31117 -3125 16170 -5334 -4055 7944 -3668 7282 4253 -11696 2013 -4677
266 -4677 4594 16056 8413 11337 4042 6451 17032 17633 9346 4247 9664 -2380 12997 14397
252 14397 -3529 3849 -5184 -8505 -1411 -6092 1327 19895 -1845 20810 33939 21960 30020
239 30020 24535 -4925 17704 23063 27594 28266 34257 8707 167 11074 16622 16199 23269 44842
225 44842 8038 10454 19473 23231 2690 14742 10460 -5269 -887 -2234 9994 11384 13515 10603
211 10603 -1926 -19543 4380 15450 566 18801 22578 31358 19742 447 -15379 2907
199 2907 -31323 -48457 -14140 -15426 -1689 -1714 -10944 -10651 15469 42410 21928 33865 19868 9682
185 9682 -6978 -17218 -21535 -8010 -22327 -14782 -462 11622 6470 -2734 5780 18776 15925
172 15925 14717 14685 26174 25292 3378 -15975 -1955 -14918 -15124 -4153 4022 11717 13464 13917 23289
157 23289 30622 44318 27735 14865 19686 14306 13617 -2146 17326 22098 32317 18032 -845
144 -845 17555 563 -14880 -15918 -5355 12809 8350 27306 17540 22653 17465 11021 1745 931
130 931 31291 36928 21830 17577 12863 21758 27727 -3878 -9744 7193 15190 32663 15565 -5238
116 -5238 -5215 7239 11742 20518 13982 31866 15570 9118 22028 25985 20840 22666 12048 2124
102 2124 -21207 -18848 -2955 -10346 -31231 -667 3290 -11515 -18363 3325 -1332 -2028 -22317 -14718
88 -14718 -3783 -11208 2494 5583 4060 11957 29709 18546 11331 8752 4234 28115 20623 8355
74 8355 11975 16865 20115 24710 3162 6172 25040 13719 18282 16148 15827 8780 20340 10139
60 10139 10752 7027 23750 22104 641 297 26929 33966 29849 19056 18781 8697 19913 15296
46 15296 -2155 -7159 5702 17654 13245 1449 -679 4818 -7609 -10448 -7109 -378 -1520 8050
32 8050 15290 20722 30126 6804 9673 14006 -11293 -459 9696 4416 -1427 10910 13474 6096
18 6096 7394 11486 17860 16398 29157 31073 38244 23195 19941 5050 5113 11243 18102 3029 -5563
3 -5563 13217 8390 394
0C94
$$ Imaginary data points
##PAGE= N=2
##DATA TABLE= (X++(I..I)), XYDATA
16383 -391983 -388187 -384185 -397414 -373534 -344657 -344783 -342737 -338237 -328885 -316119 -330123 -310115 -292699
16370 -292699 -296664 -290306 -266143 -272111 -264279 -245080 -226428 -234119 -246130 -229765 -212419 -195615
16358 -195615 -183450 -177385 -167051 -145612 -163124 -154813 -140180 -136745 -123086 -121325 -99163 -102913
16346 -102913 -93088 -72163 -97055 -87765 -81403 -67533 -42963 -35633 -16006 -15323 -16499 -5577 2906
16333 2906 -596 11215 35255 40060 60405 78858 63849 65328 76256 97479 86151 91421 96790
16320 96790 116497 127430 146056 159698 142584 147118 169245 165969 158418 162311 191331 211243
16308 211243 197870 197582 197975 217794 219095 215230 204864 233367 236306 246611 237295 241185 239287
16295 239287 268694 292826 300402 278823 283377 297326 294400 329382 346242 348880 344003 366965
16283 366965 351137 362064 380723 374762 384521 382344 380207 397416 404780 430608 435817 432684 431543
16270 431543 433262 452118 448159 425273 460369 472497 476908 476390 471045 478778 489420 496019 515243
16257 515243 522746 507520 504559 520956 533255 532060 533636 564913 567586 557175 530835 549440
16245 549440 555249 563135 565447 564711 575596 610201 612347 618231 632430 630919 630987 610098 631509 648166
16231 648166 648945 649127 651174 662448 650830 656461 672339 648526 639665 650097 671379 673896 703846
16218 703846 679281 664736 676666 673356 703814 715755 713853 733223 719645 700834 722012 734254
16206 734254 727444 752539 744153 741619 753756 760682 726793 726808 754881 760763 746310 755298 766407
16193 766407 758650 775797 789346 782634 791195 795879 780474 777365 791299 794599 807999 802678 797561
16180 797561 802601 786089 804372 803945 797610 819876 803413 814233 813505 837977 834365 828058 820303
16167 820303 827529 831648 849081 875617 860661 843338 837207 840361 862762 845705 835689 831208
16155 831208 824389 848661 842905 845005 846440 859982 870584 881570 879256 885026 886866 879068 892046
16142 892046 887600 859508 865746 885045 898917 916695 919786 897648 874353 870369 890646 883730
16130 883730 872444 885351 881137 920269 896170 879984 900612 878588 866755 876492 891965 901280
16118 901280 881134 862662 915311 912845 926139 924308 929608 916458 923472 918734 897471 920503
16106 920503 934103 958671 967258 923186 923238 924260 897687 907262 904624 926952 924273 908143 931862
16093 931862 956856 928800 918775 931294 920407 897542 897325 943625 929598 914221 942643 945141
16081 945141 917923 940765 928836 939783 960802 960495 978164 965294 957338 963029 932695 928063
16069 928063 928373 939289 911186 936135 974654 992666 973336 940511 942330 943231 952313 981680 974816
16056 974816 951732 960212 949808 940212 930239 946325 953710 959585 928683 918680 921533 928572 928142
16043 928142 929012 941043 949195 972519 967644 940081 925980 919995 950630 990664 961885 945847
16031 945847 947238 951912 958270 987176 980137 983856 995655 957992 950279 934286 936540 958694 972394
16018 972394 961870 957966 940874 938077 936566 947241 961474 924080 918212 934702 916008 927724
16006 927724 963668 966075 940451 943453 958441 960292 941953 967427 944824 934963 941472 940933 941557
15993 941557 955447 943219 946714 960343 954813 938445 948075 969172 963848 944098 966101 960867
15981 960867 936374 956537 971334 971885 971604 977452 970105 948541 948007 964022 949067 952652 941551
15968 941551 927495 936615 965587 966361 988657 985111 966534 963454 954671 951044 950764 976144 972006
15955 972006 936055 947743 970367 968367 959534 970169 950037 943517 946442 928401 913704 918775
15943 918775 942026 923093 921894 939826 955909 963730 956414 969820 965029 969029 956857 957503 972305
15930 972305 955046 964691 962004 980100 971730 957231 979895 978316 957209 952960 963782 960536 954275
15917 954275 934934 944847 982352 978156 971582 974827 978210 996131 970206 968192 982111 952587 947335
15904 947335 960849 980453 961065 933086 941368 965345 958786 963956 961293 945502 961332 970168
15892 970168 958297 952963 953731 966157 977378 999230 997745 983756 973527 963776 969677 959689 968720
15879 968720 965858 975203 964355 967518 970420 954546 966460 999436 996486 983960 965723 958286 957049
15866 957049 955504 970370 984136 971663 949700 959903 962780 971574 980640 964998 944349 960182
15854 960182 965923 976718 973730 964950 958355 954831 937953 945711 947942 947443 954680 956356 974161 983085
15840 983085 969160 957124 965854 951334 950871 976023 973729 946372 953712 979859 979143 950913 979286
15827 979286 963368 987399 988250 966914 985145 1013825 1012480 977879 953717 972113 969131 976048
15815 976048 971396 991163 993802 999473 1003030 974996 988552 986482 959833 943682 953474 989009 995670
15802 995670 986567 978595 981068 977362 949338 964987 969701 993183 975233 950012 938272 967531
15790 967531 981331 957750 969314 986049 987253 959775 940992 983283 976180 970597 971365 976859 973989
15777 973989 966735 964262 990738 1022899 995996 980981 987053 972523 964834 979560 1006469 973031
15765 973031 967168 985328 975729 996812 1000595 981253 1008268 1017994 997320 1000079 999709 1001292 984038
15752 984038 959633 956603 963707 974558 994800 985697 1001877 1012450 1001503 988545 985927 998005
15740 998005 988007 999271 1023880 998272 979568 972462 980973 972783 992826 1012131 997766 981817
15728 981817 960759 1001503 1009416 1017291 1008038 977150 968610 974186 995471 996864 976941 959103 984086
15715 984086 1003857 980128 994332 995884 1009347 987499 970221 966264 983733 1015430 1004959 988351
15703 988351 1008763 995083 1003990 987880 973862 992445 976775 980443 1001094 1008781 1006157 1007818
15691 1007818 997195 949895 966736 987006 989210 977050 992942 989370 963170 960897 981555 974891
15679 974891 939732 952274 960172 965775 980428 995328 960824 972972 956726 958926 949501 971715
15667 971715 961607 980419 1001563 1006347 981791 985694 969796 1003076 1023766 990395 982779 1014524
15655 1014524 1002317 982445 973404 977929 990396 985535 1014205 998717 987519 991552 1015033 991738
15643 991738 972911 1006758 1013470 1014875 1006575 995579 988827 988650 1002933 995043 994103 980744 977104
15630 977104 991267 1012987 986045 995204 1001591 994530 997283 1004256 1005903 1005624 988957 986218 990954
15617 990954 1000061 1002684 981326 985377 983870 964295 985599 1008370 990186 989112 997825 994635 984016
15604 984016 991390 989804 998678 983142 972820 993735 1027478 999214 993755 997799 991110 994780 1021801
15591 1021801 1011918 1003771 989637 995719 1020786 1013318 991003 1014841 1027643 1019580 1014752 1001541
15579 1001541 992150 994486 1008642 986500 1001702 993258 994724 996657 1011371 1015818 1026478 998405
15567 998405 984940 1008019 993817 1018505 1036136 1006636 993078 999142 989532 974835 1010524 1024457
15555 1024457 1006105 996300 992426 983739 1003371 1013444 1040883 1013765 1010567 1036746 1008412 999144
15543 999144 1026134 1014104 999769 1013380 1007674 1011031 1032915 1005822 1013359 1006368 994053 1024748
15531 1024748 1017174 992895 1005934 1000825 994232 977474 1013490 1032914 1026611 1012850 1008892 1002979
15519 1002979 1014737 1039873 1000145 1011191 1010080 1019289 1021582 1030275 1048746 1033915 1029975 1027185
15507 1027185 995331 974519 986062 989968 1020765 1033012 1013047 1027836 1028781 1007661 987469 1012180
15495 1012180 1015970 1029389 1030238 1016410 992070 1007435 996106 1014875 1018213 1025539 1027040 1012050
15483 1012050 1006107 1010529 1051302 1029476 1013645 1006976 985256 1006382 1012882 1012066 1017702 999415 1003609
15470 1003609 994085 995940 1006440 1018192 1013797 993479 1009850 1018593 985729 989372 1007280 1008269 1033046
15457 1033046 1022796 985461 970702 995028 991287 1008466 1021789 1024995 1029268 1040321 1022209 1017738
15445 1017738 1037643 1014661 1019738 1004744 993688 1006673 1006531 1013682 987728 985290 1020199 1043471
15433 1043471 1029262 1021286 1033517 1024937 1021444 1001852 1003839 1025768 1022757 1010799 1032511 1015806
15421 1015806 1014277 1028266 1017952 1028300 1004928 1005770 1039276 1027519 1034301 1027624 1007461 1024484
15409 1024484 1035864 1047020 1030937 1022503 1038394 1031991 1035256 1010862 1030382 1065331 1058012 1042814
15397 1042814 1033793 1035795 1042632 1026105 1013776 1008983 1003790 1018673 1031357 1031574 1038039 1030623 1018895
15384 1018895 1017659 1018766 1014827 1026122 1037316 995890 1011915 1030724 1022526 1035603 1039510 1026476
15372 1026476 1001602 1002935 1022212 1026210 1025329 1030592 1034367 1039541 1033627 1013200 988953 997258 997671
15359 997671 1018839 1007963 1010905 1006475 999767 1023144 1005380 1003071 1012442 1001136 1019804 1050350
15347 1050350 1046975 1036605 1015647 1035625 1023218 1026826 1009132 987940 1020177 1038209 1026714 1027148
15335 1027148 1027413 1018442 1021056 1007686 1012358 1019220 1037925 1020982 1007592 1004396 991021 978165 1015622
15322 1015622 1036607 1020704 1021900 1026023 1047423 1028003 1039113 1054250 1030971 1018374 1042636 1048806
15310 1048806 1030886 1043402 1049486 1020708 1014218 1030235 1030774 1042865 1035561 1035854 1033859 1030195 1024439
15297 1024439 1009939 1027449 1025615 1008475 1014417 1027544 1032727 1042587 1051163 1026783 999509 1011139
15285 1011139 1038983 1040074 1035852 1035703 1033901 1030892 1042603 1054500 1029549 1011219 1030797 1023443 1019267
15272 1019267 1042940 1047401 1057080 1068092 1052993 1047157 1059294 1054435 1027200 1015114 1000961 1022551
15260 1022551 1044693 1027668 1038710 1040388 1070553 1035252 1038336 1058614 1079999 1055726 1045049 1050228
15248 1050228 1053398 1083528 1060774 1034392 1048840 1055648 1034639 1034455 1048544 1043272 1044951 1083954
15236 1083954 1062409 1030062 1026760 1027310 1045076 1044406 1046813 1039596 1032412 1038093 1054707 1063301 1063511 1036057
15222 1036057 1022972 1036319 1043597 1061612 1061769 1047693 1019411 1025122 1027165 1036492 1042521 1052710 1037533
15209 1037533 1042533 1052632 1058081 1069908 1072867 1054560 1033179 1038895 1048636 1059108 1052086 1025494
15197 1025494 1036869 1047857 1055916 1061206 1036078 1067353 1075725 1058957 1047113 1043820 1061497 1056868
15185 1056868 1070836 1069324 1073842 1027892 1010475 1034738 1047063 1051229 1022155 1020393 1031549 1056518
15173 1056518 1053566 1046159 1054725 1043745 1048610 1052022 1027652 1049934 1051768 1061945 1051271 1046852 1079346
15160 1079346 1059364 1065095 1044184 1046375 1047776 1044243 1043494 1044341 1040801 1056697 1060081 1056909 1022051
15147 1022051 1055728 1099515 1081200 1062928 1050668 1063325 1049347 1020764 1042078 1042059 1031364 1033920
15135 1033920 1058894 1041185 1040164 1042655 1055039 1076806 1075171 1063855 1062450 1053324 1041479 1052084
15123 1052084 1054106 1081462 1086320 1073743 1056226 1061813 1070316 1051089 1038891 1065160 1054788 1075293
15111 1075293 1081594 1049532 1043095 1073648 1090604 1072377 1038855 1048525 1040678 1042541 1058362 1065389
15099 1065389 1033822 1068488 1075708 1077238 1059324 1064103 1064175 1069776 1058740 1060490 1069373 1084792 1072097
15086 1072097 1054777 1068890 1070761 1082822 1080402 1095561 1091246 1076764 1064091 1071439 1061092 1044849
15074 1044849 1043286 1051593 1093017 1089989 1088312 1060661 1074259 1079802 1078345 1060318 1071354 1072176 1054139
15061 1054139 1050967 1046609 1056293 1068874 1065926 1069307 1082119 1069504 1062664 1049127 1050073 1063938 1057388
15048 1057388 1043415 1051143 1043399 1057721 1058825 1086554 1065944 1061916 1054189 1055451 1058138 1055397 1068361
15035 1068361 1094822 1074588 1079724 1074325 1086003 1094557 1099810 1083181 1075232 1062861 1049628 1049869 1054746
15022 1054746 1060661 1054827 1075499 1089389 1095021 1105262 1086533 1076280 1075892 1095203 1096087 1084967 1094007
15009 1094007 1099656 1102862 1081241 1070483 1092577 1081466 1097376 1094019 1077779 1087228 1086381 1092098 1112376
14996 1112376 1079830 1066983 1064687 1067206 1068105 1070551 1054631 1076983 1086211 1074844 1080241 1092892 1064813
14983 1064813 1043257 1073693 1086310 1063812 1057906 1044101 1080595 1085952 1077945 1097501 1069566 1052636
14971 1052636 1063825 1118635 1091875 1089744 1089107 1115753 1086151 1080620 1062918 1066628 1075373 1068021 1076589
14958 1076589 1089593 1095671 1099646 1076559 1059311 1083415 1101592 1088318 1081814 1077950 1097819 1114040
14946 1114040 1105818 1089558 1100272 1073958 1071448 1057507 1050221 1065492 1080474 1108742 1078757 1074445
14934 1074445 1081603 1054252 1063794 1066061 1101240 1113732 1091204 1083626 1085432 1087918 1079435 1086253 1088601
14921 1088601 1099029 1090071 1095283 1084846 1067699 1068929 1059389 1081175 1068389 1071334 1046221 1054564
14909 1054564 1101713 1112306 1102164 1093069 1105214 1076633 1093741 1075787 1086581 1100026 1100599 1107157
14897 1107157 1094456 1076644 1071686 1057888 1074815 1080030 1097415 1063880 1074145 1106083 1103084 1123008
14885 1123008 1112085 1109845 1091112 1106505 1120817 1096536 1111135 1098702 1072578 1076839 1072994 1071298
14873 1071298 1071232 1061453 1084234 1104027 1088744 1116987 1112616 1105205 1115392 1140793 1112034 1097295
14861 1097295 1097779 1090089 1084934 1092116 1088256 1073677 1095153 1087288 1108150 1107100 1117459 1113838 1096405
14848 1096405 1088144 1082988 1104066 1103490 1090503 1104144 1091784 1084243 1079317 1090871 1123033 1109013
14836 1109013 1106849 1089930 1115417 1107642 1088280 1102280 1118623 1108404 1104637 1112460 1099842 1085945
14824 1085945 1096075 1116135 1105182 1108788 1115596 1107825 1108852 1125821 1124393 1104008 1086790 1080789
14812 1080789 1092792 1111439 1111223 1113223 1120437 1110227 1109029 1090077 1084389 1119642 1123650 1127205 1110483
14799 1110483 1108851 1110790 1099005 1079850 1104146 1117292 1120776 1115226 1112838 1114143 1110917 1094230 1105720
14786 1105720 1124532 1128046 1140820 1161599 1134407 1122058 1128336 1133956 1121252 1113067 1115633 1108462
14774 1108462 1118220 1126323 1147386 1138766 1137433 1116493 1092792 1120080 1150058 1119756 1116535 1099728
14762 1099728 1103769 1127325 1126867 1115004 1108082 1102844 1110598 1125022 1102907 1081446 1090823 1082420 1082751
14749 1082751 1100928 1102265 1109869 1089231 1103858 1122464 1125349 1119144 1122984 1121534 1113294 1117097 1080950
14736 1080950 1112598 1136941 1129628 1114537 1098326 1097015 1111895 1115037 1114020 1114952 1091645 1088990 1099922
14723 1099922 1116942 1126511 1114405 1112704 1101682 1103918 1132904 1154678 1148513 1125744 1117681 1111178
14711 1111178 1132176 1116257 1106403 1112135 1122221 1135758 1130865 1156668 1135312 1128699 1122202 1102868
14699 1102868 1094528 1137120 1157287 1114186 1118643 1098303 1097741 1122546 1138276 1131570 1131279 1130806 1143155
14686 1143155 1127252 1130009 1130763 1110465 1127418 1134841 1127947 1149812 1141107 1118561 1093528 1100472 1108969
14673 1108969 1114222 1145297 1141161 1155919 1147457 1132820 1107139 1111526 1099838 1101694 1116098 1117740
14661 1117740 1112098 1127465 1136494 1124404 1133958 1156799 1142152 1134983 1129584 1130195 1146954 1137555 1128628
14648 1128628 1123613 1091502 1105115 1119095 1114556 1109548 1115639 1112997 1120169 1126026 1131041 1121207 1120874
14635 1120874 1114400 1112055 1142967 1147463 1127901 1111952 1131318 1123250 1132458 1138361 1131047 1123912 1138547
14622 1138547 1144154 1144238 1142958 1148684 1157945 1118119 1116142 1106745 1104692 1113896 1117006 1135758 1127188 1134357
14608 1134357 1127012 1141194 1109882 1106704 1134601 1125847 1123320 1148643 1144178 1139845 1136568 1126582 1134101
14595 1134101 1139537 1139519 1155830 1165576 1172229 1150911 1147077 1138346 1140955 1148746 1144237 1149432 1150498 1127935
14581 1127935 1159276 1157043 1131915 1123299 1109627 1110474 1115887 1125529 1135486 1160082 1152329 1148899 1151883
14568 1151883 1142952 1156660 1141484 1124715 1138072 1136667 1145902 1149960 1141176 1139724 1120884 1117307 1143451
14555 1143451 1148200 1136162 1132171 1146501 1152935 1148621 1133252 1134196 1139718 1127306 1111023 1108049 1113075
14542 1113075 1128759 1124841 1140640 1133043 1138872 1109517 1130196 1139562 1144626 1161324 1172838 1165845
14530 1165845 1146177 1141396 1140931 1158270 1145769 1142421 1159507 1154819 1153174 1160939 1179041 1145602 1118501
14517 1118501 1139144 1139312 1145719 1163109 1128603 1125360 1133959 1139320 1152358 1146301 1166550 1166353 1152017
14504 1152017 1151330 1162212 1170890 1181743 1150689 1168042 1160125 1146491 1143252 1178629 1181104 1174628 1172181
14491 1172181 1151485 1139170 1142269 1145627 1133656 1148957 1146990 1133630 1124716 1133914 1141474 1133876 1150256
14478 1150256 1161728 1150541 1173310 1178919 1162224 1140984 1144232 1132957 1108949 1124570 1161334 1181464
14466 1181464 1198949 1183869 1159277 1147095 1154110 1153151 1142478 1166999 1153628 1132942 1122166 1128341
14454 1128341 1150849 1156330 1156435 1159559 1157414 1144172 1157901 1163071 1142617 1148119 1158979 1163774 1160602
14441 1160602 1168337 1177916 1192011 1175772 1153667 1127054 1149338 1160060 1143476 1153590 1163487 1165437
14429 1165437 1160992 1151764 1172055 1172726 1163440 1159697 1156646 1151101 1154207 1179931 1157741 1171745 1166496
14416 1166496 1175211 1173442 1188315 1146131 1122889 1142147 1150111 1143886 1128812 1148581 1145752 1148799
14404 1148799 1129951 1143538 1141204 1139176 1167084 1161227 1183462 1185773 1159794 1167590 1186205 1184767
14392 1184767 1170482 1155635 1152646 1156170 1163064 1153700 1166634 1184378 1172419 1137544 1143270 1167315
14380 1167315 1154102 1173940 1161031 1164646 1163977 1166730 1169876 1172152 1172430 1181497 1169162 1159216 1164741
14367 1164741 1161359 1161705 1172869 1182508 1179833 1203102 1177013 1175689 1169061 1178583 1172607 1154112 1181579
14354 1181579 1180823 1196922 1179668 1188954 1190281 1169495 1172999 1183131 1171945 1173818 1166619 1171125 1185593
14341 1185593 1176152 1171166 1186238 1199847 1185522 1188433 1163352 1179052 1181514 1199661 1212833 1185841
14329 1185841 1177382 1216696 1219981 1201739 1181367 1162826 1172212 1177799 1182298 1189600 1177345 1167552 1178561
14316 1178561 1177210 1205231 1219131 1201581 1201357 1173078 1183900 1181702 1175585 1199993 1175467 1159142
14304 1159142 1145236 1147184 1123855 1152039 1180556 1181623 1170188 1169328 1176429 1193260 1199033 1169787
14292 1169787 1156869 1167884 1172558 1162710 1173099 1154860 1136999 1155052 1167072 1148821 1155298 1190144
14280 1190144 1186732 1194142 1197612 1176951 1168375 1173761 1166857 1180443 1165010 1155138 1167273 1177170 1217469
14267 1217469 1200670 1211999 1214196 1176563 1181310 1166029 1158159 1158253 1147147 1165552 1175210 1186964 1185823
14254 1185823 1190314 1197580 1206388 1188219 1191297 1170505 1165930 1207730 1212888 1201910 1180106 1177186 1182509
14241 1182509 1182977 1176164 1175949 1164933 1169291 1170491 1167069 1169783 1192384 1202162 1211922 1203065 1205152 1195776
14227 1195776 1187751 1180085 1187015 1166262 1164853 1192886 1188432 1197611 1195160 1206919 1216802 1211308 1181105
14214 1181105 1198517 1185169 1201906 1195229 1161958 1177410 1217322 1203267 1178859 1189216 1187501 1197074
14202 1197074 1191129 1215339 1206870 1184233 1200067 1186901 1204670 1208945 1197597 1204983 1212230 1201122
14190 1201122 1197148 1220802 1196886 1184895 1186312 1189035 1186825 1190377 1209849 1194870 1178783 1172910
14178 1172910 1173136 1190378 1200869 1194093 1171361 1199133 1201453 1223534 1225851 1206556 1234804 1207310
14166 1207310 1201680 1226914 1219622 1205917 1208090 1217003 1221657 1215268 1218763 1187266 1209652 1208985 1197490
14153 1197490 1182874 1196318 1245846 1224038 1230337 1219130 1199763 1197749 1215658 1220231 1207634 1215994
14141 1215994 1225424 1236594 1239678 1227098 1216101 1210924 1210338 1201858 1186619 1193382 1204896 1242552 1252069
14128 1252069 1231252 1219471 1237694 1275958 1229791 1217334 1229014 1222795 1238629 1243882 1220108 1203539
14116 1203539 1214810 1231016 1195021 1210336 1203037 1218956 1215871 1220089 1249263 1214740 1214331 1203598
14104 1203598 1199813 1220311 1206836 1203141 1201020 1198305 1219777 1212764 1208413 1189013 1208748 1225151
14092 1225151 1212639 1208119 1212747 1204890 1231006 1239299 1230027 1245034 1247917 1228262 1203650 1178324
14080 1178324 1190825 1220920 1223583 1208932 1235757 1213905 1196223 1222157 1254228 1248946 1225077 1229051
14068 1229051 1215745 1200914 1206506 1222158 1248039 1255301 1230920 1203653 1206562 1221853 1237251 1246654
14056 1246654 1229027 1237902 1223241 1215682 1194040 1206132 1234381 1223893 1228723 1223132 1201371 1202587
14044 1202587 1214773 1218990 1219387 1222681 1207434 1195284 1178605 1175782 1202096 1216219 1197725 1225200
14032 1225200 1232203 1245399 1249627 1249600 1232492 1210877 1229273 1240094 1263764 1263611 1268266 1234136 1228759
14019 1228759 1240171 1257760 1259638 1239096 1247252 1261273 1260871 1230187 1199857 1224028 1230831 1246339
14007 1246339 1232155 1225685 1248331 1236301 1232946 1219285 1241048 1229093 1236230 1225761 1220421 1214825
13995 1214825 1214409 1226402 1212835 1235949 1229279 1249435 1255731 1221543 1224655 1240746 1225647 1189529
13983 1189529 1225326 1225477 1219859 1203776 1208225 1219501 1229946 1241186 1235369 1222356 1215940 1216676 1210453
13970 1210453 1222230 1210073 1249808 1240530 1254317 1229955 1233672 1237164 1255303 1272915 1271759 1278629
13958 1278629 1259577 1258060 1250753 1255174 1247397 1244262 1254947 1249331 1216451 1224480 1234664 1220245 1242454
13945 1242454 1242423 1222507 1204568 1197109 1226149 1239851 1243080 1249590 1253239 1265065 1246736 1238145 1245005
13932 1245005 1241585 1252466 1237892 1244686 1266908 1241429 1231392 1228292 1211262 1216614 1222227 1245999
13920 1245999 1254529 1244362 1234313 1244339 1251562 1263545 1248882 1257316 1268144 1270020 1280610 1254592
13908 1254592 1272915 1270206 1261127 1258059 1255231 1256130 1233964 1240566 1252045 1257647 1242056 1244883 1267629
13895 1267629 1252053 1228770 1244606 1270009 1265011 1240435 1280652 1256756 1243681 1239191 1230866 1242021
13883 1242021 1247836 1258473 1259171 1275451 1267720 1263240 1241529 1239692 1268342 1278889 1264574 1269610 1289347
13870 1289347 1273660 1261218 1251724 1261474 1243235 1233525 1258623 1275570 1271334 1270163 1272859 1250242
13858 1250242 1269085 1238720 1232219 1276918 1277671 1281997 1294022 1266453 1273387 1285769 1280775 1270008
13846 1270008 1268018 1251431 1272553 1247889 1261742 1270133 1270499 1279071 1262356 1232723 1226774 1250755
13834 1250755 1246200 1238126 1253618 1281076 1299875 1312467 1289677 1265884 1276225 1283621 1284710 1272226
13822 1272226 1260071 1284893 1253841 1264511 1293770 1306140 1291322 1280911 1271857 1275220 1287649 1283995
13810 1283995 1284618 1251795 1267504 1267661 1255760 1265133 1284107 1286111 1275601 1294449 1303748 1274631 1258529
13797 1258529 1291604 1270503 1267506 1254876 1247367 1245386 1276214 1302122 1279678 1278986 1265560 1254011
13785 1254011 1253263 1278769 1293896 1289090 1267574 1256962 1248818 1270828 1289559 1291080 1287366 1296028 1307817
13772 1307817 1300657 1299726 1293553 1284779 1281739 1291771 1271067 1260453 1249050 1265195 1279083 1251634
13760 1251634 1257945 1295792 1297230 1309267 1287996 1284744 1311531 1313454 1309777 1280252 1256003 1280045
13748 1280045 1277379 1308897 1297439 1279311 1288716 1278102 1262301 1286736 1311033 1312219 1293802 1288901
13736 1288901 1290848 1303336 1304531 1291523 1308567 1306922 1300794 1293458 1296264 1289084 1276140 1292519 1297070
13723 1297070 1300769 1309438 1295201 1277904 1269484 1278243 1282442 1280130 1288561 1304253 1296157 1275555 1274083
13710 1274083 1263451 1259974 1273011 1266236 1281667 1282132 1306477 1300262 1297231 1278124 1298347 1305717 1328667
$$ [...]
##END NTUPLES=NMR SPECTRUM
##END=
