##TITLE=1H_EC-3296(XI-1)
 CDCl3
 8 sc, 
 6.7.2023
##JCAMPDX= 6.0         $$ Bruker NMR JCAMP-DX V2.0
##DATA TYPE= NMR SPECTRUM
##DATA CLASS= NTUPLES
##ORIGIN= UXNMR, Bruker Analytische Messtechnik GmbH
##OWNER= root
$$ XWIN-NMR		Version 3.5
$$ Thu Jul  6 14:31:14 2023 Russian Standard Time (UT+4h)  she@DPX200
##.OBSERVE FREQUENCY= 200.13135
##.OBSERVE NUCLEUS= ^1H
##.ACQUISITION MODE= SIMULTANEOUS
##.ACQUISITION SCHEME= undefined
##.AVERAGES= 8
##.DIGITISER RES= 18
##SPECTROMETER/DATA SYSTEM= spect
##.PULSE SEQUENCE= zg30
##.SOLVENT NAME= CDCl3
##.SHIFT REFERENCE= (INTERNAL, CDCl3, 0, 15.7965)
##AUDIT TRAIL= $$ (NUMBER, WHEN, WHO, WHERE, WHAT)
$$ ##TITLE= Audit trail, XWIN-NMR		Version 3.5
$$ ##JCAMPDX= 5.01
$$ ##ORIGIN= Bruker BioSpin GmbH
$$ ##OWNER= she
$$ F:/spectra/data/she/nmr/H-F/1/pdata/1/auditp.txt
$$ ##AUDIT TRAIL=  $$ (NUMBER, WHEN, WHO, WHERE, WHAT)
(   1,<2023-07-06 14:29:24.62 +0400>,<she>,<DPX200>,
      <created by zg, POWCHK disabled, PULCHK disabled
       configuration hash MD5:
       00 E9 B6 7A A2 85 ED C7 34 08 36 98 17 FE 4E 26
       data hash MD5: 16K
       E3 2E 29 89 CB 25 BB 39 40 8B 0E 0C FB 10 94 D8>)
(   2,<2023-07-06 14:29:27.65 +0400>,<she>,<DPX200>,
      <Start of raw data processing
       efp BC_mod = 2 LB = 0.24 FT_mod = 6 PKNL = 1 PHC0 = -20783.12 PHC1 = 5.852721 SI = 16K 
       data hash MD5: 16K
       89 36 E0 42 8B FC 29 93 92 E6 6D 6E 9C 98 33 2B>)
(   3,<2023-07-06 14:29:50.15 +0400>,<she>,<DPX200>,
      <pk PHC0 = -3.32908 PHC1 = 2.2 
       data hash MD5: 16K
       F8 0F 4B 55 5F 9E 72 89 84 7C 88 06 78 3E 24 49>)
(   4,<2023-07-06 14:29:54.07 +0400>,<she>,<DPX200>,
      <abs ABSG = 5 
       data hash MD5: 16K
       DD CD D6 7F 09 E1 3F 0F E9 47 06 CD CC 62 EB 0F>)
(   5,<2023-07-06 14:30:19.29 +0400>,<she>,<DPX200>,
      <pk PHC0 = 3.109516 PHC1 = -4.400001 
       data hash MD5: 16K
       F2 B0 77 E2 6D 28 9A B7 BA 95 73 36 62 46 C9 0C>)
(   6,<2023-07-06 14:30:22.62 +0400>,<she>,<DPX200>,
      <abs ABSG = 5 
       data hash MD5: 16K
       92 A2 68 60 46 AD D8 F0 33 0F F9 4E B0 65 AA F9>)
$$ ##END=
$$ 
$$ hash MD5
$$ E2 4D E8 6B 89 A5 19 EF 1C 18 DD FD B2 59 12 76
##$RELAX= 
##$RELAX= 
##$RELAX= 
##$RELAX= 
##$RELAX= 
##$RELAX= 
$$ Bruker specific parameters
$$ --------------------------
##$DU= <F:/spectra>
##$EXPNO= 1
##$NAME= <H-F>
##$PROCNO= 1
##$TYPE= <nmr>
##$USER= <she>
##$AMP= (0..31)
100 100 100 100 100 100 100 100 100 100 100 100 100 100 100 100 100 100 
100 100 100 100 100 100 100 100 100 100 100 100 100 100 
##$AQSEQ= 0
##$AQ_mod= 1
##$AUNM= <au_zg>
##$AUTOPOS= <>
##$BF1= 200.13
##$BF2= 200.13
##$BF3= 200.13
##$BF4= 200.13
##$BF5= 200.13
##$BF6= 200.13
##$BF7= 200.13
##$BF8= 200.13
##$BYTORDA= 1
##$CFDGTYP= 0
##$CFRGTYP= 5
##$CHEMSTR= <none>
##$CNST= (0..31)
1 1 145 1 1 1 1 1 1 1 1 1 1 1 1 1 1 1 1 1 1 1 1 1 1 1 1 1 1 1 1 1 
##$CPDPRG= <>
##$CPDPRG1= <>
##$CPDPRG2= <>
##$CPDPRG3= <>
##$CPDPRG4= <mlev>
##$CPDPRG5= <mlev>
##$CPDPRG6= <mlev>
##$CPDPRG7= <mlev>
$$ [...]
##$SUBNAM3= <"">
##$SUBNAM4= <"">
##$SUBNAM5= <"">
##$SUBNAM6= <"">
##$SUBNAM7= <"">
##$SUBNAM8= <"">
##$SUBNAM9= <"">
##$SW= 18.05172834244
##$SWIBOX= (0..15)
0 0 2 0 0 0 0 0 0 0 0 0 0 0 0 0 
##$SW_h= 3612.71676300578
##$TD= 16384
##$TD0= 1
##$TE= 0
##$TE2= 300
##$TE3= 300
##$TEG= 300
##$TL= (0..7)
0 120 120 120 120 120 120 120 
##$TP= (0..7)
150 150 150 150 150 150 150 150 
##$TP07= 0
##$TPNAME0= <>
##$TPNAME1= <>
##$TPNAME2= <>
##$TPNAME3= <>
##$TPNAME4= <>
##$TPNAME5= <>
##$TPNAME6= <>
##$TPNAME7= <>
##$TPOAL= (0..7)
0.5 0.5 0.5 0.5 0.5 0.5 0.5 0.5 
##$TPOFFS= (0..7)
0 0 0 0 0 0 0 0 
##$TUNHIN= 0
##$TUNHOUT= 0
##$TUNXOUT= 0
##$USERA1= <user>
##$USERA2= <user>
##$USERA3= <user>
##$USERA4= <user>
##$USERA5= <user>
##$V9= 5
##$VALIST= <valist>
##$VCLIST= <CCCCCCCCCCCCCCC>
##$VD= 0
##$VDLIST= <DDDDDDDDDDDDDDD>
##$VPLIST= <PPPPPPPPPPPPPPP>
##$VTLIST= <TTTTTTTTTTTTTTT>
##$WBST= 1024
##$WBSW= 4
##$XGAIN= (0..3)
0 0 0 0 
##$XL= 0
##$YL= 0
##$YMAX_a= 752906
##$YMIN_a= -840351
##$ZGOPTNS= <>
##$ZL1= 120
##$ZL2= 120
##$ZL3= 120
##$ZL4= 120
##$ABSF1= 15.72705
##$ABSF2= -2.3248
##$ABSG= 5
##$ABSL= 3
##$ALPHA= 0
##$AQORDER= 0
##$ASSFAC= 0
##$ASSFACI= 0
##$ASSFACX= 0
##$ASSWID= 0
##$AUNMP= <proc_1d>
##$AZFE= 0.1
##$AZFW= 0.1
##$BCFW= 0
##$BC_mod= 2
##$BYTORDP= 0
##$COROFFS= 0
##$CY= -3
##$DATMOD= 1
##$DC= 0
##$DFILT= <>
##$DTYPP= 0
##$F1P= 0
##$F2P= 0
##$FCOR= 1
##$FTSIZE= 16384
##$FT_mod= 6
##$GAMMA= 0
##$GB= 0
##$INTBC= 1
##$INTSCL= 3.70164e-10
##$ISEN= 128
##$LB= 0.24
##$LEV0= 0
##$LPBIN= 0
##$MAXI= 10000
##$MC2= 0
##$MEAN= 0
##$ME_mod= 0
##$MI= 1.114404
##$NCOEF= 0
##$NC_proc= -3
##$NLEV= 6
##$NOISF1= 3.799351
##$NOISF2= 2.8
##$NSP= 0
##$NTH_PI= 0
##$NZP= 0
##$OFFSET= 15.79647
##$PC= 1
##$PHC0= -20783.34
##$PHC1= 3.65272
##$PH_mod= 1
##$PKNL= yes
##$PPARMOD= 0
##$PSCAL= 0
##$PSIGN= 0
##$REVERSE= no
##$SF= 200.12999501038
##$SI= 16384
##$SIGF1= 3
##$SIGF2= 2
##$SINO= 5.538805
##$SIOLD= 16384
##$SREGLST= <1H.CDCl3>
##$SSB= 0
##$STSI= 16384
##$STSR= 0
##$SW_p= 3612.71676300578
##$SYMM= 0
##$S_DEV= 0
##$TDeff= 16384
##$TDoff= 0
##$TI= <>
##$TILT= no
##$TM1= 0
##$TM2= 0
##$TOPLEV= 0
##$USERP1= <user>
##$USERP2= <user>
##$USERP3= <user>
##$USERP4= <user>
##$USERP5= <user>
##$WDW= 1
##$XDIM= 16384
##$YMAX_p= 273729972
##$YMIN_p= -114098
$$ End of Bruker specific parameters
$$ ---------------------------------
##NTUPLES= NMR SPECTRUM
##VAR_NAME=  FREQUENCY,     SPECTRUM/REAL,   SPECTRUM/IMAG
##SYMBOL=    X,             R,               I
##VAR_TYPE=  INDEPENDENT,   DEPENDENT,       DEPENDENT
##VAR_FORM=  AFFN,          ASDF,            ASDF
##VAR_DIM=   16384,         16384,           16384
##UNITS=     HZ,            ARBITRARY UNITS, ARBITRARY UNITS
##FACTOR=    0.220516191357247, 1,           1
##FIRST=     3161.34739992422, 0,            0
##LAST=      -451.369363081562, 0,           0
##MIN=       -451.369363081562, -114098,     0
##MAX=       3161.34739992422, 273729972,    0
$$ Real data points
##PAGE= N=1
##DATA TABLE= (X++(R..R)), XYDATA
$$ [...]
8853 828167 832017 832238 841607 857192 859619 877831 886068 899871 902719 911300 933068 949072 962294
8840 962294 978608 995726 1020164 1038302 1050166 1074047 1097040 1118808 1140089 1164871 1201776 1223089
8828 1223089 1242269 1268786 1292428 1329656 1366388 1396747 1427798 1464750 1498697 1526353 1565179
8817 1565179 1597284 1647813 1689303 1735270 1767844 1806591 1841194 1871747 1916074 1968833 2015608
8806 2015608 2062040 2100786 2148903 2197591 2252746 2298104 2359432 2418146 2494679 2567481 2644978
8795 2644978 2736596 2816070 2902083 2983331 3061488 3168506 3261167 3376564 3487466 3620265 3747951
8784 3747951 3885801 4027391 4166526 4301502 4456446 4627274 4795697 4986570 5193979 5407274
8774 5407274 5662109 5923532 6218270 6537303 6904351 7330345 7835619 8387939 8974547 9559073
8764 9559073 10164391 10764425 11375950 12019047 12717535 13445727 14154018 14727104 15124519 15304170
8754 15304170 15230323 14941654 14548382 14132044 13787673 13514827 13301534 13137014 13001136 12842736
8744 12842736 12711735 12624178 12592615 12639597 12781469 13005518 13365528 13844063 14456032 15188109
8734 15188109 16039311 16982961 17993278 19028096 20124997 21305326 22597885 23991236
8726 23991236 25439778 26859360 28186135 29311590 30088491 30481412 30545203 30351559 29936287
8717 29936287 29361178 28710069 27989585 27207020 26377477 25543943 24864793 24385980 24088087
8708 24088087 23957048 24135127 24746520 25903325 27654915 30411562 33397139 37453414 42901125
8699 42901125 45820061 41339727 34695242 30422770 27880679 26380081 25418328 25023408
8691 25023408 24890842 24904480 24958717 25234553 25548169 25852197 25987265 25935056 25565024 24932752
8681 24932752 24073819 23104304 22076919 21098396 20103498 19150749 18214986 17343553 16481519
8672 16481519 15654246 14826959 14061204 13326801 12677167 12058218 11527215 11054112 10666013
8663 10666013 10301965 9983721 9694006 9468784 9272459 9120563 8982326 8891074 8819834 8798481
8653 8798481 8781846 8809558 8855897 8915155 8966863 9031819 9075846 9117258 9132260 9143652 9121930
8642 9121930 9069113 8956828 8800007 8561109 8292115 8021014 7748073 7492596 7267262 7035760
8632 7035760 6802707 6555910 6318710 6099832 5911303 5735065 5598021 5483500 5381512 5301713
8622 5301713 5239633 5174141 5099052 5025336 4956902 4895488 4854229 4836824 4841220 4870354 4922706 5000318
8610 5000318 5098190 5200774 5328309 5479513 5645732 5810429 5974374 6164225 6341841 6490694
8600 6490694 6599294 6691941 6773489 6838369 6841458 6788610 6706854 6581967 6446919 6334705 6266484
8589 6266484 6219640 6184103 6194606 6238009 6319416 6413583 6516061 6653885 6815359 7033171 7296468
8578 7296468 7591044 7925271 8323474 8841957 9446300 10133795 10909543 11689857 12420907 13083535
8568 13083535 13715710 14403533 15114339 15701408 16142109 16618578 17045903 17378099 17769571
8559 17769571 18167516 18518036 18706507 18331816 17629939 17012845 16505118 16035254 15494826
8550 15494826 14803680 14176502 13739849 13467532 13352539 13437416 13669494 14060425 14561592 15137984
8540 15137984 15753257 16378921 17027639 17750407 18487274 19209848 19841722 20346546 20653765
8531 20653765 20647352 20571964 20695956 21081191 21720744 22505072 23115327 23287518 22867711 21856853
8521 21856853 20376831 18719093 17232078 16036414 15104668 14383746 13806821 13214104 12596957
8512 12596957 11988829 11457951 11024297 10685543 10421204 10249820 10166899 10121877 10073667 10043758
8502 10043758 10015020 10000825 10047629 10132338 10189372 10205389 10265364 10282025 10215324 10158862 10102877
8491 10102877 10050052 9888706 9457473 8900566 8398102 7946139 7505457 7004094 6425280 5895417
8481 5895417 5431838 4996084 4649026 4354245 4088598 3872203 3681249 3523078 3371125 3241968
8471 3241968 3114371 2991106 2865292 2753773 2641973 2532948 2422843 2329224 2252861 2169877
8461 2169877 2090666 2008929 1922870 1861647 1796496 1734427 1671460 1617169 1564510 1510181 1463288
8450 1463288 1414916 1373357 1345920 1308934 1273016 1235425 1199411 1168136 1140075 1114287 1088274
8439 1088274 1059568 1023125 1001971 979421 951960 930815 910661 883664 860768 838553 820853
8428 820853 804602 790955 780660 769767 756969 756894 737893 714089 701572 680205 675553 659689
8416 659689 648926 652101 643949 631243 625432 614820 606501 594557 589656 584772 576088 572902 569442
8403 569442 565033 575826 565611 554074 544278 540260 535173 536556 539657 534916 527374 527877 533339 532661
8389 532661 531023 531443 516999 521957 512828 506909 493167 480391 481171 481703 476294 466544 462907 454273
8375 454273 451823 450449 459248 461493 459261 457961 458920 455268 465863 464564 457709 467833 468689 467052
8361 467052 462445 457167 457615 460836 460588 460937 467183 463540 453784 452727 445548 433929 433252 429777 427883
8346 427883 426357 428122 416284 405944 400538 386872 381888 382129 371486 365162 358882 358376 351605 346656
8332 346656 346299 351618 351851 349630 350419 349518 349749 344492 337565 338843 339838 345242 345078 342700 338941 334329
8316 334329 338165 333773 328875 321579 319166 313219 306307 301388 287921 280739 282165 280886 275998 269024
8302 269024 258965 267528 257567 255836 252698 252830 249193 244522 246982 245277 243234 242206 242309 233137 223110
8287 223110 229422 225907 227092 236481 239034 242684 245906 235191 234114 231608 231660 230017 222059 223773 221655
8272 221655 220155 222020 224660 222877 223141 225283 219773 213256 215051 215032 214529 219459 213995 209605 220357
8257 220357 221573 218731 223635 225251 216743 216106 217920 215607 213841 219366 225103 221261 221164 228419 221453
8242 221453 222624 227156 229335 229490 239301 250993 252392 256251 254717 250696 249755 246026 250713 268116
8228 268116 273003 273597 282149 291535 308575 325516 333000 355569 382138 409285 391606 358900 330939
8215 330939 314085 301476 299156 305599 298027 300125 298272 303671 298623 298169 304936 310577 310542 313640 327094
8200 327094 327030 321202 328948 333937 351814 344933 341688 350111 407422 411881 382649 379688 373401 376740
8186 376740 374463 378410 375620 373336 380970 385364 374021 387731 392033 392321 390354 388348 389699 390783
8172 390783 393018 397969 409671 428952 435715 444164 456479 468559 472739 476562 489153 496535 511469
8159 511469 515329 512178 511793 513729 517092 526018 521142 519825 526158 520706 515883 521470 526679 538255
8145 538255 530970 531419 548736 555300 554895 562343 568369 573767 583113 601786 604312 614392 625462 635851
8131 635851 643707 648252 666579 675774 685837 702616 709081 718709 726655 736207 738935 746007 755670 766841
8117 766841 778252 785215 798234 811649 827229 835010 836944 842873 862582 868121 875479 888281 894736
8104 894736 905728 923251 940925 947755 956292 976602 983408 999617 1011436 1029905 1032863 1051165
8092 1051165 1077504 1089072 1102208 1120407 1128584 1143592 1171533 1185113 1187074 1204867 1225073 1244871
8080 1244871 1261880 1282022 1300970 1321508 1342902 1364226 1383246 1406611 1436332 1469143 1490141
8069 1490141 1518764 1542961 1573103 1609734 1638996 1658732 1691322 1735374 1759045 1789302 1820197
8058 1820197 1859524 1891902 1934487 1979687 2010442 2049091 2089439 2127440 2170881 2219741 2276656
8047 2276656 2315034 2370002 2427457 2481481 2536075 2605638 2666582 2720613 2780143 2841071 2900075
8036 2900075 2958126 3024853 3093583 3162965 3232794 3310621 3373070 3440079 3520273 3591178 3669375
8025 3669375 3743323 3820372 3886065 3956075 4023736 4100012 4185494 4254560 4318928 4394473 4462854
8014 4462854 4522465 4599277 4669391 4743077 4809942 4869328 4927605 4996555 5058807 5116385 5172164
8003 5172164 5233002 5286184 5344304 5390170 5439690 5479777 5515015 5545102 5570520 5595385 5611774
7992 5611774 5617489 5631503 5647602 5652375 5664011 5674538 5679553 5683799 5683134 5671502 5667021 5658596 5646421
7979 5646421 5632719 5619754 5602302 5594828 5584354 5574105 5566226 5550671 5540322 5531514 5529320 5524419
7967 5524419 5512730 5497983 5482557 5456447 5426144 5393955 5353676 5319330 5273221 5227073 5176441
7956 5176441 5125490 5073107 5009447 4936758 4869491 4798587 4719638 4648619 4568789 4479506 4386307
7945 4386307 4302398 4210690 4108361 4019340 3931162 3837313 3752751 3665078 3569646 3488334 3394455
7934 3394455 3304335 3232343 3148175 3069620 2988027 2919490 2848900 2775019 2707996 2641954 2578747
7923 2578747 2515475 2471531 2421291 2362801 2310327 2253375 2184266 2115116 2056924 2000983 1948604
7912 1948604 1913604 1860387 1815684 1776942 1739796 1696495 1662631 1632018 1602242 1567153 1539492
7901 1539492 1506079 1474963 1445122 1407612 1381273 1359839 1338614 1307967 1278601 1253415 1232688
7890 1232688 1206929 1184002 1150466 1128475 1107988 1091594 1066650 1045850 1027254 1009187 996761
7879 996761 986592 975975 958807 949545 932594 916601 896543 886807 874973 863520 849560 835557
7867 835557 820522 812994 795772 778532 772478 768079 754669 745710 739063 725227 709905 698193 684817
7854 684817 676985 668707 653642 636445 621474 619406 615132 607274 600980 593301 590033 582017 577561 575033
7840 575033 563250 565607 557490 557878 555995 555842 549729 540794 535814 527711 527744 518450 504210 495679 491631
7825 491631 496495 495451 489139 487946 491385 493796 497949 502933 501130 492445 487973 479789 469798 500335
7811 500335 490095 463312 461625 449883 444399 435882 434997 437628 435237 425187 420405 406372 415542
7798 415542 425629 429711 432037 439048 447665 451775 460886 469064 466292 462420 465283 481753 482610 476259
7784 476259 466073 465730 466235 465476 467759 472348 471276 478279 478653 478744 490564 500019 499087 496389 504806 522860
7768 522860 524787 529111 532982 540526 557433 562900 559068 559256 559182 564341 571041 586355 596154 590506 601202
7753 601202 610444 623788 635078 652635 665952 681517 694744 707638 726444 737299 749725 756949
7741 756949 763230 768283 787165 800760 818446 831457 853461 884076 891321 896597 909988 932696
7729 932696 941526 955901 974230 987942 1015032 1055024 1078984 1102268 1124049 1162850 1193193 1238167
7717 1238167 1279434 1312914 1344282 1362619 1384274 1405037 1433348 1467285 1480565 1513921 1548609
7706 1548609 1579266 1621742 1663939 1712331 1779650 1840061 1904367 1969868 2034527 2103724 2172684
7695 2172684 2256759 2360325 2475796 2593875 2677851 2742690 2764019 2753714 2750273 2751716 2771939
7684 2771939 2804217 2827737 2866362 2927065 2990097 3061207 3153218 3268576 3395767 3511630 3631647
7673 3631647 3761522 3914613 4071714 4221077 4359171 4507220 4647134 4796088 4943309 5097714
7663 5097714 5244259 5408827 5598989 5811205 6039271 6304820 6614345 6942575 7291760 7693756
7653 7693756 8146862 8677469 9343731 10153382 11115560 12311264 13770761 15623373 17916538
7644 17916538 20595826 23051802 25253358 28441904 32898156 38243646 42890187 43116759
7636 43116759 38043357 31745259 26582260 22639804 19772340 17738044 16376164 15454027
7628 15454027 14799693 14408399 14281918 14371363 14655546 15103893 15731305 16475285 17228126 18141628
7618 18141628 19496216 21366511 23742480 26439647 29188587 31356853 32044435 31648665
7610 31648665 31687407 32467052 32953262 31042048 26581994 21947003 18292174 15578637 13526033
7601 13526033 11969749 10772361 9805908 8960994 8218840 7587272 7026936 6514883 6044929
7592 6044929 5618369 5223759 4885338 4604204 4355490 4141294 3953919 3764585 3585138 3432098
7582 3432098 3289455 3169176 3063253 2975432 2891924 2804972 2723294 2640003 2578991 2525757 2473231
7571 2473231 2404973 2342852 2278075 2216239 2162530 2108588 2042530 1996070 1959131 1939837 1907975
7560 1907975 1867112 1814876 1753567 1693332 1644075 1600994 1561480 1524109 1476659 1422322 1376393
7549 1376393 1338915 1309576 1265309 1221552 1186272 1147930 1131173 1119052 1112769 1112804 1124808 1153891
7537 1153891 1201058 1253474 1299275 1347872 1415158 1505873 1559182 1501821 1350507 1199428 1079646
7526 1079646 987906 907959 849194 803224 752810 709688 677645 652031 630431 601833 568053
7515 568053 549996 517513 507662 495127 486311 477222 455633 447355 427121 421344 420662 423973 415563
7502 415563 409379 402801 398294 393872 386849 385335 389644 387366 380603 381738 380402 378519 372337 359367
7488 359367 360534 354840 345453 342683 333914 325442 323292 315876 313523 311304 305037 304190 308215 307717 303653
7473 303653 298079 294577 289867 296095 288200 264454 264350 247067 239214 240464 241179 243216 243602 236592 234366
7458 234366 224625 219383 220049 224498 222289 225973 233599 234918 236585 239095 238022 231919 222820 217397 202943
7443 202943 194624 197749 184744 188337 176070 162380 165806 174825 161170 158329 152535 152263 161218 160186
7429 160186 160482 152228 152638 156641 156849 159481 153582 155997 159429 151732 152514 147950 145233 131581 132135
7414 132135 129592 124172 124090 132707 126254 127391 134880 128171 131200 137573 146377 158252 150762 150963 145666
7399 145666 151517 152588 156654 152038 150461 145882 142981 145878 141552 138154 130126 127286 125354 117216
7385 117216 99960 97937 93946 98945 103591 106788 91947 87320 84957 85941 82882 78592 70742 72300
7371 72300 84871 78837 73573 74622 81234 87403 82839 91422 94206 93301 92495 83853 82688 82907 83890
7356 83890 80141 85228 84983 93475 97000 96550 94498 94073 89633 89540 96573 94977 97586 101117 97775 86964
7340 86964 84188 76397 83307 86267 84800 85778 85432 84266 75882 71185 76683 79803 79380 74734 77332
7325 77332 76516 74942 72153 81790 84925 93117 99840 109004 111460 119612 125357 113251 111386 112619 122094
7310 122094 120573 125459 130492 128106 126314 126789 121298 124127 130204 131629 133371 125731 114834 107787
7296 107787 108289 107003 97039 92654 84188 81671 75405 69075 64938 66405 68558 66392 69648 62760 58361
7281 58361 56543 56252 71043 70539 73574 80095 92346 97443 104746 119643 126537 130421 125413 123845
7267 123845 111357 98462 88831 88016 91068 80567 81028 85160 85837 78940 69924 75044 76076 79565
7253 79565 83756 82903 90908 95307 100331 95210 90886 94176 96447 104865 106347 108758 119442 124063 125482
7238 125482 117732 114861 111604 116273 127735 126933 130312 130358 123612 123666 126550 127991 121506 122146 117140 115206
7222 115206 118348 115887 118788 109755 112338 113312 115250 108048 112921 107373 103530 114385 115509 120414
7208 120414 118397 109525 112036 114181 123056 128692 122771 122121 124766 124249 131929 132374 131169 138931 141397
7193 141397 140360 138475 132464 121504 119440 118915 119128 114673 120805 119477 115891 120368 115163 116471 114898
7178 114898 104640 112311 116213 113437 114052 110492 112276 117887 126610 129459 126896 138098 146109 141400
7164 141400 148809 148381 142817 145378 150585 154874 159817 157181 160836 163671 168632 179511 186210 200511
7150 200511 199667 189251 195328 195289 204976 218752 219570 222978 227149 243582 249762 244948 250525 263423
7136 263423 259698 264431 279160 282272 292031 296949 291504 306271 320297 323416 334174 345809 352916
7123 352916 355126 362675 378802 390780 410801 421466 436599 451654 462544 483639 502283 518008
7111 518008 523637 547222 566863 583718 602307 623380 654151 680864 700402 731498 771873 811246
7099 811246 840557 865488 905804 948158 998342 1071180 1142151 1194135 1243857 1287025 1337972 1364168
7087 1364168 1361282 1357471 1345319 1333201 1312300 1304578 1301831 1293290 1286810 1291717 1309111 1333887 1362635
7074 1362635 1387436 1423408 1462720 1504263 1557973 1614749 1674102 1736016 1809274 1886039 1956501
7063 1956501 2016905 2083120 2161853 2240420 2321400 2400613 2515247 2634223 2761741 2915403 3109036
7052 3109036 3327728 3578392 3879344 4215396 4599667 5025539 5395453 5672878 5949053 6370390
7042 6370390 6958130 7675983 8494774 9236846 9735613 10169225 10546384 10447882 9992783 9467057
7032 9467057 8931888 8423782 7932675 7513245 7200879 7030997 6963590 6983399 7040460 7089811
7022 7089811 7163224 7320253 7602695 8044536 8642771 9393418 10200293 10874214 11296502 11678391
7012 11678391 12198416 12702005 13096814 13498229 13865522 14066043 13903087 13114051 11883103
7003 11883103 10597021 9446278 8433130 7615011 7012112 6584412 6270749 6083057 5992024
6994 5992024 5989908 6043182 6096229 6103196 6106108 6214885 6477587 6871225 7357164 7819772 8091838
6983 8091838 8271643 8442177 8234750 7700684 7106932 6467336 5835836 5208742 4608796 4098883
6973 4098883 3684270 3335421 3047040 2800344 2584601 2389779 2232852 2092637 1965225 1864907
6963 1864907 1760457 1662079 1586464 1513683 1443586 1389697 1337856 1294697 1254603 1218311 1169337
6952 1169337 1128589 1098840 1069062 1040215 1003521 975890 965781 946595 921757 910376 894660
6941 894660 889907 888089 880993 877935 873694 859712 854526 873731 901335 915163 921017 928290 926661
6928 926661 910525 875684 823966 786656 744708 701316 660505 621951 597113 574505 558301 546506
6916 546506 523170 499254 489136 490982 484286 471082 459695 451531 441871 434649 437255 433853 429913
6903 429913 429895 431535 422067 417953 421420 415988 420196 418809 418001 422923 430347 429745 424048 415553 422289
6888 422289 429137 432116 430692 447203 452400 448050 457263 465203 469589 474665 477552 483352 487394 504814
6874 504814 513995 531896 544785 550262 552796 565761 579649 586615 592681 604006 617713 630514 652820
6861 652820 660309 677582 702494 715864 732973 752328 763212 789770 819158 844941 862407 874728
6849 874728 899713 931986 951280 975045 1010171 1045650 1071148 1099642 1130253 1163129 1198487 1241488
6837 1241488 1291882 1336194 1385018 1447580 1498928 1553979 1624639 1691916 1761567 1846991 1938775
6826 1938775 2041382 2140516 2250234 2380554 2524332 2678950 2850691 3044210 3258026 3496008
6816 3496008 3752681 4014348 4291822 4587969 4894707 5212698 5542582 5884581 6237013 6597312
6806 6597312 6944598 7256233 7517602 7715281 7821753 7833430 7763788 7595823 7340731 7018925
6796 7018925 6638339 6228145 5800907 5365499 4946551 4548228 4185837 3838253 3536157 3255422
6786 3255422 2995995 2766666 2564812 2374953 2211922 2063125 1927986 1799678 1686465 1594808
6776 1594808 1506790 1423266 1346379 1278870 1213535 1151007 1096399 1064507 1015572 966699 927262
6765 927262 899614 864719 830905 804102 773667 754862 719871 692746 670705 646928 636429 622024
6753 622024 601247 575434 554486 533275 510145 495409 482239 458443 445380 438457 425343 400054
6741 400054 387222 380972 368082 357719 354294 344668 334201 318315 309575 299007 293976 282989 278764
6728 278764 270647 259005 247839 237824 234728 222633 213348 208958 203535 204480 199878 192020 185006 178187
6714 178187 176826 162852 158429 153385 146240 138027 134047 133532 126191 124648 122534 114875 115427 112660 106543
6699 106543 107935 106981 99125 102327 103868 97605 105371 101946 94199 93443 100908 107216 111582 108560 106171
6684 106171 93064 99196 105897 104265 105988 107377 112479 115482 122742 121345 123909 123853 134236 142216
6670 142216 140328 134612 136903 136070 125025 122606 120118 115267 119356 109188 106533 112340 101115 95665
6656 95665 79952 75794 67407 60905 64870 61861 59396 65805 58042 53763 55945 58147 54803 54964 55212
6641 55212 54965 47841 49192 51750 50837 59371 55791 62272 53784 61890 64466 72142 69275 72698 74002
6626 74002 73699 75896 72860 72642 73440 76150 72047 62396 62806 56033 57355 56482 56597 48545 37658 34212
6610 34212 40467 41256 26693 22557 22162 22415 18879 16524 23593 18042 22879 22311 17379 17285 10397 9616
6594 9616 8382 2095 -6797 -5354 -5608 -7787 -8926 -920 -6380 -20640 -20665 -15258 -14797 -10877 -11020 -6933
6578 -6933 -14975 -11318 -11384 -18644 -22608 -28128 -23420 -17456 -20043 -21614 -15762 -17330 -12051 -16511 -23135
6563 -23135 -20048 -21127 -22166 -27543 -27216 -28916 -28208 -32594 -25847 -23708 -17157 -16145 -15224 -13102 -16463
6548 -16463 -16124 -23611 -27925 -16935 -15185 -23353 -21540 -26193 -24028 -21195 -20250 -18248 -34549 -29312 -27390
6533 -27390 -28851 -26743 -24582 -27499 -29741 -23738 -29919 -32197 -32562 -26273 -18897 -17643 -14567 -23486 -28559
6518 -28559 -25848 -29889 -34825 -34439 -29350 -35112 -40669 -36226 -24099 -26611 -31036 -35456 -47756 -44885
6504 -44885 -37091 -37176 -33505 -34335 -36358 -37046 -32624 -33804 -35718 -32371 -31288 -36591 -35761 -33180 -36239 -29908
6488 -29908 -31442 -34164 -28592 -31533 -31493 -27928 -28753 -29023 -29138 -35295 -36864 -31543 -25382 -25463 -32269 -27167
6472 -27167 -32831 -41990 -37984 -42252 -38242 -41433 -36493 -32302 -33030 -39618 -45963 -44179 -40992 -40873 -35005
6457 -35005 -28776 -29412 -34243 -43669 -39584 -36298 -34228 -37955 -36509 -38205 -39170 -23195 -30097 -31533 -32806
6442 -32806 -36540 -34670 -29275 -25406 -21182 -26846 -28708 -22981 -27781 -34740 -37052 -33208 -35198 -31176 -24389
6427 -24389 -22354 -22860 -19554 -26991 -29703 -22816 -24327 -31063 -28927 -27797 -19185 -20667 -27706 -22839 -15307
6412 -15307 -8032 -14592 -17412 -16970 -18063 -9379 -6568 -9594 -5482 -5330 -6645 -6249 -7237 -731 2469 -1120
6396 -1120 -3699 -2615 -6132 -3736 -12671 -16335 -9989 -10305 -11942 -15342 -12662 -14241 -12997 -9577 -16971
6381 -16971 -24503 -29419 -21185 -22608 -19403 -17796 -19860 -22976 -23522 -21210 -22139 -34344 -41406 -36932 -39260
6366 -39260 -31120 -35029 -28716 -28616 -29953 -37977 -36666 -34623 -38709 -41087 -45079 -35914 -36485 -29391 -31584
6351 -31584 -44162 -35847 -31525 -32295 -35672 -40423 -35017 -30674 -29653 -36257 -37098 -31616 -35479 -33329 -40043
6336 -40043 -48688 -49030 -51354 -35508 -42349 -51138 -47918 -44213 -47233 -50198 -51189 -47360 -46442 -53674 -54268
6321 -54268 -50039 -42477 -45067 -50172 -48625 -48497 -47471 -40541 -45577 -50667 -48142 -46157 -49540 -55560 -45010
6306 -45010 -45607 -49585 -48762 -48127 -44557 -39590 -39892 -41775 -44171 -53765 -53726 -48793 -54870 -51266 -43821 -45634
6290 -45634 -46452 -46493 -42705 -41622 -41652 -43192 -45847 -44896 -42733 -52354 -49348 -46672 -48759 -52796 -51578 -35443
6274 -35443 -32021 -46098 -51818 -51952 -50007 -46210 -39015 -38265 -40098 -49793 -37890 -34140 -39548 -39512 -42718
6259 -42718 -44883 -41804 -36601 -34084 -40739 -41900 -40885 -34682 -30786 -25933 -26823 -29510 -31798 -35374 -24762
6244 -24762 -30040 -33689 -33688 -36176 -39060 -29072 -30994 -37298 -38755 -41580 -37524 -31966 -32173 -25168 -32903 -41247
6228 -41247 -40867 -34000 -39284 -43502 -50717 -48203 -40348 -38426 -37807 -38368 -45173 -53885 -55848 -55765 -49579 -44335
6212 -44335 -45729 -44556 -35863 -42879 -46354 -48002 -47986 -51418 -49381 -41233 -45906 -46596 -44870 -50319 -51065 -49259
6196 -49259 -44719 -50989 -49404 -46845 -44366 -43260 -46333 -52447 -47026 -48869 -49905 -40314 -38307 -51867
6182 -51867 -46948 -44482 -53051 -49530 -48191 -47948 -38143 -38609 -43854 -40147 -35754 -33685 -50139 -51246 -46119
6167 -46119 -41884 -49612 -54011 -55020 -49817 -55601 -59030 -53376 -51693 -60131 -53437 -42072 -42476 -38679 -39788
6152 -39788 -47311 -53141 -43830 -41193 -43365 -43597 -40105 -38341 -33914 -37376 -53460 -48590 -46309 -47252 -42869
6137 -42869 -46544 -48962 -45626 -40327 -39088 -47039 -45263 -41774 -45143 -49478 -53680 -45779 -41902 -45048 -48055
6122 -48055 -46766 -37772 -39570 -38025 -39125 -36281 -35191 -37814 -42371 -45689 -42103 -40113 -41997 -51606 -52917
6107 -52917 -42946 -47312 -51796 -49088 -40527 -37885 -43382 -46087 -46888 -50679 -50538 -42901 -48117 -43325 -42201
6092 -42201 -49371 -46861 -42494 -39453 -40696 -44232 -42819 -40356 -45976 -49251 -49918 -38768 -30204 -39556 -40417
6077 -40417 -44449 -44496 -44813 -41984 -47275 -41882 -34775 -35663 -32979 -40617 -41257 -35479 -44101 -41338 -34926 -35133
6061 -35133 -33536 -41086 -37481 -38178 -32766 -36777 -38599 -44168 -49260 -45020 -44798 -40502 -44413 -49006 -50177
6046 -50177 -51756 -45789 -37337 -33915 -35878 -42926 -45566 -51524 -44769 -32255 -40232 -53819 -48724 -43478
6032 -43478 -40651 -43971 -37191 -42412 -38891 -44855 -46553 -40166 -43138 -37770 -37691 -46716 -47150 -38957 -36102
6017 -36102 -37643 -38774 -40525 -43644 -43497 -43023 -46058 -40275 -40817 -43014 -43780 -41670 -44444 -43841 -37973 -38465
6001 -38465 -29603 -41357 -43882 -37852 -41235 -42698 -46084 -39798 -38351 -35326 -35704 -35672 -30558 -35079 -35564
5986 -35564 -34411 -29923 -29948 -35718 -42662 -35313 -33243 -36584 -41383 -35286 -42153 -39594 -37504 -40715 -39677
5971 -39677 -46703 -43043 -38248 -37651 -30278 -29876 -31566 -36056 -34655 -40589 -38915 -27976 -33846 -29927 -32450
5956 -32450 -32476 -34582 -38082 -30023 -29105 -37293 -38930 -39798 -38182 -34459 -35209 -31008 -31736 -30880 -38170 -43102
5940 -43102 -39060 -36313 -33196 -31971 -30156 -32324 -34971 -28629 -31755 -38235 -34603 -36479 -32553 -37508 -40681
5925 -40681 -41722 -42169 -37886 -33715 -37400 -37887 -37450 -38168 -40679 -36948 -26917 -20504 -27623 -27268 -30943 -41407
5909 -41407 -39680 -35642 -27709 -32187 -38334 -45690 -36325 -32075 -35626 -40164 -33153 -38508 -41396 -34114 -35234
5894 -35234 -38396 -32921 -28911 -34749 -31072 -28930 -34578 -37763 -32148 -25486 -23371 -26273 -28152 -24250 -23698
5879 -23698 -27001 -34258 -36446 -35723 -28902 -23285 -24535 -34303 -40152 -38581 -44469 -39187 -29012 -28576 -30787
5864 -30787 -33470 -36594 -32318 -36878 -39769 -35328 -25308 -23121 -21965 -29327 -32090 -32543 -36728 -28159 -31841
5849 -31841 -31588 -32947 -25594 -24544 -25305 -21186 -22676 -23300 -32388 -31974 -25797 -29139 -34662 -29884 -31683 -26455
5833 -26455 -22146 -24038 -30952 -31405 -29397 -26160 -29362 -28997 -23616 -15930 -16675 -19643 -23494 -23406 -34236 -28002
5817 -28002 -35092 -38588 -27894 -25670 -21116 -25139 -24169 -30133 -25769 -24549 -33602 -30552 -17832 -21819
5803 -21819 -25021 -20417 -20433 -14202 -23734 -25561 -10548 -16987 -17895 -18968 -9141 3921 4830 4191 -370
5788 -370 -14268 -18568 -13274 -15886 -11478 -3528 -4650 -256 -4025 -3199 -5448 -11936 -17956 -19654 -19589 -13162
5772 -13162 -2338 6099 2881 -10668 -16632 -15477 -8249 671 7570 -843 -1036 6155 12043 23559
5758 23559 34356 20162 16103 12040 14277 25094 21583 19467 18050 15668 17803 15834 5934 4847
5744 4847 8339 5845 12024 11819 2237 -1862 2264 669 -3320 5838 7353 7442 4868 17458 21372
5729 21372 19584 21862 29984 30244 31692 32784 28519 27574 31857 26911 22138 29611 19396 16243 19889
5714 19889 8954 10116 8592 1975 -2624 -6897 -8224 -1539 -3294 -8646 -9394 -4566 -2583 -1144 -3680
5699 -3680 -7010 -1411 3412 172 -664 -413 -788 5780 -2339 4664 3056 -7321 -13775 -11615 -5517
5684 -5517 -6400 -14350 -21598 -15024 -16566 -21843 -27031 -20629 -20368 -20646 -21518 -21500 -22734 -28444 -15099 -17272
5668 -17272 -22430 -19745 -15210 -15528 -14416 -21426 -24353 -17492 -13887 -14696 -11540 -18645 -28336 -27831 -22915
5653 -22915 -14157 -12316 -20675 -16130 -23501 -14199 -7646 -12296 -16945 -17635 -19662 -26199 -20766 -19327 -18716
5638 -18716 -18472 -23935 -23517 -19474 -25235 -13989 -18061 -24509 -25417 -18766 -22762 -17067 -13874 -9304 -12111
5623 -12111 -10279 -6224 -4423 -5859 -14600 -9555 -11790 -19235 -21160 -21643 -28541 -17283 -19948 -25371 -24783
5608 -24783 -22913 -22011 -25343 -16914 -15140 -19878 -25931 -19088 -24644 -22112 -15486 -18447 -20437 -20988 -18545
5593 -18545 -23379 -25954 -21839 -15345 -15126 -10896 -22486 -28635 -18323 -16606 -17864 -14443 -15828 -11796
5579 -11796 -19373 -17561 -8657 -9398 -10748 -13575 -17240 -13969 -21088 -25090 -19467 -15762 -23282 -24907 -16376
5564 -16376 -15772 -12488 -13906 -12272 -9799 -9996 -5973 -4809 -5967 -10353 -9707 -17198 -16336 -14731 -20010 -18400
5548 -18400 -15381 -10850 -10340 33 -3034 -2054 -6170 -1540 -4931 -13345 -16196 -16500 -11730 -15022 -8356
5533 -8356 -2704 -8208 -15795 -14429 -14682 -9932 -6105 -19832 -17151 -9420 -18815 -13529 -12479 -5427 -8457
5518 -8457 -14868 -3420 -849 -1455 -205 -8347 -10350 -1157 -1394 -3149 -1514 1150 -4985 -9022 -5422
5503 -5422 -3988 -3656 -364 -7666 -1452 8537 5023 2739 4466 2046 8051 651 -1196 -1152 786 -7634
5487 -7634 -10659 -4899 -2599 -4184 -1485 -4392 -3855 10479 5878 2305 2695 9924 12529 17538 15980
5472 15980 16927 3890 2961 8115 3758 -1920 -186 7910 4694 6928 13758 10899 12493 11219 3140
5457 3140 4475 5519 10852 6563 2518 1370 5663 10577 10134 6274 6581 5788 3424 10486 12660 13866
5441 13866 15456 15784 7791 13972 15839 19702 18272 21041 28637 23708 21084 20414 25170 29214 32295
5426 32295 37265 35111 30705 38045 40477 44666 52282 51627 43393 40663 40546 41681 49808 47267 49374
5411 49374 43790 53322 52193 45584 54035 69694 68435 67158 76684 79576 81884 85722 94106 100283
5397 100283 104283 102389 113365 116006 115272 119193 112219 103384 96672 92742 93657 104277 107195 106414 106857
5382 106857 105584 114990 115841 115287 121902 135193 135259 132400 133675 151023 154819 160546 173642 191549
5368 191549 206737 222103 243212 254734 268075 274874 266139 262680 256315 264639 265398 255483 259362
5355 259362 268958 279272 278787 285733 304881 309534 309070 316887 331585 327607 322065 321988 313746 309782 307108
5340 307108 296951 290792 287824 284819 281621 273097 274565 281529 281890 271067 256511 238506 228982 211855
5326 211855 192567 178612 166918 161056 152052 143015 148345 150149 147903 144168 143202 144766 146748 137848
5312 137848 139755 135840 137740 159783 160945 151201 147090 143754 156045 164930 167136 162229 168800 173707
5298 173707 163674 154678 151732 158219 163059 155715 144669 143448 142541 142906 141386 138424 133750 129107
5284 129107 134745 137684 142319 148820 146504 152923 149654 150138 152353 157227 158945 161876 165717 156522 156485
5269 156485 156917 160909 161430 164394 159867 157269 160675 154219 151895 156688 156938 157352 158654 165216 161897
5254 161897 164025 160610 158448 163363 169314 167298 167432 173969 168747 178557 179692 176920 178286 182887 183177
5239 183177 183072 187196 188710 189073 187102 187967 195069 198443 198134 205735 216367 224230 234969 241288 247519
5224 247519 242276 243750 251392 258769 260303 257017 266591 265861 265991 257996 256235 252466 252024 257418 259967
5209 259967 266303 269400 282875 278579 282343 279402 283651 293383 299389 306751 312315 312365 306708 311304 324333
5194 324333 328503 340571 342100 355335 367709 384009 391969 405962 409639 412668 419081 420609 433784
5181 433784 455606 464366 467260 486166 492599 502844 520774 538083 541402 549884 556517 568653 577245
5168 577245 594256 605009 619525 625718 634369 636599 658388 675941 688616 708555 716876 728085
5156 728085 741850 754800 782457 803826 814000 826790 844316 864970 877617 893030 908052 923887
5144 923887 950916 976462 989229 1003862 1018263 1036273 1061280 1079607 1100001 1116963 1143329 1171335
5132 1171335 1197581 1225214 1262017 1302175 1342322 1387310 1416296 1450694 1499635 1549471 1598871
5121 1598871 1638361 1684915 1741835 1787929 1838174 1893675 1948028 2003579 2078980 2139820 2212198
5110 2212198 2289041 2360206 2444922 2529428 2618250 2703492 2780429 2867522 2961302 3064659 3161578
5099 3161578 3257667 3365112 3464420 3571310 3687300 3801497 3915964 4037466 4161376 4277113
5089 4277113 4414366 4555744 4695963 4838546 4995900 5176184 5371971 5581879 5806401 6039661
5079 6039661 6284699 6556477 6841186 7146708 7476045 7826947 8202549 8612337 9063715 9566725
5069 9566725 10126205 10755180 11465476 12270911 13177572 14200887 15334373 16574502 17929368
5060 17929368 19354606 20817305 22338817 23901306 25534134 27275396 29094933 30966678
5052 30966678 32899347 34847163 36651248 38195855 39468655 40353629 40623188 40299580 39543120
5043 39543120 38313085 36583361 34519985 32258980 29870520 27438943 25040381 22750130
5035 22750130 20611669 18643630 16866547 15278073 13859939 12627554 11534980 10573909
5027 10573909 9723402 8965755 8307122 7724671 7201540 6736166 6314040 5939184 5601807
5018 5601807 5291656 5023466 4780944 4553439 4356867 4175330 4007338 3850953 3709967 3580522
5008 3580522 3463035 3352774 3240981 3136388 3026601 2931635 2830831 2741445 2649081 2560652
4998 2560652 2477392 2402103 2314083 2247044 2180302 2109163 2047055 1982414 1917418 1855850 1797727
4987 1797727 1736403 1689225 1635388 1584365 1529807 1477889 1432874 1389589 1343461 1296576 1262683
4976 1262683 1215457 1182393 1148437 1109616 1072079 1041349 1013347 979280 956420 921472 893064
4965 893064 864435 837257 809029 789612 765731 739899 711962 685518 669777 650682 633811 615414
4953 615414 589480 570151 551089 532830 524406 518799 496809 476991 464853 461336 453733 448975 442845
4940 442845 439275 424500 413314 408395 400208 407610 398662 389502 387951 386276 376792 376267 370040 370525
4926 370525 371705 371696 363063 357307 348023 352977 347771 328174 331715 341422 330641 324547 329086 323744 310795
4911 310795 310390 311816 310792 312526 316831 321042 314227 310081 298104 291917 299006 305797 302273 307020
4897 307020 305794 297804 289253 293988 294237 294895 285613 276725 271132 261231 257465 254574 257149 256903 251944
4882 251944 242716 239422 238031 242413 238099 224751 216939 215042 209252 197246 188115 181073 186039 183691
4868 183691 182271 183589 187589 182816 178530 180687 183346 182289 186779 190308 197172 193374 200746 197860
4854 197860 188820 186764 181875 189613 187445 181472 175542 179378 175177 173825 174062 164269 156585 158926 151231
4839 151231 154632 151132 146309 143345 140837 138788 130629 126113 126527 128963 118259 114941 108471 105258
4825 105258 103007 93741 108295 102601 99433 104027 95408 88437 95477 102313 98810 93788 101379 101234
4811 101234 103908 105592 101307 100167 101570 110482 117171 115687 99894 99267 98249 99822 104295 107488
4797 107488 101593 93543 92350 104576 99371 102103 102205 95835 90878 89667 95189 101615 106144 99333
4783 99333 90401 92214 101356 93436 91677 89932 95589 96956 107054 109730 101395 106984 112860 123580
4769 123580 120021 113793 111404 111943 117964 126997 126712 128479 127569 131755 135929 147260 157850 163779 174816
4754 174816 176642 181908 190395 203991 212880 223111 233933 242257 256432 270666 281830 283988 277307
4741 277307 279155 275513 263606 250478 239857 234368 220545 207659 194819 176704 168459 158874 154433
4728 154433 153303 139832 125109 124305 120131 109922 97561 97791 105523 100444 96205 89291 82131 84398
4714 84398 87290 80585 84214 86613 77080 70049 73606 73714 66578 65238 63199 61559 59271 62091 59345
4699 59345 57115 60157 70204 72745 70038 66933 69714 74887 75503 82739 85833 82801 80356 72235 78891
4684 78891 76456 79890 86471 86389 85911 85632 80918 81263 81319 79373 82666 79110 84009 85617 92407 90021
4668 90021 93326 90254 85436 86779 89899 93214 92548 95393 99981 97486 93661 95606 102581 99297 96656
4653 96656 109994 118779 121978 124222 125423 140017 157545 158176 161785 165061 170880 186075 197712 202249
4639 202249 210133 216042 211901 212789 213406 201887 186874 167564 157144 148914 137943 123830 111714
4626 111714 110982 103924 101866 94867 87492 85562 87801 95382 94630 93288 97788 95767 99616 98343 87846
4611 87846 87191 95986 98646 90690 92363 94161 91482 100013 92425 80943 84247 89996 90451 88714 84562
4596 84562 77641 81096 87199 94414 98081 94999 91865 99285 99890 96468 96166 87526 92040 99912 97138
4581 97138 106560 104767 94140 90945 96591 96661 98959 99664 98671 106408 106978 109668 109343 118651 112047 111111
4565 111111 124605 126149 127322 130484 122074 120884 126975 128320 124710 122768 113982 106576 107592 103364
4551 103364 98832 94354 100539 103762 100822 100417 104792 107591 106625 98809 114469 129446 121474 124052
4537 124052 121144 126841 120969 123165 134066 138105 133140 131861 125240 113908 117651 113486 115633 115089
4523 115089 111396 108744 103385 93749 103542 108657 95944 93403 96206 95098 97310 96587 90542 97884
4509 97884 102253 97848 98756 94485 103135 116924 116693 123225 115415 119554 125165 123619 129565 124983 125959
4494 125959 123283 132372 137566 137745 147242 145333 140200 141826 134425 128947 133769 134475 139567 135817 130794
4479 130794 127361 132245 136788 138145 140148 134701 141599 132379 136481 140438 151451 152229 151307 151828 151934
4464 151934 152674 148507 142927 144099 147158 146742 145288 144551 143992 146001 141867 137468 135646 130600 132530
4449 132530 130884 137056 144737 145922 150730 144205 145731 158618 161870 175084 178969 181348 183968 187521
4435 187521 193157 200542 199913 198948 209228 209872 216431 219040 215968 206794 200852 200965 184125 174250 171926
4420 171926 165852 156695 158057 154804 152425 152415 147010 145774 153356 151235 149627 152220 154472 150204 147527
4405 147527 153109 151368 153904 147857 144787 143552 137557 143456 150495 151680 153965 152329 150713 140997
4391 140997 141755 148581 147779 150174 156244 157127 155977 166729 168704 171249 169605 172917 179674 181812 180142
4376 180142 189358 194001 202412 198263 189014 188520 196854 209600 214782 218949 224019 226512 230535 232352
4362 232352 238411 233976 234203 238063 244335 250129 257239 258504 251309 255509 266868 275410 272216 265777
4348 265777 263486 276600 286221 276461 280178 278272 276984 273394 264269 268307 269625 265748 258799 260483
4334 260483 269049 266839 267645 268916 268919 267568 263263 267376 263737 263873 260304 270913 276375 275103 267614
4319 267614 262603 269132 269045 268504 269960 272524 277426 281141 290292 297108 305199 310201 307775 315937 318010
4304 318010 322020 331775 333669 341881 333403 354541 371292 374023 374278 386898 408725 417383 422430 436823
4290 436823 443150 453607 459049 461657 461664 469204 476283 469955 467367 468414 469062 467326 467056 459309 456144
4275 456144 454843 459225 465963 467704 470447 478658 475633 473049 482212 488089 494368 501899 508369 509311 507651
4260 507651 517794 526540 535227 547248 561527 571507 589497 599006 602740 601519 603919 611687 608438
4247 608438 606616 612692 623477 631491 627148 638077 655231 662714 673032 690973 705910 724732 746841
4234 746841 757931 784038 805279 831645 860405 883613 912058 935289 965426 1000053 1031788 1047401
4222 1047401 1067928 1082110 1096167 1093453 1081923 1076364 1075183 1061006 1045808 1039151 1027374 1012989
4210 1012989 1008392 1005081 1004836 1019942 1025017 1034882 1047408 1063882 1080862 1102628 1136021 1160696 1178357
4197 1178357 1202527 1242681 1266420 1283654 1310604 1337769 1362617 1392465 1427879 1467082 1514095
4186 1514095 1545399 1586146 1633746 1675911 1722458 1782881 1833992 1898266 1963644 2033396 2112192
4175 2112192 2185793 2255884 2326228 2402114 2482704 2568432 2650762 2741918 2858134 2980970 3118782
4164 3118782 3288633 3473864 3702378 3977303 4297399 4684898 5139578 5667651 6238597 6860730
4154 6860730 7535000 8240939 9040629 9958093 10976252 12125641 13292322 14294593 15063678
4145 15063678 15424345 15255844 14634826 13638326 12333336 10935853 9598493 8367192 7298711
4136 7298711 6433362 5749418 5213152 4793239 4450804 4169077 3929058 3728350 3551943 3410797
4126 3410797 3299783 3219597 3177563 3127718 3069708 3008430 2928619 2830481 2701035 2589916 2490481
4115 2490481 2395795 2323275 2253043 2195455 2156434 2128004 2106255 2078774 2055047 2027669 2000615
4104 2000615 1976783 1951174 1922715 1903951 1885024 1868148 1862276 1844737 1838815 1852729 1858109 1859247
4092 1859247 1864397 1877732 1888753 1902191 1923818 1938128 1942238 1952907 1974441 1983845 2000585 2026128
4080 2026128 2055553 2080803 2108801 2142243 2178473 2220474 2265102 2298646 2326640 2344222 2360422
4069 2360422 2389663 2414932 2448964 2487827 2523702 2566590 2619439 2667598 2718362 2776402 2822537
4058 2822537 2886443 2944434 3008712 3087428 3160188 3220343 3294751 3371903 3464651 3549944 3638777
4047 3638777 3743004 3855641 3969420 4094079 4231026 4370839 4515906 4674701 4817504 4976139
4037 4976139 5125240 5288208 5460451 5618073 5803818 6002919 6184130 6354257 6535071 6693886
4027 6693886 6874433 7049999 7250923 7468184 7697344 7965000 8265614 8614463 9008217 9441276
4017 9441276 9939228 10507108 11129344 11837684 12622272 13487924 14425429 15442305 16525164
4008 16525164 17658364 18846256 20079998 21353478 22642287 23938163 25169074 26271221
4000 26271221 27148353 27732716 27957849 27817740 27313262 26497215 25444839 24256797 23011035
3991 23011035 21778338 20572524 19465989 18454197 17546732 16747373 16045248 15424792 14878182
3982 14878182 14416664 14013946 13674308 13384928 13135617 12934330 12763114 12625472 12516667
3973 12516667 12443204 12405148 12407656 12454377 12530483 12643248 12794303 12980923 13209220 13475441
3963 13475441 13767191 14092685 14444694 14831777 15255594 15716199 16227992 16781098 17382394
3954 17382394 18057379 18835184 19701005 20681576 21804919 23093659 24567555 26238002 28109322
3945 28109322 30130980 32282199 34513928 36816640 39173853 41555325 44020513 46703214
3937 46703214 49618307 52677243 55752164 58764013 61427338 63266627 64220965 64445489
3929 64445489 63718731 61817731 59080275 55837185 52134409 48104925 43988251 39946362
3921 39946362 36071588 32466436 29184503 26261240 23674409 21414709 19451901 17750829
3913 17750829 16255982 14954987 13813524 12806088 11922476 11123036 10409677 9773073 9198948
3904 9198948 8686926 8225680 7806086 7425294 7098784 6798449 6528250 6286902 6064784 5873544
3894 5873544 5693209 5527178 5369944 5214628 5082970 4949930 4832784 4707624 4574227 4451184
3884 4451184 4336873 4214820 4087389 3956260 3838891 3720385 3603264 3499949 3407328 3315914
3874 3315914 3216456 3118668 3023141 2923846 2829786 2739882 2661686 2585954 2513463 2433659 2360450
3863 2360450 2307051 2265059 2215742 2162566 2108667 2069526 2020382 1965439 1922117 1874876 1825336
3852 1825336 1774252 1731655 1684022 1633470 1587247 1536787 1493472 1444485 1395750 1351783 1310415
3841 1310415 1267428 1222210 1178955 1134972 1111488 1077186 1054742 1032501 1009971 985028 965541
3830 965541 949221 926740 900233 892790 879009 861196 840932 817345 802115 793164 783117 774203
3818 774203 757658 746709 734402 735138 733895 721551 716917 713520 706180 709645 704975 703206 706385 701618
3804 701618 697790 700338 691395 690110 682384 682308 679916 672549 672627 668842 673365 668722 661166 659890 666874
3789 666874 666392 656986 649421 645681 635926 633673 629949 622538 608065 605392 607188 600083 595737 589096
3775 589096 586140 581928 578899 578619 570200 576872 573570 560952 565286 560919 551755 552220 554218 549397 549232
3760 549232 540107 535705 524592 517287 502753 497718 489841 488586 478958 475487 476216 482085 484136 484414
3746 484414 485694 487127 487494 483191 488978 493870 492882 492609 477306 475242 479635 476665 465365 455023
3732 455023 450689 445070 450224 445661 443686 438732 431749 430234 429894 429679 431088 432044 436910 432401 434501
3717 434501 428257 434517 439176 444002 445448 451747 464314 464534 466829 472173 481832 482599 478355 475581 469972
3702 469972 460670 447600 444295 434797 426805 413580 410008 411958 400602 399516 410766 406459 406956 405803
3688 405803 404882 402899 404372 407389 412961 402804 406505 407567 399164 393722 383744 378905 372693 371109
3674 371109 360469 355803 348694 338230 340087 337724 348509 350081 345866 347475 351822 357492 359406 369282
3660 369282 382500 381076 377085 378215 387459 392218 398467 415418 432370 447228 459911 462191 473216
3647 473216 481272 497350 507966 525153 542266 565057 585522 608350 617876 637756 645427 649927
3635 649927 652457 644923 636018 618052 602761 593170 572892 553641 543534 520288 506053 494541
3623 494541 485592 470858 470293 467910 462752 462191 464672 454577 451147 453896 453833 448941 455259 462006 467492
3608 467492 477040 482323 484501 490634 491720 500414 508117 505592 501254 496986 493623 495583 499386 501985
3594 501985 495585 495970 500151 508745 525009 529378 534204 529791 529279 532626 521049 523944 529437 540168
3580 540168 540055 546900 548036 560790 561285 559430 562656 581939 597320 608654 622658 639924 651904
3567 651904 673988 696810 712281 731291 742549 760477 792134 818005 847779 895161 939756 992929
3555 992929 1063864 1144950 1221645 1291930 1361394 1444797 1540118 1637392 1731364 1812041 1880151 1927792
3543 1927792 1939226 1898639 1822425 1713786 1595963 1476351 1359997 1254485 1169565 1103051
3533 1103051 1043851 997181 969970 940943 915733 907594 891553 885004 881658 866972 863620 859690
3521 859690 849551 843673 843236 838750 834971 826089 829480 839586 846223 851308 854531 854764 851783 833296
3507 833296 822364 814525 794722 782319 775771 772276 775945 776903 796318 812761 804412 824760 836756
3494 836756 845983 866031 882426 891162 898923 904251 917354 930792 939607 946351 951934 958943 971163
3481 971163 976473 972194 972445 965097 962686 957428 949518 927562 916130 904542 893563 877449 866018
3468 866018 881400 882560 879726 881662 883991 887472 887983 897864 902806 909089 921259 925556 932904 938458
3454 938458 953055 955511 959344 960905 961695 962817 971050 989208 1021306 1052637 1103295 1157575 1226706
3441 1226706 1285426 1327324 1357719 1399802 1427974 1442298 1447426 1468040 1476403 1462766 1441225 1430777
3429 1430777 1415579 1401050 1378019 1372021 1375984 1379616 1374208 1390597 1406428 1434946 1461054 1488591
3417 1488591 1530796 1573398 1576234 1589339 1608573 1627748 1664259 1700497 1729357 1772863 1816224 1851355
3405 1851355 1868529 1896678 1924919 1967933 2017723 2075410 2137827 2183563 2226357 2273062 2319048
3394 2319048 2376127 2434629 2488230 2539629 2584215 2636572 2686774 2739169 2794291 2846478 2899527
3383 2899527 2946324 2991095 3043970 3083943 3131229 3192570 3248821 3298910 3362813 3414219 3475097
3372 3475097 3546181 3617453 3698981 3789751 3888129 3990839 4095118 4185361 4261126 4331338 4391312
3361 4391312 4448386 4519203 4596162 4678820 4786975 4893153 4998180 5106031 5205657 5291078 5370954
3350 5370954 5455876 5561189 5675442 5805932 5940909 6116384 6287038 6472578 6639512 6806039
3340 6806039 6976052 7175135 7364156 7569564 7764316 7969917 8155361 8355784 8539222 8725910
3330 8725910 8906219 9103430 9284058 9482031 9690981 9915103 10157521 10440125 10728295 11054709
3320 11054709 11397870 11795621 12222866 12677590 13118458 13573288 13997748 14415611 14821005
3311 14821005 15266835 15727530 16191216 16655797 17146334 17656193 18190765 18727058 19297649
3302 19297649 19913777 20584228 21252914 21899029 22523027 23237752 24031724 24940787 25906854
3293 25906854 26976590 28150762 29429023 30733630 32088757 33474450 34895208 36311967
3285 36311967 37781391 39291220 40873075 42578271 44508746 46659270 49137420 52014353
3277 52014353 55351316 59116021 63471616 68640124 74784233 82057013 90832705 101125989
3269 101125989 112804199 125764077 138331688 147786055 156021794 167971206 184797287
3262 184797287 205507684 228166006 248020480 262933722 273729972 268639517 247489255
3255 247489255 220942524 194957295 170133173 146384971 126465636 110776323 98268256
3248 98268256 87776007 78882659 71140724 64388363 58369031 53087011 48417365 44354956
3240 44354956 40803601 37767020 35078712 32761315 30685297 28837504 27137253 25649001
3232 25649001 24315484 23161309 22122102 21256316 20509332 19885883 19308649 18820963 18356656
3223 18356656 17948514 17599380 17318308 17046080 16806076 16516799 16090717 15409143 14683613
3214 14683613 14005136 13376121 12793248 12268181 11784631 11370404 10982132 10648367 10339546
3205 10339546 10053955 9781564 9515597 9239248 8999873 8748510 8520589 8291872 8065830
3196 8065830 7841199 7645159 7453954 7292957 7139647 6996998 6857675 6748372 6638079 6538402
3186 6538402 6430447 6339783 6266894 6240205 6226616 6225195 6199565 6096106 5881627 5600707 5291194
3175 5291194 4981126 4692934 4437919 4210360 4014335 3841833 3668947 3498358 3335472 3177563
3165 3177563 3035516 2887123 2765160 2653496 2570171 2506295 2461043 2418679 2377019 2329749 2275785
3154 2275785 2223880 2169586 2130428 2094211 2070263 2057015 2067333 2090760 2099570 2100154 2097736 2088370
3142 2088370 2068528 2033235 1996907 1949257 1914662 1869383 1834324 1809855 1797437 1779669 1767997
3131 1767997 1754660 1738818 1738817 1725708 1721462 1734487 1743168 1754934 1754757 1753369 1759524 1761936 1754743 1750687
3117 1750687 1757968 1783587 1808554 1841734 1864300 1883790 1887923 1883052 1866292 1863131 1856720 1865099 1882863
3104 1882863 1903030 1928475 1957481 1995796 2049791 2096083 2136425 2181260 2270088 2377180 2495879
3093 2495879 2590926 2670263 2699104 2639792 2475381 2273749 2060924 1866613 1693057 1565760
3083 1565760 1459469 1388327 1332677 1303766 1263815 1212282 1177476 1146120 1122253 1110106 1108665
3072 1108665 1115471 1112081 1110775 1090813 1070974 1047661 1015372 983339 946025 927489 909122 880932
3060 880932 863213 857059 851305 841621 833258 823235 815476 804142 796724 782075 767076 751566 735631
3047 735631 715468 698923 655724 620010 578481 548549 521808 484791 457275 445860 426794 420339
3035 420339 414800 401450 394005 388280 393906 402307 404660 411561 413426 425871 434928 427810 440779 439117
3021 439117 445088 450735 458948 465053 461291 466534 465022 457632 461559 454841 445601 439199 428605 416094
3007 416094 412624 413558 414018 408129 413860 413963 422196 421422 430657 430238 434008 431419 443404 441284 446857
2992 446857 451129 473213 483646 498312 522952 561205 600255 637574 677431 726976 768303 813508
2980 813508 868165 923325 982409 1037223 1096928 1172906 1260983 1347940 1421541 1486981 1513132 1517552
2968 1517552 1477001 1396573 1288483 1178167 1066502 962983 876158 797532 731854 680995 628134
2957 628134 588216 549702 522496 492732 454995 421336 394644 373422 355757 345574 331015 333077
2945 333077 315671 302401 292051 285484 286835 279815 267690 256177 249395 246831 243157 241092 240852
2932 240852 234326 218943 211867 208426 195848 185346 184376 186182 184828 174523 180418 185235 175569 178322
2918 178322 176614 166945 160520 153847 149994 137733 142602 143146 143095 149836 151696 163134 168613 172077 176793
2903 176793 180065 182691 174633 176394 179808 180730 178193 176507 180177 181200 181327 184713 187881 182153 179097
2888 179097 177829 183773 182647 190144 192629 192740 199930 198445 194547 192008 189813 194293 200954 202120 203440
2873 203440 207641 206312 203020 210255 223007 220762 215707 216286 211933 219526 229295 228781 218105 225844
2859 225844 218893 216901 215527 223912 214526 227366 233893 242260 238229 244359 247451 245228 241687 242491
2845 242491 243578 225830 222278 219996 204965 190565 183429 172855 162088 162690 155087 154585 161443 159720
2831 159720 164523 166020 167112 169323 171209 175143 179314 176663 172318 182146 176015 172397 163635 150866
2817 150866 148143 146866 147963 143119 136164 134942 133816 129537 128989 132825 134423 126645 123767 130293 132704
2802 132704 131853 131553 123935 129451 121840 112924 109219 110740 103253 96369 97016 90672 77756 80612 75614
2787 75614 70725 67591 61842 65688 69460 64657 52546 50157 50627 48436 46230 43180 38847 33682 30671
2772 30671 29064 27452 26212 21228 18726 24917 18067 9965 9821 6920 7271 10288 7551 4008 738
2757 738 8913 7994 7314 7095 3386 -1780 -512 2550 -591 -1729 7827 15813 18134 13172 14901 11970
2741 11970 21564 25461 16890 17790 17984 20368 19932 19854 24470 25665 23463 25090 21641 13142 14258 13851
2725 13851 11498 3766 3285 10792 7948 -856 -102 1417 3760 471 -3979 -1808 -130 125 3980
2710 3980 9549 2648 7843 17396 14993 17573 18684 23539 24426 25971 25496 19732 14970 13493 15916
2695 15916 20924 17137 19337 25102 24140 15220 15777 21733 12467 9150 12233 6166 11888 10636 5115
2680 5115 8392 10879 6931 2593 3054 -699 -5881 -11478 -12007 -8621 -8609 -5349 -2371 -8731 -8835 -20419
2664 -20419 -20718 -23322 -19203 -12680 -14741 -19339 -13148 -3377 -10018 -9418 -6154 -6902 -7059 -15508 -7927 -14811
2648 -14811 -19593 -19323 -20891 -18624 -14568 -11570 -14070 -10828 -8884 -4009 507 -12335 -11198 -6542 -10161
2633 -10161 -7138 -4274 -12161 -17313 -14706 -6336 -9969 -9255 -6033 -13391 -13340 -19605 -15735 -20626 -18689
2618 -18689 -10010 -3266 -1696 -12468 -10084 -2707 -5374 -6466 -11465 -14669 -10468 -12601 -14041 -9307
2604 -9307 -13744 -18034 -11401 -7459 -11193 -18627 -17565 -24384 -21178 -18269 -13053 -13691 -14714 -17218 -14055
2589 -14055 -3250 -12536 -13573 -15360 -22386 -19767 -17472 -17049 -20887 -16987 -24870 -21465 -19230 -33159
2575 -33159 -40404 -37076 -37354 -33038 -35549 -24782 -31848 -33780 -22218 -20247 -21034 -21718 -18775 -13220 -10824
2560 -10824 -8515 -7267 -11901 -13651 -12926 -12327 -8108 -3425 4184 7981 1886 6052 8359 178 -6314
2545 -6314 -6678 -11483 -17553 -14600 -4878 -8596 -2284 -6238 -14903 -12579 -15677 -21917 -15192 -18194 -21269
2530 -21269 -20442 -8690 -10279 -13124 -16269 -8499 -14041 -11653 -9652 -13746 -11281 -15228 -14063 -7375 -6505
2515 -6505 -15004 -20617 -15003 -15076 -18888 -24302 -19805 -21965 -6758 -9897 -16870 -19316 -26422 -24956 -16205
2500 -16205 -5277 -4736 -2320 -7467 -1735 -6205 -2036 1437 4217 6603 5024 7071 7535 2782 5784
2485 5784 9148 6753 2340 8081 12586 7273 -3774 -2374 -197 -8208 -7028 -8131 -10202 -16440 -18358
2470 -18358 -23694 -23404 -18912 -13534 -14533 -19029 -9212 -17424 -23876 -18637 -21138 -17178 -27442 -28947 -24278
2455 -24278 -28629 -36527 -27007 -27433 -17338 -10573 -12745 -19044 -18842 -9325 -10995 -12860 -12848 -10548 -15042
2440 -15042 -18158 -18736 -19809 -23037 -23829 -25304 -21029 -16783 -22453 -17085 -17554 -16657 -4043 -12832 -10548
2425 -10548 -7491 -13997 -25446 -19575 -16912 -11653 -14723 -22034 -13570 -17047 -14237 -19983 -20781 -11813 -7567
2410 -7567 -4108 -10460 -13596 -18065 -11369 -7862 -8357 -9825 -10258 -19170 -16891 -11161 -7381 -11649 -10368
2395 -10368 -11750 -14466 -17798 -10260 -10351 -16010 -17895 -14958 -13546 -19396 -19193 -12293 -12283 -10519 -13202 -11168
2379 -11168 -20565 -17259 -9222 -4294 -5982 -6942 -2790 -11308 -10599 -8835 -8902 -12819 -13756 -20628 -21266 -20272
2363 -20272 -14611 -7912 -14890 -20740 -17423 -15172 -17279 -20788 -23056 -16601 -9778 -10520 -15765 -12549 -9898
2348 -9898 -9625 805 -1722 -3771 -14910 -16437 -16830 -19568 -27009 -19028 -10771 -14672 -12977 -12213 -18810
2333 -18810 -12412 -10534 -11273 -10490 -3470 -2043 -111 -3484 -11050 -3191 -8091 -11323 -3700 -7795 -10825
2318 -10825 -8590 -11191 -5558 -79 -2596 -7456 -852 -7504 -16704 -18877 -13001 -12954 -12904 -15540 -12039 -9039
2302 -9039 -8780 -7259 -11516 -7898 -11711 -17643 -10386 -14127 -20268 -5899 -6058 -14699 -10532 -10464 -7414 -8924
2286 -8924 -15460 -15899 -8513 1363 -5667 -6943 -4983 -3311 -8440 -6127 -1826 -8738 -11839 -9330 -8358
2271 -8358 -15071 -15557 -8662 -17096 -18568 -21452 -21752 -18923 -10263 -7957 -903 -3731 -100 5201 -4153
2256 -4153 -3703 -4007 -7350 -14383 -4281 -5154 -9424 -10571 -14753 -18127 -16440 -13352 -10273 -4986 -8551
2241 -8551 -6907 -7986 -6472 -14782 -16216 -11478 -9881 -10663 -14454 -10181 -8140 -10456 -15591 -7157 -2841
2226 -2841 2200 -118 -10380 -6395 -6502 -4163 -8427 -9315 -5172 -4260 -2070 5159 10790 6085 -106
2211 -106 -3197 -1517 -7031 -3890 -7281 -11279 -5762 -8315 -17880 -15230 -10453 709 9610 4213 4753
2196 4753 6633 -125 3627 5004 -1815 -6514 -8117 -9186 -14657 -1559 -1813 3497 7319 -5198 -8830
2181 -8830 -12738 -11367 -6359 -6569 -5401 -8089 -4828 -2849 -9445 -1934 1812 4812 5188 -1497 -3233
2166 -3233 -1288 2016 8954 4843 2751 5545 1596 7330 2070 -1401 7459 5965 6214 2289 -43
2151 -43 6455 12532 17796 10900 5075 3937 6082 5210 6449 13422 9091 9585 8672 8996 6631 9605
2135 9605 9445 10456 13169 19943 19575 18385 12114 11365 14036 14177 19148 18015 16877 23801 20496 25584
2119 25584 25196 20720 16042 22894 20728 19069 17489 22854 25637 25294 24279 23565 28239 36286 39538
2104 39538 37797 44510 37707 35462 25408 29490 37965 49180 53558 47108 46255 47474 54080 57550
2090 57550 67171 63688 58390 63479 67397 70539 70573 72095 76915 86875 86619 87745 92352 95631 106080
2075 106080 110844 105703 106769 113465 126971 126493 137530 148451 154038 161552 172026 181414 202370
2062 202370 224199 238392 257473 287820 313820 345708 403419 484328 564817 620371 662574 755208
2050 755208 882003 1046113 1224430 1315559 1147855 879285 687396 543400 442217 369104
2040 369104 313581 268988 244663 220595 205990 190036 177050 168274 156248 148182 129981 109489
2028 109489 101281 92326 93060 81980 71978 61936 50498 54903 51091 51149 48917 42069 48032 48204
2014 48204 38360 40516 47190 59410 51598 47018 46369 35997 35769 32835 30191 27532 27463 22056 22082 22557
1998 22557 29082 21987 21529 27082 27058 30408 25361 19022 18337 18079 18781 24338 17880 8961 15920 18376
1982 18376 11729 -6043 4867 10923 4411 1009 3745 1507 6649 11185 3150 6855 6251 5351 1454
1967 1454 -3776 1576 73 -2678 -2066 3462 4268 3206 4380 7322 1487 -1098 135 -3577 3719
1952 3719 2945 6112 15309 14612 7923 -11501 -3339 1144 -3142 2238 1212 -1539 3679 6800 2546
1937 2546 8590 14708 11843 3433 3712 2443 10567 4281 -740 2019 5243 7319 2276 2478 7322
1922 7322 9173 7080 7594 2466 1529 -4140 -664 2277 841 646 2790 -862 -4630 4500 -1396 -622
1906 -622 3403 624 2506 15 406 7827 6415 3926 9364 13833 8861 3237 2402 2206 3185 1716
1890 1716 2234 -1401 -509 3045 -8670 395 186 636 -539 817 1739 -4738 -3629 -3248 -3070 -1948
1874 -1948 -81 2409 -4365 -4239 2437 3030 -4029 -6028 -3263 -2019 -7703 -6889 3023 7381 1846 2409
1858 2409 6760 6429 -1284 4197 9877 14237 8553 3026 3704 -3782 -2348 -1222 3105 2854 2693 2129
1842 2129 3412 -523 -8243 -10479 -2342 -7667 -6023 -6946 -224 4480 132 -3041 -758 -3168 -584
1827 -584 -1800 -5305 -10694 -2952 2270 -84 -793 2815 -332 -841 -5925 -8919 -8583 -6823 2426 231
1811 231 -5250 -2727 916 -5340 -1317 -271 4841 7340 -690 -778 6780 6366 291 592 4227 5906
1795 5906 7705 -5569 4696 -134 -3812 4097 4042 3139 1105 2188 -1437 1369 3812 8166 -5484
1780 -5484 -4105 -1836 -7943 4050 7446 6900 9835 7547 10101 5089 -6886 -10523 -493 7585
1766 7585 9894 9526 11427 10271 335 5075 -3892 -7149 295 326 925 864 -1642 -4386 -6122 -6300 -3549
1749 -3549 -6807 -14118 -9781 -493 -1375 -11259 -9712 -2184 3346 4060 677 -4962 3513 12967 -1860
1734 -1860 2676 -7286 831 6707 -3408 -10960 -12167 4506 -1549 -5245 -2982 5014 2479 4598
1720 4598 -6422 -10464 -2531 -1814 -4931 -2115 -3159 -3144 -1467 1724 -6151 -8292 -149 7764 2136
1705 2136 1036 -3241 -8858 -11626 -7867 -6891 3111 -757 -181 4304 -8770 -6787 -2945 6768 3372
1690 3372 -2561 -3225 -5485 -5692 -5083 -6485 -2474 -7627 2201 5307 7038 -4994 -8646 -4686 -9639
1675 -9639 -7753 -6006 -52 4404 2862 -4140 -4859 -709 -1320 -4565 1570 12613 11748 1448 -8106
1660 -8106 -6610 326 -396 1068 3412 3240 -3438 -6608 -2645 -9283 -2463 -7106 -2983 53 -3359
1645 -3359 -5618 -203 -2938 -6230 -6592 3156 3954 -3581 -2076 1453 5905 -534 -5038 -3774 -4575 3106
1629 3106 4768 3289 -1016 661 203 1146 3228 4772 7593 -1915 -13630 -10393 -3852 -6018 -1960
1614 -1960 6140 2711 6316 7039 4002 3507 -2813 -9985 164 642 -10653 -6093 1857 9072 6031
1599 6031 4473 6801 934 -1731 4226 2180 -936 -3313 1171 1103 -48 -365 -3055 -1833 634 -5998
1583 -5998 2322 1335 -285 -2441 -10156 -10814 -8866 -8402 -1468 3690 1390 -2521 -446 -8885 3450
1568 3450 7160 -656 3361 2211 -1899 -5278 -8837 -11186 -11970 829 -790 -7342 -5483 -8247 165
1553 165 4588 -2192 -80 706 -1581 -3945 -4903 -2609 6436 3311 4188 120 -4159 1358 7846 6478
1537 6478 -758 1335 2618 4419 -1059 -2285 1273 -3678 -10749 -1387 12389 14666 11509 4059 -117
1522 -117 -549 -1792 -1075 -282 9431 11047 1492 917 -6491 -2293 3485 -3705 -1837 -2279 1483 6741
1506 6741 5450 375 4393 -6263 -4499 2964 1297 3365 3349 440 -652 5296 8127 11157 3210
1491 3210 -6283 -4096 -4480 -837 3037 -2197 8350 3276 -883 13998 9459 1859 8828 3797 2895
1476 2895 4240 187 451 4068 5221 -289 -239 -2157 1124 -599 1637 -2980 -275 -1777 -1199 2226
1460 2226 -2304 3713 3610 -2576 1418 -4301 -6096 -7963 -4547 8300 6009 -1793 -2950 403 3520
1445 3520 1584 813 3623 -54 -2909 2894 8080 3901 6039 3682 499 887 -751 474 2114
1430 2114 7602 4380 -2358 -7844 4372 6780 1381 -3811 -7904 -8701 -1400 -558 7128 3898 5385
1415 5385 2998 -697 3752 12038 4798 -2233 -1629 -6449 -23 -614 3817 6633 1570 1795 4068 5522
1399 5522 10354 3302 -9712 -6027 -2374 4149 4105 -1731 -4471 3012 9576 8221 9825 -963 -7954
1384 -7954 -400 1873 1155 5041 -1523 2037 3732 8216 -4830 -3079 4318 4341 -2456 1851 7698
1369 7698 11689 6592 4816 7763 5915 5935 2350 9062 11379 4008 4105 -4378 -5818 -7943 1552 6741
1353 6741 9292 8362 11718 13040 -764 -820 2678 9624 5577 -4771 -2952 -34 -4722 6497 17491
1338 17491 6287 6794 74 10703 8096 -1271 5702 2303 685 2586 -3139 -5737 2385 -2628
1324 -2628 -380 -5023 1077 6187 -4059 -4445 3514 5307 -494 -1955 3336 -1374 -2182 370 10093
1309 10093 11334 3164 -5288 -3666 8647 11651 3364 -1359 -682 1871 4607 3077 -943 2002 1791
1294 1791 4896 182 4263 7036 -74 -1773 785 3598 1890 1588 3667 14144 2869 -8519
1280 -8519 -10516 2368 2830 10255 10692 653 8001 10626 9158 9314 8258 9060 5359 5317 2784 -1120
1264 -1120 1366 3923 7197 1625 4151 6149 4956 4859 -1855 -1770 -1608 6414 6874 5491 5957 7334 5680
1247 5680 3678 6487 11538 13594 6778 711 -3255 7200 5337 3950 -435 2582 3607 -4243 -14049
1232 -14049 -11109 -7364 3331 5520 2689 -2830 -2236 626 6537 4200 5712 8040 10870 8536 8533
1217 8533 1481 -733 -4463 -4824 -6996 -7467 2380 2867 2587 -305 5453 -413 -1890 -1367 -8771 -5898
1201 -5898 -1213 -3361 -5150 -719 -521 3391 5262 1617 3023 -4336 8171 1772 -5680 2151 2500
1186 2500 77 -2858 -4885 -6031 -11034 -1951 4502 7524 14047 8387 71 -926 4166 2799 125
1171 125 5025 9899 9428 2065 1405 2878 3389 6730 3482 -940 -4377 -1788 6494 -1281 -5189 -1142
1155 -1142 2788 3595 2799 -178 4787 8130 3740 5905 11735 5223 7809 7168 6271 7500 9360 4693
1139 4693 1041 11489 7765 -1719 -3257 -662 1181 3914 -2165 -1757 -1088 -1533 1165 -2051 3608
1124 3608 2738 -2153 -987 -3731 5087 6585 6736 3732 -3210 -9299 -11625 -9652 -7344 -101 -569 -1098
1108 -1098 -5190 -5395 -2624 -1950 504 -190 364 -1704 5494 2674 5030 3602 -4834 1742 -3172 -4307
1092 -4307 3039 2981 -4677 -5932 208 13878 5633 3649 6144 -3577 -2488 -2428 -859 -2 133 4013
1076 4013 -179 853 4871 5352 -1882 -5550 -1534 -9172 -10003 -5173 2301 3783 2286 -1158 -3703
1061 -3703 1119 1686 3407 8500 1046 3397 3517 5462 3918 1287 -8358 -7834 6128 11925 11418 9288
1045 9288 4863 -1551 -4489 -6514 -2533 1401 -289 476 -6146 -6064 -1291 -3392 28 -1718 -2680 -10484
1029 -10484 -4331 -2205 -4891 -7903 640 6967 5234 11446 10919 7145 10126 5596 -2260 -3754 -365
1014 -365 5099 1089 2205 7822 4420 -2781 1607 5235 7366 4906 7851 11475 2413 5828 6189
999 6189 80 -2292 -6354 2156 -1218 1298 5100 5275 7111 1742 4496 5598 -1526 -3869 -1068
984 -1068 -797 3042 -5331 -1463 6251 3308 -1868 -5150 -6182 -2392 4633 -1010 -6208 -2629 -685
969 -685 -7436 -7966 300 1674 5744 426 1986 1948 -104 -1971 3084 5121 1570 841 4576 -627
953 -627 -3154 6115 5088 1029 -3079 -4933 -3824 1495 1216 5121 4908 6694 6201 8649 1244 -2977
937 -2977 4705 8600 -2816 1828 7123 6622 2473 -1799 4356 1585 1537 760 819 -430 -443 2265 -3849
920 -3849 7505 6297 2837 5631 2608 -696 -5776 -6440 -9401 -6182 3525 6204 3508 2574 -619
905 -619 4155 8865 2706 -5474 -2146 -5080 2455 8131 -3 1426 -4300 -4659 -6407 -4692 1203 -1190
889 -1190 -369 -1024 -1160 3123 5954 10489 9487 3633 8448 4771 -58 -794 3558 7198 3562 2099
873 2099 -7384 -3699 -673 4428 11204 10113 6589 4391 7582 7646 6844 1523 -3311 -4163 2963 6107
857 6107 -2583 -6373 -1133 1669 6537 -228 -6033 -7432 -2198 6747 6448 5215 6165 4398 9810 -1419
841 -1419 4916 -1108 -1344 1990 -1658 2704 1679 -2720 -11909 217 -5366 -4923 -2284 -10442 -10202 -3976
825 -3976 3352 -4808 -6639 -1382 -2520 -8346 -11586 -15407 -9760 -3610 -4917 2630 953 -8454 -173
810 -173 2775 -174 -895 -6439 2468 -1414 -5308 1398 -4036 -1769 518 -6370 -809 241 2968 3458
794 3458 -251 2901 2696 5004 2478 -389 -7333 -2620 -202 3316 -3351 -2538 -11225 -13658 -5799 -5621
778 -5621 -1937 3697 -463 -1205 2175 -6230 1884 3737 -3610 -3814 2043 1674 4987 -256 135 -4383
762 -4383 -9694 -13892 -6494 -11154 -8615 -2131 -6879 -6072 606 -1344 1026 5970 2416 -6294 -1135
747 -1135 -4318 -2814 -1896 -7743 -2921 2427 2215 801 1008 -1106 -4023 -6525 -2175 -4736 97 -1380
731 -1380 -2481 -2746 -4832 7660 734 -8493 490 2818 -5122 -6753 -9205 -4561 331 -9959 -9136
716 -9136 -917 -2240 -10238 -3265 -9106 -14355 -5259 -5188 -8994 1521 1245 -3246 -5860 -14743 -6001 -8936
700 -8936 -4225 2009 -4817 -1714 -7194 -11214 -13516 -16137 -14170 -13092 -10772 -7267 -4514 -7294 -7125
685 -7125 -5850 -2832 477 -9761 -12010 -6864 1564 2563 3895 3436 -6195 -6215 -1587 1828 5310 11733
669 11733 7117 2765 2901 3864 1237 2053 -2930 2673 3651 -2644 -5426 -6528 925 1192 -3793 2300
653 2300 -4912 -6335 -4901 -12 3821 3002 -5098 -17272 -9631 -3720 1442 -7202 -7294 -5615 -5687 -10105
637 -10105 -8270 -2909 6915 5546 6290 2586 2703 -3654 -8818 -2320 -751 2052 6763 2944 -2430
622 -2430 -9046 -14515 -8795 -2708 -10536 -12272 -10772 -11591 -11890 -11198 -7709 -4370 -13895 -11597 -1838 -6969
606 -6969 -4750 -2186 6025 8021 4712 341 3287 -1207 -1756 -6700 -10592 -12577 -13695 -3611 -4242
591 -4242 -6652 -3207 -8779 -16474 -4753 2340 2483 -2470 -9548 -16747 -9141 -16918 -11866 -5065 -8985
576 -8985 -6318 -7159 -12068 -4713 -596 -5276 -11906 -12057 -6964 -8014 -13757 -7645 -3427 3376 6185 -1611
560 -1611 -6128 -12817 -9111 -9124 -10844 -5508 -3437 -7856 -10022 -15509 -11240 -13707 304 643 1108 250
544 250 1418 -7093 -6290 609 2029 -678 233 -7527 -12705 -11923 -4526 -1790 -7548 -6703 79 2023
528 2023 1864 -5285 -15551 -8925 -11806 -8159 -14312 -19509 -16960 -14514 -16975 -12381 -12176 -12944 -8504 -11349
512 -11349 -1759 -6496 -14509 -11833 -9378 -11944 -18785 -14377 -10699 -12338 -5818 -6862 -2406 3160 -720
497 -720 -5304 -4214 -9053 -9128 -4101 598 -4992 -12810 -15718 -15858 -6344 -7306 -10018 -11646 -13663 -11307
481 -11307 -12934 -8793 -8491 -8463 -5876 2794 -366 -5331 -8873 -6783 -914 -6216 -10493 -4137 -2588 -6828
465 -6828 -11913 -7136 -5239 -7049 -4945 -15237 -16034 -15011 -12704 -10525 -10305 -12968 -9210 -9390 -12561 -11469
449 -11469 -7837 -5837 182 -4240 -4776 -13912 -12440 -11740 -4598 -9704 -15212 -14958 -11828 -17860 -13919 -7659
433 -7659 -6634 -6657 -10071 -10107 -10520 -7594 -6738 -6949 -9917 -9675 -4144 -11300 -23204 -19740 -15352 -17796 -22101
416 -22101 -16275 -9685 -7974 -9798 -9685 -8953 -19986 -25354 -16138 -8927 -4783 -7334 -11604 -16633 -18908
401 -18908 -28814 -27175 -19351 -13985 -14356 -18227 -16206 -23371 -20493 -19884 -13275 -18161 -20021 -16200 -13331
386 -13331 -14108 -22109 -20204 -18219 -16459 -27496 -19965 -20383 -16650 -8848 -13769 -14077 -18713 -19405 -15067 -14290
370 -14290 -9910 -11211 -19066 -22318 -16576 -16949 -24984 -20941 -24702 -22332 -12378 -16041 -20455 -15797 -23976
355 -23976 -23149 -11206 -16884 -17482 -12007 -6895 -12905 -12636 -9261 -12861 -20163 -19161 -15352 -16276 -13302 -10044
339 -10044 -6678 -10803 -12031 -18272 -20175 -18559 -22670 -21669 -16785 -13660 -13959 -19841 -19625 -21030 -23484
324 -23484 -18938 -25255 -16620 -19269 -20059 -14374 -14509 -16161 -20041 -23477 -20613 -26301 -15556 -16713 -19381
309 -19381 -23051 -28158 -20207 -14900 -15077 -17026 -20946 -22206 -23951 -26798 -16493 -22824 -28714 -29892 -21511
294 -21511 -24599 -25143 -21692 -25378 -35485 -27859 -24893 -25884 -21387 -20039 -23341 -27858 -20552 -16820 -19377
279 -19377 -26123 -19251 -16288 -11109 -9941 -12223 -6242 -11568 -19369 -18194 -22544 -17874 -15634 -24353 -19370
264 -19370 -20526 -25410 -21098 -26807 -18342 -12149 -16737 -21508 -19144 -14266 -22019 -21418 -12996 -456 -9318
249 -9318 -16983 -16446 -19071 -15471 -18345 -25069 -17144 -14142 -14802 -15692 -16310 -12773 -21409 -19496 -15903 -16968
233 -16968 -19141 -20554 -18521 -24184 -23043 -22581 -19129 -24785 -21134 -20684 -22872 -27014 -23458 -18246 -26873
218 -26873 -21721 -20798 -24793 -30273 -19819 -19576 -11637 -10558 -25372 -28475 -26550 -22633 -12772 -14576 -26360
203 -26360 -24688 -24532 -20382 -22185 -25507 -21342 -21966 -30928 -31444 -29346 -19212 -25497 -24862 -11164 -9254
188 -9254 -16348 -20636 -20528 -19114 -20083 -20205 -21115 -16977 -21260 -26987 -34355 -26905 -21884 -17712 -23955 -27609
172 -27609 -23196 -26789 -27528 -25353 -21946 -27487 -21900 -22927 -26613 -26427 -19490 -22923 -19375 -19212 -21554 -22687
156 -22687 -22465 -22440 -22748 -22372 -22236 -25970 -23368 -13627 -15696 -23421 -18889 -18274 -14367 -18387 -21059 -23550 -20650
139 -20650 -30301 -25717 -29202 -26809 -13192 -15356 -16706 -19289 -24969 -29273 -22756 -20984 -18357 -22645 -26002
124 -26002 -22113 -21082 -27792 -28462 -24244 -27698 -24061 -20630 -25735 -21237 -25737 -26283 -28952 -28463 -20624 -14347
108 -14347 -25498 -28285 -24610 -19323 -18206 -23302 -25090 -23862 -25434 -25277 -20300 -19480 -21355 -18716 -18349
93 -18349 -17967 -20055 -23840 -19993 -24648 -35239 -32303 -26261 -28781 -29834 -26736 -30184 -33670 -29989 -25029
78 -25029 -24586 -22842 -18999 -20916 -18377 -22231 -24919 -28087 -20758 -20605 -24036 -24616 -25653 -24950 -28569 -22374
62 -22374 -20878 -21845 -19349 -15316 -21181 -29932 -27092 -24740 -22377 -24437 -30180 -24491 -23596 -27538 -30401 -27713
46 -27713 -23035 -20868 -22749 -24464 -24243 -23116 -20631 -25419 -28878 -27897 -25298 -29225 -28676 -33575 -29224 -25136
30 -25136 -28253 -23092 -24806 -28566 -28983 -29210 -26356 -28451 -32411 -29159 -19111 -21867 -26017 -21965 -16317
15 -16317 -16117 -16614 -19608 -24712 -26368 -24410 -22101 -26455 -34139 -27713 -25489 -25824 -27099 -30469 -29671
0 -29671
$$ Imaginary data points
##PAGE= N=2
##DATA TABLE= (X++(I..I)), XYDATA
16383 -395040 -387538 -377652 -378114 -373487 -365875 -356095 -349714 -347511 -345937 -337374 -328218 -321972 -314123 -311902
16369 -311902 -306939 -301269 -291402 -282010 -275305 -274680 -275635 -276023 -267954 -259988 -247019 -239005 -238024 -238744 -230593
16354 -230593 -228112 -226082 -218929 -210815 -204290 -208002 -201321 -189815 -186541 -185189 -171350 -162035 -159674 -156340
16340 -156340 -149847 -145995 -144442 -136183 -118651 -115772 -111634 -106055 -104010 -97854 -95931 -95904 -92320 -83006
16326 -83006 -73514 -66324 -61934 -61463 -61592 -53777 -48142 -44136 -41993 -40139 -35403 -28137 -13573 -10566 -8623
16311 -8623 -123 853 -423 7915 14842 15671 24402 22962 30537 35329 39473 46367 46444 48352 55358 57106
16295 57106 62636 71207 83036 85969 84764 89941 99895 101599 112920 114590 112411 109053 113331 118837
16281 118837 121204 125993 132926 134368 132514 141768 148190 154659 159510 167363 173106 173527 182946 184678
16267 184678 176846 184170 180642 188721 192397 201190 203793 204679 207565 215906 222882 223133 220287 217310 221896
16252 221896 229609 235909 236986 236599 243684 248848 249374 257570 263962 265535 264727 269967 268624 280398 288273
16237 288273 283342 283381 287974 287412 295426 297887 294030 307625 305101 299469 308043 315780 311296 317738 321013
16222 321013 326092 333994 329966 334641 336238 336185 341167 341910 346337 345975 344112 350977 349455 353708 358083
16207 358083 354776 350529 356600 365407 357027 366693 372012 372357 374597 376980 378185 377747 379208 381673 382706
16192 382706 385672 385146 389746 392092 382358 384125 396389 396218 398275 405761 399492 403544 408732 408531 409490
16177 409490 405611 410406 409180 411182 415601 425918 427308 422062 423020 424911 428750 429091 427695 432489
16163 432489 438412 439690 443625 450113 455397 443341 447102 453499 454143 450037 447193 444261 446306 440174
16149 440174 441839 445634 446336 450810 457920 457906 457687 462005 462813 455195 455125 455972 464840 469907 472613 465382
16133 465382 464553 468595 468470 466151 469921 470178 468590 468244 467289 467656 468961 474624 472049 473452 478904 477180
16117 477180 474712 474951 478373 483094 481696 478336 485397 487753 478761 476494 473987 481656 482941 477354
16103 477354 471664 480354 487161 489847 485477 479118 482579 474505 473761 487361 490715 489612 488654 495273
16089 495273 490725 494776 492131 490390 491233 492434 490709 496446 499814 493161 489834 490697 488044 489819 500078
16074 500078 498739 501951 496159 492167 493403 499979 497938 494678 497867 497904 499716 494042 500195 500568 493075
16059 493075 495613 497550 500269 509031 501820 507425 510099 511418 503625 498419 495644 495556 502748 506669 509538
16044 509538 507206 506697 508746 506233 504261 509137 504033 497906 501083 508547 508151 513013 507463 510573 510179
16029 510179 506232 507408 509038 504360 502400 501950 497985 507889 507357 507226 506143 508328 505238 508833 505830
16014 505830 508860 514841 515785 508448 501751 508286 508838 509782 508899 515667 507732 509189 512341 517779 517532
15999 517532 511633 512050 523602 515403 513830 519547 507735 508775 515374 515177 505522 514217 514481 507683
15985 507683 506341 510826 513205 512120 519193 516292 512702 507510 508966 510660 512466 515064 514420 514349 516304
15970 516304 518241 517050 514622 515995 505654 511237 514003 516538 516861 515419 514946 516027 512479 511281
15956 511281 510772 508003 513821 512587 512497 515599 516140 512390 512880 516067 515017 511862 507505 510225 514443
15941 514443 516224 511470 512708 519522 521254 517582 515502 518942 521284 512848 513809 512377 514337 521326
15927 521326 517448 516971 519115 521851 516372 519695 520705 517165 513435 515156 518938 521613 521080 519210 527037
15912 527037 523692 513922 515631 514085 518222 522428 519233 514054 507924 509283 512109 522743 527041 518301
15898 518301 521334 517210 520381 525813 523278 514722 516369 512255 515675 510290 515955 521904 518208 514624
15884 514624 518555 520096 525562 524999 524890 523698 532986 533595 523171 525741 525274 526330 522471 524858 528159
15869 528159 524802 526773 532649 536131 538092 535169 523297 519834 524233 519010 511004 515986 529014 526863
15855 526863 524542 525676 523165 513411 521280 526826 521414 522443 527787 527269 520948 518369 534704 531540
15841 531540 524799 532428 526496 520168 522638 518750 521326 521414 524767 521759 521939 530899 534673 537555 537199
15826 537199 544122 546421 536568 531666 526681 522840 523108 524746 529824 531939 523179 519159 526664 537556
15812 537556 533743 522728 525174 530704 534094 524084 520988 531209 529004 527230 524853 532385 538932
15799 538932 540605 538288 538623 540888 527717 536656 545018 540477 537778 528461 531277 538987 530126 528824
15785 528824 530210 531504 530565 532666 535238 536917 537578 544016 544322 532948 526984 530217 534397 539806 539397
15770 539397 545821 546845 546029 541618 539597 541775 541171 537384 545313 539629 538561 541801 532245 530866 538427
15755 538427 549224 542979 537848 534295 538962 539417 537797 543712 546110 543823 534665 544213 545715 542148
15741 542148 539937 532850 543114 538587 545252 537686 536396 535466 535831 536322 534026 534989 541301 543786 545872
15726 545872 542237 542954 541933 546928 548632 536437 536288 546783 553354 549563 542269 549321 545041 540771
15712 540771 544729 543703 542730 541912 544413 539914 540410 542265 547145 540684 537124 537933 542250 545326 547930
15697 547930 546857 551089 554572 552103 552593 545431 544770 544878 541934 536370 547288 547035 541577 542291 544150
15682 544150 543975 543292 540583 537986 537052 541146 550328 553335 550244 547772 538584 535061 543940 542930 538803
15667 538803 536676 541717 544741 540852 535579 534755 544245 548881 543128 553390 553450 547318 540238 544282 546116
15652 546116 543388 543256 545630 544879 549918 547233 551797 560391 552533 546320 556859 554511 551401 556103
15638 556103 556168 551502 553756 557152 559358 556322 559704 561276 547163 543593 548225 551706 546652 549565
15624 549565 557302 556421 554078 546808 553179 554128 560356 562661 551781 552950 551536 552196 555880 552053 550688
15609 550688 547591 555380 551748 552799 549567 554201 552014 547592 550031 555615 561110 556679 555399 552492
15595 552492 561724 553924 554777 552470 551530 548365 545474 538055 538133 544402 551735 555604 549359 554247 556122
15580 556122 545865 548978 550604 551411 557277 555017 552463 551003 551974 554751 563820 563060 553385 561652 557740
15565 557740 560300 561821 552118 558732 560427 566397 563086 555874 561789 556299 564166 564008 558751 554601
15551 554601 557696 568821 562439 564606 563067 567308 573242 564790 555621 551261 554580 565134 575798
15538 575798 572135 567414 562635 559606 563128 563720 565696 571531 565491 562463 558915 558980 560724 556831 559271
15523 559271 565269 563782 572462 572763 570382 576536 571976 564186 570007 563745 558342 557991 563176 561881 560525
15508 560525 568548 571389 566334 566535 567709 563018 556420 558259 566375 567904 565675 562597 559648 563270
15494 563270 560174 565957 572604 561349 568052 566117 563814 572869 576092 572776 577665 573125 568074 574862
15480 574862 573862 577772 569795 570745 582580 575599 570971 568357 569832 579685 582973 583365 580707 572815
15466 572815 574529 573959 572063 576458 578107 572892 573615 576871 569353 567098 568960 572605 568813 562827 569560
15451 569560 572760 576509 578500 580023 579902 578450 576088 585451 581872 583291 584113 574890 568883 572295 578146
15436 578146 579070 579349 577909 584478 581790 574666 579135 576266 577209 585345 575075 573789 573363 576647 582911
15421 582911 573637 580235 572167 567308 563424 570764 566419 576108 582788 584607 579681 570587 571180 576719
15407 576719 586013 585625 587062 591547 586233 578316 581788 576838 578397 579923 581124 581102 576520 578639 581107
15392 581107 576810 575289 587036 585181 580154 585081 585598 577725 583832 579476 581280 585767 587312 593878
15378 593878 582936 576701 584752 577805 573533 579114 576526 581314 573705 573162 575789 579157 585782 588558
15364 588558 585910 583741 584001 584380 582819 584288 584706 583309 583555 589473 581535 579466 585321 587777 582325
15349 582325 582010 581391 591398 598084 583191 584814 591598 594722 591090 583126 581351 580435 589550 587751
15335 587751 590717 588022 588680 593659 593681 584759 586650 584707 594831 595529 595933 592147 592043 589667 589532 592071
15319 592071 590395 591535 587411 590948 591011 583044 584799 592146 591320 581765 589152 595897 595479 587520 583850
15304 583850 595644 591926 591161 591139 590413 592946 600986 602385 599286 591005 583010 581650 582987 586970 591192
15289 591192 589034 591930 595017 595390 598717 605184 602897 599258 602650 601999 599638 598983 597035 598723 592429
15274 592429 593927 596071 585922 592533 603480 596568 590043 591945 595492 589564 585559 592421 599321 607410
15260 607410 614805 603101 602245 600641 590156 580992 587686 593120 596132 604503 600127 597045 602073 597571
15246 597571 588871 600313 602910 603890 607354 600064 600878 603200 607339 599147 602552 599675 597067 602130
15232 602130 608618 599750 596233 602646 608181 600306 598293 602904 602882 599706 597777 600689 598857 598672 603369
15217 603369 614210 611308 608262 610176 608713 616499 614453 609775 612186 612577 609070 605953 617554 612890
15203 612890 607080 603484 603593 605526 614808 617842 616143 609270 601521 606163 610728 607140 600999 603387
15189 603387 608427 606876 605941 607912 606795 601350 606626 602258 595991 601193 600797 605511 605193 602723 602490
15174 602490 603751 610180 616583 623559 614817 606880 611428 605210 604097 612479 619860 622635 615251 608978
15160 608978 605235 603217 613589 611625 604900 613243 616441 616371 609659 607630 612241 611397 618939 615667 605256
15145 605256 614308 615293 610946 616289 622996 621422 615913 616830 614914 615133 613304 613059 616091 611698 612858
15130 612858 623426 613791 611407 607387 614241 628473 621098 618026 619366 622930 613612 615347 610335 611146
15116 611146 609475 612282 613745 615827 618141 615591 620142 614872 613944 622246 626724 621542 614702 612383
15102 612383 626562 620924 620374 626419 629116 626764 630673 628912 622102 623128 614242 617131 617019 613020
15088 613020 607210 605501 612919 622349 617510 611629 613574 619508 628062 619476 614784 620649 618703 622594
15074 622594 621207 625223 623993 633847 635559 622194 622596 629860 624143 616695 617516 623022 619719 618948 620850
15059 620850 615567 626558 623441 617661 623951 633333 631551 629020 627052 627202 626058 621355 624870 625878
15045 625878 632086 630462 629579 626151 629159 625915 620287 628959 624601 621771 635343 639640 636597 628396
15031 628396 628981 634263 628642 629570 629001 625480 626873 631594 635018 639144 636913 636799 636127 640514 637946
15016 637946 634712 633376 628089 635851 642357 635540 632431 632323 632372 629674 635443 630353 623747 623596 622338
15001 622338 620037 627631 629686 636223 630848 634895 638883 639847 644082 639211 638662 636773 640979 642284 640800
14986 640800 642641 647700 643470 644440 639306 639928 640921 637528 638480 630383 628533 627090 630547 636386 631954
14971 631954 635997 641336 638319 633141 625955 629163 634088 639906 641007 637816 638015 635712 634199 642313
14957 642313 648732 639864 634490 639068 643358 641205 640216 638016 643659 645393 645955 635644 637403 641354
14943 641354 634082 643611 643019 638298 645077 644814 641706 643030 642158 643436 641721 641175 647066 644936 652636
14928 652636 652071 658182 651995 644624 644954 642580 647011 637850 646647 644619 643325 648598 648764 648654 652626
14913 652626 645096 641410 642473 640191 642686 646145 641759 645218 652243 646813 649403 655028 653092 656119
14899 656119 647757 650792 649923 637196 636877 646913 660581 655742 649632 651328 657186 651769 651801 655667
14885 655667 652035 651067 651099 652173 656345 652127 651043 652437 660738 659792 661075 653013 654280 652922 656570
14870 656570 656533 650183 647468 646303 655977 659737 654751 652953 647616 653063 657467 662139 658116 650692 657641
14855 657641 657577 664346 657081 662265 660407 661701 659012 660032 655641 657894 657604 651203 654869 655932 658744
14840 658744 659458 663744 663107 662665 651675 645142 651116 657282 661691 655817 655597 661040 656734 647014 645184
14825 645184 653333 652580 654222 653536 655767 652587 652980 661758 661750 663144 662462 662397 660346 662298 652940 653700 664027
14808 664027 659850 664661 670501 666625 659636 656618 658941 667053 675305 672087 659740 658051 661065 655875
14794 655875 664708 665696 657936 667411 663981 659682 662563 668182 668149 662200 655635 655938 664850 666523 661385
14779 661385 658306 657717 659862 663349 667085 667692 670564 665865 661703 658162 663809 671070 661120 660164 674514
14764 674514 670917 666841 670701 661242 664407 669230 669621 660023 667107 677660 670198 676938 679251 682293
14750 682293 675637 662100 660008 662938 669249 673286 671725 664434 670496 667363 662646 667401 667186 662758
14736 662758 664078 664099 669632 672787 676988 671587 674623 675499 671213 676038 675360 677678 673646 677311 674736
14721 674736 678647 682958 676268 670924 661042 668159 674134 676922 677476 669843 676302 676617 677393 686164 680333
14706 680333 679157 674338 672408 671750 669967 675854 677810 677671 683921 679892 671521 667193 676449 681496 683968
14691 683968 679009 684405 681645 677526 675212 670340 675597 676041 682127 683115 681331 683051 683800 671402 672760
14676 672760 679640 674980 679749 686568 681507 687906 689183 686676 687736 686276 676430 678949 686438 686336
14662 686336 685390 685761 689482 682402 679570 689128 698645 695796 687710 699174 697103 684183 685364 685339 683220
14647 683220 684564 683854 683743 674998 682124 684299 688828 685806 687724 695764 693812 689543 689319 695546 689809
14632 689809 679728 675177 688996 684625 689339 693166 691925 694657 694487 703368 702177 694259 693452 695305
14618 695305 689612 687248 693647 698194 700374 701497 691165 683931 685769 692187 694118 690401 695154 690663
14604 690663 687407 690133 691882 697708 689268 694641 690203 691066 690088 692643 695653 690739 687347 689555 690245
14589 690245 696498 695068 688572 692906 694268 695091 693374 692967 688961 696659 696681 696218 699453 699083 694868 691623
14573 691623 695279 695801 688935 682720 686176 695591 694907 703450 699680 706237 714860 705960 696754 694217 705124
14558 705124 706011 703927 698696 699349 703938 706395 705451 701723 711619 715959 710940 701561 700037 697746 700895
14543 700895 695168 704632 702094 698974 697552 697927 698373 694335 699376 703221 699634 698387 694854 702225 708980
14528 708980 710381 709466 707608 709723 705544 705877 705252 706688 703522 700047 692361 706458 709948 705576 711901
14513 711901 703738 700430 709813 706439 704627 709285 715976 716307 704677 704453 707164 707505 715392 712968 716401
14498 716401 716780 721243 709722 708844 708839 711757 704302 711980 711948 700401 707366 713942 711842 712240 726131
14483 726131 724233 713971 715454 710264 707241 718042 716299 708669 710123 716955 713965 716529 713398 717169
14469 717169 715466 716774 713553 715587 720070 718538 723091 717974 713207 719819 720384 720844 723404 721998 713478
14454 713478 713745 725097 713969 704239 722092 722567 719608 716094 708397 701179 708257 714985 712215 713652
14440 713652 721392 723608 717874 709819 714569 713997 718368 721021 724212 716953 711230 710250 714668 713127 715077
14425 715077 722093 715251 720291 723490 720826 715950 715076 711179 714171 718932 722377 719982 722143 720114
14411 720114 726085 725112 726909 733770 732352 729344 731531 730927 724402 720668 722903 718895 721361 719643 717609
14396 717609 727088 732534 733646 726774 722016 718125 715286 725915 729729 732755 724971 721215 730073 736270
14382 736270 737479 734329 725616 723293 733836 740066 731745 731562 729307 721442 718172 717313 729556 736463
14368 736463 731427 731931 726038 718967 731309 731632 730582 733793 736982 734959 735077 730969 728224 732980 741445
14353 741445 738106 732287 731851 733153 729815 726556 733308 741142 737477 742014 745705 731278 725363 728807
14339 728807 733451 730532 745910 740843 739134 743466 746644 747519 743873 741588 739253 735636 737118 742557
14325 742557 740513 729347 738698 741339 739825 745621 743914 737343 735679 741414 737379 735557 732069 731412
14311 731412 736351 731975 735539 740701 742141 742031 739219 737649 730068 736652 743121 740918 734202 742447
14297 742447 748589 746198 745688 748135 749964 745980 741260 749028 738642 748191 750107 742985 740689 736503
14283 736503 748609 750634 740691 743121 741006 740821 747986 743409 739605 742388 745294 743088 748049 748920
14269 748920 755894 752496 747163 743743 745859 752086 753791 745896 744734 747876 749456 752782 751169 746537
14255 746537 753555 765010 759237 752990 754846 759844 762660 766970 757523 758261 755502 748934 741396 747126
14241 747126 740126 740123 749958 754105 749413 753288 758158 758862 750592 755522 756777 753917 758234 760479 763135
14226 763135 765617 763026 760902 760755 759677 753954 758954 768637 762896 760892 757618 766050 761337 757339
14212 757339 755137 761792 770620 769500 761148 753086 757974 765011 764984 761017 757457 758888 754113 754973 759480
14197 759480 752904 763088 765916 755881 759502 764638 768694 765482 765013 759385 766313 767794 770062 769138
14183 769138 759195 761011 765977 767346 764511 764853 770431 768868 763903 756855 762988 761712 756757 764801
14169 764801 768188 766511 767581 773226 769177 759102 754195 756343 766235 770306 772848 765505 770547 774124
14155 774124 772351 771534 768853 771573 766091 767308 767816 755352 762659 766498 770510 773877 765280 764029
14141 764029 766770 762445 768837 766080 765429 768359 769723 767676 773902 775725 768326 768325 773193 780860 785214
14126 785214 783757 774424 776810 777191 772285 764206 763442 772673 772902 768434 766674 767108 780187 778219 770399
14111 770399 768124 768477 771370 775634 779560 782443 778905 775010 774554 776052 777948 780998 775954 770272 779410
14096 779410 789288 783966 783020 778785 779694 786347 795407 785536 778517 784287 782224 771052 772614 781777
14082 781777 790274 786325 784562 787155 786057 792585 788519 779980 778953 778689 781920 788934 789280 786844 784537
14067 784537 781186 786097 786585 785522 784806 783809 784147 783317 782122 784182 786405 785087 785328 786335 788663 782902
14051 782902 790074 784609 782414 784179 779196 781818 793335 785568 784802 790403 791404 785377 785490 790973
14037 790973 786135 787365 790965 797660 790953 790958 792804 794516 789231 784430 784375 788493 788528 798161 787521 787404
14021 787404 791861 786561 796159 807447 806559 802698 799248 796873 799721 801180 800287 792117 793587 797213
14007 797213 800991 800390 804078 802853 791175 797946 802115 797922 799391 797506 795321 791811 787065 798578
13993 798578 801861 800921 802076 803578 795776 791922 798936 804034 802839 796950 798038 799933 790828 792265
13979 792265 793984 793501 794297 795808 790626 792230 800015 795449 794914 798151 797578 797028 800200 795376 804573
13964 804573 791435 792958 798888 799464 804475 812133 810658 808447 802075 808732 799662 800824 805296 812033
13950 812033 813558 809745 810361 814506 812586 819034 817109 816454 816617 811412 817273 815264 815467 811971 813248
13935 813248 814077 817040 814496 811065 810145 810286 812189 806329 813695 821611 807706 799657 801166 805148 811465
13920 811465 814400 809140 813819 818964 820642 811673 812289 811422 816167 820650 811989 806634 820288 818666
13906 818666 815763 809704 813122 811913 814990 810271 808323 820238 817682 807847 810149 815007 814544 814352
13892 814352 820430 825619 830450 827197 821566 826380 822337 825388 819851 818920 828075 826265 819497 821635
13878 821635 819632 814939 807636 815990 819261 823321 823221 827219 824215 826487 824098 819623 821348 821233 820916
13863 820916 823598 816857 817452 818522 823857 830982 822670 824629 828416 830675 828721 832087 831325 827299 823856
13848 823856 819313 834406 832824 834202 833599 819861 823068 824887 830222 821374 825077 831378 832202 832452
13834 832452 830302 830541 828329 826113 829762 827870 832775 831280 827903 836358 840765 832664 832441 843375
13820 843375 845546 832076 829013 835945 843215 839547 830892 834495 837075 835694 838922 838733 839027 843718
13806 843718 848756 839670 847363 847608 851244 850964 847983 846396 847156 845795 836086 838562 845312 849838 842937
13791 842937 836849 844268 847791 841915 838609 829219 828232 833565 836649 838050 838280 845213 842190 835320 841158
13776 841158 841903 849123 844826 838351 838239 839555 840067 838350 837446 840509 844091 854864 851675 853360 852907
13761 852907 846684 840954 848004 848378 850130 855166 844103 850297 845820 846216 843905 842816 849423 847273
13747 847273 846331 846719 844872 842877 843759 842218 847779 846902 842910 848693 852758 846025 846288 847728 856534
13732 856534 856473 854291 854347 854914 848977 849205 858893 856319 859935 854438 854914 855223 863924 862327 849513 853057
13716 853057 853851 856059 860947 855454 855785 868027 871719 865183 857684 860432 856324 856031 857210 858039 854235
13701 854235 846603 849940 847257 851049 856439 852138 859118 866558 856808 858286 855404 849939 856957 861278
13687 861278 868241 856272 854257 853424 849868 857636 864977 863564 863118 861766 860091 867503 868038 861524 850188
13672 850188 858244 863585 865517 862888 859020 862702 862770 860042 865494 858762 863150 868175 859936 863571 861285
13657 861285 859759 862016 870803 861475 859125 869467 862993 868884 865123 862777 871895 868005 865291 856832
13643 856832 862239 864521 868123 864290 870180 871950 871671 867728 867498 876974 858160 859350 870270 871651
13629 871651 872436 877589 876875 872180 876558 863809 858534 861774 870821 874276 869799 871844 864706 867421
13615 867421 871734 872433 875329 869762 873204 874840 873884 879055 883840 880355 881676 886148 877545 876829 880194
13600 880194 881449 881010 874994 872341 873927 870468 878124 872772 871806 871400 868945 877173 881887 876733 865989
13585 865989 871146 881755 879008 883072 878997 880107 880197 878626 882884 889582 880455 883449 883993 891314 893464
13570 893464 887380 880829 879182 882367 888227 889084 885017 889661 887579 884120 892398 890011 880360 884712
13556 884712 885878 889932 895338 901076 892874 887580 887846 884666 889269 891564 887316 890798 891625 886526 885278
13541 885278 881312 886620 900412 892652 891831 891537 891761 894366 894317 899504 899371 902138 899499 897272 896487 894411
13525 894411 895284 893156 893843 888869 887912 896588 904059 900698 898835 890856 891060 890991 904105 903132 905111 905533
13509 905533 898655 901655 905336 911090 905643 903983 895308 897155 903769 893803 888655 897105 904789 907754
13495 907754 904935 900092 898171 894926 895198 902628 905921 901598 896981 899067 902371 904281 901064 900033
13481 900033 897653 907106 904025 902974 912205 910350 911014 909271 911980 903572 906164 909693 907343 896178
13467 896178 900010 907363 910272 900691 899304 898102 905518 913639 912687 911437 910287 918410 905670 908365
13453 908365 912911 913375 915136 916581 927678 922600 913059 911672 916108 914689 913255 912472 917287 918099 916415
13438 916415 918378 914391 908466 909319 916922 916658 918392 910602 907007 913000 921865 911767 912961 917422
13424 917422 916120 909156 907913 906887 916888 927518 920188 923112 920416 921267 918901 922174 914330 917352
13410 917352 927713 922489 920695 922477 918698 919082 921343 922870 927882 919429 921366 923156 927503 926847
13396 926847 929054 927642 927255 922822 916943 914619 921662 921336 915839 921824 932678 935580 928777 922181
13382 922181 926736 932618 930363 927907 932504 938375 932193 934616 938185 939535 936183 926682 926682 926698 929240
13367 929240 928853 928761 932877 935083 930220 926313 921012 925994 931174 927500 931509 937666 937402 936485 930225
13352 930225 923320 930608 927441 935011 937283 930509 933073 933863 938108 933999 933871 935559 936029 935810 938850
13337 938850 943491 948369 949019 947273 950484 954844 948006 945128 942721 933776 937478 935699 942659 943532 941623
13322 941623 942829 944851 942754 950920 945159 948776 947815 946869 948316 947309 949366 958850 955603 952928 940572
13307 940572 943096 948888 947197 944567 944083 947812 948429 949666 951234 949369 949787 944976 955365 958928 957413
13292 957413 963356 957419 951473 946821 953115 950315 954879 950672 949683 939272 948753 956239 955627 953279
13278 953279 960347 964516 962373 956396 951529 951799 965764 962290 955598 961450 955318 958771 966056 965379
13264 965379 963131 958851 958262 955536 955445 952105 950154 948590 957087 954723 960932 959985 953489 949712 961587
13249 961587 959214 960368 958584 954468 962580 958964 963135 967681 968490 958853 949484 951670 960251 969258
13235 969258 965934 965711 972851 963105 960953 964778 971134 961574 962221 963384 956748 957212 956341 959400 974375
13220 974375 973621 972775 968918 969494 971223 969506 967423 960656 959947 962943 977677 979802 968697 967850 964304
$$ [...]
##END NTUPLES=NMR SPECTRUM
##END=
