##TITLE=1H_EC-3296(X-2)
 CDCl3
 8 sc, 
 4.7.2023
##JCAMPDX= 6.0         $$ Bruker NMR JCAMP-DX V2.0
##DATA TYPE= NMR SPECTRUM
##DATA CLASS= NTUPLES
##ORIGIN= UXNMR, Bruker Analytische Messtechnik GmbH
##OWNER= root
$$ XWIN-NMR		Version 3.5
$$ Tue Jul  4 14:08:43 2023 Russian Standard Time (UT+4h)  she@DPX200
##.OBSERVE FREQUENCY= 200.13135
##.OBSERVE NUCLEUS= ^1H
##.ACQUISITION MODE= SIMULTANEOUS
##.ACQUISITION SCHEME= undefined
##.AVERAGES= 8
##.DIGITISER RES= 18
##SPECTROMETER/DATA SYSTEM= spect
##.PULSE SEQUENCE= zg30
##.SOLVENT NAME= CDCl3
##.SHIFT REFERENCE= (INTERNAL, CDCl3, 0, 15.7469)
##AUDIT TRAIL= $$ (NUMBER, WHEN, WHO, WHERE, WHAT)
$$ ##TITLE= Audit trail, XWIN-NMR		Version 3.5
$$ ##JCAMPDX= 5.01
$$ ##ORIGIN= Bruker BioSpin GmbH
$$ ##OWNER= she
$$ F:/spectra/data/she/nmr/H-F/1/pdata/1/auditp.txt
$$ ##AUDIT TRAIL=  $$ (NUMBER, WHEN, WHO, WHERE, WHAT)
(   1,<2023-07-04 14:07:33.10 +0400>,<she>,<DPX200>,
      <created by zg, POWCHK disabled, PULCHK disabled
       configuration hash MD5:
       00 E9 B6 7A A2 85 ED C7 34 08 36 98 17 FE 4E 26
       data hash MD5: 16K
       80 74 A7 E0 CC 44 06 F9 10 AC 80 CF C9 A6 4A 85>)
(   2,<2023-07-04 14:07:36.03 +0400>,<she>,<DPX200>,
      <Start of raw data processing
       efp BC_mod = 2 LB = 0.24 FT_mod = 6 PKNL = 1 PHC0 = -20628.93 PHC1 = 7.652719 SI = 16K 
       data hash MD5: 16K
       76 D7 D8 3E F6 50 9D 27 8C C2 BA 65 6D 40 85 61>)
(   3,<2023-07-04 14:07:54.67 +0400>,<she>,<DPX200>,
      <pk PHC0 = -0.3234496 PHC1 = 1.2 
       data hash MD5: 16K
       BC B3 17 65 81 F4 59 DD 90 C9 55 C7 85 33 27 0B>)
(   4,<2023-07-04 14:07:58.17 +0400>,<she>,<DPX200>,
      <abs ABSG = 5 
       data hash MD5: 16K
       18 21 CF EB 8D 90 A0 3C 1A EB A4 53 11 D7 EE FB>)
$$ ##END=
$$ 
$$ hash MD5
$$ 62 6A 11 DD 2B C4 39 77 88 03 3C FE C7 4B 85 39
##$RELAX= 
##$RELAX= 
##$RELAX= 
##$RELAX= 
##$RELAX= 
##$RELAX= 
$$ Bruker specific parameters
$$ --------------------------
##$DU= <F:/spectra>
##$EXPNO= 1
##$NAME= <H-F>
##$PROCNO= 1
##$TYPE= <nmr>
##$USER= <she>
##$AMP= (0..31)
100 100 100 100 100 100 100 100 100 100 100 100 100 100 100 100 100 100 
100 100 100 100 100 100 100 100 100 100 100 100 100 100 
##$AQSEQ= 0
##$AQ_mod= 1
##$AUNM= <au_zg>
##$AUTOPOS= <>
##$BF1= 200.13
##$BF2= 200.13
##$BF3= 200.13
##$BF4= 200.13
##$BF5= 200.13
##$BF6= 200.13
##$BF7= 200.13
##$BF8= 200.13
##$BYTORDA= 1
##$CFDGTYP= 0
##$CFRGTYP= 5
##$CHEMSTR= <none>
##$CNST= (0..31)
1 1 145 1 1 1 1 1 1 1 1 1 1 1 1 1 1 1 1 1 1 1 1 1 1 1 1 1 1 1 1 1 
##$CPDPRG= <>
##$CPDPRG1= <>
##$CPDPRG2= <>
##$CPDPRG3= <>
##$CPDPRG4= <mlev>
##$CPDPRG5= <mlev>
##$CPDPRG6= <mlev>
##$CPDPRG7= <mlev>
##$CPDPRG8= <mlev>
##$CPDPRGB= <>
##$CPDPRGT= <>
##$D= (0..31)
0 1.2 0 0 0 0 0 0 0 0.06 0 0.03 0 0 0 0 0.0002 0 0 0 0 0 0 0 0 0 0 0 0 
0 0 0 
##$DATE= 1688465252
##$DBL= (0..7)
120 120 120 120 120 120 120 120 
##$DBP= (0..7)
150 150 150 150 150 150 150 150 
##$DBP07= 0
##$DBPNAM0= <>
##$DBPNAM1= <>
##$DBPNAM2= <>
##$DBPNAM3= <>
##$DBPNAM4= <>
$$ [...]
##$SUBNAM3= <"">
##$SUBNAM4= <"">
##$SUBNAM5= <"">
##$SUBNAM6= <"">
##$SUBNAM7= <"">
##$SUBNAM8= <"">
##$SUBNAM9= <"">
##$SW= 18.05172834244
##$SWIBOX= (0..15)
0 0 2 0 0 0 0 0 0 0 0 0 0 0 0 0 
##$SW_h= 3612.71676300578
##$TD= 16384
##$TD0= 1
##$TE= 0
##$TE2= 300
##$TE3= 300
##$TEG= 300
##$TL= (0..7)
0 120 120 120 120 120 120 120 
##$TP= (0..7)
150 150 150 150 150 150 150 150 
##$TP07= 0
##$TPNAME0= <>
##$TPNAME1= <>
##$TPNAME2= <>
##$TPNAME3= <>
##$TPNAME4= <>
##$TPNAME5= <>
##$TPNAME6= <>
##$TPNAME7= <>
##$TPOAL= (0..7)
0.5 0.5 0.5 0.5 0.5 0.5 0.5 0.5 
##$TPOFFS= (0..7)
0 0 0 0 0 0 0 0 
##$TUNHIN= 0
##$TUNHOUT= 0
##$TUNXOUT= 0
##$USERA1= <user>
##$USERA2= <user>
##$USERA3= <user>
##$USERA4= <user>
##$USERA5= <user>
##$V9= 5
##$VALIST= <valist>
##$VCLIST= <CCCCCCCCCCCCCCC>
##$VD= 0
##$VDLIST= <DDDDDDDDDDDDDDD>
##$VPLIST= <PPPPPPPPPPPPPPP>
##$VTLIST= <TTTTTTTTTTTTTTT>
##$WBST= 1024
##$WBSW= 4
##$XGAIN= (0..3)
0 0 0 0 
##$XL= 0
##$YL= 0
##$YMAX_a= 428358
##$YMIN_a= -487154
##$ZGOPTNS= <>
##$ZL1= 120
##$ZL2= 120
##$ZL3= 120
##$ZL4= 120
##$ABSF1= 15.72155
##$ABSF2= -2.330299
##$ABSG= 5
##$ABSL= 3
##$ALPHA= 0
##$AQORDER= 0
##$ASSFAC= 0
##$ASSFACI= 0
##$ASSFACX= 0
##$ASSWID= 0
##$AUNMP= <proc_1d>
##$AZFE= 0.1
##$AZFW= 0.1
##$BCFW= 0
##$BC_mod= 2
##$BYTORDP= 0
##$COROFFS= 0
##$CY= -3
##$DATMOD= 1
##$DC= 0
##$DFILT= <>
##$DTYPP= 0
##$F1P= 0
##$F2P= 0
##$FCOR= 1
##$FTSIZE= 16384
##$FT_mod= 6
##$GAMMA= 0
##$GB= 0
##$INTBC= 1
##$INTSCL= 3.70164e-10
##$ISEN= 128
##$LB= 0.24
##$LEV0= 0
##$LPBIN= 0
##$MAXI= 10000
##$MC2= 0
##$MEAN= 0
##$ME_mod= 0
##$MI= 1.114404
##$NCOEF= 0
##$NC_proc= -6
##$NLEV= 6
##$NOISF1= 3.799351
##$NOISF2= 2.8
##$NSP= 0
##$NTH_PI= 0
##$NZP= 0
##$OFFSET= 15.74689
##$PC= 1
##$PHC0= -20629.25
##$PHC1= 8.852719
##$PH_mod= 1
##$PKNL= yes
##$PPARMOD= 0
##$PSCAL= 0
##$PSIGN= 0
##$REVERSE= no
##$SF= 200.13000493288
##$SI= 16384
##$SIGF1= 3
##$SIGF2= 2
##$SINO= 5.538805
##$SIOLD= 16384
##$SREGLST= <1H.CDCl3>
##$SSB= 0
##$STSI= 16384
##$STSR= 0
##$SW_p= 3612.71676300578
##$SYMM= 0
##$S_DEV= 0
##$TDeff= 16384
##$TDoff= 0
##$TI= <>
##$TILT= no
##$TM1= 0
##$TM2= 0
##$TOPLEV= 0
##$USERP1= <user>
##$USERP2= <user>
##$USERP3= <user>
##$USERP4= <user>
##$USERP5= <user>
##$WDW= 1
##$XDIM= 16384
##$YMAX_p= 515492610
##$YMIN_p= -447370
$$ End of Bruker specific parameters
$$ ---------------------------------
##NTUPLES= NMR SPECTRUM
##VAR_NAME=  FREQUENCY,     SPECTRUM/REAL,   SPECTRUM/IMAG
##SYMBOL=    X,             R,               I
##VAR_TYPE=  INDEPENDENT,   DEPENDENT,       DEPENDENT
##VAR_FORM=  AFFN,          ASDF,            ASDF
##VAR_DIM=   16384,         16384,           16384
##UNITS=     HZ,            ARBITRARY UNITS, ARBITRARY UNITS
##FACTOR=    0.220516191357247, 1,           1
##FIRST=     3151.42518699721, 0,            0
##LAST=      -461.291576008574, 0,           0
##MIN=       -461.291576008574, -447370,     0
##MAX=       3151.42518699721, 515492610,    0
$$ Real data points
##PAGE= N=1
##DATA TABLE= (X++(R..R)), XYDATA
$$ [...]
6336B398776R6928M4906J94264K03223J52567J11310J10699J28854K43001M10160
6326D094688K11745K41593K00454K38331J89119J28110J07397L6617K3875j05908
6316E366021j95907j24450q4603k31629j61251q7088j66698j27491r0922n6517
6306D039465l6686j1101J23918N641n5336K5777J47031J57888J90958L20292J73174
6295E081021K06042K42616J59905L97472L71820K73434L91075L55077L18622J91413
6285G988497J57563J01535P2710k7398j82803k02735l43037m15923m67641l66157
6275F314611n02514m15789m07010m23346k37000k74677l08084k26451k36030k68917
6265C014793j70833j71770k14667j01344r0310q7316k08549j11699r5202l5481
$$ y = [2398776, 2495704, 2540610, 2734874, 2938097, 3090664, 3201974, 3312673, 3441527, 3684528, 4094688, 4306433, 4548026, 4748480, 4986811, 5175930, 5304040, 5411437, 5448054, 5471929, 5366021, 5170114, 5045664, 4961061, 4729432, 4568181, 4481093, 4314395, 4186904, 4095982, 4039465, 4002779, 3991678, 4115596, 4121237, 4065901, 4091678, 4238709, 4396597, 4587555, 4907847, 5081021, 5287063, 5529679, 5689584, 6087056, 6458876, 6732310, 7123385, 7478462, 7797084, 7988497, 8146060, 8247595, 8320305, 8292907, 8110104, 7907369, 7564332, 7148409, 6680768, 6314611, 5812097, 5396308, 4989298, 4565952, 4328952, 4054275, 3746191, 3519740, 3283710, 3014793, 2843960, 2672190, 2457523, 2356179, 2265869, 2178553, 1970004, 1858305, 1763103, 1727622]
6255A727622p3080j45570m8461k0989p0456j50923l1451q2462j11611j8224K1071
6244I95466j16137p2275M6129Q0942r5066l3219j5138L5464l0712p133l358j17913
6232F67050j36639P5756N103o8983m0278R1014k7621o5896k6644k898J918M3272
6220E15154l5188j15668M4096p591p0699J7291m6676k1755j9677Q8853k7577j9490
6208C01073O1728j07522O688K2501n662j5326J12866p9295k3700j09743Q881k8799
6196A43690R4967N1025M1612l9583o833n3723o0885j02724L0755O8023M7577K0199
6184B34100L0277q7186R450j68949r578O0881M4582J05953n4260N9242j03927
6173A20585l2309R3790r5760N9738o2552q3286J70585l0780k1491j6351K0858
$$ y = [1727622, 1654542, 1508972, 1460511, 1439522, 1369066, 1218143, 1186692, 1104230, 992619, 974395, 995466, 879329, 807054, 853183, 934125, 839059, 805840, 790702, 826166, 795454, 788321, 784963, 667050, 530411, 606167, 611270, 542287, 502009, 593023, 565402, 499506, 472862, 469964, 471882, 515154, 479966, 364298, 408394, 400803, 330104, 347395, 300719, 278964, 259287, 348140, 320563, 301073, 362801, 255279, 261967, 284468, 278806, 263480, 376346, 297051, 273351, 163608, 172489, 143690, 238657, 289682, 331294, 291711, 284878, 231155, 170270, 67546, 98301, 166324, 213901, 234100, 264377, 177191, 186641, 17692, 8114, 68995, 113577, 219530, 165270, 224512, 120585, 88276, 182066, 86306, 146044, 83492, 206, 170791, 140011, 118520, 102169, 123027]
6162A23027q2814J3163J329O2352O8021L6360n2786p2678q2325K0778N6109j9861
6150G0675M1144k5896l7307L4909J4235K3098q6400l8186O8483l9465k9448O0980
6138E6822n5286K9289o5630R3132q4004j3354Q7396p1822k6060P3139K7939J569
6126E3130j50063O0699O4166n569O4193k2531o9897j096J52650k4023L9530P1689
6114B32878l7642p5971l1056j06167n8218J1486K2325P8012M6670J6316L527j4509
6102H7651O8173r2594J2783o1449q8313K2362l8973M9573L954P2646K3192m100
6090E4905m8358K2529L6239j53988p2162J66474Q223o1548M5997q0009N5986N2512
6078B6800N0341K919m7934j124l646j5128j2950j1825j9701N6L5064m4990M7394
$$ y = [123027, 40213, 53376, 54705, 117057, 185078, 221438, 168652, 95974, 13649, 34427, 90536, 70675, 111819, 85923, 48616, 83525, 97760, 120858, 34458, -3728, 64755, 25290, -4158, 56822, 1536, 30825, -34805, 58327, -25677, -39031, 48365, -23457, -49517, 23622, 51561, 53130, -96933, -36234, 27932, 22363, 86556, 64025, -5872, -6968, 145682, 121659, 161189, 232878, 195236, 119265, 88209, -17958, -76176, -64690, -42365, 35647, 82317, 98633, 102160, 87651, 155824, 63230, 76013, 14564, -73749, -51387, -90360, -40787, -36833, 35813, 59005, 54905, 6547, 29076, 65315, -88673, -160835, 5639, 13862, -47686, -1689, -81698, -25712, 26800, 77141, 80060, 32126, 31002, 27356, 12228, -722, -12547, -32248, -32192, 2872, -42118, 5276]
6065E276l1090J4609P014l8315k8528o214j0622o614L2841M0429k1476l6109P001
6052g1798o1694N851K5129M0582J7145L1921P7163k3781n9260p9416R17P0752
6040b6489J08530j22569m2689O6263L8544n1804m077k8070j06159L767M878Q9242
6028g0633N4353J17978m7452l6016j09384m1845m9067J00065J2327J6948J04010
6017E1284j09089j268J6791o8518m9709N1455J9889l5201J04775j5979j5443p3292
6005a24305M0494M9424l0799j0574k2044j8121M2787N1224m8813M0071q3097n1402
5993a65155L7704j06597P1029P7774O6357l3251K0479M5861r1763J2975r142m0496
5981a14225P8789k7484J4293N8678p8203K6594j21315Q4795K0099J740J11507
$$ y = [5276, -25814, -11205, -4191, -42506, -71034, -77248, -87870, -94484, -61643, -21214, -42690, -78799, -71798, -133492, -127641, -102512, -61930, -44785, -12864, 64299, 40518, -18742, -98158, -97241, -26489, 82041, -40528, -83217, -16954, 21590, -30214, -34291, -62361, -168520, -164753, -159875, -70633, -16280, 101698, 54246, 18230, -91154, -132999, -182066, -82001, -69674, -52726, 51284, -57805, -59073, -42282, -110800, -160509, -109054, -89165, -124366, -19591, -35570, -51013, -124305, -83811, -34387, -65186, -75760, -97804, -115925, -73138, -21914, -70727, -30656, -113753, -165155, -127451, -234048, -163019, -85245, -18888, -52139, -31660, 14201, -77562, -64587, -73729, -114225, -35436, -62920, -48627, 10051, -68152, -41558, -162873, -78078, -57979, -56239, 55268]
5970E5268j35j35453L9846L3972p2188K3824N6973M515l2280R2423O5034p2173
5958E9626k2908k0651K1641j0184K8074p6400m9154j4058o554J36173L9926j18100
5946c2569o9657O504n4432M7518L6208o0510k753J34389p580j10553M4525r9M2630
5933b6379q6536J2630P1805L0003p270J0904N1678j1953m5981n1584O6771p5313
5921f1225l1088M3667L393o7193J4799O5186Q6071O234J4281R2504j1012j92473
5909c6856l7347M4524o4962p7363R8781J17153l2054K7354j14401l9655P726k2621
5897a29721P9425P8450n082k3697Q981o42m4052K9908o5090J45076r0803r0837
5885a08084L9418n3293Q2676k6453R3646k443K5325J02438l0890k1085o5097J596
$$ y = [55268, 55133, -80320, -40474, -6502, -78690, -54866, 2107, 6622, -25658, 66765, 131799, 59626, 36718, 16067, 37708, 27524, 55598, -20802, -69956, -84014, -90568, 45605, 85531, -32569, -102226, -95722, -150154, -102636, -66428, -126938, -129691, 4698, -2882, -113435, -68910, -69009, -26379, -112915, -100285, -28480, 1523, -5747, 5157, 56835, 44882, -1099, -52683, 14088, -61225, -92313, -48646, -45253, -112446, -97647, -32461, 53610, 59844, 74125, 166629, 155617, -36856, -74203, -29679, -94641, -172004, -73223, 43930, 11876, 39230, -75171, -114826, -107100, -129721, -50296, 28154, 23072, -625, 8356, 7714, -36338, -6430, -71520, 73556, -17247, -108084, -68666, -121959, -39283, -65736, 27910, 25467, 50792, 153230, 122340, 101255, 36158, 37754]
5873C7754j3398j5354j4012N6861j13488r5139R2413M3645Q18m8125Q2521n639
5861H857n6017K6953P9333l1019k7460q9300J13543O5258O2498k5754l514j35083
5849a1705o162J14879M4562r2061n4950J24829O2607o5691P628k2509o0996L5934
5837G6365n2924m6877l1978N5077l9465Q4502J05247o3090M781K702L06j19435
5825b4789l2289L2356L9317J00313j4114L5085j01673r610l9747O8247M2672q4440
5813A1328J04268m4775l4633J9355R887j3609Q038n427M8726k6243o4010N2072
5801F4977J9066q5026J0306N7256P5559n8343K0948m1280j3809M8349K6511J2135
5789A36649j1380j635r5719N2690k2711Q5M878M6759Q0969j20917p8895J48038
$$ y = [37754, 24356, 9002, -5010, 51851, -61637, -156776, -64363, -20718, -19900, -68025, 14496, 8857, -47160, -20207, 59126, 28107, 647, -88653, 24890, 90148, 152646, 126892, 123378, -11705, -17867, 97012, 141574, 49513, -5437, 119392, 181999, 116308, 123936, 101427, 40431, 76365, 23441, -23436, -55414, -337, -39802, 44700, 149947, 86857, 91638, 94340, 94646, -24789, -57078, -24722, 14595, 114908, 100794, 135879, 34206, 24596, -15151, 53096, 95768, 11328, 115596, 70821, 36188, 55543, 65430, 51821, 59859, 54432, 103158, 76915, 12905, 64977, 84043, -983, 9323, 66579, 142138, 83795, 104743, 63463, 49654, 98003, 124514, 136649, 125269, 123634, 27915, 80605, 57894, 57979, 62857, 109616, 190585, 69668, -9227, 138811]
5777A38811l7953m1735P5588j2550j18469Q8349O052n98P7240j05466q6902J44101
5765A26468m6047J7902M5222j320N1651R9948j10103n1714N0621O422J3928j9891
5753A83087p1949P079l7349l2370O9780O1274n451O2526P8663j599j18337L6777
5741B32131J67278p4492j04920J6805l8867J85184Q912q1751m282j3198J1464
5730C04264o2347Q5346j3449J2510k1674M5053K5410M804P367J39687j0664o6735
5718D49572j9048J59904L933k7825j6630M4303j4904l1169Q5496O3614K5130q189
5706G14187k2505o324J60105j2866m7594N9705p0295J1218M6954p1873m250m6539
5694G09923K337P6740R7448K0988k2940j940p4771r055J47283N2939l1274L979
$$ y = [138811, 100858, 59123, 134711, 122161, 3692, 92041, 98093, 97495, 174735, 69269, -17633, 126468, 80421, 98323, 143545, 142225, 193876, 293824, 183721, 132007, 182628, 189050, 202978, 183087, 111138, 118217, 80868, 48498, 118278, 179552, 174101, 236627, 315290, 313691, 195354, 232131, 399409, 324917, 219997, 236802, 197935, 383119, 392031, 310280, 305998, 292800, 304264, 241917, 327263, 313814, 326324, 304650, 349703, 375113, 379917, 387284, 526971, 516307, 449572, 430524, 590428, 594361, 566536, 549906, 594209, 579305, 548136, 633632, 697246, 722376, 714187, 691682, 685358, 845463, 832597, 785003, 844708, 774413, 785631, 832585, 760712, 756462, 709923, 712260, 789000, 886448, 907436, 884496, 882556, 807785, 798730, 946013, 998952, 967678, 971657]
5682I71657L5346J406P1773k8060J0783l0064N6285O8010N2532O5672j3312O2648
5670A324676M7651Q0832p3234K9798K7841q5653P2363J38292n3616o4821j1445
5659A432684P5750L8215o3439m6198J03360k1527M5679P6892m618N2215J73613
5648A862626k31053p9370o6579j88988m8413l1144j27566n2052P4171N010L4073
5637A150715j05306O2926j10214n8844m0832J0034P9604K8245k0640l5604N4435
5626A014519M322l2106q3414k6175j01920R997n067q741Q5213k3706k0911J571
5614H13582n7164M4441k6360r0902J4547O4637l4414m5127q0478m3218k3165N6778
5602E93157O7092p4929l6945j03641M7335J0995n2257j0979Q0168r585R117n3319
$$ y = [971657, 1007003, 1008409, 1080182, 1052122, 1062905, 1032841, 1089126, 1157136, 1209668, 1275340, 1262028, 1324676, 1372327, 1453159, 1379925, 1409723, 1437564, 1351911, 1424274, 1562566, 1508950, 1444129, 1432684, 1508434, 1546649, 1483210, 1437012, 1540372, 1518845, 1564524, 1641416, 1636798, 1689013, 1862626, 1631573, 1552203, 1485624, 1296636, 1248223, 1217079, 1089513, 1037461, 1111632, 1116642, 1150715, 1045409, 1108335, 998121, 939277, 898445, 908479, 988083, 1016328, 995688, 960084, 1014519, 1018841, 986735, 903321, 877146, 775226, 785223, 780156, 771415, 856628, 832922, 812011, 813582, 756418, 800859, 774499, 683597, 698144, 762781, 728367, 683240, 602762, 559544, 536379, 593157, 660249, 585320, 548375, 444734, 492069, 503064, 450807, 439828, 519996, 510411, 519528, 466209]
5590D66209P3502p5548N856O4543p6671j4457N4470m3114n3036L1917J16937n7393
5578D93215r9628N110M463p2138l7485Q9418n859j5069l6609Q2772P2504k5882
5566D54812M150q823K1593m0638r6436J4876J83285N5221J4581l27r3313j5246
5554D93735n0157o7379l7104J13243J04076j3975n8110m152K5097O2348P5862
5543F43484N903K1354m3661N5323J0365r0079n0929K1419m0685n0457Q7950p3401
5531D96586Q1349K334L1320N8758J3127M893j0813L6303r2267k9717L1309O6238
5519F89420K9176o7620l8565K4545J1883R795k3219M2032M5046m3456K763q853
5507F72947q438k8671L325L5854o7591K5179l5451j7841M5164J5700p1461k9441
$$ y = [466209, 539711, 464163, 470019, 534562, 457891, 443434, 497904, 454790, 401754, 433671, 550608, 493215, 393587, 398697, 403160, 331022, 293537, 382955, 377096, 362027, 325418, 408190, 480694, 454812, 458962, 450139, 471732, 431094, 334658, 349534, 532819, 588040, 602621, 602294, 508981, 493735, 443578, 376199, 339095, 452338, 556414, 542439, 484329, 480177, 505274, 567622, 643484, 649387, 670741, 627080, 682403, 692768, 602689, 551760, 573179, 532494, 482037, 569987, 496586, 577935, 580269, 611589, 670347, 683474, 688367, 677554, 713857, 621590, 591873, 623182, 689420, 718596, 650976, 612411, 636956, 648839, 658634, 635415, 677447, 722493, 679037, 681800, 672947, 664509, 635838, 639163, 675017, 607426, 632605, 597154, 579313, 624477, 640177, 568716, 539275]
5495E39275L1144J082l4427J1010Q0193n1962J675M5251m5738n5560J4992k3574
5483E13361J243P125q3807n4355M4855Q9389J17796M348j5550j2993O1707J7678
5471F90797l8977j51906n576L9384Q1920N9839N0171M2470n6614j3651j6145N6421
5459G38133m3485P9294N5723n1129n2580o2232O1623O1146j2373n3958O3505k0986
5447G62681N3727o7814k5658J46076N0179r597l2610J5501L9285p7823Q1335j2404
5435I22878j6079N1734R2079R9863k8711k5043L3876P456k744L7617o7593M7316
5423A152649J44413r003o9534q677n626Q5860j19272J1447j9658K9059Q4117K9933
5411A305708k6149L3888p6598p2532J3859J23221p6394m3866n2552L2667J3619
$$ y = [539275, 570419, 571501, 537074, 548084, 628277, 576315, 577990, 623241, 577503, 521943, 536935, 513361, 514604, 521729, 437922, 383567, 428422, 517811, 635607, 639955, 624405, 611412, 673119, 690797, 651820, 499914, 494338, 533722, 615642, 675481, 725652, 768122, 711508, 697857, 681712, 738133, 694648, 773942, 829665, 778536, 725956, 663724, 725347, 786493, 774120, 720162, 783667, 762681, 816408, 748594, 722936, 869012, 919191, 909594, 876984, 892485, 931770, 853947, 935282, 922878, 906799, 958533, 1050612, 1150475, 1121764, 1096721, 1130597, 1138053, 1135309, 1172926, 1105333, 1152649, 1297062, 1288059, 1218525, 1209848, 1204222, 1290082, 1170810, 1182257, 1162599, 1191658, 1275775, 1305708, 1279559, 1313447, 1236849, 1164317, 1178176, 1301397, 1225003, 1181137, 1128585, 1161252, 1174871]
5400A174871m9914L4874O9218M3675l8960L9075M4957M7102r320j0705n5452p7918
5388A211503M5762m3888J7726k7245m4044K5368o6184Q2158j7104n0412q9263
5377A044377j29762M4075L664j74786J35006J10029n1994o4067N2008n5165Q1363
5366I94748R67n6138K6731J3165m4269o6674j823M1972O1752n0390j7804j1532
5354H90705p7593o2814J6391K6913K6721l5977p2583k8320O4161n5921r9158J5889
5342F08414j3322J10016R5625j2734K7334J6354r2880q2386k220J09896M0942
5331H05039j11426m570J785M2366M9126k938p344j36446m8818K14708r9886p5872
5319F25724j0934M4420j7357k7276O9191J6554j11967r0935Q6335M2096k2183
$$ y = [1174871, 1124957, 1159831, 1229049, 1272724, 1233764, 1272839, 1317796, 1364898, 1355578, 1344873, 1289421, 1211503, 1257265, 1213377, 1231103, 1203858, 1159814, 1185182, 1118998, 1201156, 1184052, 1133640, 1044377, 914615, 958690, 962354, 787568, 922574, 1032603, 980609, 916542, 968550, 913385, 994748, 995715, 939577, 966308, 979473, 935204, 868530, 866707, 908679, 970431, 920041, 902237, 890705, 813112, 750298, 766689, 793602, 820323, 784346, 711763, 683443, 747604, 691683, 592525, 608414, 595092, 705108, 800733, 787999, 815333, 831687, 738807, 656421, 654201, 764097, 805039, 693613, 689043, 690828, 733194, 782320, 779382, 772038, 635592, 586774, 801482, 701596, 625724, 614790, 659210, 641853, 614577, 683768, 700322, 588355, 497420, 583755, 625851, 603668]
5308F03668P4963q123O9153K327r2078O1477J2300k145L1107j5230p9412O9796
5296G27803M636m8795M4501N5036n9911l8306J9418N8726L7733q5216p939J70668
5284H78354q0475r7157k091n6385K8418N4107o282K0262l9840m180j1588p6414
5272F06729J4686P9682L044j1932J63889J38053j19064p4851J4260m3926n1393
5261G19177k1121J3982J6982m3121M0527O8940Q848M5215L197p2275p4701M3611
5249G49261p327j4399P975r976M0851N3208J454q7636N1926P7830O4085L0527
5237I57779r7003o0978J7607K644K3380q0737K4693n3608k7632L2873m886M5781
5225G79913n4960k2572L5336L9186k5401P3626J1738K4653k1824n5408O1071O3115
$$ y = [603668, 678631, 670508, 739661, 741988, 649910, 711387, 723687, 721542, 752649, 737419, 658007, 727803, 732439, 683644, 728145, 783181, 723270, 684964, 704382, 763108, 800841, 715625, 707686, 878354, 797879, 700722, 698631, 642246, 670664, 724771, 718489, 738751, 698911, 694731, 683143, 606729, 621415, 701097, 704141, 692209, 856098, 994151, 875087, 800236, 814496, 770570, 719177, 698056, 712038, 729020, 685899, 726426, 795366, 804214, 849429, 852626, 780351, 705650, 749261, 741934, 727535, 735510, 725534, 766385, 819593, 821047, 733411, 785337, 863167, 927252, 957779, 860776, 799798, 817405, 820049, 843429, 762692, 787385, 733777, 706145, 739018, 734132, 779913, 724953, 702381, 737717, 776903, 751502, 825128, 836866, 861519, 839695, 784287, 845358, 908473]
5213I08473j4115J3268j5741j23952n381O148J20066l3347O0398j7903p4118O9410
5201H93206k3877j27010m4202R7371N0714J53015q8482J8080n9552Q8732j6107
5190I41888M2682P7611o5844j0274J2040j00038O8796J32486J2684L5271J13985
5179A261287M6017m6488l3502J01239l6926m9904J02946J16048L871n3793Q989
5168A419784j9186P0732q2599m9135j343J144q0909j17664k8916M9248j25088
5157A036068R8144J9407k26671O8179k4430K0882Q7682j22079o2869J08754R89
5146A004056p637o0710r8815O3170o3437r1546j2895J28168o6111Q3345J2525
5135H90113j25422m4419j1003n9094j09020N1804J71012k3331j1258q098L0572
$$ y = [908473, 894358, 907626, 891885, 767933, 762552, 768700, 888766, 855419, 915817, 897914, 823796, 893206, 869329, 742319, 698117, 795488, 846202, 999217, 910735, 928815, 869263, 957995, 941888, 984570, 1062181, 996337, 986063, 998103, 898065, 966861, 1099347, 1112031, 1147302, 1261287, 1307304, 1260816, 1227314, 1328553, 1291627, 1241723, 1344669, 1460717, 1464588, 1410795, 1419784, 1400598, 1471330, 1388731, 1339596, 1338253, 1339397, 1258488, 1140824, 1111908, 1161156, 1036068, 1134212, 1153619, 926948, 995127, 970697, 991579, 1079261, 957182, 894313, 1003067, 1004056, 996419, 935709, 836894, 900064, 836627, 745081, 732186, 860354, 794243, 877588, 890113, 764691, 720272, 709269, 650175, 541155, 592959, 763971, 740640, 729382, 721284, 751856]
5124G51856m360L7570O813k8581O4460k451o2496L8436j2338j8128K4781o1610
5112G33952J7702N5180M718O7027l6983r8l4946j00907M5314o5836k5402M7572
5100G07293P5522o4969O676N7061j1227K5529j9395r045J26740l8469L2009o9700
5088H18025r396k1757m4169m4285Q0286L4285N1645J24052L4067j03741j47815
5077G71197Q9888J26064j3516n4376O537m9577q0015J22875k3384m1533J49803
5066A003963m944q5465n5743J33383L6360m1455r5648J0458J30788M088j8124
5055A017661O2479P3944K1450L4179m4439l2795j5918j13782N6293J35019m3336
5044A150755p6595j7610o781Q7856P0135k4414K2219m442n6544m4815O001N9895
$$ y = [751856, 747496, 785066, 791879, 763298, 827758, 825307, 762811, 801247, 788909, 770781, 795562, 733952, 751654, 806834, 811552, 878579, 841596, 841498, 806552, 705645, 750959, 685123, 659721, 707293, 782815, 717846, 724522, 781583, 770356, 795885, 776490, 767445, 894185, 855716, 887725, 818025, 808629, 786872, 742703, 698418, 778704, 812989, 864634, 988686, 1022753, 919012, 771197, 861085, 987149, 973633, 919257, 925794, 876217, 796202, 919077, 895693, 854160, 1003963, 999019, 913554, 857811, 991194, 1027554, 986099, 890451, 900909, 1031697, 1035785, 1017661, 1080140, 1154084, 1175534, 1209713, 1165274, 1132479, 1116561, 1002779, 1059072, 1194091, 1150755, 1074160, 1056550, 1049769, 1137625, 1207760, 1183346, 1205565, 1201123, 1144579, 1099764, 1105765, 1165660]
5032A165660k0639j0428J26635n2986k2745M0107L0535J09939p362O0957N3550
5021A473223r4515n7946J21762L946K6481L5572O1608o7460L9908k8021M6429
5010A560987K5906k5823Q9452l6172j12935L6306Q5096m365O8352n6393K3916
4999A654327K7626L846m1625L8657J6018J93968j286j51497j3338J6307N2810
4988A795813k1621o7774n3839k3522P6802K70m0003M3448Q2720k4011j13697k8974
4976A625612p1317l4547J0034n5209M0214N1012J03812L0617j08464L7010k7907
4965A600867L1451P084l4432p0151P1129J15448J4549j01754L4567J04348J3636
4954A786742k6607J8490J46379q4751q2336J67431Q5319k4162j9248K3351L2318
$$ y = [1165660, 1145021, 1134593, 1261228, 1208242, 1185497, 1225604, 1256139, 1366078, 1358716, 1419673, 1473223, 1378708, 1320762, 1442524, 1446470, 1472951, 1508523, 1570131, 1502671, 1542579, 1514558, 1560987, 1586893, 1561070, 1650522, 1614350, 1501415, 1537721, 1622817, 1618452, 1686804, 1630411, 1654327, 1681953, 1685799, 1644174, 1682831, 1698849, 1892817, 1891531, 1740034, 1726696, 1743003, 1795813, 1774192, 1706418, 1652579, 1629057, 1705859, 1706129, 1666126, 1709574, 1792294, 1768283, 1654586, 1625612, 1554295, 1519748, 1529782, 1474573, 1514787, 1565799, 1669611, 1700228, 1591764, 1628774, 1600867, 1632318, 1639402, 1604970, 1534819, 1605948, 1721396, 1735945, 1634191, 1668758, 1773106, 1786742, 1760135, 1778625, 1925004, 1840253, 1757917, 1925348, 2010667, 1986505, 1967257, 1990608, 2022926]
4943B022926Q9608l3923k1951j2587N2939K7039n0405N1483R6752N8007M2103
4932B321991q9910M8876Q2197L8918l0541J3254Q8352L9826J06788o3094P9432
4921B636089Q402R833r1321q5946p1606J07827L7275p9492m9375M9595k5264O0454
4909B506471N2204J8585r2389L4285j8311K2554r476n4089L6804j015M4941O4178
4897B604742N6060n4153N1498K9944J144m6418O063Q8256l7733l779P6915M1072
4885B813611O4904K9930l0794o4326R2622J00426L2397J5820J28164J64833M6880
4874C394467L1633L2981O9583Q3624O4276L9614M6384J81005J15697K6158O2705
4863D148127J11607O6764J80971J9430R8256K3569J13559J70678N3726L1434K28484
$$ y = [2022926, 2112534, 2078611, 2056660, 2044073, 2097012, 2124051, 2073646, 2125129, 2221881, 2279888, 2321991, 2232081, 2280957, 2363154, 2402072, 2371531, 2384785, 2473137, 2512963, 2619751, 2556657, 2636089, 2644491, 2654324, 2563003, 2477057, 2405451, 2513278, 2550553, 2471061, 2421686, 2471281, 2446017, 2506471, 2558675, 2577260, 2484871, 2519156, 2500845, 2523399, 2513923, 2459834, 2496638, 2495623, 2540564, 2604742, 2660802, 2606649, 2658147, 2688091, 2689235, 2642817, 2648880, 2737136, 2699403, 2695624, 2772539, 2813611, 2878515, 2908445, 2877651, 2813325, 2905947, 3006373, 3038770, 3054590, 3182754, 3347587, 3394467, 3426100, 3459081, 3528664, 3612288, 3676564, 3716178, 3762562, 3943567, 4059264, 4085422, 4148127, 4259734, 4326498, 4507469, 4526899, 4625155, 4648724, 4762283, 4932961, 4986687, 5018121, 5246605]
4852E246605M5947J82328J70402M4603L6024K01543J90968N8117J92544R6945
4842F466026J26734M2759J77007J89969J74162J47632J13249M3075J13888J72838
4832G767339K69400J51824P7136J35817K27248J66067J18022R0632K33122J60104
4822I396711N4774J57232K36564J86131J25733M3698J04003J48987L8281J26763
4812A0618877K07807J67957J04760R418J4561J22674K13407J43657K2161N9716
4802A1684995j587K04137J02654J11567J78430J02276Q8587K30023J70028K24132
4792A3095242J08047N5235J57287J67871J00966Q3909K08746J98763J39306J68250
4782A4483622O5308P8230J48565J47905J92715O0967J35816P1056K24491J47493
$$ y = [5246605, 5292552, 5474880, 5645282, 5689885, 5725909, 5927452, 6118420, 6176537, 6369081, 6466026, 6592760, 6635519, 6812526, 7002495, 7176657, 7324289, 7437538, 7480613, 7594501, 7767339, 8036739, 8188563, 8265699, 8401516, 8628764, 8794831, 8912853, 9003485, 9236607, 9396711, 9451485, 9608717, 9845281, 10031412, 10157145, 10200843, 10304846, 10453833, 10492114, 10618877, 10826684, 10994641, 11099401, 11108819, 11123380, 11246054, 11459461, 11603118, 11625279, 11684995, 11683408, 11887545, 11990199, 12101766, 12280196, 12382472, 12471059, 12701082, 12871110, 13095242, 13203289, 13258524, 13415811, 13583682, 13684648, 13768557, 13977303, 14176066, 14315372, 14483622, 14548930, 14627160, 14775725, 14923630, 15116345, 15177312, 15313128, 15384184, 15608675, 15756168]
4772A5756168J8126J37021J22742R2250Q1432N0867J12084J64268J18069J45271
4762A6798298J93863J9723J25497J49050O7228K2380J80309J42982J02247J10074
4752A7911651J62841J29583R8054J17830K61512K31492J83494J86488J51185J58481
4742A9592611K68823J26854J80659K57084J80231K81359K10916J96337K89771
4733B1584645K54283K31835K59503L51259L31296K80477L83327M17207M51268
4724B4545100L48474M12167N97302O88608O71167P43102Q64002J015470J165613
4715C1051005J308149J402596J717257J775522J984554K240510K459422K757896
4707D6696911K831793K824457K890045K928054K852670K666324K560296J869431
$$ y = [15756168, 15774294, 15911315, 16034057, 16126307, 16207739, 16258606, 16370690, 16534958, 16653027, 16798298, 16992161, 17011884, 17137381, 17286431, 17353659, 17376039, 17556348, 17699330, 17801577, 17911651, 18074492, 18204075, 18302129, 18419959, 18681471, 18912963, 19096457, 19282945, 19434130, 19592611, 19861434, 19988288, 20168947, 20426031, 20606262, 20887621, 21098537, 21294874, 21584645, 21838928, 22070763, 22330266, 22681525, 23012821, 23293298, 23676625, 24093832, 24545100, 24893574, 25305741, 25903043, 26591651, 27262818, 28005920, 28869922, 29885392, 31051005, 32359154, 33761750, 35479007, 37254529, 39239083, 41479593, 43939015, 46696911, 49528704, 52353161, 55243206, 58171260, 61023930, 63690254, 66250550, 68119981]
4699F8119981J131831J0195j121087k204809k959750l570008l858865l821245
4691E1726243l766307l502610l323726k722876k420352k291131j961877j658286
4683C0079078j480117j305661j151185j078114r28315p39275o78522o39660o98653
4674B1379576n37411m62757l19119k79954l46541k69402k16970j02870k24580
4665A8619972r1943J8960n1182N9851R3804J22560J87316J54139L10762K20645
4655A9644884L02712M38281N71026N58329O78526P98467Q24694J059858J112996
4646B5989773J465864J506917J545939J798543K071400K193729K441510K535196
4638D1548871K600389K594221K564762K360629K204337J964707J429093N42122
$$ y = [68119981, 69251812, 69262007, 68140920, 65936111, 62976361, 59406353, 55547488, 51726243, 47959936, 44457326, 41133600, 38410724, 35990372, 33699241, 31737364, 30079078, 28598961, 27293300, 26142115, 25064001, 24135686, 23396411, 22717889, 22078229, 21379576, 20842165, 20379408, 20060289, 19780335, 19433794, 19164392, 18947422, 18844552, 18619972, 18528029, 18546989, 18495807, 18555658, 18649462, 18772022, 18959338, 19113477, 19424239, 19644884, 19947596, 20385877, 20956903, 21515232, 22193758, 22992225, 23816919, 24876777, 25989773, 27455637, 28962554, 30508493, 32307036, 34378436, 36572165, 39013675, 41548871, 44149260, 46743481, 49308243, 51668872, 53873209, 55837916, 57267009, 57809131]
4630E7809131p9392j032180j950699k483183k974838l305552l361455l144935
4622C9476897l060133k951575k600542k310649k042595j873877j683072j434472
4614B1519982j329866j157174j073309r86926p77285q50291o95715n98462o14519
4605A3436435n75699n99658m95159m08742m38963l92335k36034l54172j98048
4596I737625l72007l74273j79120j02021j88858k23466k36451j14874j35676l6955
4586G773924j93885j7403k6886j55046r6933k5015j46408k8066n6199j0494j8034
4575F999555o13l1585l6138P9744j56610p8064j35508r3019K376j38537j43641
4564F267960p4189p6382j04130o0547j13552p2958r8381q7293m9432n2808m9947
$$ y = [57809131, 57729739, 56697559, 54746860, 52263677, 49288839, 45983287, 42621832, 39476897, 36416764, 33465189, 30864647, 28553998, 26511403, 24637526, 22954454, 21519982, 20190116, 19032942, 17959633, 16972707, 16195422, 15345131, 14649416, 14050954, 13436435, 12860736, 12261078, 11765919, 11357177, 10918214, 10525879, 10289845, 9935673, 9737625, 9365618, 8991345, 8812225, 8710204, 8521346, 8297880, 8061429, 7946555, 7810879, 7773924, 7580039, 7562636, 7535750, 7380704, 7283771, 7258756, 7112348, 7084282, 7028083, 7017589, 6999555, 6998942, 6967357, 6931219, 7010963, 6854353, 6776289, 6640781, 6547762, 6550138, 6411601, 6267960, 6193771, 6117389, 6013259, 5952712, 5839160, 5766202, 5667821, 5580528, 5531096, 5478288, 5428341]
4553E428341n3529J6489r962J1895j75958j03478m7110J41489O1949j43333r9077
4542E027716Q9154r2806p6729J11083K3098n1449Q3357j5307n6134M5572l7620
4531E049935k2303N4697j77986q8215O447l9666j51185k9226p2987k9846r5155
4520D404510j47466j53511n7524L6429J8259j05135q3471l1909j59408j2976k9345
4509C678453J7878j7371k10529P722Q3380l4567p7181n1290M9752K7362j5891
4498C457718n502j0617j26790m2480J16993K7122j32403K9281l2971P0562L1189
4487C382102K4711o0905K8407P5353o0128q3918L2649J5997o2572N7529J58203
4476C507428k8608l0704Q6376M909L153j18628J9179Q7465l3691p0175L1447l5090
$$ y = [5428341, 5374812, 5391301, 5381339, 5393234, 5217276, 5113798, 5066688, 5208177, 5270126, 5126793, 5027716, 5116870, 5024064, 4947335, 5058418, 5081516, 5030067, 5113424, 5098117, 5041983, 5087555, 5049935, 5027632, 5082329, 4904343, 4816128, 4822575, 4782909, 4631724, 4602498, 4529511, 4499665, 4404510, 4257044, 4103533, 4046009, 4082438, 4100697, 3995562, 3912091, 3880182, 3720774, 3707798, 3678453, 3696331, 3678960, 3468431, 3476153, 3559533, 3524966, 3447785, 3396495, 3446247, 3473609, 3457718, 3452216, 3441599, 3314809, 3272329, 3389322, 3416444, 3284041, 3313322, 3280351, 3350913, 3382102, 3406813, 3345908, 3374315, 3449668, 3389540, 3305622, 3338271, 3354268, 3291696, 3349225, 3507428, 3478820, 3448116, 3534492, 3539401, 3542554, 3423926, 3443105, 3530570, 3496879, 3426704, 3458151, 3423061]
4464C423061N7927P9405m2105N1639m4540Q7435J23406m3444o9342l2467N3240
4453C644215P447K7122P0975K7059N1030K0425Q6773r9066J3220P1203Q7744r9152
4441C908995L6758Q3634n1826N1754M2339J14988l554O2589k8689J06114K255
4430D325357k6352Q5665O2169Q9571M2730L935J0851N2655J18133l977j25661
4419D635076J17098M7740j5472p2213R3831K8499p9118J5499K7169l7522l0610
4408D729977M9544p066P5727j13285n1472k5478j1901n1136M1223L9463n6712
4397D618884O3454k772r8601J10282P0974k8376J51668M3935l184L5041l467r057
4385D948781Q3090O7668L0646o7610J2793J01853L5988j9018K4674J62735K0909
$$ y = [3423061, 3480988, 3560393, 3518288, 3569927, 3525387, 3612822, 3736228, 3692784, 3623442, 3590975, 3644215, 3651662, 3678784, 3749759, 3776818, 3827848, 3848273, 3935046, 3835980, 3849200, 3920403, 4008147, 3908995, 3945753, 4029387, 3977561, 4029315, 4071654, 4186642, 4183088, 4245677, 4216988, 4323102, 4325357, 4299005, 4384670, 4446839, 4536410, 4579140, 4583075, 4593926, 4646581, 4764714, 4760737, 4635076, 4752174, 4799914, 4784442, 4712229, 4806060, 4834559, 4755441, 4770940, 4798109, 4760587, 4729977, 4779521, 4772455, 4848182, 4734897, 4683425, 4657947, 4646046, 4594910, 4636133, 4675596, 4618884, 4682338, 4679566, 4580965, 4691247, 4762221, 4733845, 4885513, 4929448, 4926264, 4961305, 4957838, 4948781, 5031871, 5099539, 5130185, 5062575, 5075368, 5177221, 5213209, 5194191, 5218865, 5381600, 5402509]
4374E402509q8072K674N6678J08921N6464j9662P7522o9982J5720J7317m8123
4363E511966Q3991Q2267N678j21419J09722K7783M8049m0672n2175m029o229J8359
4351E663291k0149M2471J5033J33549M7847q8771p350J13840k0079p370l7565
4340E834747J40141Q9952j47391M3911J31180K15266M9037n4325J21960R2471
4330F516949Q3843M1249J53880J52328M1731P9586M8452Q8062J65715O3919J20138
4319G555852J29041M5710Q1956M9180J92825J33233J18497J4689n941J28814J05102
4308H548958J62438l8411p9698P0716N5303o087j11810L4137N9616P2260M1218
4297H808640m8373N5584O7634P4364P464J6415P1638J1294P8110J20277N3647
$$ y = [5402509, 5314437, 5317111, 5373789, 5482710, 5539174, 5519512, 5597034, 5527052, 5542772, 5560089, 5511966, 5595957, 5678224, 5683902, 5562483, 5672205, 5699988, 5748037, 5707365, 5655190, 5651161, 5644932, 5663291, 5643142, 5685613, 5700646, 5834195, 5882042, 5793271, 5785921, 5899761, 5879682, 5872312, 5834747, 5974888, 6064840, 5917449, 5961360, 6092540, 6307806, 6356843, 6302518, 6424478, 6516949, 6600792, 6642041, 6795921, 6948249, 6989980, 7069566, 7118018, 7206080, 7371795, 7435714, 7555852, 7684893, 7730603, 7812559, 7861739, 8054564, 8187797, 8306294, 8320983, 8315042, 8443856, 8548958, 8711396, 8672985, 8593287, 8664003, 8719306, 8713219, 8601409, 8635546, 8695162, 8767422, 8808640, 8760267, 8815851, 8883485, 8957849, 8965313, 8981728, 9053366, 9064660, 9142770, 9263047, 9316694]
4286I316694j1117m9485O330J4891O0835m1788L8830k6263P4947O2415r4166j56827
4274I195296J33506P0003M5856q0491m6599J6559m0798k8827o5084J31326q6513
4263I244234J04443j5702n6519J04617q9820j25739O461Q247J58301n8232q5007
4252I195284Q8882j18811j31722N9527O5043J9248o2409N7955L6310L9947N5359
4241I304613j8371j06249k6079P045M5999N3042l1017Q3052M3989M9919K6042
4230I431985j0998J9797m4414L4641J19049O9222R3754o602K2585R2456M2445
4219I863920R7971O3621O0490J22553J07190J31902M6992M5792J28227J86304
4209A0854962J23091J31363J00441R0692R0767P0264J31370O7305l200J82941
$$ y = [9316694, 9305577, 9256092, 9262422, 9277313, 9338148, 9296360, 9335190, 9308927, 9383874, 9446289, 9352123, 9195296, 9328802, 9398805, 9444661, 9364170, 9317571, 9334130, 9293332, 9264505, 9199421, 9330747, 9244234, 9348677, 9332975, 9276456, 9381073, 9291253, 9165514, 9171975, 9180222, 9338523, 9280291, 9195284, 9284166, 9165355, 9033633, 9093160, 9158203, 9177451, 9115042, 9172997, 9209307, 9249254, 9304613, 9286242, 9179993, 9153914, 9160959, 9206958, 9260000, 9228983, 9312035, 9356024, 9405943, 9431985, 9420987, 9440784, 9396370, 9431011, 9550060, 9619282, 9713036, 9706434, 9729019, 9821475, 9863920, 9961891, 10025512, 10086002, 10208555, 10315745, 10447647, 10494639, 10540431, 10668658, 10854962, 10978053, 11109416, 11209857, 11300549, 11391316, 11461580, 11592950, 11660255, 11657055, 11839996]
4199A1839996R9317J32678Q6413R9349K41673K50354J05241J58582J35148K60666
4189A3409417K84596M4527K58899K80095K56642K13883K40332K58883J64020J93535
4179A5604829L39090L55114L83108K61146M54362M19477L63927L56377M82349
4170A9019779N09178O37626N79736L72996M13656N33437N82179O55627O34309
4161B3938523N44535M47298M69638N22891O01899M62108N31882M52291M72493
4152B8443558N33137N21027N46691M16739N01814M25563N00049N29748M27410
4143C2845736M47918N10211K84273K93081M04614K71655J73467K54409J95482
4134C5680846K80588K47735K24350K20634J89469Q1502K72177K37779K73009M06301
$$ y = [11839996, 11939313, 12071991, 12158404, 12257753, 12499426, 12749780, 12855021, 13013603, 13148751, 13409417, 13694013, 13738540, 13997439, 14277534, 14534176, 14748059, 14988391, 15247274, 15411294, 15604829, 15943919, 16299033, 16682141, 16943287, 17397649, 17817126, 18181053, 18537430, 19019779, 19528957, 20166583, 20746319, 21119315, 21532971, 22066408, 22648587, 23304214, 23938523, 24483058, 24930356, 25399994, 25922885, 26524784, 26986892, 27518774, 27971065, 28443558, 28976695, 29497722, 30044413, 30461152, 30962966, 31388529, 31888578, 32418326, 32845736, 33293654, 33803865, 34088138, 34381219, 34785833, 35057488, 35230955, 35485364, 35680846, 35961434, 36209169, 36433519, 36654153, 36843622, 36925124, 37197301, 37435080, 37708089, 38114390]
4124C8114390L52972M93676O31974N35118P35802O53061O42983P51818O96800
4115D3608594P02808P05380O86885N90965M03211L14458K39076J02792K16908
4106D7571077L6548R3837Q7104k0647K47371J95338J08952J79335L55366L57381
4096D9211662M69459O60370O70952O77056Q12587Q17769R99459J183915J122686
4087E6625915J207674J235173J216469J156556J305815J383673J253000J167248
4079F6551523J094546P26857N80672L48017L07813J53428q1856j57529j88824
4070F9334647k36782l21436m79706m66366n45474n42029n00546m79938m12362
4061F5350008m13674j51275q2485Q6725O0993K81375K17923J96215L92765L79764
$$ y = [38114390, 38467362, 38961038, 39593012, 40128130, 40863932, 41516993, 42159976, 42911794, 43608594, 44311402, 45016782, 45703667, 46294632, 46697843, 47012301, 47251377, 47354169, 47571077, 47607625, 47701462, 47788566, 47767919, 48015290, 48210628, 48319580, 48498915, 48854281, 49211662, 49681121, 50341491, 51012443, 51689499, 52502086, 53319855, 54319314, 55503229, 56625915, 57833589, 59068762, 60285231, 61441787, 62747602, 64131275, 65384275, 66551523, 67646069, 68372926, 68953598, 69301615, 69609428, 69762856, 69681000, 69523471, 69334647, 69097865, 68776429, 68296723, 67830357, 67284883, 66742854, 66242308, 65762370, 65350008, 64936334, 64785059, 64702574, 64789299, 64850292, 65131667, 65349590, 65545805, 65938570, 66318334]
4051F6318334N18078M35579M27667N61653O07259N54212O88106Q42169Q63012
4042G1816069J003035J141668J314508J384808J585467J902140K159322K382756
4034H4689773K688251L213863L514527L763709M411162N050936N578986O540078
4026A19451285P464185Q361991R187258R603913R766884R802740R972521J0143932
4018A93754709R208275O699929K520452k790098q010636j1835583j3869141j4485905
4010A61192002j3600002j2068657j0184595q561458p226122o001822m923274m199289
4002I4426783l464451k820642k238253j584232j091176p30779l25333m7287K02071
3993H2326701L85496P07297R00834R40090J025593R63191O90304N96580M68604
$$ y = [66318334, 66836412, 67271991, 67699658, 68261311, 68868570, 69422782, 70110888, 70953057, 71816069, 72819104, 73960772, 75275280, 76660088, 78245555, 80147695, 82307017, 84689773, 87378024, 90591887, 94106414, 97870123, 102281285, 107332221, 112911207, 119451285, 126915470, 135277461, 144464719, 154068632, 163835516, 173638256, 183610777, 193754709, 202962984, 209662913, 212183365, 209393267, 201382631, 189547048, 175677907, 161192002, 147592000, 135523343, 125338748, 116777290, 109551168, 103549346, 98626072, 94426783, 90962332, 88141690, 85903437, 84319205, 83228029, 82497250, 82171917, 82124630, 82326701, 82712197, 83419494, 84320328, 85260418, 86286011, 87249202, 87939506, 88536086, 89004690]
3984H9004690J93444K12349j24147k51991l31854l68017m35579o11871j119477
3975H6167547j809123k708089l487624m019452m123215m108267l727592l314917
3967E8869268k907017k565722k188828j947440j775908j472386j357719j245076
3959D3409172j178636j110581r05382q56692p53015o68036o12360n58346n58259
3950C6207865n65337n22182m84540l83976l69893k90855k29023k91920o3793p7263
3940C2929083j87012j61845n5207j7378j47075J417m2672j95534k18319j91248
3930C1714210k30600k09447j99905k71349j94814k48883l26977l19930k54374
3921B9457931m27663l62497k72913k44173k42670k23044j35010q3097q0262j33553
$$ y = [89004690, 89198134, 89410483, 89286336, 89034345, 88702491, 88334474, 87898895, 87287024, 86167547, 84358424, 81650335, 78162711, 74143259, 70020044, 65911777, 62184185, 58869268, 55962251, 53396529, 51207701, 49260261, 47484353, 46011967, 44654248, 43409172, 42230536, 41119955, 40214573, 39357881, 38604866, 37936830, 37324470, 36766124, 36207865, 35642528, 35120346, 34635806, 34251830, 33881937, 33591082, 33362059, 33070139, 33006346, 32929083, 32742071, 32580226, 32525019, 32507641, 32360566, 32361983, 32319311, 32123777, 31905458, 31714210, 31483610, 31274163, 31074258, 30802909, 30608095, 30359212, 30032235, 29712305, 29457931, 29030268, 28667771, 28394858, 28150685, 27908015, 27684971, 27549961, 27466864, 27386602, 27253049]
3911B7253049n8788k8301j19571L226N6520l9239K302O9374J06004J87822J12566
3900B7544964M2379K53631L14236K51599K14588J11988J1563K623j1374k01126
3890B8535071j84252k48398k97992k93561l44194m37077l83347m87938l78245
3881B5480067n07797m25767m40711m59808l53271n26815m56573k94157n17161
3872B1498007l96303n03253l63113j87130j67160k62397k35144k47879j79215
3863A8956413K3962k44315p9460L4942j50096j03760J8007j37760q1542Q398r5419
3852A8149370j64505l1615M5720R3516R3539Q1460P7896j4298K1636J02748K41667
3841A8697134K28692J10162J88034J56043K40556K73366L81916K64698L13383
$$ y = [27253049, 27194261, 27165960, 27046389, 27049615, 27106135, 27066896, 27069198, 27138572, 27244576, 27432398, 27544964, 27587343, 27840974, 28155210, 28406809, 28621397, 28733385, 28744948, 28747571, 28736197, 28535071, 28350819, 28102421, 27804429, 27510868, 27166674, 26729597, 26346250, 25858312, 25480067, 24972270, 24546503, 24105792, 23645984, 23292713, 22765898, 22309325, 22015168, 21498007, 21101704, 20598451, 20235338, 20048208, 19881048, 19618651, 19383507, 19135628, 18956413, 18980375, 18736060, 18656600, 18691542, 18541446, 18437686, 18455693, 18317933, 18236391, 18244789, 18149370, 17984865, 17953250, 17998970, 18092486, 18186025, 18267485, 18345381, 18331083, 18352719, 18455467, 18697134, 18925826, 19035988, 19224022, 19380065, 19620621, 19893987, 20275903, 20540601, 20853984]
3832B0853984L09897L16359K77816L77681N11977L42446L80441L98642M46853
3823B4216096N97538M21511M26252N50565N21286N50081N94974M59104K77430
3814B8614837M75952O41603L74650M22094N78515O65333O65024O86162P75544
3805C3899714Q10552P93319R25811Q84759R34705R91783Q75385Q31938Q18669
3796D1766635N78529N06204M50850K32166n1404j85177k27645m60586n11043m91181
3786D1607348o91382p04026o32294n86195o23095n27171l85450m92027m40462
3777C6525246m75071n04656n30662n02384n13505l76817m87771n68156n28578
3768C2037646l90484m67483n28328l43957k83616l18541k50906j93897k52048
$$ y = [20853984, 21163881, 21480240, 21758056, 22135737, 22647714, 22990160, 23370601, 23769243, 24216096, 24813634, 25235145, 25661397, 26211962, 26733248, 27283329, 27878303, 28337407, 28614837, 29090789, 29732392, 30107042, 30529136, 31107651, 31772984, 32438008, 33124170, 33899714, 34710266, 35503585, 36429396, 37314155, 38248860, 39240643, 40116028, 40947966, 41766635, 42345164, 42851368, 43302218, 43534384, 43482980, 43297803, 43070158, 42609572, 42098529, 41607348, 40915966, 40211940, 39579646, 38993451, 38370356, 37843185, 37457735, 36965708, 36525246, 36050175, 35545519, 35014857, 34512473, 33998968, 33622151, 33134380, 32566224, 32037646, 31647162, 31179679, 30651351, 30307394, 30023778, 29705237, 29454331, 29260434, 29008386]
3759B9008386m7256l8366j35407j01408q944L8102P9803P9455J31607Q5512P0416
3748B9161900K16920J57939J69617L00180K86771J28646K77618J85164J41798
3739C1026553L0349j05379k12115k60731k70538m10822n48388o45336p53248n90096
3729B7260249n51480o11779m75182m09270l69408l84325l44597n8184j50212k26348
3719B3679464j55093j81902m2917k65709j41189l3644j70214k64355q6420l23476
3709B2014545j68691o8901k43912j86803j78499n7234j09967q8353r9929k05802
3699B0606454j99037k06315l21410k04200k61702l05676j99306j74776k51779
3690A8482253j11912j15508j12097n9601q7063J07788R5022p6733K1356L1721
$$ y = [29008386, 28961130, 28922764, 28787357, 28685949, 28677005, 28715107, 28794910, 28874365, 29005972, 29091484, 29161900, 29378820, 29536759, 29706376, 30006556, 30293327, 30421973, 30699591, 30884755, 31026553, 31056902, 30951523, 30739408, 30478677, 30208139, 29797317, 29248929, 28603593, 27850345, 27260249, 26708769, 26096990, 25621808, 25212538, 24843130, 24458805, 24114208, 24056024, 23905812, 23679464, 23524371, 23342469, 23299552, 23033843, 22892654, 22859010, 22688796, 22424441, 22338021, 22014545, 21845854, 21776953, 21533041, 21346238, 21167739, 21110505, 21000538, 20912185, 20812256, 20606454, 20407417, 20201102, 19879692, 19675492, 19413790, 19108114, 18908808, 18734032, 18482253, 18370341, 18254833, 18142736, 18083135, 17996072, 18103860, 18198882, 18122149, 18143505, 18175226]
3680A8175226j72006j10870k07589k89440k75472k35915l65708m33769k76783
3671A5807674l31758l38635k18163l46972k08116k88526k94032j04240k84870
3662A3392362k06336j35958j88047l9024k4192r4219j43747j44287j25509j95184
3652A2095859k00124j58509k40015k64972k66425l52198k77193j94369k32273
3643I909781j79426j84784k56689k23295j60166o8118k29856k20840k19584k3979
3633H143044j46271j58279j21374k13717j71657j52251j68888k8307m8474j08466
3623F825360j02490l1920j7926k05292j39704j01247j50897k8009j55167j29170
3613E763538N7881J5437q007l5825j94007j56849O7654P9011n2209j2484j9720
$$ y = [18175226, 18003220, 17892350, 17684761, 17395321, 17119849, 16883934, 16518226, 16084457, 15807674, 15475916, 15137281, 14919118, 14572146, 14364030, 14075504, 13781472, 13677232, 13392362, 13186026, 13050068, 12862021, 12822997, 12798805, 12704586, 12560839, 12416552, 12291043, 12095859, 11895735, 11737226, 11497211, 11232239, 10965814, 10613616, 10336423, 10142054, 9909781, 9730355, 9545571, 9288882, 9065587, 8905421, 8837303, 8607447, 8386607, 8167023, 8143044, 7996773, 7838494, 7717120, 7503403, 7331746, 7179495, 7010607, 6982300, 6933826, 6825360, 6722870, 6690950, 6673024, 6467732, 6328028, 6226781, 6075884, 6047875, 5892708, 5763538, 5821419, 5836856, 5828849, 5793024, 5599017, 5442168, 5509822, 5588833, 5536624, 5524140, 5504420]
3602E504420j29892P2415R6748l6304n9039M8560q7931p9253L7583j04232L482
3591E266557P9217N2642N4289N6789k2486J08272L5892K0475n663l0000L0949
3580E646933M0102P5863l2768J40092M3364J66823K06670Q7457J2252J76302K29659
3569F792749J29827Q8561J36214J05964M0758p2457r1101j12391k28458q2677
3559F706989j26880k39302j32544j22869q2983r5319j54627k7805n3944m1855
3549E628861n6330o6177o8040j0960n7601p0723J19425K7667m8254r9489P9998
3538E378377M5259l6951q7595K9527R5360p1529k8752J13085o9383P8922k0470
3527E425850n8685J17509J3459M1977J8296n6411N9029J43442O1844J5522m3611
$$ y = [5504420, 5374528, 5446943, 5543691, 5507387, 5448348, 5496908, 5408977, 5329724, 5367307, 5263075, 5266557, 5345774, 5398416, 5452705, 5509494, 5487008, 5595280, 5631172, 5651647, 5645984, 5615984, 5646933, 5687035, 5762898, 5730130, 5870222, 5913586, 6080409, 6287079, 6374536, 6386788, 6563090, 6792749, 6922576, 7011137, 7147351, 7253315, 7294073, 7221616, 7130515, 7018124, 6789666, 6706989, 6580109, 6340807, 6208263, 6085394, 6002411, 5907092, 5752465, 5724660, 5670716, 5628861, 5572531, 5506354, 5438314, 5427354, 5369753, 5299030, 5418455, 5446122, 5397868, 5298379, 5378377, 5423636, 5386685, 5299090, 5328617, 5423977, 5352448, 5323696, 5436781, 5367398, 5446320, 5425850, 5367165, 5484674, 5498133, 5540110, 5558406, 5501995, 5561024, 5704466, 5766310, 5781832, 5738221]
3516E738221J87102J24362J38525J23952J75180J54348O0924J60356N0882K1938
3506F935790K0674J8738M2225R615K7830r990j6602L1448q1468L7998r1459j12675
3494F812124k0657l5122j7680j705K1768j2363k8867P908J2791Q7224R5592q8357
3482F832656R4398j6320J6153J20871Q6496R7730l4257O4651J81081J56094n0757
3471G548796L0325P6883j15288n5453J6972P9497M403R9428M281K9913k1395J6743
3459G715105J73108J02874o6953J69258l458M8697P3610P2939K1244o9N0821n3306
3447H303870n250L8671R7997q229J69848J42501m174k4773J04873J51121K4476
3436H990931p9181J10252J07074O0941K08008J56458L6570n59J07577J32871Q8585
$$ y = [5738221, 5925323, 6049685, 6188210, 6312162, 6487342, 6641690, 6702614, 6862970, 6913852, 6935790, 6956464, 6975202, 7017427, 7027042, 7054872, 7044882, 7028280, 7059728, 6978260, 7016258, 6924799, 6812124, 6791467, 6756345, 6738665, 6736960, 6758728, 6746365, 6717498, 6725406, 6738197, 6825421, 6921013, 6832656, 6927054, 6910734, 6926887, 7047758, 7134254, 7231984, 7197727, 7262378, 7443459, 7599553, 7548796, 7579121, 7656004, 7540716, 7485263, 7502235, 7581732, 7586135, 7685563, 7689844, 7719757, 7698362, 7715105, 7888213, 7991087, 7924134, 8093392, 8089934, 8138631, 8212241, 8285180, 8306424, 8306355, 8357176, 8303870, 8298620, 8337291, 8435288, 8427059, 8596907, 8739408, 8735234, 8710461, 8815334, 8966455, 8990931, 8911750, 9022002, 9129076, 9190017, 9398025, 9554483, 9591053, 9590494, 9698071, 9830942, 9919527]
3425I919527J12146N2125J26375J77227J44391J48586J79000J84869K36874Q69
3415A1281989J60832J91018J10576J02544O3850Q5459J5032J31533N1595J08520
3405A2302948P9114R1234K67037J98709J4765J00350K87183L89209K64530K10536
3395A4205615L20630L14934L60148K16621L35803L91225L00001L62723K79125
3386A7086825K14339K35389K31572K01515K65997K47673K66158K46838K57201
3377A9253507K06865L27299L14983J99426L92033M33539L29967L42355K11593
3368B2011567L27794M45249M24929L53917M03717L59833L92060M33894L99717
3359B5552677L25741L27277M69578L69816M15967L87534N30217L69256L76747
$$ y = [9919527, 10031673, 10083798, 10210173, 10387400, 10531791, 10680377, 10859377, 11044246, 11281120, 11281989, 11442821, 11633839, 11744415, 11846959, 11910809, 11996268, 12011300, 12142833, 12194428, 12302948, 12382062, 12473296, 12740333, 12939042, 12953807, 13054157, 13341340, 13730549, 13995079, 14205615, 14526245, 14841179, 15201327, 15417948, 15753751, 16144976, 16444977, 16807700, 17086825, 17301164, 17536553, 17768125, 17969640, 18235637, 18483310, 18749468, 18996306, 19253507, 19460372, 19787671, 20102654, 20302080, 20694113, 21127652, 21457619, 21799974, 22011567, 22339361, 22784610, 23209539, 23563456, 23967173, 24327006, 24719066, 25152960, 25552677, 25878418, 26205695, 26675273, 27045089, 27461056, 27848590, 28378807, 28748063, 29124810]
3350B9124810N06683M85767O16944N98074M69191N41967O35241O39752P89281
3341C4407710P07213P69216P96838R00161R50758J147235J210213J179564J247465
3332D3316373J267659J354860J268687J408633J524817J525124J632584J718886
3324E5017623J605115J745036J740454J956050K047812J982463J934454K075609
3316G0104616K196881K263899K268234K441780K780663K891982L109238L212376
3308I1269669L169183L595346L966753M276107M563421M768051M866768M975742
3300A25451040N298152N863112O515091P688415Q964190J0467382J1931478J3756229
3292A95935089J5803797J8306324K0971757K3753845K6411403K8270280K8785110
$$ y = [29124810, 29631493, 30117260, 30734204, 31332278, 31801469, 32343436, 32978677, 33618429, 34407710, 35114923, 35884139, 36680977, 37581138, 38531896, 39679131, 40889344, 42068908, 43316373, 44584032, 45938892, 47207579, 48616212, 50141029, 51666153, 53298737, 55017623, 56622738, 58367774, 60108228, 62064278, 64112090, 66094553, 68029007, 70104616, 72301497, 74565396, 76833630, 79275410, 82056073, 84948055, 88057293, 91269669, 94438852, 98034198, 102000951, 106277058, 110840479, 115608530, 120475298, 125451040, 130749192, 136612304, 143127395, 150815810, 159780000, 170247382, 182178860, 195935089, 211738886, 230045210, 251016967, 274770812, 301182215, 329452495, 358237605]
3285C58237605K8752768K9471206L0327066K9349700K4482210J4686430J85625
3278E15492610j5635309k9051700l7769130m2462976m2323005l8627988l3030467
3271B76592035k7475837k2793631j9162457j6368487j4269126j2369040j0876451
3264A53277006r611209q152406p005117n872384n081349m461964l838495l510279
3256A05743803l137699k969493k531380k180918j898320j498055j347461j078622
3248H9101855p91493n00606l67168O4660M07844O21539Q86127J187834J644680
3239I2255272K051502K427749K972329L432460L810540M179313M813673N508453
3231A21451291O654470Q024617R681159J1566322J3655878J5080908J6016038
$$ y = [358237605, 386990373, 416461579, 446788645, 476138345, 500620555, 515306985, 515492610, 499857301, 470805601, 433036471, 390573495, 348250490, 309622502, 276592035, 249116198, 226322567, 207160110, 190791623, 176522497, 164153457, 153277006, 143665797, 135513391, 128508274, 122635890, 117554541, 113092577, 109254082, 105743803, 102606104, 99636611, 97105231, 94924313, 93025993, 91527938, 90180477, 89101855, 88310362, 87809756, 87442588, 87507248, 87915092, 88536631, 89422758, 90610592, 92255272, 94306774, 96734523, 99706852, 103139312, 106949852, 111129165, 115942838, 121451291, 128105761, 136130378, 145811537, 157377859, 171033737, 186114645, 202130683]
3224B02130683J6244833J6258200J6589421J5201480J0850347K486029q379249
3217B71381744j8402898k4554364k6155021k4036073k0296964j6516615j3530491
3210A27889318j1038317r193642p942903p072530o051058n389470m596911m044193
3202G2560294l484329k992845k527156k196520k017223j869393j839449j592823
3194E4040556j438494j288168j194199r33753r67659q18462o72053o17452l97407
3185D5712909k46388j60977L1660L0754J24616L33556L57394O67743O68957P72490
3175D8292714R63430J054859J119762J320697J382373J224125J276709R84531
3167E7619200N76645K45584l40109q98590j277503j762120k215514k360241k438861
$$ y = [202130683, 218375516, 234633716, 251223137, 266424617, 277274964, 279760993, 271381744, 252978846, 228424482, 202269461, 178233388, 157936424, 141419809, 127889318, 116851001, 107657359, 99714456, 92641926, 86590868, 81201398, 76604487, 72560294, 69075965, 66083120, 63555964, 61359444, 59342221, 57472828, 55633379, 54040556, 52602062, 51313894, 50119695, 49185942, 48218283, 47399821, 46727768, 46110316, 45712909, 45466521, 45305544, 45337204, 45367958, 45492574, 45826130, 46183524, 46851267, 47520224, 48292714, 49256144, 50311003, 51430765, 52751462, 54133835, 55357960, 56634669, 57619200, 58195845, 58441429, 58101320, 57202730, 55925227, 54163107, 51947593, 49587352, 47148491]
3158D7148491k465090k448779k309295k077476j932936j745011j649762j406136
3150C1114006j366482j262598j183304r51561r38974q16058p88315o99961p25633
3141B2381120o25470n09542n08996n41396m54583m53310l68186l08208l40683
3132A8270746m16684l46993l08547l52107l29842k43947j71010k55705l37779
3123A5508132k50284k51816j86914j64037j26237j16106j08737k31527j51835
3114A3920639q5645j53436p0242j59305j54520j71582o6029j37877j73652j68417
3104A2579934j17981m3737m5051j00427o8057m7268N5650L1260p6513P9009J33957
3093A2380776j08265j5417K9895J0117o407O9272N1050M6195J16653P7687J41375
$$ y = [47148491, 44683401, 42234622, 39925327, 37847851, 35914915, 34169904, 32520142, 31114006, 29747524, 28484926, 27301622, 26350061, 25411087, 24595029, 23806714, 23106753, 22381120, 21755650, 21246108, 20737112, 20195716, 19741133, 19287823, 18919637, 18611429, 18270746, 17854062, 17507069, 17198522, 16846415, 16516573, 16272626, 16101616, 15845911, 15508132, 15257848, 15006032, 14819118, 14655081, 14528844, 14412738, 14304001, 14072474, 13920639, 13834994, 13681558, 13611316, 13452011, 13297491, 13125909, 13059880, 12922003, 12748351, 12579934, 12461953, 12418216, 12373165, 12272738, 12204681, 12157413, 12213063, 12244323, 12167810, 12246819, 12380776, 12272511, 12257094, 12286989, 12297106, 12290699, 12359971, 12411021, 12457216, 12573869, 12651556, 12792931]
3082A2792931J19863J87071K12486K17793K46220J85527K79352K93356K55130
3073A4789729L25991M80307M85093O49116O54085O00083P88860R56839J060800
3064B0790903J218766J243867J307602J290655J289406J302118J050138Q30074
3056C0323529L03385j75806p60590j205833j643716j697400j783033j681296j504667
3047B0174573j503752j303177j038218j024515q97731p38587o94055n59399o13080
3038A1802059n04129m13504m11781m54587k36485m11765l38096j84231j71433
3029H676048l52924l13328j05427j67063j88001j89372o2012r8170j83895j25273
3019F890583j68622k0471j15907k11096n343K1086j16364r4357r2991n0986l4677
$$ y = [12792931, 12912794, 13099865, 13312351, 13530144, 13776364, 13961891, 14241243, 14534599, 14789729, 15115720, 15596027, 16081120, 16730236, 17384321, 17984404, 18773264, 19730103, 20790903, 22009669, 23253536, 24561138, 25851793, 27141199, 28443317, 29493455, 30323529, 30626914, 30451108, 29690518, 28484685, 26840969, 25143569, 23360536, 21679240, 20174573, 18670821, 17367644, 16329426, 15304911, 14407180, 13668593, 12974538, 12415139, 11802059, 11297930, 10884426, 10472645, 10018058, 9781573, 9369808, 9031712, 8847481, 8676048, 8323124, 8009796, 7904369, 7737306, 7549305, 7359933, 7297921, 7199751, 7015856, 6890583, 6721961, 6701490, 6585583, 6374487, 6369144, 6390230, 6273866, 6179509, 6086518, 6035532, 6000855]
3008F000855l8358L3686J2149P4420J413k1794J9553K9613J72886J04039P5202
2997F463664J34386J00692J30965K07676M4094N8890l5501j23036p4597r0657
2987F816576k13347j70194j86096j77917j22001j63026j73415j25991K7707q1211
2977E431085j43586j34573o1361j19992M448n8260M147n4118m0832m9500r0844
2966D686614J4853N8920l858j4110k928j15334J1948l6512k6789j6009K7359r3876
2954D490278r753l4313p1596O9159j4036M2047J6613j4673o8707m0334N2306l8604
2942D378387q2217R4771O9781p8279J18580O0213q622P7759K6873J46034j02284
2931D700996L1221k8494q5304m9019r1509j85612k42039p1079K5228j12621j10868
$$ y = [6000855, 5962497, 5996183, 6008332, 6082752, 6084165, 6062371, 6081924, 6111537, 6284423, 6388462, 6463664, 6598050, 6698742, 6829707, 7037383, 7081477, 7140367, 7104866, 6981830, 6907233, 6816576, 6603229, 6433035, 6246939, 6069022, 5947021, 5783995, 5610580, 5484589, 5512296, 5431085, 5287499, 5152926, 5091565, 4971573, 4976021, 4917761, 4921908, 4867790, 4826958, 4777458, 4686614, 4701467, 4760387, 4756529, 4742419, 4739491, 4624157, 4636105, 4599593, 4572804, 4556795, 4584154, 4490278, 4480525, 4446212, 4374616, 4443775, 4429739, 4471786, 4488399, 4473726, 4405019, 4364685, 4416991, 4378387, 4296170, 4390941, 4460722, 4382443, 4501023, 4561236, 4552614, 4630373, 4657246, 4803280, 4700996, 4732217, 4703723, 4618419, 4569400, 4477891, 4292279, 4050240, 3979161, 4004389, 3891768, 3780900]
2920C780900r1087j37303l9039l5665j15974j18290J9907P036r4086J9992n2989
2909C143402q2807J6600L7170P7564r7306k8975n2361R2362o5732k9832J28133
2898C138218q738q3829l6836N0944O3414P5020j11532L8877K6895j97310l0690
2887B924433l533p1239k9223Q3212M9835p7654n1921n5021j3040n6810L0965J2640
2875B742644K9423n7039j0821M9263j13909q0697L0640m4242k3964L3227R1585
2864B646110k6902j18410j51297r2965K580J0065n4572j37910q6830l451m6126
2853A940292R4279j2908m4311m4992L829R185j28790P9420K259J0560n550m9658
2841A853615q7166r574O4647j6907o8378J1163J1122o2653n6385L0757j59435
$$ y = [3780900, 3689813, 3552510, 3513471, 3477806, 3361832, 3243542, 3263449, 3270485, 3176399, 3196391, 3143402, 3060595, 3077195, 3114365, 3191929, 3094623, 3065648, 3013287, 3105649, 3039917, 3010085, 3138218, 3129480, 3045651, 3008815, 3059759, 3123173, 3198193, 3086661, 3125538, 3152433, 2955123, 2924433, 2920900, 2849661, 2820438, 2903650, 2953485, 2875831, 2823910, 2768889, 2755849, 2699039, 2730004, 2742644, 2772067, 2715028, 2704207, 2753470, 2639561, 2558864, 2589504, 2545262, 2521298, 2554525, 2646110, 2619208, 2500798, 2349501, 2256536, 2259116, 2269181, 2214609, 2076699, 1989869, 1986418, 1940292, 2034571, 2021663, 1977352, 1932360, 1936189, 1945374, 1816584, 1896004, 1898263, 1908823, 1903273, 1853615, 1766449, 1756875, 1821522, 1804615, 1736237, 1747400, 1758522, 1695869, 1639484, 1670241, 1510806]
2830A510806l7474K1140R2527j1622o1097k8904p7715J3025M9206o0050m468L845
2818A409219K9467L1535o2183l7233n7078J5135N072m5757N2950O3418o2147l4861
2806A307537R557r139m7659K5170Q325j24711J5312m6749O1858L0822m6849N6922
2794A240396P424j1018q8298L9209L2358o1376K5631N7727q4757j23606L7512
2783A071202p3991L4068M1302o893m3437l6822M702j33282R8261J3809k3799J3327
2771I58447K6796L8774N4623j2046m5131o9652O4776q980m3251k6908k865J6964
2759I51547J6234J130O4164k6819j20746p6657K4474k8702n6295J72706R879k1452
2747I09463r1794n2513R5418k1202k1630P46O575P8059o2467p6511J2133J06503
$$ y = [1510806, 1473332, 1494472, 1586999, 1575377, 1514280, 1485376, 1407661, 1420686, 1469892, 1409842, 1405374, 1409219, 1438686, 1470221, 1408038, 1370805, 1313727, 1328862, 1333934, 1288177, 1341127, 1404545, 1342398, 1307537, 1317094, 1307955, 1260296, 1285466, 1293791, 1169080, 1184392, 1137643, 1199501, 1230323, 1183474, 1240396, 1247820, 1236802, 1148504, 1187713, 1220071, 1158695, 1184326, 1242053, 1157296, 1033690, 1071202, 997211, 1031279, 1072581, 1065688, 1022251, 985429, 990131, 856849, 955110, 968919, 945120, 958447, 985243, 1024017, 1078640, 1066594, 1021463, 951811, 1016587, 1007607, 964356, 937448, 934583, 951547, 967781, 968911, 1033075, 1006256, 885510, 808853, 833327, 804625, 748330, 921036, 930915, 909463, 817669, 765156, 860574, 839372, 817742, 818488, 825063, 903122, 840655, 764144, 776277, 882780]
2735H82780J282P5337n9479m8370n0186l7715q1603J8950p24K338K6820q6287
2723F43143o5663o0229P1032q9530K5610r55J03588N0123j67736n0347m524J26225
2711E80737n2782p2076O7473N2052L2951j11670J7481K121o3513o9623m05K26322
2699F09068l2944j4477M1052j60535K343J7622J0593M216m7565J726K8440j0223
2687D49316M6322l6774l4684K3769J6003p8383J764L29P2061k0818J33497j633
2675E70769j00731k2813K2954N2303j08193M7436M7738o4467K4196O9907p2677
2664D66422o6800K6903r951n6802l8397J17221o4216Q0000K5798p7953L3027l0332
2652D04920m4202r878J4181l8167K2868q75J8377o1542M4638P0345k6328j00497
$$ y = [882780, 884062, 959399, 899920, 851550, 801364, 763649, 682046, 700996, 700272, 702610, 729430, 643143, 577480, 517251, 588283, 498753, 524363, 523408, 626996, 677119, 509383, 459036, 454512, 580737, 527955, 455879, 523352, 575404, 608355, 496685, 514166, 516287, 452774, 383151, 382746, 609068, 576124, 561647, 602699, 442164, 444507, 462129, 472722, 476938, 429373, 431099, 459539, 449316, 495638, 458864, 424180, 447949, 463952, 385569, 387333, 387662, 459723, 438905, 572402, 570769, 470038, 447225, 470179, 522482, 414289, 461725, 509463, 444996, 469192, 539099, 466422, 399622, 426525, 416574, 359772, 321375, 438596, 374380, 454380, 480178, 402225, 435252, 404920, 360718, 350840, 365021, 326854, 349722, 348847, 367224, 305682, 350320, 420665, 394337, 293840]
2640B93840j9549k0232O9568O544L501o2989K9278n2576k219M5284q7017L1553
2628B34986N4607r7354L4514J16814N5326o4852j76362k8637J38934r2658k0005
2617A55313O5743k4081J14316m4135j0269q7244L6365j4888j22682m2169M3123
2606F9392K8720Q3955J7842k065j2469k0637l3398O7310o1151n9564O4150j8190
2594A23895P4261O7239k1750J6554m4131p7501m5939P2395K6532l2231O6914m2956
2582A83282j2982L0375M3543k7543R107j5259j53828O9578K6474o1506J8381L2804
2570A42426p8522M0241Q4344m2169l6229l7183n3268l3314Q3870M6473P0948p8160
2558A09457l388J808M3990p7523M0616n1398j7484L3715Q9114j20547p2134O9000
$$ y = [293840, 274291, 254059, 323627, 330171, 333672, 270683, 299961, 247385, 245166, 290450, 203433, 234986, 289593, 192239, 226753, 343567, 398893, 334041, 157679, 129042, 267976, 175318, 155313, 221056, 196975, 311291, 267156, 256887, 169643, 206008, 191120, 68438, 26269, 69392, 98112, 182067, 199909, 197844, 185375, 164738, 131340, 198650, 137499, 77935, 142085, 123895, 198156, 265395, 243645, 260199, 216068, 138567, 92628, 165023, 191555, 159324, 226238, 183282, 170300, 200675, 244218, 216675, 225782, 210523, 56695, 126273, 152747, 91241, 109622, 142426, 63904, 104145, 188489, 146320, 110091, 72908, 19640, -13674, 70196, 116669, 187617, 109457, 106069, 107877, 151867, 74344, 114960, 63562, 46078, 79793, 168907, 48360, -23774, 45226]
2546D5226Q5238J6839J9069j14528N9751L8885o6368J6778j5263p3540K0732L2920
2534F5739n2535P2529m6159m1450n448J6689J24250m6719q413q988p6874Q5940
2522G8561p9782M5186L2877N7291J1615m4033j04970p131R6451P5339o4979q910
2510H7515J24538k2402r0549j1994o9897J21204k2125k0338K9633o6784N9137
2499A17938L8096L4238o8542m4541k6842j2711k5056o670p761n146J36623j6624
2487A13002o2884J144K7017L4638L0467N358o4958o6931k536p1749R2833n279
2475C0122R8041m7799n4026R5998n0011r9362p061J79N5581P1324K4125l5819
2463H1292M3462j9748n3543K595L546J3389l0864Q154o9814m1049J30592m1125
$$ y = [45226, 130464, 147303, 166372, 51844, 111595, 150480, 84112, 100890, 85627, 12087, 32819, 65739, 13204, 85733, 39574, -1876, -7324, 9365, 133615, 86896, 78483, 69495, -7379, 78561, -1221, 43965, 76842, 134133, 145748, 101715, -3255, -10386, 86065, 161404, 96425, 87515, 212053, 189651, 99102, 87108, 17211, 138415, 116290, 95952, 125585, 58801, 117938, 156034, 190272, 121730, 77189, 50347, 37636, 12580, 5910, -1851, -6997, 129626, 113002, 50118, 51262, 78279, 112917, 143384, 148742, 83784, 16853, 14317, -57432, 35401, 30122, 128163, 80364, 26338, 122336, 72325, -27037, -34098, -33919, 21662, 92986, 117111, 81292, 124754, 105006, 51463, 54058, 57604, 70993, 40129, 48283, -21531, -62580, 68012, 26887]
2451B6887L7131L4100j44623Q7892K6020p9408R0743q595N3260n5065o3916N2782
2439E7208j1346P902l0186K1009L2557r0898l9932k2917L4455Q0252o4963O4290
2427C7431L566N2666M584Q0690p3430l9854j1572k0729R3487M1058j72855O4444
2415E9486O1048j13444l0299P3240N9838K0987j1219r6141p3138r261J68372N2501
2403A61970j20540J6732L7501j4893o9991n208k6761K6074l5479K4046J12152
2392A05603o8690j9453J4088n5434k9007Q171Q7109L59n0752Q6570K0116p324
2380I1356k4790q6001O2888l3505m140O5203q0731L9183r92R8930j0254q9728
2368B7419M3024R5087K2492q0823M464P5863k8043K8177O9821j48045p0230P0533
$$ y = [26887, 64018, 98118, -46505, 41387, 67407, -12001, 78742, 70147, 123407, 68342, 4426, 57208, 45862, 53764, 23578, 44587, 77144, -13754, -53686, -76603, -42148, 38104, -26859, 37431, 40997, 93663, 98247, 178937, 105507, 65653, 54081, 33352, 126839, 167897, -4958, 59486, 120534, 7090, -23209, 50031, 109869, 130856, 119637, 23496, -49642, -58903, 109469, 161970, 41430, 58162, 95663, 80770, 10779, 5571, -21190, 4884, -30595, -6549, 105603, 36913, 17460, 31548, -23886, -52893, -44722, 42387, 42746, -8006, 78564, 98680, 91356, 66566, -19435, 43453, 9948, 5808, 71011, -9720, 29463, 28471, 127401, 117147, 27419, 70443, 165530, 188022, 107199, 111663, 187526, 159483, 187660, 257481, 109436, 39206, 109739]
2356A09739L2356q7518j29251O5204P2398r4330K6926J19691r3930Q444J9181
2345D8910m5883N8344L2302m6969m7650k957O2613n1820o9585J68040J6449k5839
2333I5955l6173O4621l8505q6355r2835J44244k4475r40L7502l8904q5066Q2588
2321B1657R5212K3467n2147N02J1011j6125k6758J6401R0572l0640p756j11463
2309A3933L9612n9818Q8416L0335p0917j00525K1836J15698K4088k751K7876o1096
2297F6687k9503K9856M6810K2544k6999o367N798p1645j3668L6407N7583p6952
2285D0551O794o1767O2429L4295M4219o4981J8869J32520J5025k8153M4616m586
2273B39831j08421o1578k5457r5839m0070P8526P9597M1342K6802j8703M1978
$$ y = [109739, 142095, 54577, -74674, -9470, 62928, -31402, -4476, 115215, 21285, 29729, 48910, 3027, 61371, 93673, 46704, -946, -3903, 58710, 6890, -62695, 105345, 121794, 95955, 59782, 124403, 85898, -457, -93292, 50952, 26477, 25537, 63039, 24135, -60931, 21657, 116869, 140336, 88189, 88691, 99702, 83577, 56819, 73220, 163792, 133152, 125396, 13933, 53545, -6273, 82143, 112478, 41561, -58964, -37128, 78570, 102658, 99907, 127783, 66687, 37184, 67040, 113850, 136394, 109395, 103028, 108826, 37181, 23513, 59920, 117503, 40551, 47345, -14422, 48007, 82302, 126521, 61540, 80409, 212929, 227954, 199801, 244417, 239831, 131410, 69832, 44375, -51464, -91534, -13008, 66589, 107931, 134733, 116030, 158008]
2262A58008O0404J6791m0983l2532q7237j5109O1023p6295n8543o6612Q6656K1836
2250B7407J40196R756n7601q8025k3521J35282m3207l9215L4140l4341J0948o6410
2238E409J1421P6740j9059m3340k1150J24954J4044J14782M1939r3274l0432O5935
2226B47969m6152l1716K5356m0408M813k158l6793k5517M6493l0464K4082M768
2214A40273M8581k0195N6530o862q1653K8447O3417O237Q2097M8958p0863q4636
2202B10331j6234J8942p0847O0944J36967n9136J7497L7238N4334K5714L0636
2191D46386j26235J14231j3363r7907J25652J674N3154k8876m7045m8153p0303
2180C09215P7484K0078l7444L3782O0174O8076m5583p0990M2023P9551q092P3910
$$ y = [158008, 218412, 235203, 194220, 161688, 74451, 59342, 120365, 44070, -14473, -81085, 5571, 27407, 167603, 177359, 119758, 31733, 8212, 143494, 100287, 61072, 95212, 60871, 71819, 5409, 16830, 93570, 74511, 31171, 10021, 134975, 149019, 263801, 305740, 212466, 182034, 247969, 201817, 170101, 195457, 155049, 159862, 157704, 120911, 95394, 141887, 111423, 135505, 140273, 188854, 168659, 225189, 218327, 136674, 165121, 228538, 234775, 316872, 365830, 294967, 210331, 194097, 213039, 142192, 203136, 340103, 280967, 298464, 335702, 390036, 415750, 446386, 320151, 434382, 421019, 323112, 448764, 450438, 503592, 474716, 427671, 379518, 309215, 386699, 406777, 369333, 403115, 463289, 531365, 485782, 414792, 456815, 536366, 528274, 602184]
2168F02184M7857n3947k7276o7592J7228R355J47319l392q1226k6490r27J141
2156E64234o3005N1103k8533J16893N1190Q790p4346J21522Q6699R357k1557L5574
2144H57921N3282k1863J47765J11720Q651O0415L9856M5879Q7418n7944J9658
2133A352758K9083J02752J65474l4248M3378J06010R7747j4517J27501J51237
2123B127175o0765J2636R9187J5566L6109L7341J32978J98477J19913K12808J58462
2112C089887K07321K54526L89959M47488L09672K71639K73707N15585N86829N64003
2102F910616Q61680J251048J650756K085955K666449K343056J772844K927214
2094B2469618L617963K099925k519837o392062n262410l321025j999185j433995
$$ y = [602184, 650041, 596094, 568818, 501226, 518454, 527809, 675128, 671736, 590510, 564020, 563093, 564234, 501229, 552332, 523799, 640692, 691882, 700672, 626326, 747848, 834547, 843904, 822347, 857921, 911203, 889340, 1037105, 1148825, 1157476, 1217891, 1257747, 1303626, 1391044, 1333100, 1352758, 1381841, 1484593, 1650067, 1615819, 1659197, 1765207, 1862954, 1848437, 1975938, 2127175, 2066410, 2079046, 2178233, 2193799, 2229908, 2267249, 2400227, 2598704, 2718617, 2931425, 3089887, 3297208, 3551734, 3941693, 4389181, 4698853, 4970492, 5244199, 5759784, 6346613, 6910616, 7772296, 9023344, 10674100, 12760055, 15426504, 17769560, 19542404, 22469618, 26087581, 28187506, 25667669, 19275607, 14013197, 10692172, 8692987, 7258992]
2086G258992j131452p23954m43778m27020m65192k06687k54505k47214j23588
2077C235602l20393l68150k14533j60308p5495q4550q5601k01160k08434j44058
2067A372920j9526j50741l2961q8517q2512j02339L2785k6628m6554J689j14691
2056G42925p4261k9265L8737r6191P526p6308J3135M3082L0564j80955k4014R8147
2044D93122q608k2108k6335J17708q4815p2449j0753j23107j6195O5857J4251
2033C26568J8946o0148k7976K7848j0178j38564j9149J47318J01326n6523k5356
2022B84112m5870o7857l3392n8948O1283L7063J3543l3018K2018n1478j7853Q9063
2010A98666r3107L8232O245J9825J06023m5880o1677J4726q9135Q7495M0741L0026
$$ y = [7258992, 6127540, 5403586, 4959808, 4532788, 4067596, 3860909, 3606404, 3359190, 3235602, 2915209, 2547059, 2332526, 2172218, 2096723, 2012173, 1926572, 1725412, 1516978, 1372920, 1353394, 1202653, 1169692, 1081175, 998663, 896324, 929109, 902481, 855927, 857616, 742925, 668664, 639399, 678136, 581945, 589471, 513163, 526298, 569380, 599944, 418989, 394975, 493122, 484514, 462406, 436071, 553779, 468964, 396515, 385762, 262655, 246460, 312317, 326568, 345514, 285366, 257390, 285238, 275060, 136496, 117347, 264665, 365991, 309468, 284112, 238242, 170385, 136993, 78045, 139328, 176391, 189934, 156916, 178934, 127456, 109603, 198666, 105559, 143791, 150036, 169861, 275884, 230004, 168327, 183053, 93918, 181413, 222154, 252180]
1998B52180j40842q2355J33745J1971r3477K9487k6608n9921J94220n3324l8014
1987A27062p8321J6993o0510L1400M2507j5718l8805J3934m5055J03576j4287
1976H2776M845J19867r7113q4553J06001k2073j45688L4570M1307L4446m1077
1965C3308K3525p9746j88O1192k852Q176J942J2754N4565k2179q1506k1298N041
1952g266J6160P7018o0823n3704N0558L790l1693m5708q122J0386j4287K8700
1940c4991M6306L5119m0461N8383j13213J19403m6270j15435O6733R737P1007
1929E6318J4317J4001n857j25153k7579Q9750k2681O3366m2087k7183j26204J59352
1917B0360O4717j20173n8315J70313N0805n8625j29919n7277n7734M8346Q8337
$$ y = [252180, 111338, 28983, 162728, 174699, 81222, 110709, 84101, 24180, 218400, 165076, 127062, 48741, 65734, 5224, 36624, 79131, 63413, 24608, 38542, -6513, 97063, 82776, 87621, 207488, 110375, 25822, 131823, 109750, -35938, -1368, 39939, 74385, 33308, 56833, -22913, -23101, 38091, 35239, 43415, 45357, 58111, 112676, 90497, 8991, -12307, -7266, 8894, 85912, 25089, -28615, 21943, 25733, -5960, -51668, -59790, -49404, -63691, -34991, 11315, 46434, 5973, 64356, -48857, 70546, 24276, -91159, -24426, -14689, 56318, 70635, 84636, 78779, -46374, -73953, 15797, -6884, 56482, 14395, -12788, -138992, 20360, 85077, -35096, -93411, 76902, 127707, 69082, -60837, -118114, -175848, -127502, -39165]
1906c9165R2023J4925r9423q910P2859R0440j51717O062n670l240l4203O4644
1894a375O853j5780o3330L177N3599m1933k1381o2712J3403L9458N5094P727N795
1881b1405O8851l9459R4240m7634p9906j2782M4110J35034K4785j01386J0797
1870G5245o2972n8773O1803K9477K9712m8385j7540m6852l3155Q9551m7984j0622
1858d0495l1075l166j3096P7203M3742o2832k5993o9390N8393l696J01821L463
1846C4879J70q7057j00823O8127O1392l6527K1386j8178K1071m350M4396l5966
1834c1480Q6865j08057Q2520M3249n4304o1018j4868J01869m2032J17604P236
1823A27584K8806k2132R180o6220j0406m7543j20819m2612O2490M4684J864O8272
$$ y = [-39165, 52858, 67783, -31640, -40550, 32309, 122749, -28968, -22906, -28576, -31816, -66019, -1375, 5478, -10302, -73632, -70455, -16856, -58789, -80170, -142882, -129479, -90021, -34927, -27200, -21405, 47446, 7987, 102227, 54593, -25313, -38095, 6015, 141049, 165834, 64448, 75245, 12273, -46500, 15303, 44780, 74492, 26107, 8567, -38285, -71440, 18111, -29873, -40495, -71570, -74736, -87832, -10629, 33113, -29719, -55712, -125102, -66709, -70405, 31416, 34879, 35049, -52008, -152831, -84704, -23312, -59839, -38453, -56631, -35560, -39910, 4486, -31480, 55385, -52672, 29848, 73097, 18793, -42225, -57093, 44776, 2744, 120348, 127584, 156390, 134258, 143438, 77218, 66812, 19269, -101550, -144162, -81672, -36988, -35124, 33148]
1811C3148n3507n9142o6602j1566K7760M212K7906O873m7775K8030L0562k8741
1799a08842N6794k9942R4371n566k303m6442K168P0862M011q1784O2658p9303
1787f3318k5479N0542j567O979J8377o8291m3248k252K5262J89966p3909n1564
1775c8502m4767O314R0543o9033L2682J3528m5420M73q4856O154J14506O0428
1763D2050j48765k0724P8483j3402j4782j5820K1049L5876J7601n025K979k2761
1751d3241L1861K2648l2361k3288k4406L3994j9622k8036N4344J7915P079m0741
1739d3854O1347q1070J5814K7790j0471j06448k8948l8801K9544J16119m8333
1728a07311o186J9411L4023k7995J6883j6383K6516J3119N3446o2259K8780n0838
$$ y = [33148, -20359, -79501, -146103, -157669, -129909, -125697, -97791, -90918, -138693, -110663, -80101, -108842, -52048, -81990, 12381, 6815, 4512, -41930, -39762, 31100, 35111, -46673, 15985, -63318, -88797, -38255, -39822, -32843, -14466, -82757, -126005, -128257, -102995, 86971, 13062, -38502, -83269, -76955, 13588, -55445, -22763, -9235, -54655, -54182, -139038, -132884, -18378, 42050, -106715, -127439, -48956, -62358, -77140, -92960, -71911, -36035, -18434, -23459, -20480, -43241, -11380, 11268, -21093, -44381, -68787, -34793, -54415, -82451, -28107, -10192, -3113, -43854, 17493, -63577, -47763, -19973, -30444, -136892, -165840, -204641, -175097, -58978, -107311, -113497, -94086, -60063, -88058, -71175, -87558, -61042, -47923, 5523, -56736, -27956, -78794]
1716g8794M4834L3068p6026j2771M1387M2733p7465j0184N5502L5275r9127k6809
1704a28377J32625K4722j09585l4556K1980j5121L5049l0321P9749q442l3678
1693f5955p468l9493n1367Q9006n3645J2395N1766o4983J14083R2245k4617p9916
1681b7949L6809p6608m1623L0327m1348M8895J0991M4292n0122O290L4437K105
1669b3504J3613J1483m0120j07010J4531J02254R552l694Q011o2416L3189n1244
1657i5355l7538P1443N3669l5467K9563O787P0183q7736j16558M4218J6397M2315
1645c8079J27699j1394j68683J3161K0106O6008k9829n7966m8559N6108n225q1188
1633a57841O0036P9021m530p8220q0355J55971M077m8565P6070o9109j15550J00557
$$ y = [-78794, -33960, -892, -76918, -89689, -48302, -5569, -83034, -93218, -37716, -2441, -101568, -128377, 4248, 28970, -80615, -115171, -93191, -108312, -73263, -103584, -23835, -32277, -65955, -73423, -112916, -164283, -75277, -128922, -116527, -64761, -129744, -15661, 76584, 51967, -27949, 8860, -67748, -109371, -79044, -120392, -71497, -60506, -16214, -66336, -60046, -25609, -23504, -9891, 1592, -38528, -145538, -131007, -28753, -19201, -22895, -14884, -77300, -44111, -95355, -132893, -61450, -7781, -43248, -13685, -6898, 63285, -24451, -141009, -96791, -80394, -38079, 89620, 78226, -90457, -77296, -57190, 8818, -21011, -78977, -127536, -71428, -76653, -157841, -97805, -18784, -23314, -101534, -181889, -25918, -21841, -70406, 5664, -63445, -178995, -78438]
1621g8438q489K0114M8661j2802O4742o362m649n4694J6140o3600l2934j07418
1609b19729J36303N6777o6656j25657R8827J7365N8172p0057O9272n0106L114
1598i2375J85854q3307M9497n5621j53565N9795m045L0352O0825j21411J760J6482
1586a05759O5824k0402J7573j1199P5257p0565j02752L5902Q4437O473p1422j6629
1574a13262L2467M7334k6843l136l0839P9399j3184N0455K5432n9420p6429j42098
1562b30124R4190K4307r833J49238l4675n1859Q4504p810K0318N2714j63885o5976
1550a38891N7327K3791k4126j1164k9188M1500n4921R409Q1914j31442L9282P6344
1538f0165j0277M4643K9333l2315K8527l3391q4141J07944k1324k1005J01178
$$ y = [-78438, -86927, -66813, -18152, -30954, 33788, 27426, 22777, -31917, -15777, -79377, -112311, -219729, -83426, -26649, -93305, -218962, -120135, -102770, -44598, -114655, -45383, -95489, -92375, 93479, 10172, 59669, 4048, -149517, -89722, -93767, -63415, -2590, -124001, -122241, -105759, -39935, -60337, -42764, -53963, 21294, -49271, -152023, -116121, -31684, -25211, -96633, -113262, -80795, -33461, -60304, -63440, -94279, -14880, -28064, 22391, 47823, -11597, -88026, -230124, -135934, -111627, -121460, 27778, -6897, -58756, 25748, 17938, 38256, 90970, -72915, -138891, -81564, -57773, -81899, -93063, -122251, -80751, -135672, -126263, -44349, -175791, -136509, -60165, -70442, -25799, 3534, -28781, -254, -33645, -117786, -9842, -31166, -52171, 49007]
1527D9007Q7722j00429r8415O0621L2150j23419o7860O0587K9091j25706R7996
1516i8655J44806r7572p4638l7597J9854N5354P6463m8122N2873m4671k8510n729
1504h6144L2347L3577K0418j50883L7654L9706L4324q8106J85638m7158k3931
1493a2558j5538n1959j4301l3964Q754o3248j1066R465R7437J02987j9723P298
1481C584k1690j10016N5047K2606j9020l870M4577L3489Q2798q8435j17438q35
1469a19203R0734q9980K3685L9551p1659k169n3514M7945O4612L2661j5140l4746
1457h7223j962N2980N2695l9598M2739l3858p282K522Q0751k6156o9524l9261
1445g3177M9306K8305p2227Q1787J9659p843r1161l4995K4107N0914o2279n1547
$$ y = [49007, 136729, 36300, -62115, -1494, 30656, -92763, -160623, -100036, -70945, -196651, -98655, 46151, -51421, -126059, -163656, -143802, -88448, -11985, -60107, -7234, -51905, -80415, -86144, -53797, -20220, 198, -150685, -113031, -73325, -39001, -127107, 58531, 11373, -12558, -28096, -80055, -94356, -128320, -119566, -182814, -193880, -184415, -86978, 16009, -3714, 3584, -18106, -128122, -73075, -50469, -69489, -73359, -28782, 4707, 87505, -930, -118368, -119203, -28469, -118449, -94764, -55213, -126872, -129041, -182555, -134610, -69998, -37337, -52477, -87223, -89185, -36205, 16490, -23108, 19631, -14227, -21509, -18987, 61764, 35608, -33916, -73177, -23871, 4434, -67793, 13994, 33653, 25810, -65351, -100346, -76239, -25325, -87604, -139151]
1433a39151J24389k3001p3251J14943l831j17671J4918n1705L5105o7321J6936
1422a69640Q7216L8580Q5835l2951p4049R4151L083n6250l033l1555o3129J01586
1410b0156J9718q1033M604K4774M0397q5830k1306j5358P8199N5490o2402J4490
1398d8413L8399M8713o1489k7477r927M4742n9583R611J12108n0698L7314m4527
1386a1227l5023J1710M0691j1670k732m0104K3206K9653J26943p2985o196L0147
1374H2413q3900n3986J534Q3155o8893n3841O4575N7898q9346J00193n858l0072
1362C872l6404M8267k6192n3580J18694l9808q6060k219M4431J05233j05323p6169
1350a05258L3261J9426r036j3356q8884j6696L9080L8120k4322k6076N1015J25572
$$ y = [-139151, -14762, -37763, -111014, 3929, 98, -117573, -102655, -154360, -119255, -186576, -169640, -82424, -43844, 41991, 9040, -65009, 29142, 32225, -24025, -27058, -58613, -121742, -20156, -438, -81471, -76867, -52093, -11696, -97526, -118832, -134190, -55991, -501, -62903, -48413, -10014, 38699, -22790, -50267, -60194, -15452, -75035, -65424, 46684, -4014, 33300, -11227, -46250, -34540, 6151, -5519, -8251, -48355, -25149, 4504, 131447, 58462, 52266, 82413, -1487, -55473, -53939, 29216, -39677, -93518, -28943, 28955, -60391, 39802, 33944, 3872, -32532, 15735, -10457, -64037, 54657, 14849, -71211, -73430, -28999, 76234, -29089, -105258, -71997, -52571, -61607, -74963, -163847, -180543, -141463, -103343, -127665, -153741, -102726, 22846]
1338B2846j28175n6361J46771M1753n3290K9752r500l7457n449j2876Q1058n9281
1326d0209o7684R3719q4517q0471O0893P0407P984k8026O7383k6065j4835M5966
1314D545K9128j23462N1868Q2824j13965l3283N6973Q2597n0465l4027p1172P0890
1302d7549N7333j32183J239O2394M770O6750O4677j5529q7404q5752P0508J6096
1290b4650J36398m7867o4414N935M120K1973O8955m9077l4273r3337M3535M5073
1278A2371J9885r3696M1501p7387m8088J20501J18945m0667k3666k3061k7603
1267b0965k4347P1128N6901M8553p0524r5760j9207K0812J56931n9833o2284L3923
1255C5328m864K3484l7029n6095K7199L0549L553p2921n9717P8092o262q6690
$$ y = [22846, -105329, -161690, -14919, 26834, -26456, 3296, -6204, -43661, -49110, -61986, 19072, -40209, -107893, -14174, -98691, -179162, -118269, -47862, -39878, -67904, -521, -26586, -41421, 4545, 33673, -89789, -37921, 44903, -69062, -102345, -45372, 37225, -13240, -47267, -118439, -47549, 9784, -122399, -121160, -58766, -53996, 12754, 77431, 61902, -25502, -111254, -40746, -24650, 111748, 63881, -533, 5402, 9522, 31495, 100450, 51373, 17100, -76237, -32702, 12371, 32256, -61440, -19939, -97326, -145414, -24913, 94032, 53365, 29699, 6638, -20965, -45312, 25816, 82717, 131270, 60746, -35014, -54221, -33409, 123522, 63689, 1405, 35328, 30464, 53948, 16919, -39176, -11977, 18572, 22125, -50796, -110513, -32421, -38683, -125373]
1243a25373N4550k1670J03311m0571j43006N9948O6634j5891j69k9566N0295O0901
1231A9393m4598r55k8186o074P7974p107p9375k9382K5725L4292L5935n1088o3460
1218a16906P0163O1634n758k4539L4387L9730p4045r264l6526M8246O5204m9835
1206B491M8218n692k5388M7085j17289P0906L7549r5678k6363l2040m2112L7271
1194a01042M8359l4571j16441N10K5824J47132l5071J1908k1148Q3891K2576M5979
1182G7906j2937k8140j4240p4612L899m7035K5169L4971l3389L0815m9806L0532
1170e6867K7845J6536n2825r510j4393j8027J9210J57n612K6542J0463l6944k1288
1157a14713J5407Q3400M1570O1624r5399j3779J6060N0766L561L2047p6028l5133
$$ y = [-125373, -70823, -92493, 10818, -29753, -172759, -112811, -46177, -62068, -62237, -91803, -41508, 19393, -25205, -26160, -54346, -60420, 17554, 10447, -68928, -98310, -72585, -38293, -2358, -53446, -116906, -46743, 14891, 9133, -15406, 18981, 58711, -15334, -24598, -61124, -12878, 52326, 2491, 50709, 45017, 19629, 66714, -50575, 20331, 57880, -37798, -64161, -96201, -138313, -101042, -52683, -87254, -203695, -203185, -177361, -30229, -65300, -53392, -74540, 9351, 31927, 77906, 64969, 36829, 22589, -52023, -48124, -95159, -69990, -35019, -68408, -37593, -87399, -56867, -29022, -12486, -65311, -74821, -89214, -107241, -88031, -87874, -93486, -66944, -56481, -93425, -114713, -99306, -15906, 25664, 87288, -8111, -21890, -5830, 44936, 48497, 80544, 4516, -30617]
1145c0617l7327K3805R7630k4137m2600k3699m5963Q270O862L9611L3108k6351
1133b1408J01039o515r2822n6316L5057k1744r809k0578O1745R6716N5720j13872
1121G213k9158J2574k2548J30863j43750l5344k7308Q3334n0347K5088r467j3459
1109g2309Q3460M161j43452k8103J51893O5321q7044l802L6904o5407m9042P8039
1097b9381J9175K3713j1556p9098k8374L1947N9047m6732m9525N1624K0180J5726
1085b3254l2544J4616l6736Q5690p272k3495K678q3313J18768Q5382n1444p0371
1073b1295N4193r3305o8899O8086O3387L4461M4557r0182M4469J8269q2808j567
1061c0634p3351J12363M6412o65n0404J1935k2855m2012K0332M2684k292J2264
$$ y = [-30617, -67944, -44139, 53491, 29354, -13246, -36945, -82908, -74638, -67776, -28165, 4943, -21408, 79631, 73116, -19706, -76022, -40965, -62709, -72518, -93096, -31351, 65365, 121085, 7213, -21945, -9371, -31919, 98944, -44806, -80150, -107458, -24124, -74471, -49383, -58850, -72309, 11151, 15312, -128140, -156243, -4350, 60971, -26073, -29875, 7029, -58378, -107420, -29381, -10206, 13507, 1951, -77147, -105521, -73574, -14527, -61259, -110784, -59160, -38980, -23254, -55798, -41182, -77918, 7772, 500, -22995, -20317, -103630, 15138, 100520, 49076, -21295, 32898, -60407, -129306, -61220, 2167, 36628, 81185, -8997, 35472, 53741, -29067, -30634, -103985, 8378, 54790, 54125, 3721, 15656, -7199, -49211, -28879, 13805, 11513, 23777]
1049B3777n7086m7297O3402o0253m5518M2783J7450K2743P7515K8466l075r0185
1037b7278P462o169Q3494q9450p2294n0435K6220O9041J53995p4732j12483L5506
1025e7123K1408O4579k8709K2310n9740R975J42707k7486l7614l4532K6168R445
1013E1388j0114K0482l2390n779l3634L1458l2078K2788N381o4815Q9223k4291
1001A7619o1150N4926K121r5235N0018L0522k6208m4986n322Q3737k6237j9676
989c9871r2712R3445l5892j1341K7483K9472m1406K3644J19216N0248j2290m8704
977F1292j8859j12031N37M9351M8960p3120r006K4632N8581r7717m343n2971k1955
964a46649R3254J08475n6746K6989m0745M3754k6361p2382J06721M6014l9445
$$ y = [23777, -33309, -80606, -17204, -77457, -122975, -80192, -62742, -39999, 37516, 65982, 62907, -27278, -19816, -25985, 57509, -31941, -104235, -154670, -128450, -59409, 94586, 19854, -92629, -57123, -35715, 28864, 155, 22465, -37275, -27300, 115407, 87921, 50307, 15775, 41943, 51388, 41274, 61756, 29366, 23587, -10047, 21411, -10667, 12121, 17502, -47313, 41910, 17619, -43531, 11395, 13516, -81719, -31701, -1179, -27387, -72373, -77695, 6042, -20195, -39871, -132583, -39138, -75030, -86371, -58888, -29416, -70822, -47178, 72038, 122286, 109996, 61292, 42433, -69598, -69061, -19710, 29250, -43870, -52876, -28244, 30337, -67380, -71723, -124694, -146649, -53395, 55080, -1666, 25323, -15422, 28332, 1971, -70411, 36310, 82324, 42879]
953D2879m3573J1111j1743J6843L82n7260m9565K5434J25371N4593r5964j27011
941a08503k6838J21236J3637J1403J6377k6202k9551r0261N1386P6992l3491J3635
929a0180l7021O767J14417m1150l2160L9815j18490l8213O7362O6041j8060M1409
917D0537r5696m4494O2710J6982j4649O4086q3958l3222J2856J24788l4954K3871
905C8857R564p3175p880P1544o3246N0413O377n348j3898l8567K1298n4340O2844
892D443K5241l5821M1688k2392l2247J2608j1742O433j1584O5294m4740j38942
880a41761O5590R283N4657j8550k7046O7349O464J28777k3299k8403k388p2243
868A8430m1890M0372k1299n692r6755J60873P7839p5956K22m1975j65598J65290
$$ y = [42879, -694, 10417, -1326, 15517, 15899, -41361, -90926, -65492, 59879, 114472, 18508, -108503, -135341, -14105, -468, 10935, 27312, 1110, -28441, -118702, -67316, 9676, -23815, -10180, -47201, -40434, 73983, 32833, 673, 40488, -78002, -116215, -48853, 17188, -872, 40537, -55159, -99653, -36943, -19961, -34610, 29476, -54482, -87704, -74848, 49940, 14986, 38857, 48421, -24754, -32634, 38910, -24336, 26077, 32454, 27106, 13208, -25359, -4061, -58401, 4443, 29684, -6137, 35551, 13159, -19088, -6480, -18222, -11789, -23373, 41921, -2819, -141761, -76171, -66888, -12231, -30781, -57827, 9522, 15986, 144763, 121464, 93061, 90673, 18430, -23460, 16912, -4387, -10079, -106834, 54039, 131878, 55922, 56144, 14169, -151429, 13861]
856A3861J07956j14436J025N1549J7270l9827K0096j841o6371o6936M5568n3287
844h5373J2711Q1566k9603k2431P429J28697N7273j27033q7102P4681n6500N637
832d0048O2220j42919K8383l5469l6468Q6118M8029J22013o1456K6849q1528M035
820b0241J05503n3883l5565J37207l3663J4475M9555n8741l3800j36809p5211
809a41173R0816K2798n1248m246L2270Q7190q4742K1210P7308J0389j34254O9886
797c796l1861j0006R7501N44m108O2786j83204l090K0881M8718L2377n9125j4743
784d7126l3419J07045j2884j8063P3905p4559l1560J8861n7935R469o0522J26108
772f80N804M1345K6293L905p5371o5752R1244N9805j04668n5394J7695n068J15908
$$ y = [13861, 121817, 7381, 8406, 59955, 77225, 37398, 57494, 55653, -10718, -77654, -32086, -85373, -72662, 8904, -20699, -43130, -35701, 92996, 150269, 23236, -63866, 10815, -45685, -40048, 22172, -120747, -92364, -127833, -164301, -78183, -30154, 91859, 30403, 57252, -24276, -20241, 85262, 31379, -4186, 133021, 99358, 113833, 163388, 104647, 70847, -65962, -141173, -50357, -27559, -78807, -83053, -50783, 36407, -48335, -27125, 50183, 60572, -73682, -3796, -35657, -45663, 51838, 52382, 48274, 111060, -72144, -75234, -54353, -5635, 26742, -32383, -47126, -80545, 26500, 13616, -4447, 69458, -5101, -36661, -17800, -75735, -66266, -126788, -680, 5124, 46469, 72762, 76667, 1296, -64456, 26788, 86593, -18075, -73469, -55774, -60842, 55066]
759E5066J08516j05746r8397J10255k8825Q002k9312J3506Q704o5086M8618N8322
747H3623m6199k0986J6643j7597M0606n0459q8539J16899J3982n0449L8311J5674
735E1509M5503O3921o5668l1419p3804j93415J3960J20276J36885k9003n340O0291
723I3696r710k7865m5621p9893M8069K5076k5334Q4357k9504m9486R845R4258
711H7888K4829q4883Q0420p4019m2933O1250K579K9089r670j5591N2884m6834
699F5009l6046m6264M2962Q9142m1797R892o497j8728N7721m3500o6084j5662
687i852J3231Q7110m8419j25425p1624L7034O9386R9897k0644Q942n6475L846
675a2993O8227Q470J8877l5576m1123m2443Q3645q3876m1175N6057m7518O020
$$ y = [55066, 163582, 57836, -40561, 69694, 40869, 48871, 19559, 33065, 41769, -23317, 25301, 83623, 37424, 16438, 33081, 15484, 56090, 5631, -82908, 33991, 47973, -2476, 35835, 51509, 97012, 160933, 95265, 63846, -9958, -203373, -189413, -69137, 67748, 38745, 33405, 93696, 83986, 56121, 10500, -69393, -21324, 3752, -21582, 62775, 33271, -16215, -6370, 87888, 112717, 27834, 108254, 34235, -8698, 52552, 55131, 84220, 74550, 58959, 111843, 65009, 28963, -17301, 25661, 114803, 73006, 82898, 76401, 57673, 115394, 71894, 5810, -9852, 3379, 90489, 42070, -83355, -154979, -117945, -48559, 51338, 30694, 39636, -16839, -12993, 55234, 63704, 82581, 47005, 5882, -36561, 47084, -36792, -77967, -21910, -69428, -63408]
663f3408m6721p6626R7225P2792j6706p232k6748K2843n9544M6173L7341m0135
651f0746O7835m3726k6561J7625j0280o4109j7975J24276R1048m5065N670J0254
639D8246o6936P435k4465Q8663j3652M0531k0639J4207n7730l6479Q7018p272
627E8927k4560J7621p5558L8433O1773j17K5921n6211l2932J073R169O7869J2741
614A04149l8323k7646K0446k5093M8674K6621j06927m9305O6918J72764k3532
603A68746n2750o1015k9582j0397L4653j17850M108J27160P2274j8862k7095O5268
591A54658j20034r922J38319j26790k135L4613l7464l8508k3826P214O4923k6716
579A4332K4362k6714p9486l4903P2204N1953r1333j1240J9013J30393P6752n0186
$$ y = [-63408, -110129, -186755, -89530, -16738, -33444, -40676, -67424, -44581, -104125, -57952, -20611, -60746, 7089, -36637, -63198, -45573, -55853, -119962, -137937, -13661, 77387, 32322, 37992, 48246, -18690, -11255, -35720, 52943, 39291, 79822, 59183, 73390, 15660, -20819, 66199, 58927, 34367, 51988, -23570, 14863, 76636, 76519, 102440, 46229, 13297, 14370, 23539, 91408, 104149, 65826, 38180, 58626, 33533, 82207, 108828, 1901, -47404, 19514, 192278, 168746, 115996, 54981, 25399, 15002, 49655, -68195, -64087, 63073, 135347, 116485, 89390, 154658, 34624, 24702, 163021, 36231, 34096, 68709, 31245, -7263, -31089, -23875, 41048, 14332, 38694, 11980, -67506, -102409, -30205, 21748, -69585, -80825, -61812, 68581, 145333, 95147]
567I5147q3085j14591J53847K3124L023J15506r8102r8971j0800N7842j32186
556h9246J0028J1642N63P3496M8228J03337o0854k8772L4972k4295l4871J5597
544E9825k3465j2838N815J3645l6588j38652Q8201M1662j0624k4727J7471p531
532b7806L3484J9042p9064J7799J06361J00786n6052n3567r469k9539n8809J45792
520A08958l0222o8510M2615m436K9558L9672J23797j63638p862K0236j4183M1252
508A17237k4758j7573k4266M0574K489m0641J8744j278k1776K3889o456p5028
496h843R487N739j0146J28611q5324j03707k239J42798Q5224k08640Q4975J15333
484A53268r9455o813J03041q6678o2138o0754M5305Q4776o222K5758l4672k688
$$ y = [95147, 12062, -102529, 51318, 74442, 77465, 192971, 94869, -4102, -14902, 42940, -89246, -79218, -67576, -67013, 6483, 54711, 158048, 97194, 68422, 103394, 79099, 44228, 59825, 36360, 23522, 29337, 42982, 6394, -132258, -44057, -2395, -13019, -37746, -20275, -27806, 5678, 24720, -54344, -36545, 69816, 170602, 114550, 60983, 51514, 21975, -36834, 108958, 78736, 10226, 52841, 48405, 77963, 117635, 241432, 77794, 69932, 90168, 75985, 117237, 92479, 74906, 50640, 91214, 93703, 53062, 71806, 70528, 48752, 72641, 66185, -8843, 644, 6383, -3763, 124848, 39524, -64183, -66422, 76376, 161600, -47040, 37935, 153268, 53813, 47000, 150041, 63363, 1225, -59529, -14224, 70552, 64330, 90088, 55416, 52728]
472E2728J83p1263n1166K4526J34497K0909n0238l6788O565P8286l3664r6302
460b1727j3937J44367j3619M8723N3191N5080j58830j07983O7982P9890k0526
449A12611o0686m3031M7169K369J0466k6132l1664J7710N9974L6479r423k661
437A13181K8255n0803l9829N1159q7048j4667m2136J17327Q7981m4125l4836o8316
425A6143K3490J2307n9316j5235k687O2981n8635Q2065M3519O5478r164M6188
413B07134q1913o8880J37817L3014n5404j89663Q6736j0007K2676J2438K3444
402A17392K4382k9517r5472J1626L7880l5743M1533M0208N3764K2654j2428p8973
390I7306m4635J8894j52348J1142J09585q800J12346r841m8672M0436l2421n9700
$$ y = [52728, 52911, -18352, -69518, -44992, 89505, 110414, 60176, 23388, 29953, 108239, 74575, -21727, -35664, 108703, 95084, 143807, 196998, 252078, 93248, -14735, 53247, 133137, 112611, 51925, 8894, 56063, 58432, 68898, 42766, 11102, 28812, 88786, 125265, 115842, 113181, 141436, 90633, 50804, 101963, 14915, 248, -41888, 75439, 163420, 119295, 84459, 16143, 39633, 51940, -7376, -22611, -25298, 37683, -20952, 61113, 104632, 170110, 160946, 207134, 125221, 56341, 194158, 227172, 171768, -17895, 68841, 58834, 81510, 93948, 117392, 141774, 112257, 16785, 28411, 66291, 30548, 72081, 112289, 166053, 188707, 176279, 97306, 52671, 71565, -80783, -69641, 39944, 31144, 143490, 133649, 84977, 125413, 92992, 33292]
378C3292M7448K2907K1825L6436K1320j05154m6193J30306O0198j60584n1541
367A0260j5201K9276J00321m8332r2001m174K4647m296j9421Q7156N1991j28408
355h182L5058J41676J3922j11516o1768k9704j9369J07112q003k2108Q7265l0463
343I3920k4695q5614M4048N1576P3697P522l1961L5324q3309j06431k8559N9305
331D823N6195K510j14936J04949N68l3890k8466P6463m0582j7379M1702n823o2061
318a5927o0146J46452j0463J09475k7031q4702m2252K2540o7053M6529k6786l7475
306d6839P6253m5941J10895j3304l870m2733l1870J1013J1776K7120o915K4998
294G0583n8648n3643N6165J965O4522j0892j4181L1898n5903k9590J340J08556
$$ y = [33292, 80740, 103647, 125472, 161908, 183228, 78074, 31881, 162187, 222385, 61801, 10260, -4941, 24335, 124656, 76324, -15677, -19851, 4796, 500, -18921, 68235, 120226, -8182, 26876, 168552, 182474, 70958, 9190, -20514, -39883, 67229, 59226, 37118, 124383, 93920, 69225, -16389, 27659, 79235, 152932, 160454, 128493, 163817, 80508, -25923, -54482, 4823, 61018, 63528, -51408, 53541, 54109, 20219, -8247, 68216, 27634, 10255, 51957, 46134, -15927, -76073, 70379, 59916, 169391, 142360, 57658, 15406, 37946, -29107, 17422, -9364, -46839, 29414, -16527, 94368, 81064, 77194, 34461, 2591, 13604, 25380, 52500, 45585, 70583, 11935, -41708, 14457, 16422, 80944, 70052, 55871, 87769, 31866, 2276, 3616, 112172]
282A12172k6276R8253n7988j37971P8877L8087J02202m7873r3772O0991l1018
271I5684n5581q1824K3772N1188n8717J9184l272K3951k5196Q8013j5744m8034
259A3424N6758k9525l7895M4562j1325O1791O2479j01771J7596J4100r0481N935
247E648n084l5937J54108P7499n2627l1412n4711j16346K8253M7204J319J07982
235A25896P2183o2898l4297q4056r7923L1243R6185M4683n4107J3273k6077l7549
223a3444M8200j3117k5439Q1017J6071k4193n4941j9945N4321Q3119m5016o6974
211A9659O7447P6896r3233l5781L7529m0119m9031j3781J10701m9576n7402m0512
199f7203J25696J51127k6712l8876o7432p7013M056l8124q389l2908K8257J10281
$$ y = [112172, 85896, 184149, 126161, -11810, 67067, 105154, 207356, 159483, 65711, 126702, 95684, 40103, -41721, -17949, 33239, -25478, -6294, -9566, 14385, -10811, 77202, 61458, 13424, 70182, 40657, 2762, 47324, 35999, 97790, 160269, 58498, 76094, 90194, -287, 5648, 564, -35373, 118735, 196234, 143607, 112195, 57484, -58862, -30609, 16595, 17914, 125896, 198079, 135181, 100884, 16828, -81095, -49852, 46333, 91016, 36909, 50182, 24105, -13444, 34756, 21639, -3800, 77217, 93288, 69095, 14154, -5791, 48530, 131649, 86633, 19659, 87106, 164002, 70769, 34988, 72517, 32398, -16633, -30414, 80287, 30711, -26691, -67203, 58493, 209620, 182908, 144032, 76600, -413, 3643, -34481, -42870, -75778, -47521, 62760]
187F2760m74m6954p7420l1608N5492J2306M7208n4719L9537L6961p3411K3755
175f567k2304k393R913j5649r600p2184J6298L3345K2918K9569j4061N4016N7333
162H0634j36173j9906m5507J3093M6634O1353o7757K2196J1669k1462J5137J2640
150b7449P5788l1218m5048K2913P1206p3345L0852r8901N4910P4143n1115k6337
138b3601o1L2903p759o3276O8422M3210M2004j66082j29900k1658R9678l4824
126a60944J08564L7055j8958M0765j1290j87835L4011J51335k7640O9301l5732
115a368m8558j13894K0573K6520J2440Q1139N9511o739r7947j0401L2192k6382
103g2914o016j806p942K9156n8328k3568J9789k9673L2909N526o7511K8470M4117
$$ y = [62760, 62286, 15332, -62088, -93696, -38204, -25898, 21310, -33409, 6128, 43089, -30322, -6567, -28871, -31264, -21351, -37000, -46600, -118784, -102486, -69141, -46223, -16654, -30715, 23301, 80634, -55539, -75445, -120952, -107859, -61225, 128, -67629, -45433, -33764, -55226, -40089, -27449, 48339, 17121, -27927, -5014, 66192, -7153, 23699, -75202, -20292, 53851, 2736, -23601, -23662, 9241, 1482, -61794, 6628, 49838, 91842, -74240, -204140, -225798, -126120, -160944, -52380, -15325, -34283, 6482, -4808, -192643, -158632, -7297, -34937, 34364, -1368, -49926, -163820, -143247, -116727, -104287, -23148, 36363, 29624, -68323, -78724, -46532, -72914, -78930, -80736, -88678, -59522, -117850, -141418, -121629, -151302, -118393, -112867, -180378, -151908, -107791]
90a07791l456k6974J900N2124M996k4225m7513m3551L2155j548K7316q519k5132
77a70218J8142k4171m8729k7471n035N6868J3038m2566m4359J0643J02753k6714
65a87819M945m0721k975J6532L117n7384P7055n0292j0225L1041M069j0432J08913
52a14176l0236M489m1479j19501l265O9929R8565K1362r5815o086K1732l295r0310
39b88086j0293P9282o06M168K6476K1014m1395j6422o9449L6798m6157K111N189
26b97370k3893K6047K3732q149L48l6271P631K6479K0645l8944j6371O9777m1303
13b87642j8479n2377j6983R513p7215N8450o2637L6262Q2656j2657m7039l5155
1d23303K7927
$$ y = [-107791, -111247, -138221, -136321, -84197, -79201, -103426, -150939, -194490, -162335, -163883, -136567, -145086, -170218, -152076, -176247, -224976, -252447, -257482, -200614, -187576, -230142, -274501, -263858, -161105, -187819, -182874, -223595, -226570, -210038, -206921, -264305, -187250, -237542, -247767, -216726, -212657, -223089, -114176, -144412, -139923, -181402, -300903, -304168, -234239, -135674, -114312, -210127, -216213, -194481, -197776, -288086, -298379, -219097, -219703, -215535, -189059, -168045, -209440, -225862, -295311, -258513, -304670, -302559, -297370, -321263, -295216, -271484, -279633, -279285, -315556, -307925, -281446, -260801, -299745, -316116, -246339, -287642, -306121, -358498, -375481, -365968, -443183, -384733, -447370, -411108, -328452, -341109, -388148, -423303, -395376]
0c95376
$$ y = [-395376]
$$ Imaginary data points
##PAGE= N=2
$$ [...]
##END NTUPLES=NMR SPECTRUM
##END=
