##TITLE=1H_EC-3296(X-1)
 CDCl3
 8 sc, 
 4.7.2023
##JCAMPDX= 6.0         $$ Bruker NMR JCAMP-DX V2.0
##DATA TYPE= NMR SPECTRUM
##DATA CLASS= NTUPLES
##ORIGIN= UXNMR, Bruker Analytische Messtechnik GmbH
##OWNER= root
$$ XWIN-NMR		Version 3.5
$$ Tue Jul  4 13:59:24 2023 Russian Standard Time (UT+4h)  she@DPX200
##.OBSERVE FREQUENCY= 200.13135
##.OBSERVE NUCLEUS= ^1H
##.ACQUISITION MODE= SIMULTANEOUS
##.ACQUISITION SCHEME= undefined
##.AVERAGES= 8
##.DIGITISER RES= 18
##SPECTROMETER/DATA SYSTEM= spect
##.PULSE SEQUENCE= zg30
##.SOLVENT NAME= CDCl3
##.SHIFT REFERENCE= (INTERNAL, CDCl3, 0, 15.7215)
##AUDIT TRAIL= $$ (NUMBER, WHEN, WHO, WHERE, WHAT)
$$ ##TITLE= Audit trail, XWIN-NMR		Version 3.5
$$ ##JCAMPDX= 5.01
$$ ##ORIGIN= Bruker BioSpin GmbH
$$ ##OWNER= she
$$ F:/spectra/data/she/nmr/H-F/1/pdata/1/auditp.txt
$$ ##AUDIT TRAIL=  $$ (NUMBER, WHEN, WHO, WHERE, WHAT)
(   1,<2023-07-04 13:57:59.73 +0400>,<she>,<DPX200>,
      <created by zg, POWCHK disabled, PULCHK disabled
       configuration hash MD5:
       00 E9 B6 7A A2 85 ED C7 34 08 36 98 17 FE 4E 26
       data hash MD5: 16K
       8F 57 9C 99 D7 A3 7C BC F6 D4 6F CB E1 45 2D 4E>)
(   2,<2023-07-04 13:58:04.59 +0400>,<she>,<DPX200>,
      <Start of raw data processing
       efp BC_mod = 2 LB = 0.24 FT_mod = 6 PKNL = 1 PHC0 = -20631.31 PHC1 = 9.852719 SI = 16K 
       data hash MD5: 16K
       18 92 21 E0 79 07 6D AF 27 62 1E A6 6C 3A 09 3A>)
(   3,<2023-07-04 13:58:25.82 +0400>,<she>,<DPX200>,
      <pk PHC0 = 2.377908 PHC1 = -2.2 
       data hash MD5: 16K
       1A 9F 4C 4C 21 24 33 7A 71 6F 98 7F FF E7 F8 1C>)
(   4,<2023-07-04 13:58:29.42 +0400>,<she>,<DPX200>,
      <abs ABSG = 5 
       data hash MD5: 16K
       8A 8A 7B A7 33 EA EC 4C 80 FA 99 F4 A1 8F B2 39>)
$$ ##END=
$$ 
$$ hash MD5
$$ 7B 5F 29 86 38 D9 F3 4D BE F0 34 CD 76 34 2D 6E
##$RELAX= 
##$RELAX= 
##$RELAX= 
##$RELAX= 
##$RELAX= 
##$RELAX= 
$$ Bruker specific parameters
$$ --------------------------
##$DU= <F:/spectra>
##$EXPNO= 1
##$NAME= <H-F>
##$PROCNO= 1
##$TYPE= <nmr>
##$USER= <she>
##$AMP= (0..31)
100 100 100 100 100 100 100 100 100 100 100 100 100 100 100 100 100 100 
100 100 100 100 100 100 100 100 100 100 100 100 100 100 
##$AQSEQ= 0
##$AQ_mod= 1
##$AUNM= <au_zg>
##$AUTOPOS= <>
##$BF1= 200.13
##$BF2= 200.13
##$BF3= 200.13
##$BF4= 200.13
##$BF5= 200.13
##$BF6= 200.13
##$BF7= 200.13
##$BF8= 200.13
##$BYTORDA= 1
##$CFDGTYP= 0
##$CFRGTYP= 5
##$CHEMSTR= <none>
##$CNST= (0..31)
1 1 145 1 1 1 1 1 1 1 1 1 1 1 1 1 1 1 1 1 1 1 1 1 1 1 1 1 1 1 1 1 
##$CPDPRG= <>
##$CPDPRG1= <>
##$CPDPRG2= <>
##$CPDPRG3= <>
##$CPDPRG4= <mlev>
##$CPDPRG5= <mlev>
##$CPDPRG6= <mlev>
##$CPDPRG7= <mlev>
##$CPDPRG8= <mlev>
##$CPDPRGB= <>
##$CPDPRGT= <>
##$D= (0..31)
0 1.2 0 0 0 0 0 0 0 0.06 0 0.03 0 0 0 0 0.0002 0 0 0 0 0 0 0 0 0 0 0 0 
0 0 0 
##$DATE= 1688464679
##$DBL= (0..7)
120 120 120 120 120 120 120 120 
##$DBP= (0..7)
150 150 150 150 150 150 150 150 
##$DBP07= 0
##$DBPNAM0= <>
##$DBPNAM1= <>
##$DBPNAM2= <>
##$DBPNAM3= <>
##$DBPNAM4= <>
$$ [...]
##$SUBNAM3= <"">
##$SUBNAM4= <"">
##$SUBNAM5= <"">
##$SUBNAM6= <"">
##$SUBNAM7= <"">
##$SUBNAM8= <"">
##$SUBNAM9= <"">
##$SW= 18.05172834244
##$SWIBOX= (0..15)
0 0 2 0 0 0 0 0 0 0 0 0 0 0 0 0 
##$SW_h= 3612.71676300578
##$TD= 16384
##$TD0= 1
##$TE= 0
##$TE2= 300
##$TE3= 300
##$TEG= 300
##$TL= (0..7)
0 120 120 120 120 120 120 120 
##$TP= (0..7)
150 150 150 150 150 150 150 150 
##$TP07= 0
##$TPNAME0= <>
##$TPNAME1= <>
##$TPNAME2= <>
##$TPNAME3= <>
##$TPNAME4= <>
##$TPNAME5= <>
##$TPNAME6= <>
##$TPNAME7= <>
##$TPOAL= (0..7)
0.5 0.5 0.5 0.5 0.5 0.5 0.5 0.5 
##$TPOFFS= (0..7)
0 0 0 0 0 0 0 0 
##$TUNHIN= 0
##$TUNHOUT= 0
##$TUNXOUT= 0
##$USERA1= <user>
##$USERA2= <user>
##$USERA3= <user>
##$USERA4= <user>
##$USERA5= <user>
##$V9= 5
##$VALIST= <valist>
##$VCLIST= <CCCCCCCCCCCCCCC>
##$VD= 0
##$VDLIST= <DDDDDDDDDDDDDDD>
##$VPLIST= <PPPPPPPPPPPPPPP>
##$VTLIST= <TTTTTTTTTTTTTTT>
##$WBST= 1024
##$WBSW= 4
##$XGAIN= (0..3)
0 0 0 0 
##$XL= 0
##$YL= 0
##$YMAX_a= 602256
##$YMIN_a= -845288
##$ZGOPTNS= <>
##$ZL1= 120
##$ZL2= 120
##$ZL3= 120
##$ZL4= 120
##$ABSF1= 15.74358
##$ABSF2= -2.30827
##$ABSG= 5
##$ABSL= 3
##$ALPHA= 0
##$AQORDER= 0
##$ASSFAC= 0
##$ASSFACI= 0
##$ASSFACX= 0
##$ASSWID= 0
##$AUNMP= <proc_1d>
##$AZFE= 0.1
##$AZFW= 0.1
##$BCFW= 0
##$BC_mod= 2
##$BYTORDP= 0
##$COROFFS= 0
##$CY= -3
##$DATMOD= 1
##$DC= 0
##$DFILT= <>
##$DTYPP= 0
##$F1P= 0
##$F2P= 0
##$FCOR= 1
##$FTSIZE= 16384
##$FT_mod= 6
##$GAMMA= 0
##$GB= 0
##$INTBC= 1
##$INTSCL= 3.70164e-10
##$ISEN= 128
##$LB= 0.24
##$LEV0= 0
##$LPBIN= 0
##$MAXI= 10000
##$MC2= 0
##$MEAN= 0
##$ME_mod= 0
##$MI= 1.114404
##$NCOEF= 0
##$NC_proc= -4
##$NLEV= 6
##$NOISF1= 3.799351
##$NOISF2= 2.8
##$NSP= 0
##$NTH_PI= 0
##$NZP= 0
##$OFFSET= 15.72155
##$PC= 1
##$PHC0= -20628.93
##$PHC1= 7.652719
##$PH_mod= 1
##$PKNL= yes
##$PPARMOD= 0
##$PSCAL= 0
##$PSIGN= 0
##$REVERSE= no
##$SF= 200.130010003971
##$SI= 16384
##$SIGF1= 3
##$SIGF2= 2
##$SINO= 5.538805
##$SIOLD= 16384
##$SREGLST= <1H.CDCl3>
##$SSB= 0
##$STSI= 16384
##$STSR= 0
##$SW_p= 3612.71676300578
##$SYMM= 0
##$S_DEV= 0
##$TDeff= 16384
##$TDoff= 0
##$TI= <>
##$TILT= no
##$TM1= 0
##$TM2= 0
##$TOPLEV= 0
##$USERP1= <user>
##$USERP2= <user>
##$USERP3= <user>
##$USERP4= <user>
##$USERP5= <user>
##$WDW= 1
##$XDIM= 16384
##$YMAX_p= 270249741
##$YMIN_p= -156352
$$ End of Bruker specific parameters
$$ ---------------------------------
##NTUPLES= NMR SPECTRUM
##VAR_NAME=  FREQUENCY,     SPECTRUM/REAL,   SPECTRUM/IMAG
##SYMBOL=    X,             R,               I
##VAR_TYPE=  INDEPENDENT,   DEPENDENT,       DEPENDENT
##VAR_FORM=  AFFN,          ASDF,            ASDF
##VAR_DIM=   16384,         16384,           16384
##UNITS=     HZ,            ARBITRARY UNITS, ARBITRARY UNITS
##FACTOR=    0.220516191357247, 1,           1
##FIRST=     3146.35395633494, 0,            0
##LAST=      -466.362806670843, 0,           0
##MIN=       -466.362806670843, -156352,     0
##MAX=       3146.35395633494, 270249741,    0
$$ Real data points
##PAGE= N=1
##DATA TABLE= (X++(R..R)), XYDATA
$$ [...]
$$ plain form
6673 130627 131597 142837 152573 131442 111867 100339 103682 108652 105188 87267 63272 61336 69859
6660 69859 58948 65952 96762 111381 87671 86475 87356 83110 88191 72173 64443 61719 59450 45565
6646 45565 61095 44470 56041 50799 41487 49140 48713 37541 18023 37130 64125 52091 44123
6633 44123 60177 42235 21865 32939 30118 21365 15063 17495 -8024 10550 14651 13970 27733
6620 27733 27027 15715 14099 34207 21762 25141 41602 19783 -11055 18787 11874 15572 -3906
6607 -3906 9489 34093 50560 37692 26126 60421 51769 30887 26905 39243 40331 68886 65191
6594 65191 52819 17300 5345 14341 4359 -1590 2186 18942 -7669 6546 19087 39251 63334
6581 63334 72501 38361 38950 76310 77164 101295 91569 86186 105463 113821 82479 67046 64923 59469
$$ packed form
6673A30627R70J1240R736k1131j9575j1528L343M970l464j7921k3995j936Q523
6660F9859j0911P004L0810J4619k3710j196Q81m246N081j6018p730k724k269j3885
6646D5565J5530j6625J1571n242r312P653m27j1172j9518J9107K6995j2034p968
6633D4123J6054j7942k0370J1074k821q753o302K432k5519J8574M101o81J3763
6620B7733p06j1312j616K0108j2445L379J6461k1819l0838K9842o913L698j9478
6607c906J3395K4604J6467j2868j1566L4295q652k0882l982J2338J088K8555l695
6594F5191j2372l5519j1955Q996r982n949L776J6756k6611J4215J2541K0164K4083
6581F3334R167l4140N89L7360Q54K4131r726n383J9277Q358l1342j5433k123n454
$$ plain form
6567 59469 59508 61088 48090 54150 71881 87227 82342 49589 50225 54634 53443 57868 61517 46111
6553 46111 60196 86000 79458 79164 68698 45747 46733 48618 46100 71429 88813 98697 75740
6540 75740 74616 77355 81977 89507 90503 102388 81323 100122 90197 128018 129384 150634 179089
6527 179089 161815 179980 168563 162153 158973 183500 200087 198184 220270 223741 231587 265119 270749
6514 270749 268023 302860 359015 363289 349013 360726 390493 407275 429929 433435 443411 477134
6502 477134 497754 558486 582024 626114 710383 763008 835176 915507 1011722 1147293 1311593
6491 1311593 1460666 1681455 1943250 2257802 2685957 3200824 3788360 4343476 4819360 4939180
6481 4939180 4676952 4110076 3421622 2780813 2257839 1878440 1569863 1336224 1154679 1028095
$$ packed form
6567E9469L9J580j2998O060J7731J5346m885l2753O36M409j191M425L649j5406
6553D6111J4085K5804o542k94j0466k2951R86J885k518K5329J7384R884k2957
6540G5740j124K739M622P530R96J1885k1065J8799r925L7821J366K1250K8455
6527A79089j7274J8165j1417o410l180K4527J6587j903K2086L471P846L3532N630
6514B70749k726L4837N6155M274j4276J1713K9767J6782K2654L506R976L3723
6502D77134K0620O0732K3538M4090Q4269N2625P2168Q0331R6215J35571J64300
6491A311593J49073K20789K61795L14552M28155N14867N87536N55116M75884J19820
6481D939180k62228n66876o88454o40809n22974l79399l08577k33639j81545j26584
$$ plain form
6471 1028095 872357 764775 708694 646461 561204 510482 496223 464855 411319 383133 408274
6460 408274 347045 329507 336335 324063 308246 281808 275748 257570 233368 197356 183428 174912
6448 174912 158156 147535 158690 151101 135807 117692 136268 110703 91114 77951 62823 64923
6436 64923 78574 76812 78532 70226 60932 63090 31651 45819 62793 37631 41196 29475 35160
6423 35160 78320 58048 41143 35789 39757 60491 48318 48570 43469 51250 73966 75907 77071
6410 77071 97881 98346 107305 115524 121439 106883 120841 130577 116051 146320 142778 119455 143440
6397 143440 143598 158555 160176 132261 139874 145855 140961 160883 205588 229523 287718 352704 429523
6384 429523 508403 584517 632950 644704 600984 542431 455344 353924 296306 243926 175408
$$ packed form
6471A028095j55738j07582n6081o2233q5257n0722j4259l1368n3536k8186K5141
6460D08274o1229j7538O828j2272j5817k6438o060j8178k4202l6012j3928q516
6448A74912j6756j0621J1155p589j5294j8115J8576k5565j9589j3163j5128K100
6436F4923J3651j762J720q306r294K158l1439J4168J6974k5162L565j1721N685
6423C5160M3160k0272j6905n354L968K0734j2173K52n101P781K2716J941J164
6410G7071K0810M65Q959Q219N915j4556J3958R736j4526L0269l542k3323K3985
6397A43440J58J4957J621k7915P613N981m894J9922M4705K3935N8195O4986P6819
6384D29523P8880P6114M8433J1754m3720n8553q7087j01420n7618n2380o8518
$$ plain form
6373 175408 138697 135331 122577 95622 75691 67645 52294 46247 41160 20087 18470 18251 26374
6360 26374 11004 16867 11681 13925 9062 9490 13705 16967 24307 29076 7992 32316 42479 42317
6346 42317 50887 60725 58425 71961 80266 73518 72322 44581 57715 43326 25702 20497 27772
6333 27772 9705 4455 18020 11387 5519 7659 39459 54072 61862 51676 41671 41109 34220
6320 34220 25933 49472 62130 55893 86755 101512 106201 122264 176736 189653 226306 282128
6308 282128 323718 355833 408678 450479 434509 414745 365760 311684 253028 198094 145723 132547
6296 132547 102431 74743 77923 44262 18423 2974 -10426 -13051 -28722 -28862 -42604 -51060 -33911
6283 -33911 -36939 -20217 -29323 -30994 -54547 -60329 -72354 -59922 -69875 -71072 -68642 -67372 -62578 -98566
$$ packed form
6373A75408l6711l366j2754k6955j9931q046j5351o047n087k1073j617k19Q123
6360B6374j5370N863n186K244m863M28M215L262P340M769k1084K4324J0163j62
6346D2317Q570R838k300J3536Q305o748j196k7741J3134j4389j7624n205P275
6333B7772j8067n250J3565o633n868K140L1800J4613P790j0186j0005n62o889
6320C4220q287K3539J2658o237L0862J4757M689J6063N4472J2917L6653N5822
6308B82128M1590L2115N2845M1801j5970j9764m8985n4076n8656n4934n2371j3176
6296A32547l0116k7688L180l3661k5839j5449j3400k625j5671j40j3742q456J7149
6283c3911l028J6722r106j671k3553n782j2025J2432r953j197K430J270M794l5988
$$ plain form
6269 -98566 -75966 -53176 -62275 -58336 -65035 -51025 -71193 -85959 -77681 -104099 -99990 -68317 -62570
6256 -62570 -75519 -74637 -82378 -74557 -76955 -122441 -121456 -91914 -76726 -101054 -112637 -103419 -114911
6243 -114911 -109538 -86228 -105672 -106406 -88698 -96292 -123133 -117735 -113722 -129928 -127851 -106923 -112742
6230 -112742 -102351 -85905 -112405 -98174 -98020 -120092 -149472 -141219 -101647 -80715 -96231 -131609
6218 -131609 -102356 -73417 -88408 -99319 -100541 -111104 -96721 -91767 -121162 -121953 -108715 -111843 -101579
6205 -101579 -119369 -137468 -119165 -121047 -117848 -107274 -90077 -132833 -144595 -97333 -90942 -129372
6193 -129372 -117496 -94451 -110643 -110796 -111983 -143045 -124686 -118239 -99309 -110537 -88146 -102135
6181 -102135 -103052 -90728 -126324 -115320 -120328 -128770 -131077 -117347 -129381 -124375 -126129 -125769 -107534
$$ packed form
6269i8566K2600K2790r099L939o699J4010k0168j4766Q278k6418M109L1673N747
6256f2570j2949Q82p741P821k398m5486R85K9542J5188k4328j1583R218j1492
6243a14911N373K3310j9444p34J7708p594k6841N398M013j6206K077K0928n819
6230a12742J0391J6446k6500J4231J54k2072k9380Q253L9572K0932j5516l5378
6218a31609K9253K8939j4991j0911j222j0563J4383M954k9395p91J3238l128J0264
6205a01579j7790j8099J8303j882L199J0574J7197m2756j1762M7262O391l8430
6193a29372J1876K3045j6192j53j187l1062J8359O447J8930j1228K2391j3989
6181a02135r17J2324l5596J1004n008q442k307J3730j2034N006j754L60J8235
$$ plain form
6168 -107534 -132922 -116752 -156352 -147424 -94799 -108170 -140152 -132250 -109222 -119483 -133437 -109812
6156 -109812 -91587 -94604 -77553 -85186 -100422 -90422 -90848 -63067 -20598 -30692 -27679 -50108 -75574
6143 -75574 -77108 -108260 -109393 -109225 -90054 -86961 -97235 -124050 -121813 -112734 -121844 -114437 -110787 -100004
6129 -100004 -104166 -120066 -144337 -108272 -107083 -98261 -86791 -103079 -101147 -104535 -108651 -110356 -115322
6116 -115322 -118229 -119118 -114261 -121030 -119171 -128676 -102824 -102309 -103059 -107881 -117084 -105843 -96930 -92926 -95295
6101 -95295 -113327 -116369 -111083 -115564 -125395 -117699 -114194 -117280 -107980 -108157 -114044 -95878 -92775 -95834
6087 -95834 -95300 -82998 -93936 -103746 -95819 -104834 -85566 -73480 -71283 -93822 -104043 -90504 -86030
6074 -86030 -83175 -73739 -79534 -84887 -96300 -83680 -56665 -84589 -106151 -95803 -93656 -91790 -102187
$$ packed form
6168a07534k5388J6170l9600Q928N2625j3371l1982P902K3028j0261j3954K3625
6156a09812J8225l017J7051p633j5236J0000m26K7781M2469j0094L013k2429k5466
6143g5574j534l1152j133J68J9171L093j0274k6815K237R079r110P407L650J0783
6129a00004m162j5900k4271L6065J189Q822J1470j6288J932l388m116j705m966
6116a15322k907q89M857o769J859r505K5852N15p50m822r203J1241Q913M004k369
6101i5295j8032l042N286m481r831P696L505l086R300j77n887J8166L103l059
6087i5834N34J2302j0938r810P927r015J9268J2086K197k2539j0221J3539M474
6074h6030K855R436n795n353j1413J2620K7015k7924k1562J0348K147J866j0397
$$ plain form
6061 -102187 -117929 -92397 -92441 -86607 -104785 -104941 -65765 -62263 -72405 -70399 -45969 -45003 -51772 -32939
6047 -32939 -12112 1139 2525 5708 17707 18248 -11089 -12945 -14654 -19773 -52225 -79935 -61461
6034 -61461 -70095 -79098 -94868 -78027 -54289 -49258 -54838 -74248 -71996 -58146 -63730 -57331 -23954
6021 -23954 19500 10321 12727 52695 92231 110987 107991 108160 86570 42492 25049 19142 607
6008 607 3967 -13340 -47097 -73209 -44867 -34496 -32646 -40254 -70589 -72482 -66254 -49652 -39772
5995 -39772 -6668 -36551 -36298 -14506 -16775 -27849 -25320 -18940 11259 14042 8912 18869 -7568
5982 -7568 -17779 -18558 -28406 -10489 6410 -16326 -20933 -15494 -51150 -68633 -73949 -61337 -60204
5969 -60204 -58098 -75858 -87106 -77958 -71637 -53776 -83631 -91443 -76916 -71201 -83074 -77106 -74301
$$ packed form
6061a02187j5742K5532m4N834j8178j56L9176L502j0142K006K4430R66o769J8833
6047c2939K0827J3251J386L183J1999N41k9337j856j709n119l2452k7710J8474
6034f1461q634r003j5770J6841K3738N031n580j9410K252J3850n584O399L3377
6021b3954M3454r179K406L9968L9536J8756k996J69k1590m4078j7443n907j8535
6008F07L360j7307l3757k6112K8342J0371J850p608l0335j893O228J6602R880
5995c9772L3104k9883K53K1792k269j1074K529O380L0199K783n130R957k6437
5982g568j0211p79r848J7917J6899k2736m607N439l5656j7483n316J2612J133
5969f0204K106j7760j1248R148O321J7861k9855p812J4527N715j1873N968K805
$$ plain form
5956 -74301 -62869 -41963 -40635 -46290 -44466 -44014 -44764 -78628 -59756 -56425 -68108 -78829 -87444 -72097
5942 -72097 -54620 -73017 -80849 -55389 -61226 -60546 -33684 -23795 -37520 -51620 -70315 -61246 -56008
5929 -56008 -74358 -84962 -53540 -54083 -45180 -50337 -68734 -27032 833 -19271 -8872 -6095 716
5916 716 20538 26732 -3817 -11304 10079 1778 -20185 -7894 -25314 -20829 5349 4645 -23446
5903 -23446 -47734 -5706 22118 25754 3327 28185 12084 4921 28498 39504 29590 10415
5891 10415 19981 45293 82736 83580 113448 138237 144224 152014 129844 102350 84462 69643 59741
5878 59741 67437 84769 54696 14291 31292 49311 43920 42619 29692 36360 73353 48749 72424
5865 72424 73871 59236 94728 112740 144224 156651 147307 158690 197121 228532 306364 369389
$$ packed form
5956g4301J1432K0906J328n655J824M52p50l3864J8872L331j1683j0721q615J5347
5942g2097J7477j8397p832K5460n837O80K6862R889j3725j4100j8695R069N238
5929e6008j8350j0604L1422n43Q903n157j8397M1702K7865k0104J0399K777O811
5916G16J9822O194l0549p487K1383q301k1963J2291j7420M485K6178p04k8091
5903b3446k4288M2028K7824L636k2427K4858j6101p163K3577J1006r914j9175
5891A0415R566K5312L7443Q44K9868K4789N987P790k2170k7494j7888j4819r902
5878E9741P696J7332l0073m0405J7001J8019n391j301j2927O668L6993k4604K3675
5865G2424J447j4635L5492J8012L1484J2427r344J1383L8431L1411P7832O3025
$$ plain form
5853 369389 425428 441300 358719 300745 220484 163513 152977 101335 63099 93362 91997 79423
5841 79423 78156 94686 78861 66363 61868 45137 65479 78537 99565 108083 115234 120435 134386
5828 134386 143861 161249 194907 221860 257002 308397 355253 386505 415452 353204 283231 227027
5816 227027 176705 124824 94547 78568 68015 65518 64028 51596 50225 37668 40734 49427 43500
5803 43500 53920 56304 54683 36062 41777 35168 58401 76660 89478 72668 70498 76778 110936
5790 110936 122878 147623 159804 115804 84614 78551 47451 29656 12554 -3929 4466 22778
5778 22778 30857 38833 19033 9620 -18779 -31284 -1819 29440 29109 7717 -5640 11448 14658
5765 14658 -2056 18827 -332 -6207 31991 53256 24301 26380 -25293 -21183 -4093 -16955
$$ packed form
5853C69389N6039J5872q2581n7974q0261n6971j0536n1642l8236L0263j365j2574
5841G9423j267J6530j5825j2498m495j6731K0342J3058K1028Q518P151N201J3951
5828A34386R475J7388L3658K6953L5142N1395M6856L1252K8947o2248o9973n6204
5816B27027n0322n1881l0277j5979j0553k497j490j2432j371j2557L066Q693n927
5803D3500J0420K384j621j8621N715o609K3233J8259J2818j6810k170O280L4158
5790A10936J1942K4745J2181m4000l1190o063l1100j7795j7102j6483Q395J8312
5778B2778Q079P976j9800r413k8399j2505K9465L1259l31k1392j3357J7088L210
5765A4658j6714K0883j9159n875L8198K1265k8955K079n1673M110J7090j2862
$$ plain form
5753 -16955 151 12445 19452 -4974 9462 3917 3496 14898 25818 501 -17901 7195 33230
5740 33230 48428 14143 25903 27145 25725 29691 56100 56169 75236 63101 93228 107260 153620
5727 153620 146908 140986 125376 120928 111372 101553 103629 76827 87568 58177 59058 61198 37848
5714 37848 38153 31804 16998 7657 9584 26826 14828 16935 20108 31624 30303 13153 2010
5701 2010 11877 -24574 -2383 96 -3567 3708 37577 61306 60731 41285 19982 -5545 -6681
5688 -6681 -20909 -10666 -5313 -1313 -6650 -18554 -9086 -16176 -26246 -23003 904 17746 2808
5675 2808 -34117 -34949 -23724 -29975 -48703 -42288 -20976 -20452 -6924 -8027 -6170 6047 25283 29720
5661 29720 34746 18203 3505 9175 19681 31149 17722 -15432 -1685 14953 1279 -12494
$$ packed form
5753a6955J7106J2294P007k4426J4436n545m21J1402J0920k5317j8402K5096K6035
5740C3230J5198l4285J1760J242j420L966K6409O9J9067j2135L0127J4032M6360
5727A53620o712n922j5610m448r556r819K076k6802J0741k9391Q81K140k3350
5714C7848L05o349j4806r341J927J7242j1998K107L173J1516j321j7150j1143
5701B010R867l6451K2191K479l663P275L3869K3729n75j9446k1303k5527j136
5688f681j4228J0243N353M000n337j1904R468p090j0070L243K3907J6842j4938
5675B808l6925q32J1225o251j8728O415K1312N24J3528j103J857J2217J9236M437
5661B9720N026j6543j4698N670J0506J1468j3427l3154J3747J6638j3674j3773
$$ plain form
5649 -12494 -2654 -14138 -9714 -34063 -26741 -3242 -7477 -2198 5338 1111 -14683 10811 12293
5636 12293 5614 8331 8833 10830 22458 11205 27060 46134 29610 32018 25199 2362 4668
5623 4668 1287 1850 -12943 -10272 -37610 -45240 3173 6259 5001 26740 19309 11573 7494 19319
5609 19319 -8320 18402 12844 -8971 9914 5193 5976 -12335 1315 36908 25470 49027 36085
5596 36085 33503 19891 8777 14031 34626 19566 -2553 10672 4785 20064 8218 -339 24452
5583 24452 33913 50984 31228 55362 55354 28436 26139 33646 29153 29702 37154 38290 46807 35087
5569 35087 24496 57438 77153 66038 32691 34426 25189 36399 48719 42152 81380 85461 70020
5556 70020 48551 59628 76598 54832 45670 52672 44730 75956 91803 70673 87281 108979
$$ packed form
5649a2494R840j1484M424k4349P322K3499m235N279P536m227j5794K5494J482
5636A2293o679K717N02J997J1628j1253J5855J9074j6524K408o819k2837K306
5623D668l381N63j4793K671k7338p630M8413L086j258K1739p431p736m079J1825
5609A9319k7639K6722n558k1815J8885m721P83j8311J3650L5593j1438K3557j2942
5596C6085k582j3612j1114N254K0595j5060k2119J3225n887J5279j1846q557K4791
5583B4452R461J7071j9756K4134qk6918k297P507m493N49P452J136Q517j1720
5569C5087j0591L2942J9715j1115l3347J735r237J1210J2320o567L9228M081j5441
5556G0020k1469J1077J6970k1766r162P002p942L1226J5847k1130J6608K1698
$$ plain form
5544 108979 120639 110971 79434 97159 94864 80730 86887 98110 77376 88239 73234 76108
5532 76108 93379 109780 111198 107625 107600 109768 103724 114183 88786 90541 115275 139283 131823 119371
5518 119371 139218 123426 102452 136836 134860 120504 140190 152701 149963 160178 174493 173371
5506 173371 180021 179259 176638 210617 228360 214276 262773 281622 293210 317349 326112 354636 405091
5493 405091 451215 493488 538469 564284 601213 633741 655363 668398 627238 585006 509708 431055
5481 431055 379453 347200 328673 287095 277706 241380 227346 218726 236496 238178 237764 230920 213214
5468 213214 211951 224608 226575 244715 252433 235099 232972 224501 230953 206124 181162 203751 218354
5455 218354 192435 181979 202777 197150 188389 176427 184056 189507 211850 208409 227758 253198 240070
$$ packed form
5544A08979J1660r668l1537J7725k295j4134O157J1223k0734J0863j5005K874
5532G6108J7271J6401J418l573k5K168o044J0459k5397J755K4734K4008p460j2452
5518A19371J9847j5792k0974L4384j976j4356J9686J2511k738J0215J4315j122
5506A73371O650p62k621L3979J7743j4084M8497J8849J1588K4139Q763K8524N0455
5493D05091M6124M2273M4981K5815L6929L2528K1622J3035m1160m2232p5298p8653
5481D31055n1602l2253j8527m1578r389l6326j4034q620J7770J682m14o844j7706
5468B13214j263J2657J967J8140P718j7334k127q471O452k4829k4962K2589J4603
5455B18354k5919j0456K0798n627q761j1962P629N451K2343l441J9349K5440j3128
$$ plain form
5442 240070 235505 238445 236557 204798 224256 207644 229569 241330 249202 246199 253252 256968 267570
5429 267570 263780 227863 253299 250426 248822 269270 267317 254997 270523 303588 308006 315662 321523
5416 321523 342335 340916 354835 357921 373730 350891 339665 352711 346830 312625 302507 300911
5404 300911 284181 289063 309883 316679 293968 270562 276386 294485 288618 286301 282327 272192 279815
5391 279815 301124 321634 332793 352163 374390 423395 473752 516273 570370 607579 652857 663469
5379 663469 658793 656912 617395 578890 521009 474778 460767 404282 365138 326079 308679 272543
5367 272543 257467 273365 235848 230356 234345 223717 217449 214673 198307 173400 198438 208511
5355 208511 206505 208689 225868 207192 189430 187621 184746 184886 174523 183741 197831 211730 184376
$$ packed form
5442B40070m565K940j888l1759J9458j6612K1925J1761P872l003P053L716J0602
5429B67570l790l5917K5436k873j604K0448j953j2320J5526L3065M418P656N861
5416C21523K0812j419J3919L086J5809k2839j1226J3046n881l4205j0118j596
5404C00911j6730M882K0820O796k2711k3406N824J8099n867k317l974j0135P623
5391B79815K1309K0510J1159J9370K2227M9005N0357M2521N4097L7209M5278J0612
5379F63469m676j881l9517l8505n7881m6231j4011n6485l9144l9059j7400l6136
5367B72543j5076J5898l7517n492L989j0628o268k776j6366k4907K5038J0073
5355B08511k006K184J7179j8676j7762j809k875J40j0363R218J4090J3899k7354
$$ plain form
5342 184376 171870 169648 171555 157260 135624 125121 142198 162235 151378 145773 150995 140607
5330 140607 155222 163753 169090 154548 143232 132608 141511 159327 159373 163595 167271 170494 159483
5317 159483 146265 148371 147341 151197 175035 194635 187963 192209 209443 179354 174837 196553 217249
5304 217249 204992 192468 199687 213997 206978 231220 218344 201983 201817 197087 204757 212215 201581
5291 201581 200316 220721 215248 179965 179373 210809 223264 224572 212841 241049 263440 259737 258142
5278 258142 265903 244051 226324 215976 216146 224826 226993 268045 241536 241049 256325 259257 255633
5265 255633 253368 258681 276875 286282 290241 284681 290657 310483 300504 283104 299389 324870 350138
5252 350138 345506 363116 383593 379357 395329 395769 402711 412085 441913 487540 510630 533884 565076
$$ packed form
5342A84376j2506k222J907j4295k1636j0503J7077K0037j0857n605N222j0388
5330A40607J4615Q531N337j4542j1316j0624Q903J7816M6M222L676L223j1011
5317A59483j3218K106j030L856K3838J9600o672M246J7234l0089m517K1716K0696
5304B17249j2257j2524P219J4310p019K4242j2876j6361j66m730P670P458j0634
5291B01581j265K0405n473l5283n92L1436J2455J308j1731K8208K2391l703j595
5278B58142P761k1852j7727j0348J70Q680K167M1052k6509m87J5276K932l624
5265B55633k265N313J8194R407L959n560N976J9826r979j7400J6285K5481K5268
5252C50138m632J7610K0477m236J5972M40O942R374K9828M5627K3090K3254L1192
$$ plain form
5239 565076 596310 622913 663368 710652 739903 820012 944909 1038558 1127633 1216592 1290665
5228 1290665 1406803 1530865 1650408 1750790 1783238 1790709 1816391 1876703 1934894 1919009 1790823
5217 1790823 1629150 1478963 1350739 1207521 1094101 978472 887039 793341 749501 735034
5207 735034 673330 657832 633782 588422 554152 542829 550804 546800 542843 541721 527417 533441 527625
5194 527625 519889 515903 519867 533861 521436 541060 557670 544975 561334 551849 588001 602809
5182 602809 626139 649324 681414 686123 684434 667859 684875 697545 685407 697643 737028 757443
5170 757443 787436 804138 840014 875211 927871 980065 1039208 1104657 1198360 1297482 1409818
5159 1409818 1545676 1643180 1733309 1806586 1864337 1935692 2030127 2116419 2243454 2369992 2510992
$$ packed form
5239E65076L1234K6603M0455M7284K9251Q0109J24897R3649Q9075Q8959P4073
5228A290665J16138J24062J19543J00382L2448P471K5682O0312N8191j5885j28186
5217A790823j61673j50187j28224j43218j13420j15629r1433r3698m3840j4467
5207G35034o1704j5498k4050m5360l4270j1323P975m004l957j122j4304O024n816
5194E27625p736l986L964J3994j2425J9624J6610j2695J6359r485L6152J4808
5182F02809K3330K3185L2090M709j689j6575J7016J2670j2138J2236L9385K0415
5170G57443K9993J6702L5876L5197N2660N2194N9143O5449R3703R9122J12336
5159A409818J35858R7504R0129P3277N7751P1355R4435Q6292J27035J26538J41000
$$ plain form
5148 2510992 2687836 2854360 3021524 3085168 3062430 2985227 2971171 2971420 2958347 2873445 2616766
5137 2616766 2358532 2153844 1995210 1856661 1714855 1558877 1442607 1347039 1284107 1220981
5127 1220981 1195560 1182636 1159987 1161246 1149817 1136689 1129770 1150284 1167275 1189961 1251438 1342827
5115 1342827 1454381 1602188 1713628 1830684 1924703 1913344 1816230 1661511 1491389 1340569
5105 1340569 1230039 1138924 1091442 1058277 1048582 1031869 1014238 1005283 983236 984511 1005823 1005776
5093 1005776 995751 955834 953599 953838 987455 1018280 1036117 1045131 1101958 1121645 1135417 1145337
5081 1145337 1194108 1287216 1316034 1395205 1486069 1557678 1677535 1802640 1944829 2088010 2276657
5070 2276657 2503943 2753227 2972479 3166311 3284169 3317396 3244474 3130802 2979382 2859993
$$ packed form
5148B510992J76844J66524J67164O3644k2738p7203j4056K49j3073q4902k56679
5137B616766k58234k04688j58634j38549j41806j55978j16270r5568o2932o3126
5127A220981k5421j2924k2649J259j1429j3128o919K0514J6991K2686O1477R1389
5115A342827J11554J47807J11440J17056R4019j1359r7114j54719j70122j50820
5105A340569j10530r1115m7482l3165r695j6713j7631q955k2047J275K1312m7
5093A005776j0025l9917k235K39L3617L0825J7837R014N6827J9687J3772R920
5081A145337M8771R3108K8818P9171R0864P1609J19857J25105J42189J43181J88647
5070B276657K27286K49284K19252J93832J17858L3227p2922j13672j51420j19389
$$ plain form
5060 2859993 2773776 2761367 2796488 2908827 3099517 3313094 3607879 3852789 4002981 3946938
5050 3946938 3665428 3318215 2943726 2587690 2347018 2120505 1942411 1776606 1682843 1614796
5040 1614796 1560316 1492470 1459632 1426623 1393402 1355760 1332750 1320338 1313888 1328139 1309309 1319290
5028 1319290 1311361 1332431 1344331 1344271 1359546 1387563 1429378 1491806 1516945 1552362 1622260 1677596
5016 1677596 1747843 1850827 1974168 2100097 2271139 2458592 2666762 2940879 3240062 3570927
5006 3570927 3854756 4042698 4110208 4047449 3874173 3603831 3306743 3056182 2825479 2657498
4996 2657498 2543309 2432229 2401634 2408792 2442528 2481485 2550616 2646327 2823197 3018801 3227284
4985 3227284 3462379 3701708 3949420 4200322 4420878 4600001 4685424 4792118 4951804 5179769
$$ packed form
5060B859993q6217j2409L5121J12339J90690K13577K94785K44910J50192n6043
5050C946938k81510l47213l74489l56036k40672k26513j78094j65805r3763o8047
5040A614796n4480o7846l2838l3009l3221l7642k3010j2412o450J4251j8830R981
5028A319290p929K1070J1900o0J5275K8017M1815O2428K5139L5417O9898N5336
5016A677596P0247J02984J23341J25929J71042J87453K08170K74117K99183L30865
5006C570927K83829J87942O7510o2759j73276k70342k97088k50561k30703j67981
4996B657498j14189j11080l0595P158L3736L8957O9131R5711J76870J95604K08483
4985C227284K35095K39329K47712K50902K20556J79123Q5423J06694J59686K27965
$$ plain form
4975 5179769 5338843 5402783 5452718 5374862 5125372 4669555 4131419 3603721 3136231 2761211
4965 2761211 2475135 2256057 2085894 1952258 1808331 1726258 1659751 1576434 1518896 1459107
4955 1459107 1410120 1334821 1281998 1259441 1219119 1223020 1211850 1218438 1196995 1164700 1142152 1134492
4943 1134492 1107679 1094392 1115442 1084725 1071536 1077010 1052370 1036060 1056459 1069421 1085647 1099350
4931 1099350 1139634 1189871 1197759 1204512 1211489 1238264 1271919 1329728 1394843 1460060 1542373 1595642
4919 1595642 1705862 1833052 2001328 2201216 2385395 2567216 2691418 2727898 2663979 2559843
4909 2559843 2470520 2401463 2386484 2366146 2401907 2485936 2546348 2619734 2667373 2660528 2627728 2591139
4897 2591139 2554430 2490155 2347903 2206014 2047759 1922421 1827865 1726979 1645398 1572565
$$ packed form
4975E179769J59074O3940M9935p7856k49490m55817n38136n27698m67490l75020
4965B761211k86076k19078j70163j33636j43927q2073o6507q3317n7538n9789
4955A459107m8987p5299n2823k2557m0322L901j1170O588k1443l2295k2548p660
4943A134492k6813j3287K1050l0717j3189N474k4640j6310K0399J2962J6226J3703
4931A099350M0284N0237P888O753O977K6775L3655N7809O5115O5217Q2313N3269
4919A595642J10220J27190J68276J99888J84179J81821J24202L6480o3919j04136
4909B559843q9323o9057j4979k0338L5761Q4029O0412P3386M7639o845l2800l6589
4897B591139l6709o4275j42252j41889j58255j25338r4556j00886q1581p2833
$$ plain form
4887 1572565 1555882 1512242 1502699 1484867 1481484 1500268 1552568 1577861 1571569 1562598 1517937 1472450
4875 1472450 1480862 1485850 1456324 1452299 1483046 1500431 1545870 1569590 1618005 1685979 1773669 1863687
4863 1863687 1948764 2009717 2013336 1990234 1878263 1780696 1699441 1613329 1533321 1461604 1427865
4852 1427865 1426672 1414693 1438135 1429696 1428215 1455713 1482586 1508369 1534144 1529382 1532993 1553372
4840 1553372 1540211 1556753 1533084 1512095 1518935 1541917 1537348 1545477 1565109 1551569 1565255 1564642
4828 1564642 1525761 1477396 1450494 1452017 1421160 1414067 1420961 1426776 1435224 1468086 1518808 1535333
4816 1535333 1537724 1544172 1591088 1664586 1710971 1720670 1719396 1705333 1701657 1666371 1673515 1669770 1657950
4803 1657950 1671382 1692451 1718170 1775915 1786718 1736285 1691706 1657571 1623697 1598803 1600852 1593697
$$ packed form
4887A572565j6683m3640r543j7832l383J8784N2300K5293o292q971m4661m5487
4875A472450Q412M988k9526m025L0747J7385M5439K3720M8415O7974Q7690R0018
4863A863687Q5077O0953L619k3102j11971r7567q1255q6112q0008p1717l3739
4852A427865j193j1979K3442q439j481K7498K6873K5783K5775m762L611K0379
4840A553372j3161J6542k3669k0989O840K2982m569Q129J9632j3540J3686o13
4828A564642l8881m8365k6902J523l0857p093O894N815Q448L2862N0722J6525
4816A535333K391O448M6916P3498M6385R699j274j4063l676l5286P144l745j1820
4803A657950J3432K1069K5719N7745J0803n0433m4579l4135l3874k4894K049p155
$$ plain form
4791 1593697 1612806 1665934 1715993 1732640 1792254 1901570 1945445 2001861 2054749 2113107 2150398
4780 2150398 2172760 2237749 2311656 2384613 2490234 2628617 2806367 3012625 3243728 3522345
4770 3522345 3792946 4044631 4183571 4171024 3974520 3644812 3274893 2908087 2575274 2339444
4760 2339444 2133012 1988140 1871410 1749426 1684253 1633947 1566691 1517046 1451706 1403059 1375498
4749 1375498 1310788 1243509 1210609 1192853 1162885 1170490 1140605 1116175 1096083 1099221 1099298 1120247
4737 1120247 1102339 1078052 1070472 1097488 1086567 1078255 1083060 1081258 1078901 1078693 1105728 1090486 1127923
4724 1127923 1161790 1162100 1172004 1210111 1240440 1270030 1306858 1363352 1404341 1494368 1591629 1671438
4712 1671438 1780998 1957842 2143527 2369073 2592268 2767761 2868170 2805005 2651035 2429075
$$ packed form
4791A593697J9109N3128N0059J6647N9614J09316M3875N6416N2888N8358L7291
4780B150398K2362O4989P3907P2957J05621J38383J77750K06258K31103K78617
4770C522345K70601K51685J38940j2547j96504l29708l69919l66806l32813k35830
4760B339444k06432j44872j16730j21984o5173n0306o7256m9645o5340m8647k7561
4749A375498o4710o7279l2900j7756k9968P605k9885k4430k0092L138P7K0949
4737A120247j7908k4287p580K7016j0921q312M805j802k357k08K7035j5242L7437
4724A127923L3867L10R904L8107L0329K9590L6828N6494M0989R0027R7261P9809
4712A671438J09560J76844J85685K25546K23195J75493J00409o3165j53970k21960
$$ plain form
4702 2429075 2174055 1955368 1776186 1602540 1492849 1408060 1316808 1244940 1205585 1150753
4692 1150753 1130591 1112444 1084630 1077285 1041604 1019481 1008142 999476 989547 952645 925415 941727
4680 941727 942279 953496 928950 925371 917037 893871 896384 878740 888368 885312 869234 862648 846132
4667 846132 844135 831986 824269 797387 781697 783527 765704 784007 772499 788457 793634 803356 823595
4654 823595 797508 788681 817318 807682 799454 813251 800668 806485 805798 818688 807084 814926 817348
4641 817348 804041 785307 778869 786030 785230 774771 800944 808461 798122 810278 806970 824922 834150
4628 834150 855570 872768 881235 899604 912364 916508 913879 913865 917360 912178 945572 957209 956233 958368
4614 958368 958920 948549 927124 947824 988118 1000635 1022406 1058081 1088010 1069777 1079907 1110205
$$ packed form
4702B429075k55020k18687j79182j73646j09691q4789r1252p1868l9355n4832
4692A150753k0162j8147k7814p345l5681k2123j1339q666r929l6902k7230J6312
4680I41727N52J1217k4546l579q334k3166K513j7644R628l056j6078o586j6516
4667H46132j997j2149p717k6882j5690J830j7823J8303j1508J5958N177R722K0239
4654H23595k6087q827K8637r636q228J3797j2583N817o87J2890j1604P842K422
4641H17348j3307j8734o438P161q00j0459K6173P517j0339J2156l308J7952R228
4628H34150K1420J7198Q467J8369J2760M144k629j4L495n182L3394J1637r76K135
4614I58368N52j0371k1425K0700M0294J2517K1771L5675K9929j8233J0130L0298
$$ plain form
4602 1110205 1088611 1105046 1143854 1154947 1163896 1167661 1167721 1188294 1200171 1200865 1199794 1176760 1184751
4589 1184751 1197964 1181701 1184876 1168546 1146822 1140903 1126070 1119610 1144378 1132025 1131695 1156632
4577 1156632 1145052 1163431 1170927 1173479 1183050 1193610 1203693 1189876 1214210 1221920 1231395 1237471 1250200
4564 1250200 1263092 1244076 1220431 1249556 1253490 1262939 1256521 1241860 1240010 1235746 1295100 1300298 1316311
4551 1316311 1320595 1347944 1365381 1394139 1415087 1435066 1464697 1471420 1513755 1518231 1541106 1557751
4539 1557751 1588654 1652635 1688872 1691810 1715401 1720610 1737135 1758149 1745643 1747340 1778458 1792311
4527 1792311 1788439 1815560 1837154 1829056 1859507 1879079 1924109 1950236 1982720 2013772 2039347 2127458
4515 2127458 2223355 2323970 2426830 2492663 2540099 2565673 2575518 2555577 2470530 2429610 2409909
$$ packed form
4602A110205k1594J6435L8808J1093Q949L765O0K0573J1877O94j071k3034P991
4589A184751J3213j6263L175j6330k1724n919j4833o460K4768j2353l30K4937
4577A156632j1580J8379P496K552R571J0560J0083j3817K4334P710R475O076J2729
4564A250200J2892j9016k3645K9125L934R449o418j4661j850m264N9354N198J6013
4551A316311M284K7349J7437K8758K0948J9979K9631O723M2335M476K2875J6645
4539A557751L0903O3981L6237K938K3591N209J6525K1014j2506J697L1118J3853
4527A792311l872K7121K1594q098L0451J9572M5030K6127L2484L1052K5575Q8111
4515B127458R5897J00615J02860O5833M7436K5574R845j9941q5047m0920j9701
$$ plain form
4504 2409909 2388288 2331133 2285536 2293099 2309885 2336776 2333873 2298960 2314134 2315935 2345474 2363189
4492 2363189 2376901 2383728 2438887 2481790 2536704 2618384 2742593 2854395 2972963 3102081 3224432
4481 3224432 3355341 3448173 3538222 3579118 3565040 3498741 3429796 3330766 3250373 3195110 3165370
4470 3165370 3137122 3126591 3122155 3138517 3110804 3010826 2924408 2837587 2773370 2702131 2625212 2597804
4458 2597804 2553802 2548570 2540214 2542363 2577954 2599036 2620212 2651102 2704879 2796099 2842455 2879423
4446 2879423 2958741 3027091 3120517 3191333 3276689 3333905 3357201 3309728 3213895 3084198 2959026
4435 2959026 2837980 2692239 2589011 2539011 2493657 2415125 2391664 2350266 2305581 2263476 2219675
4424 2219675 2220863 2220250 2216716 2196411 2175921 2159456 2142384 2139293 2137210 2135118 2119251 2103550 2076761
$$ packed form
4504B409909k1621n7155m5597P563J6786K6891k903l4913J5174J801K9539J7715
4492B363189J3712O827N5159M2903N4914Q1680J24209J11802J18568J29118J22351
4481C224432J30909R2832R0049M0896j4078o6299o8945r9030q0393n5263k9740
4470C165370k8248j0531m436J6362k7713r9978q6418q6821o4217p1239p6919k7408
4458B597804m4002n232q356K149L5591K1082K1176L0890N3777R1220M6356L6968
4446B879423P9318O8350R3426P0816Q5356N7216K3296m7473r5833j29697j25172
4435B959026j21046j45741j03228n0000m5354p8532k3461m1398m4685m2105m3801
4424B219675J188o13l534k0305k0490j6465j7072l091k083k092j5867j5701k6789
$$ plain form
4411 2076761 2074119 2069939 2056088 2032555 2030985 2016733 2007814 2025853 2030740 2023317 2025415 2041881 2033716
4398 2033716 2040338 2051706 2053857 2034507 2047833 2027621 2007155 1995311 1986296 1970120 1958539 1948398
4386 1948398 1919965 1924615 1959562 1969070 1975753 1965881 1950909 1979186 1985892 1981852 1988240 2010662 2022392
4373 2022392 2037323 2047803 2042534 2066782 2116894 2148375 2174065 2192645 2185896 2216355 2237692 2251058
4361 2251058 2219488 2194913 2200182 2190552 2214433 2222456 2218144 2251313 2291147 2280899 2279615 2277715 2292479
4348 2292479 2298631 2316979 2356575 2373017 2368113 2357670 2351323 2352175 2318332 2298931 2284078 2286536 2273944
4335 2273944 2279141 2289364 2291821 2287946 2288954 2292284 2301163 2297383 2285691 2276759 2248280 2227669 2222004
4322 2222004 2229393 2232841 2237832 2244792 2231941 2207858 2222764 2257416 2277886 2270137 2283797 2294205
$$ packed form
4411B076761k642m180j3851k3533j570j4252q919J8039M887p423K098J6466q165
4398B033716O622J1368K151j9350J3326k0212k0466j1844r015j6176j1581j0141
4386A948398k8433M650L4947R508O683r872j4972K8277O706m040O388K2422J1730
4373B022392J4931J0480n269K4248N0112L1481K5690J8580o749L0459K1337J3366
4361B251058l1570k4575N269r630K3881Q023m312L3169L9834j0248j284j900J4764
4348B292479O152J8348L9596J6442m904j0443o347Q52l3843j9401j4853K458j2592
4335B273944N197J0223K457l875J008L330Q879l780j1692q932k8479k0611n665
4322B222004P389L448M991O960j2851k4083J4906L4652K0470p749J3660J0408
$$ plain form
4310 2294205 2335571 2363683 2355217 2377654 2418834 2449753 2514253 2578419 2640116 2731479 2803374 2818701
4298 2818701 2806869 2764540 2735042 2702830 2667909 2650710 2646797 2614391 2629139 2654471 2656585 2648797
4286 2648797 2641655 2679782 2705672 2710679 2718533 2752979 2798980 2822328 2817300 2827615 2848953 2861892
4274 2861892 2901543 2947937 2978364 3019542 3068052 3110573 3162748 3196166 3293674 3378514 3441521
4263 3441521 3535553 3618507 3754206 3879534 3985469 4115590 4339322 4587241 4876082 5200327
4253 5200327 5610755 6125946 6761542 7517322 8457688 9483994 10451501 11183315 11067348
4244 11067348 10121188 9079144 8377360 8004909 7821650 7623859 7102553 6430016 5885758
4235 5885758 5491386 5220568 4994905 4857653 4764066 4734347 4708304 4684240 4743968 4769965 4775232
$$ packed form
4310B294205M1366K8112q466K2437M1180L0919O4500O4166O1697R1363P1895J5327
4298B818701j1832m2329k9498l2212l4921j7199l913l2406J4748K5332K114p788
4286B648797p142L8127K5890N007P854L4446M6001K3348n028J0315K1338J2939
4274B861892L9651M6394L0427M1178M8510M2521N2175L3418R7508Q4840O3007
4263C441521R4032Q2954J35699J25328J05935J30121K23732K47919K88841L24245
4253E200327M10428N15191O35596P55780R40366J026306R67507P31814j15967
4244A1067348r46160j042044p01784l72451j83259j97791n21306o72537n44258
4235E885758l94372k70818k25663j37252r3587k9719k6043k4064N9728K5997N267
$$ plain form
4224 4775232 4782944 4829117 4896756 4972417 5023676 5068669 5141695 5176653 5224321 5236745 5250867 5300084
4212 5300084 5349990 5412594 5453826 5502626 5545517 5565207 5566706 5556978 5566665 5575877 5623868 5690613
4200 5690613 5774554 5903064 6041480 6160152 6307126 6473159 6635216 6838103 7035295 7249127
4190 7249127 7469392 7631958 7769170 7906398 8033952 8212375 8388113 8576095 8656861 8671352
4180 8671352 8730696 8824617 8979213 9207074 9527425 9867546 10270679 10766895 11362962 12084159
4170 12084159 12934619 13951018 15192334 16712774 18608148 20877921 23633164 26722941
4162 26722941 29447324 30424211 29370476 26741224 23799966 21433930 19258008 17317016
4154 17317016 15824857 14808976 14129780 13594177 13069526 12570266 12060522 11600076 11232736
$$ packed form
4224D775232P712M6173O7639P5661N1259M4993P3026L4958M7668J2424J4122M9217
4212E300084M9906O2604M1232M8800M2891J9690J499r728R687R212M7991O6745
4200E690613Q3941J28510J38416J18672J46974J66033J62057K02887J97192K13832
4190G249127K20265J62566J37212J37228J27554J78423J75738J87982Q0766J4491
4180H671352N9344R3921J54596K27861L20351L40121M03133M96216N96067P21197
4170A2084159Q50460J016399J241316J520440J895374K269773K755243L089777
4162B6722941K724383R76887j053735k629252k941258k366036k175922j940992
4154A7317016j492159j015881o79196n35603n24651m99260n09744m60446l67340
$$ plain form
4145 11232736 10968083 10743600 10581728 10459313 10421359 10476050 10608362 10813291 11074339 11340998
4135 11340998 11696684 12149616 12684457 13409496 14364760 15429156 16345680 16599392 15879276
4126 15879276 14706600 13596286 12768251 12185826 11797319 11564325 11426852 11310617 11185547
4117 11185547 11027183 10869864 10740671 10662314 10663834 10705452 10783955 10839229 10855121 10825911 10710929
4106 10710929 10528647 10305090 10052604 9876161 9784076 9696294 9669597 9720921 9786078 9846944
4096 9846944 9958212 10069043 10191587 10324229 10434995 10479899 10463926 10437201 10438450 10477191 10573479
4085 10573479 10749936 10997980 11300046 11585436 11813130 11971866 12100976 12203498 12341202
4076 12341202 12440506 12547570 12704098 12864696 12985242 13178446 13433909 13745662 14091601 14494383
$$ packed form
4145A1232736k64653k24483j61872j22415l7954N4691J32312K04929K61048K66659
4135A1340998L55686M52932N34841P25039R55264J064396R16524K53712p20116
4126A5879276j172676j110314q28035n82425l88507k32994j37473j16235j25070
4117A1185547j58364j57319j29193p8357J520M1618P8503N5274J5892k9210j14982
4106A0710929j82282k23557k52486j76443r2085q7782k6697N1324O5157O0866
4096I846944J11268J10831J22544J32642J10766M4904j5973k6725J249L8741R6288
4085A0573479J76457K48044L02066K85390K27694J58736J29110J02522J37704
4076A2341202R9304J07064J56528J60598J20546J93204K55463L11753L45939M02782
$$ plain form
4066 14494383 15017863 15649249 16324157 17065379 17879625 18760240 19860509 21416369 23412117
4057 23412117 25799720 28369074 30538920 31875850 31110117 28984595 27228171 26253958
4049 26253958 26163457 26696589 27991139 30049070 32821975 35662371 37788025 37729539 36191018
4040 36191018 35193600 35354515 36268826 37149657 36244874 33565372 31018532 29183719 27980516
4031 27980516 26754001 24902793 22693242 20749745 19136156 17726301 16205173 14598727
4023 14598727 13137465 11940338 11034667 10351577 9745825 9252684 8804366 8416897 8074267
4014 8074267 7790897 7488282 7189882 6942974 6685226 6482973 6352096 6215976 6086126 5949163
4004 5949163 5834660 5746483 5640210 5482386 5319016 5163293 5047322 4947365 4859996 4779328
$$ packed form
4066A4494383N23480O31386O74908P41222Q14246Q80615J100269J555860J995748
4057B3412117K387603K569354K169846J336930p65733k125522j756424r74213
4049B6253958r0501N33132J294550K057931K772905K840396K125654n8486j538521
4040C6191018r97418J60915R14311Q80831r04783k679502k546840j834813j203203
4031B7980516j226515j851208k209551j943497j613589j409855j521128j606446
4023A4598727j461262j197127r05671o83090o05752m93141m48318l87469l42630
4014H074267k83370l02615k98400k46908k57748k02253j30877j36120j29850j36963
4004E949163j14503q8177j06273j57824j63370j55723j15971r9957q7369q0668
$$ plain form
3994 4779328 4707988 4650475 4616871 4592306 4581770 4550799 4514436 4540776 4535223 4493911 4501028 4502841
3982 4502841 4514497 4517606 4508865 4496540 4450760 4366189 4308401 4272507 4248890 4237422 4226989 4231774
3970 4231774 4208382 4182381 4199237 4212086 4227891 4289374 4367237 4452551 4550882 4646090 4759108
3959 4759108 4897301 5057157 5210158 5349593 5388860 5375255 5334250 5274463 5212026 5197793 5251991
3948 5251991 5334556 5427826 5548912 5705017 5888376 6068289 6270670 6533701 6860922 7304301
3938 7304301 7837096 8515783 9345330 10290332 11400323 12875376 14818043 17337023 20058782
3929 20058782 22511294 23610490 21476941 17722519 14404037 11986696 10384978 9229370
3921 9229370 8397592 7789361 7354824 7021117 6760455 6504330 6273403 6020228 5805993 5586141
$$ packed form
3994D779328p1340n7513l3604k4565j0536l0971l6363K6340n553m1312P117J813
3982D502841J1656L109q741j2325m5780q4571n7788l5894k3617j1468j0433M785
3970D231774k3392k6001J6856J2849J5805O1483P7863Q5314R8331R5208J13018
3959D759108J38193J59856J53001J39435L9267j3605m1005n9787o2437j4233N4198
3948E251991Q2565R3270J21086J56105J83359J79913K02381K63031L27221M43379
3938G304301N32795O78687Q29547R45002J109991J475053J942667K518980K721759
3929B0058782K452512J099196k133549l754422l318482k417341j601718j155608
3921I229370q31778o08231m34537l33707k60662k56125k30927k53175k14235k19852
$$ plain form
3911 5586141 5414812 5216091 4997278 4845903 4719381 4549901 4425665 4340567 4257101 4177015
3901 4177015 4122813 4035535 4007055 3963867 3946903 3953548 3953477 3957645 4034066 4058847 4077834 4142003
3889 4142003 4230782 4346898 4421612 4480467 4491295 4410702 4327578 4261676 4182564 4124444 4071167
3878 4071167 4062888 4070780 4071543 4109224 4116419 4101413 4048791 3990039 3902421 3810022 3691936 3581031
3866 3581031 3479000 3404958 3329680 3280908 3264243 3278606 3265315 3243884 3247933 3258932 3265290 3259836
3854 3259836 3246547 3240421 3257829 3297766 3337073 3380651 3424538 3469726 3516847 3556736 3595292 3609361
3842 3609361 3602420 3547188 3489777 3464238 3447547 3450569 3432275 3426321 3458858 3510002 3544786 3611505
3830 3611505 3686822 3776855 3894563 3977072 3990605 3941458 3876388 3780221 3679832 3623572 3579956
$$ packed form
3911E586141j71329j98721k18813j51375j26522j69480j24236q5098q3466q0086
3901D177015n4202q7278k8480m3188j6964O645p1M168P6421K4781J8987O4169
3889D142003Q8779J16116P4714N8855J0828q0593q3124o5902p9112n8120n3277
3878D071167q279P892P63L7681P195j5006n2622n8752q7618r2399j18086j10905
3866C581031j02031p4042p5278m8772j6665J4363j3291k1431M049J0999O358n454
3854C259836j3289o126J7408L9937L9307M3578M3887M5188M7121L9889L8556J4069
3842C609361o941n5232n7411k5539j6691L022j8294n954L2537N1144L4784O6719
3830C611505P5317R0033J17708Q2509J3533m9147o5070r6167j00389n6260m3616
$$ plain form
3819 3579956 3513615 3531663 3507140 3460799 3483528 3492859 3517870 3558126 3591548 3621878 3664657 3728569
3807 3728569 3826107 3900135 3969230 4066088 4144726 4181499 4213618 4263621 4300869 4406222 4502181
3796 4502181 4630818 4757216 4910310 5021176 5096318 5162126 5207019 5235426 5264589 5212660 5116355
3785 5116355 4988504 4814614 4691179 4566096 4488330 4445651 4439229 4443075 4495063 4573233 4605482
3774 4605482 4625025 4607973 4579146 4535985 4498932 4464334 4455479 4436572 4461122 4523705 4589156 4669301
3762 4669301 4773733 4806328 4822255 4834181 4859836 4895831 4934995 4979672 5029344 5061880 5049108
3751 5049108 5018482 4949886 4871413 4773862 4683004 4660149 4613898 4614058 4632289 4649685 4654719 4672231
3739 4672231 4655712 4626731 4601185 4589040 4574500 4559820 4567807 4624361 4654894 4686430 4681298 4682680
$$ packed form
3819C579956o6341J8048k4523m6341K2729R331K5011M0256L3422L0330M2779O3912
3807C728569R7538P4028O9095R6858P8638L6773L2119N0003L7248J05353R5959
3796D502181J28637J26398J53094J10866P5142O5808M4893K8407K9163n1929r6305
3785E116355j27851j73890j23435j25083p7766m2679o422L846N1988P8170L2249
3774D605482J9543j7052k8827m3161l7053l4598q855j8907K4550O2583O5451Q0145
3762D669301J04432L2595J5927J1926K5655L5995L9164M4677M9672L2536j2772
3751E049108l0626o8596p8473r7551r0858k2855m6251J60J8231J7396N034J7512
3739D672231j6519k8981k5546j2145j4540j4680P987N6554L0533L1536n132J382
$$ plain form
3727 4682680 4686741 4695691 4721303 4780607 4845648 4914332 5045006 5158244 5206060 5215897 5198697 5135843
3715 5135843 5067345 5029299 5038634 5010258 4977361 4942399 4898235 4843301 4831593 4818815 4823961 4832500
3703 4832500 4836415 4849649 4842540 4832146 4839669 4844415 4828244 4826053 4845323 4871374 4894346 4901144 4946549
3690 4946549 4981710 5015416 5043614 5105148 5142570 5190404 5191705 5177375 5192842 5224264 5240443 5238684
3678 5238684 5249895 5244381 5244024 5232654 5235546 5252224 5265088 5257239 5253811 5270683 5276091 5267877 5266582
3665 5266582 5274864 5271471 5272912 5271889 5333492 5360057 5396912 5436639 5451231 5472217 5480506 5468934
3653 5468934 5470497 5449959 5467949 5479049 5505595 5517472 5588030 5650503 5736254 5819413 5907184 6022657
3641 6022657 6129037 6255582 6387186 6427481 6444284 6404734 6292124 6218474 6163464 6048848
$$ packed form
3727D682680M061Q950K5612N9304O5041O8684J30674J13238M7816R837j7200o2854
3715E135843o8498l8046R335k8376l2897l4962m4164n4934j1708j2778N146Q539
3703D832500L915J3234p109j0394P523M746j6171k191J9270K6051K2972O798M5405
3690D946549L5161L3706K8198O1534L7422M7834J301j4330J5467L1422J6179j759
3678E238684J1211n514l57j1370K892J6678J2864p849l428J6872N408q214j295
3665E266582Q282l393J441j023O1603K6565L6855L9727J4592K0986Q289j1572
3653E468934J563k0538J7990J1100K6546J1877P0558O2473Q5751Q3159Q7771J15473
3641F022657J06380J26545J31604M0295J6803l9550j12610p3650n5010j14616
$$ plain form
3631 6048848 5955411 5872742 5819912 5788182 5749685 5732697 5727137 5745841 5740555 5716385 5717740 5715069
3619 5715069 5741394 5708576 5655226 5625217 5601707 5624412 5619120 5604483 5638410 5661255 5650240 5686569
3607 5686569 5688751 5693810 5705055 5740534 5729020 5747183 5776205 5764767 5729345 5726961 5716154 5702232
3595 5702232 5673013 5649550 5657114 5657231 5648716 5635284 5643238 5646756 5652845 5663680 5701717 5727801 5773312
3582 5773312 5795785 5776885 5780218 5820304 5822267 5843021 5824397 5809787 5836909 5866703 5900324 5948403
3570 5948403 6019573 6033778 6043921 6090877 6175284 6232758 6290437 6354941 6419913 6462287 6532288
3559 6532288 6575715 6617101 6601402 6559901 6541154 6522507 6479847 6460534 6448456 6438807 6450562 6478372
3547 6478372 6482319 6507264 6539892 6546146 6500703 6501333 6474247 6445970 6452316 6439858 6431643 6447150 6473315
$$ packed form
3631F048848r3437q2669n2830l1730l8497j6988n560J8704n286k4170J355k671
3619E715069K6325l2818n3350l0009k3510K2705n292j4637L3927K2845j1015L6329
3607E686569K182N059J1245L5479j1514J8163K9022j1438l5422k384j0807j3922
3595E702232k9219k3463P564J17q515j3432P954L518O089J0835L8037K6084M5511
3582E773312K2473j8900L333M0086J963K0754j8624j4610K7122K9794L3621M8079
3570E948403P1170J4205J0143M6956Q4407N7474N7679O4504O4972M2374P0001
3559F532288M3427M1386j5699m1501j8747j8647m2660j9313j2078r649J1755K7810
3547F478372L947K4945L2628O254m5443O30k7086k8277O346j2458q215J5507K6165
$$ plain form
3534 6473315 6527769 6594477 6651577 6645417 6673038 6674198 6665738 6629318 6587714 6579749 6581384 6626825
3522 6626825 6691248 6723535 6765970 6752367 6797636 6829467 6857940 6869494 6869582 6852815 6864017 6895049
3510 6895049 6937621 6956423 7006502 7089696 7150090 7179338 7249360 7311942 7342315 7350458 7387750 7425358
3498 7425358 7492859 7555828 7586612 7588316 7606324 7605211 7583645 7590013 7631495 7705531 7764198 7822372
3486 7822372 7916568 7988988 8030522 8079896 8121060 8143640 8149277 8151771 8181835 8227317 8270614 8324935
3474 8324935 8377677 8427520 8509031 8554057 8601678 8682056 8757842 8868771 8937388 8997643 9005403
3463 9005403 9009879 9043291 9125508 9201493 9297215 9407826 9521158 9610909 9732822 9828093 9907404
3452 9907404 9935871 10001983 10064967 10180540 10263364 10354454 10440866 10518709 10652167 10807158 10920979
$$ packed form
3534F473315N4454O6708N7100o160K7621J160q460l6420m1604p965J635M5441
3522F626825O4423L2287M2435j3603M5269L1831K8473J1554Q8j6767J1202L1032
3510F895049M2572J8802N0079Q3194O0394K9248P0022O2582L0373Q143L7292L7608
3498G425358O7501O2969L0784J704J8008j113k1566O368M1482P4036N8667N8174
3486G822372R4196P2420M1534M9374M1164K2580N637K494L0064M5482M3297N4321
3474H324935N2742M9843Q1511M5026M7621Q0378P5786J10929O8617O0255P760
3463I005403M476L3412Q2217P5985R5722J10611J13332Q9751J21913R5271P9311
3452I907404K8467O6112O2984J15573Q2824R1090Q6412P7843J33458J54991J13821
$$ plain form
3441 10920979 11096825 11214312 11355342 11462459 11644105 11821392 12016263 12154120 12354426
3432 12354426 12554865 12756933 12936278 13087310 13209086 13318802 13364053 13413509 13492660 13635866
3422 13635866 13773478 13977364 14169190 14389451 14612320 14857468 15096450 15334877 15504688
3413 15504688 15773602 16031365 16285168 16567617 16952846 17300603 17675934 17988729 18237813
3404 18237813 18467394 18751446 19073559 19507374 19990479 20557789 21119191 21726676 22277870
3395 22277870 22697749 23004899 23393343 23919192 24516788 25067596 25668205 26235156 26844178
3386 26844178 27457909 28017065 28505007 29028937 29609214 30202238 30748300 31394894 32088040
3377 32088040 32957807 34063909 35282812 36592968 38006833 39528751 41240389 43108055
$$ packed form
3441A0920979J75846J17487J41030J07117J81646J77287J94871J37857K00306
3432A2354426K00439K02068J79345J51032J21776J09716M5251M9456P9151J43206
3422A3635866J37612K03886J91826K20261K22869K45148K38982K38427J69811
3413A5504688K68914K57763K53803K82449L85229L47757L75331L12795K49084
3404A8237813K29581K84052L22113M33815M83105N67310N61402O07485N51194
3395B2277870M19879L07150L88444N25849N97596N50808O00609N66951O09022
3386B6844178O13731N59156M87942N23930N80277N93024N46062O46594O93146
3377C2088040Q69767J106102J218903J310156J413865J521918J711638J867666
$$ plain form
3369 43108055 45286998 47957951 51019313 54377285 58142414 62581840 67895508 74108870
3361 74108870 81390633 90089766 100559870 113645919 130795868 153992302 185041850
3354 185041850 220012257 252126997 270249741 247900170 201915051 160455747 129728487
3347 129728487 109100083 94411059 83916795 75881392 70077407 65354912 61299381 57502417
3339 57502417 54270755 51492839 49524732 48031204 47052072 46325477 45949625 45832072 46140270
3330 46140270 46657074 47517192 48574257 50029636 51849087 54158352 57194955 61349045
3322 61349045 66423811 71707368 75917313 77014738 72937386 66035160 59248582 53864881
3314 53864881 49803054 46761688 44439471 42791708 41567668 40582358 39750804 39194968 38801152
$$ packed form
3369D3108055K178943K670953L061362L357972L765129M439426N313668O213362
3361G4108870P281763Q699133J0470104J3086049J7149949K3196434L1049548
3354A85041850L4970407L2114740J8122744k2349571m5985119m1459304l0727260
3347A29728487k0628404j4689024j0494264q035403n803985m722495m055531l796964
3339E7502417l231662k777916j968107j493528r79132p26595l75852j17553L08198
3330D6140270N16804Q60118J057065J455379J819451K309265L036603M154090
3322F1349045N074766N283557M209945J097425m077352o902226o786578n383701
3314E3864881m061827l041366k322217j647763j224040r85310q31554n55836l93816
$$ plain form
3305 38801152 38563846 38416549 38328999 38234414 38204061 38215248 38351449 38527590 38768568 39062934
3295 39062934 39492390 39980336 40572997 41239494 42050961 43024393 44197926 45579837 47252694
3286 47252694 49259002 51693029 54648183 58340725 62849581 67760562 72214845 74917228
3278 74917228 75237536 74981013 75810507 78623840 83597075 90277214 97080424 101457723 100287146
3269 100287146 93905874 86268600 79861898 75267389 72183769 70238604 69132055 68608968
3261 68608968 68399302 68190294 67825244 67125142 65965223 64325194 62119818 59470373 56587785
3252 56587785 53727574 51006012 48552687 46349728 44416433 42691394 41139457 39751224
3244 39751224 38490485 37314655 36204677 35137962 34151798 33197289 32294535 31434006 30673165
$$ packed form
3305C8801152k37306j47297q7550r4585l0353J1187J36201J76141K40978K94366
3295C9062934M29456M87946N92661O66497Q11467R73432J173533J381911J672857
3286D7252694K006308K434027K955154L692542M508856M910981M454283K702383
3278G4917228L20308k56523Q29494K813333M973235O680139O803210M377299j170577
3269A00287146o381272p637274o406702m594509l083620j945165j106549n23087
3261F8608968k09666k09008l65050p00102j159919j640029k205376k649445k882588
3252E6587785k860211k721562k453325k202959j933295j725039j551937j388233
3244C9751224j260739j175830j109978j066715r86164r54509r02754q60529p60841
$$ plain form
3235 30673165 30038183 29427006 28818898 28265860 27680993 27124438 26623761 26118216 25623919
3226 25623919 25142828 24657233 24210917 23777415 23321984 22924375 22567124 22200981 21864831
3217 21864831 21545898 21259929 20952304 20655731 20375583 20091724 19796594 19526151 19287736
3208 19287736 19075142 18899517 18668437 18437739 18226671 17984169 17776940 17567589 17391900
3199 17391900 17203066 17021087 16863697 16737443 16593021 16449081 16284059 16121016 15915597
3190 15915597 15747317 15562903 15418763 15309264 15214191 15125887 15025817 14879786 14770985 14667724
3180 14667724 14596415 14460642 14300658 14189196 14088814 13950710 13825964 13721344 13625424 13532373
3170 13532373 13438558 13341479 13263326 13179389 13103924 13010467 12947777 12842670 12758124 12684915 12602123
$$ packed form
3235C0673165o34982o11177o08108n53038n84867n56555n00677n05545m94297
3226B5623919m81091m85595m46316m33502m55431l97609l57251l66143l36150
3217B1864831l18933k85969l07625k96573k80148k83859k95130k70443k38415
3208A9287736k12594j75625k31080k30698k11068k42502k07229k09351j75689
3199A7391900j88834j81979j57390j26254j44422j43940j65022j63043k05419
3190A5915597j68280j84414j44140j09499r5073q8304j00070j46031j08801j03261
3180A4667724p1309j35773j59984j11462j00382j38104j24746j04620r5920r3051
3170A3532373r3815r7079p8153q3937p5465r3457o2690j05107q4546p3209q2792
$$ plain form
3159 12602123 12523698 12462276 12446145 12422269 12372625 12276438 12158713 12013921 11879597 11773575
3149 11773575 11658793 11576583 11495321 11423127 11356773 11239096 11119610 11035939 10961255 10899191 10842611
3138 10842611 10767960 10735124 10693198 10624151 10584774 10516139 10468814 10420593 10326876 10225416 10110975
3127 10110975 10032115 9962452 9905116 9844308 9780487 9739311 9707331 9698397 9659138 9622269 9596855
3116 9596855 9547848 9488971 9441879 9388718 9338212 9304170 9240611 9205507 9159991 9112137 9086171
3105 9086171 9046745 9035950 9002633 8967695 8985009 8977804 8961103 8926450 8872480 8813869 8766270 8735401
3093 8735401 8711741 8661893 8626236 8574783 8518917 8484542 8423840 8370123 8332295 8297768 8285086
3082 8285086 8277793 8273020 8236587 8233163 8219591 8209331 8169357 8197300 8227567 8228289 8268244 8330510
$$ packed form
3159A2602123p8425o1422j6131k3876m9644r6187j17725j44792j34324j06022
3149A1773575j14782q2210q1262p2194o6354j17677j19486q3671p4684o2064n6580
3138A0842611p4651l2836m1926o9047l9377o8635m7325m8221r3717j01460j14441
3127A0110975p8860o9663n7336o0808o3821m1176l1980q934l9259l6869k5414
3116I596855m9007n8877m7092n3161n0506l4042o3559l5104m5516m7854k5966
3105I086171l9426j0795l3317l4938J7314p205j6701l4653n3970n8611m7599l0869
3093H735401k3660m9848l5657n1453n5866l4375o0702n3717l7828l4527j2682
3082H285086p293m773l6433l424j3572j0260l9974K7943L0267P22L9955O2266
$$ plain form
3070 8330510 8393765 8449317 8523713 8622592 8688655 8743706 8768744 8741869 8673855 8553505 8401819
3059 8401819 8256037 8110742 8001974 7909280 7847280 7785587 7734136 7678858 7643669 7615264 7584579
3048 7584579 7583211 7583190 7536544 7545273 7555972 7554350 7575268 7617157 7616241 7624669 7645747 7667342 7677297
3035 7677297 7693103 7706185 7729694 7795805 7876748 7930694 7944749 7955017 7996098 8062408 8118030
3024 8118030 8164143 8223177 8288174 8358427 8402189 8438923 8499803 8552082 8629137 8692717 8770913
3013 8770913 8849015 8915440 8980906 9066459 9141377 9212400 9301160 9357315 9468106 9558278 9640909
3002 9640909 9749624 9784417 9846676 9927458 10022938 10152719 10252679 10351404 10483785 10663994 10819828
2991 10819828 10968780 11125622 11229651 11358223 11486486 11605966 11689376 11748613 11801736 11850094
$$ packed form
3070H330510O3255N5552P4396R8879O6063N5051K5038k6875o8014j20350j51686
3059H401819j45782j45295j08768r2694o2000o1693n1451n5278l5189k8405l0685
3048G584579j368k1m6646Q729J0699j622K0918M1889r16Q428K1078K1595R955
3035G677297J5806J3082K3509O6111Q0943N3946J4055J0268M1081O6310N5622
3024H118030M6113N9034O4997P0253M3762L6734O0880N2279P7055O3580P8196
3013H770913P8102O6425O5466Q5553P4918P1023Q8760N6155J10791R0172Q2631
3002I640909J08715L4793O2259Q0782R5480J29781R9960R8725J32381J80209J55834
2991A0819828J48952J56842J04029J28572J28263J19480Q3410N9237N3123M8358
$$ plain form
2981 11850094 11901072 11963832 11997158 12032986 12081511 12084575 12114061 12171834 12260250 12332601 12404944
2970 12404944 12473197 12551107 12654767 12774941 12893227 13063696 13244847 13394669 13605138 13787853
2960 13787853 13969611 14125562 14308022 14521512 14774844 14993140 15291716 15604443 15883378
2951 15883378 16186526 16498076 16801266 17112270 17437616 17774386 18051156 18324195 18615914
2942 18615914 18866960 19090390 19250106 19299028 19376122 19493943 19597927 19698759 19858446 20079114
2932 20079114 20286902 20526063 20804803 21161808 21563215 22016564 22530013 23069816 23728825
2923 23728825 24444818 25237804 26124518 27058321 28051433 28997175 29796959 30346681 30615548
2914 30615548 30654232 30472680 30024441 29318256 28492778 27632825 26925051 26374918 25987086 25775920
$$ packed form
2981A1850094N0978O2760L3326L5828M8525L064K9486N7773Q8416P2351P2343
2970A2404944O8253P7910J03660J20174J18286J70469J81151J49822K10469J82715
2960A3787853J81758J55951J82460K13490K53332K18296K98576L12727K78935
2951A5883378L03148L11550L03190L11004L25346L36770K76770K73039K91719
2942A8615914K51046K23430J59716M8922P7094J17821J03984J00832J59687K20668
2932B0079114K07788K39161K78740L57005M01407M53349N13449N39803O59009
2923B3728825P15993P92986Q86714R33803R93112R45742P99784N49722K68867
2914C0615548L8684j81552m48239p06185q25478q59953p07774n50133l87832k11166
$$ plain form
2904 25775920 25679205 25659717 25770031 25921489 26154273 26421834 26689384 26952138 27198638 27411307
2894 27411307 27635158 27842256 28012941 28233569 28449279 28593145 28620440 28482472 28129002 27594244
2884 27594244 26959841 26284849 25578355 24855647 24086101 23329906 22691062 22171220 21687099
2875 21687099 21321209 21019856 20752971 20559160 20397271 20257772 20090234 19845683 19555761
2866 19555761 19221702 18824056 18398236 17954458 17495206 16999298 16532366 16056286 15549448
2857 15549448 15078689 14625974 14198938 13809238 13473166 13116647 12816384 12504714 12214756
2848 12214756 11971340 11716494 11492478 11302429 11115028 10946200 10756763 10596581 10470044
2839 10470044 10299178 10128405 9959626 9794559 9632652 9444730 9248053 9053889 8908996
$$ packed form
2904B5775920r6715j9488J10314J51458K32784K67561K67550K62754K46500K12669
2894B7411307K23851K07098J70685K20628K15710J43866K7295j37968l53470n34758
2884B7594244o34403o74992p06494p22708p69546p56195o38844n19842m84121
2875B1687099l65890l01353k66885j93811j61889j39499j67538k44551k89922
2866A9555761l34059l97646m25820m43778m59252m95908m66932m76080n06838
2857A5549448m70759m52715m27036l89700l36072l56519l00263l11670k89958
2848A2214756k43416k54846k24016j90049j87401j68828j89437j60182j26537
2839A0470044j70866j70773j68779j65067j61907j87922j96677j94164j44893
$$ plain form
2830 8908996 8731146 8588124 8431077 8269588 8120372 8014383 7931669 7823730 7713346 7596158
2820 7596158 7453672 7328409 7193542 7071652 6973686 6861645 6694806 6601743 6489366 6387919
2810 6387919 6288863 6182685 6080557 5991964 5938535 5868814 5795597 5738040 5699802 5627400 5530180
2799 5530180 5427304 5348137 5275564 5198263 5101808 5001880 4941320 4863417 4765809 4691177 4589223
2788 4589223 4504521 4438912 4361421 4306173 4215417 4166403 4079926 4024767 4005596 3941017 3871370
2777 3871370 3783283 3745603 3724788 3677593 3645098 3615054 3559959 3500532 3430022 3385677 3340534
2766 3340534 3324858 3276717 3188725 3163152 3115758 3069611 3011278 2962007 2934813 2879149 2827492
2755 2827492 2803924 2762960 2719241 2693470 2623994 2596352 2558721 2541601 2516852 2474744 2449245
$$ packed form
2830H908996j77850j43022j57047j61489j49216j05989q2714j07939j10384j17188
2820G596158j42486j25263j34867j21890r7966j12041j66839r3063j12377j01447
2810F387919r9056j06178j02128q8593n3429o9721p3217n7557l8238p2402r7220
2799E530180j02876p9167p2573p7301r6455r9928o0560p7903r7608p4632j01954
2788D589223q4702o5609p7491n5248r0756m9014q6477n5159j9171o4579o9647
2777C871370q8087l7680k0815m7195l2495l0044n5095n9427p0510m4345m5143
2766C340534j5676m8141q7992k5573m7394m6147n8333m9271k7194n5664n1657
2755B827492k3568m0964m3719k5771o9476k7642l7631j7120k4749m2108k5499
$$ plain form
2744 2449245 2416628 2377202 2347444 2310640 2281400 2242036 2221194 2178348 2142025 2120165 2097839
2733 2097839 2062982 2051732 2010946 1980735 1929445 1912413 1876156 1859333 1831910 1816076 1791667
2722 1791667 1769395 1761385 1772326 1712678 1666533 1647976 1668542 1645448 1632746 1623311 1586762 1589696
2710 1589696 1558508 1578909 1574266 1548721 1517189 1484014 1499375 1490736 1448977 1441482 1432944 1421427
2698 1421427 1388133 1374263 1355199 1347976 1339430 1330269 1308886 1267590 1241340 1242165 1230841 1220495
2686 1220495 1213060 1182409 1181917 1191659 1181659 1193018 1181858 1163732 1136705 1145411 1148361 1130402 1129079
2673 1129079 1118777 1116746 1106303 1113512 1120583 1133424 1090744 1048506 1066683 1074883 1068107 1039609
2661 1039609 1035903 1028790 1031465 1027165 1003262 992765 981415 972355 976084 966245 954782 949339 935365
$$ packed form
2744B449245l2617l9426k9758l6804k9240l9364k0842m2846l6323k1860k2326
2733B097839l4857j1250m0786l0211n1290j7032l6257j6823k7423j5834k4409
2722A791667k2272q010J0941n9648m6145j8557K0566k3094j2702r435l6549K934
2710A589696l1188K0401m643k5545l1532l3175J5361q639m1759p495q538j1517
2698A421427l3294j3870j9064p223q546r161k1383m1296k6250Q25j1324j0346
2686A220495p435l0651m92R742j0000J1359j1160j8126k7027Q706K950j7959j323
2673A129079j0302k031j0443P209P071J2841m2680m2238J8177Q200o776k8498
2661A039609l706p113K675m300k3903j0497j1350r060L729r839j1463n443j3974
$$ plain form
2648 935365 953345 972959 966739 976483 986890 977607 957210 945683 937679 945165 936326 944433 956644
2635 956644 937249 969813 959361 955041 977504 937139 946944 946481 953040 952158 936101 933146 934567
2622 934567 923494 903146 905952 896656 872280 892399 894318 919374 944915 948268 941692 935278 942245
2609 942245 942231 940878 926068 905145 907475 887677 865285 842423 819434 796667 765464 773527 769055
2596 769055 779136 768609 758165 740206 734845 710215 697303 721700 705225 698156 697536 701589 680709
2583 680709 670016 681472 659404 653391 659344 654754 667749 657679 659203 660965 674968 668985 648308
2570 648308 619507 607925 583872 562344 551230 530032 528650 497912 492599 487317 466456 455506
2558 455506 472472 478505 444047 443165 450989 455477 442669 435458 426417 415924 406744 395309 400582
$$ packed form
2648I35365J7980J9614o220R744J0407r283k0397j1527q004P486q839Q107J2211
2635I56644j9395L2564j0452m320K2463m0365R805m63O559q82j6057k955J421
2622I34567j1073k0348K806r296k4376K0119J919K5056K5541L353o576o414O967
2609I42245j4j353j4810k0923K330j9798k2392k2862k2989k2767l1203Q063m472
2596G69055J0081j0527j0444j7959n361k4630j2912K4397j6475p069o20M053k0880
2583F80709j0693J1456k2068o013N953m590J2995j0070J524J762J4003n983k0677
2570F48308k8801j1582k4053k1528j1114k1198j382l0738n313n282k0861j0950
2558D55506J6966O033l4458q82P824M488j2808p211r041j0493r180j1435N273
$$ plain form
2545 400582 415199 410336 425148 402425 378406 374336 365022 381062 359275 332167 335610 340493 355604
2532 355604 359494 336295 313088 307582 320251 327009 292523 293676 290496 279318 273062 231178 240030
2519 240030 246019 229962 217665 240048 242750 226077 227684 229747 242750 239360 219361 214619 202229
2506 202229 195493 198104 173375 173919 198481 199457 206525 198615 167325 157257 177803 165531 155215
2493 155215 163258 148519 163801 162569 165512 180211 161588 147544 132371 139051 130721 129105 105900
2480 105900 105459 122536 116717 132136 163974 125023 123675 134659 127656 122137 129831 102065 99156
2467 99156 113700 91111 92202 157222 145441 96247 73761 101148 87101 70607 89927 111911
2455 111911 94036 81746 89025 78599 70507 62933 68266 83185 89887 64271 38100 36677 41552
$$ packed form
2545D00582J4617m863J4812k2723k4019m070r314J6040k1787k7108L443M883J5111
2532C55604L890k3199k3207n506J2669O758l4486J153l180j1178o256m1884Q852
2519B40030N989j6057j2297K2383K702j6673J607K063J3003l390j9999m742j2390
2506B02229o736K611k4729N44K4562R76P068p910l1290j0068K0546j2272j0316
2493A55215Q043j4739J5282j232K943J4699j8623j4044j5173O680q330j616k3205
2480A05900m41J7077n819J5419L1838l8951j348J0984p003n519P694k7766k909
2467I9156J4544k2589J091O5020j1781m9194k2486K7387j4047j6494J9320K1984
2455A11911j7875j2290P279j0426q092p574N333J4919O702k5616k6171j423M875
$$ plain form
2442 41552 52393 51617 49361 58552 46143 37568 45923 65832 66710 70097 82223 82641 58994 40878
2428 40878 50015 58783 21283 32467 57978 65670 91513 109506 87589 78553 73856 89087 89285
2415 89285 100159 80404 51559 37706 62550 59937 43404 36479 46809 63232 60703 74532
2403 74532 82520 59707 36920 53952 35941 37056 46522 39633 31216 24926 16094 20423 26118 18755
2389 18755 21675 227 -10204 12250 43928 63128 67932 93477 90020 62762 56104 22894 15052
2376 15052 20212 29357 9693 2930 26261 11200 -5757 5527 26534 31420 25312 18160 -18376
2363 -18376 -10635 -12755 -16640 -151 6622 14124 39962 10105 -1177 -12234 -2545 -1068 11129
2350 11129 22443 13093 38317 22827 4523 9568 15067 4593 -5621 -16259 -5476 -22178
$$ packed form
2442D1552J0841p76k256R191j2409q575Q355J9909Q78L387J2126M18k3647j8116
2428D0878R137Q768l7500J1184K5511P692K5843J7993k1917r036m697J5231J98
2415H9285J0874j9755k8845j3853K4844k613j6533o925J0330J6423k529J3829
2403G4532P988k2813k2787J7032j8011J115R466o889q417o290q832M329N695p363
2389A8755K920k1448j0431K2454L1678J9200M804K5545l457k7258o658l3210p842
2376A5052N160R145j9664o763K3331j5061j6957J1284K1007M886o108p152l6536
2363a8376P741k120l885J6489O773P502K5838k9857j1282j1057R689J477J2197
2350A1129J1314r350K5224j5490j8304N045N499j0474j0214j0638J0783j6702
$$ plain form
2338 -22178 -30525 -6836 -8689 1421 -8715 20315 19938 -7584 240 8470 -4715 -5792 3509
2325 3509 23051 14349 -5674 -23446 -13028 -2438 -20863 -22920 -33176 -36370 -32211 -21779 -4494
2312 -4494 -2025 -13561 10887 -13581 -32580 -3350 20659 15552 23293 -7576 -22545 -12622 -12820
2299 -12820 -5413 14029 4998 9637 -11826 -27143 -17486 4743 -2 -5017 -18653 -32615 -43250
2286 -43250 -20335 -1810 -35575 -17493 -7339 -24622 -21560 -16557 -4455 -7158 -9611 477 17947
2273 17947 9893 -25249 -32602 -11367 -7658 -2218 -23309 -479 24701 34426 697 -6261 6841
2260 6841 9518 18380 9205 20769 -11267 -19372 -16815 -8724 -4205 4941 -3360 -10186 -5149 -20432
2246 -20432 -46587 -49423 -34742 -17131 6787 3428 -20813 -18750 -2792 220 3263 -10678 26769
$$ packed form
2338b2178q347K3689j853J0110j0136K9030l77k7522P824Q230j3185j077R301
2325C509J9542q702k0023j7772J0418J0590j8425k057j0256l194M159J0432J7285
2312d494K469j1536K4448k4468j8999K9230K4009n107P741l0869j4969R923j98
2299a2820P407J9442r031M639k1463j5317R657K2229m745n015j3636j3962j0635
2286d3250K2915J8525l3765J8082J0154j7283L062N003J2102k703k453J0088J7470
2273A7947q054l5142p353K1235L709N440k1091K2830K5180R725l3729o958J3102
2260F841K677Q862r175J1564l2036q105K557Q091M519R146q301o826N037j5283
2246b0432k6155k836J4681J7611K3918l359k4241K063J5958L012L043j3941L7447
$$ plain form
2233 26769 50182 35002 17652 9614 27868 29075 14847 31236 31536 18094 24021 22014 21602
2220 21602 42863 69487 38467 23583 32469 36467 38193 77518 60331 45346 25786 53770
2208 53770 78436 51148 54489 82053 63446 76654 91624 84651 104700 95245 103427 86417 110421
2195 110421 114614 125778 131322 123082 118108 108931 118549 144566 153030 145163 142687 140861 116664 111749
2181 111749 136787 144250 158543 179511 167273 134586 153953 166040 135358 144959 165951 175330
2169 175330 192832 216492 225259 230052 237364 253604 253831 268864 274886 296118 296897 302472 307632 344546
2155 344546 347678 350819 361463 377082 407495 436616 477939 492154 499006 505220 523627 539065
2143 539065 553765 559513 573302 612556 660782 702513 739691 771489 818713 888003 954351 1043285
$$ packed form
2233B6769K3413j5180j7350q038J8254J207j4228J6389L00j3442N927k007m12
2220B1602K1261K6624l1020j4884Q886L998J726L9325j7187j4985j9560K7984
2208E3770K4666k7288L341K7564j8607J3208J4970o973K0049r455Q182j7010K4004
2195A10421M193J1164N544q240m974r177R618K6017Q464p867k476j826k4197m915
2181A11749K5038P463J4293K0968j2238l2687J9367J2087l0682R601K0992R379
2169A75330J7502K3660Q767M793P312J6240K27J5033O022K1232P79N575N160L6914
2155C44546L132L141J0644J5619L0413K9121M1323J4215O852O214J8407J5438
2143E39065J4700N748J3789L9254M8226M1731L7178L1798M7224O9290O6348Q8934
$$ plain form
2131 1043285 1134800 1235538 1304265 1319492 1391067 1509612 1701527 1910164 2174962 2517404
2121 2517404 2932513 3496704 4253774 5348484 6874957 8357047 8839771 7429999 5593265
2112 5593265 4188139 3257838 2655256 2176762 1821680 1559558 1409006 1284306 1179010
2103 1179010 1071674 1020826 979572 931615 811502 711519 671783 641010 591823 556610 506753
2092 506753 481930 477622 446561 429582 393774 371851 369529 322200 302219 264059 244007 242963
2080 242963 233385 230069 241046 207740 211908 193524 155760 173581 195238 170700 173390 161375
2068 161375 144561 133916 153846 126280 114858 124273 88296 126993 126242 119533 119162 94886 85261
2055 85261 72941 70552 71989 56208 67377 85873 81396 88495 70068 68893 44489 73437 54054
$$ packed form
2131A043285R1515J00738O8727J5227P1575J18545J91915K08637K64798L42442
2121B517404M15109N64191P57070J094710J526473J482090M82724j409772j836734
2112E593265j405126r30301o02582m78494l55082k62122j50552j24700j05296
2103A179010j07336n0848m1254m7957j20113r9983l9736l0773m9187l5213m9857
2092E06753k4823m308l1061j6979l5808k1923k322m7329j9981l8160k0052j044
2080B42963r578l316J0977l3306M168j8384l7764J7821K1657k4538K690j2015
2068A61375j6814j0645J9930k7566j1422R415l5977L8697p51o709l71k4276r625
2055H5261j2320k389J437j5781J1169J8496m477P099j8427j175k4404K8948j9383
$$ plain form
2042 54054 34153 35290 48366 43818 54507 39769 5555 24569 35915 34490 23051 33093
2030 33093 35605 16027 8548 -932 4341 8105 24445 26662 42271 29953 17848 30262 5157
2017 5157 -7193 15565 38206 28284 40634 38408 6341 13659 31918 29149 9097 -2145 -15509
2004 -15509 -357 13432 -9443 3675 40426 29483 24695 3648 -2042 -4217 -7779 -16947 -12831
1991 -12831 -11017 -23456 -43144 -47574 -13943 -36529 -34839 3078 14739 3131 -959 -8873 -26627
1978 -26627 -6575 6102 -26134 -33704 -27196 -33139 6260 19224 4075 29872 -54 -18240
1966 -18240 -49716 -2319 -5129 1866 -15031 -6172 -2744 -17399 -30470 -9847 13553 -20410 -24164
1953 -24164 -34931 -8561 -2441 -17978 -25466 -30587 -19925 2339 8443 7352 23801 15843 28162
$$ packed form
2042E4054j9901J137J3076m548J0689j4738l4214J9014J1346j425j1439J0042
2030C3093K512j9578p479r480N273L764J6340K217J5609j2318j2105J2414k5105
2017E157j2350K2758K2641r922J2350k226l2067P318J8259k769k0052j1242j3364
2004a5509J5152J3789k2875J3118L6751j0943m788k1047n690k175l562r168M116
1991a2831J814j2439j9688m430L3631k2586J690L7917J1661j1608m090p914j7754
1978b6627K0052J2677l2236p570O508n943L9399J2964j5149K5797k9926j8186
1966a8240l1476M7397k810O995j6897Q859L428j4655j3071K0623K3400l3963l754
1953b4164j0767K6370O120j5537p488n121J0662K2264O104j091J6449p958J2319
$$ plain form
1940 28162 12282 -12779 -9288 972 23792 2494 8483 10553 5440 23107 5401 -33869 -35365
1927 -35365 -17701 -4758 -14601 -10661 -10864 -7475 -1592 -32942 -50436 -37278 -10478 -14439 -30395
1914 -30395 -4054 -37123 -44278 -37448 -25373 -22894 -35178 -32246 -38464 -26138 -28121 -48990 -49007 -36475
1900 -36475 -30046 -31047 -22381 -28565 -47942 -29391 -21971 -21504 -44177 -37995 -33301 -11904 -15225 -16543
1886 -16543 -24503 -14748 -4278 -3713 -409 -6078 -7451 11204 36 -37807 -49974 -29237 -43044
1873 -43044 -48931 -27602 -38016 -26375 -29372 -58293 -63464 -38984 -29828 -22298 -34630 -20698 -17487
1860 -17487 -18737 -9979 -8403 -16301 -11819 -13290 -37928 -17647 -41711 -38608 -16641 -14275 -9787 -7449
1846 -7449 -16875 -7609 -20597 -19179 13725 1806 -12043 -22954 -47685 -55101 -45979 -27880 -40678
$$ packed form
1940B8162j5880k5061L491J0260K2820k1298N989K070n113J7667j7706l9270j496
1927c5365J7664J2943r843L940k03L389N883l1350j7494J3158K6800l961j5956
1914c0395K6341l3069p155O830J2075K479j2284K932o218J2326j983k0869j7J2532
1900c6475O429j001Q666o184j9377J8551P420M67k2673O182M694K1397l321j318
1886a6543p960R755J0470N65L304n669j373J8655j1168l7843j2167K0737j3807
1873d3044n887K1329j0414J1641k997k8921n171K4480R156P530j2332J3932L211
1860a7487j250Q758J576p898M482j471k4638K0281k4064L103K1967K366M488K338
1846g449r426R266j2988J418L2904j1919j3849j0911k4731p416R122J8099j2798
$$ plain form
1833 -40678 -34684 -45296 -55563 -25383 -34691 -24225 -48003 -44377 -37282 -44784 -31871 -27225 -31278
1820 -31278 -10603 -24596 -367 -36954 -55550 -32353 -35810 -30154 -30882 -12101 -1898 -24282 -44693
1807 -44693 -55395 -35651 -22358 -14185 -38791 -56010 -54008 -41907 -26571 -26632 -30239 -22854 -22126 -5893
1793 -5893 -13413 -36290 -44948 -43466 -55536 -31081 -11206 -17087 -22556 -33743 -31793 -43623 -32493
1780 -32493 -50664 -56955 -40490 -23491 940 1021 -40768 -41107 -27939 -37060 -25897 -41747 -53071
1767 -53071 -63589 -50061 -31401 -46536 -46953 -43577 -37808 -59451 -44900 -62422 -66353 -63523 -39982
1754 -39982 -5812 7124 434 -29366 -45893 -51576 -30831 -16689 -20690 -26708 -38059 -48923 -41829
1741 -41829 -59119 -46614 -48851 -54451 -40015 -24582 -6400 -22139 -18097 -33195 -57665 -51296 -35832
$$ packed form
1833d0678N994j0612j0267L0180r308J0466k3778L626P095p502J2913M646m053
1820c1278K0675j3993K4229l6587j8596K3197l457N656p28J8781J0203k2384k0411
1807d4693j0702J9744J3293Q173k4606j7219K002J2101J5336o1l607P385P28J6233
1793e893p520k2877q658J482j2070K4455J9875n881n469j1187J950j1830J1130
1780c2493j8171o291J6465J6999K4431Q1m1789l39J3168r121J1163j5850j1324
1767e3071j0518J3528J8660j5135m17L376N769k1643J4551j7522l931K830K3541
1754c9982L4170J2936o690k9800j6527n683K0745J4142m001o018j1351j0864P094
1741d1829j7290J2505k237n600J4436J5433J8182j5739M042j5098k4470O369J5464
$$ plain form
1728 -35832 -23061 -36568 -34295 -14535 -13930 -54761 -37671 -14632 -24355 -25980 -25334 -27049 -42155
1715 -42155 -30686 -9988 -4152 -22991 -22411 -33798 -40943 -39574 -36522 -19668 -28918 -35243 -38045 -65740
1701 -65740 -43035 -57855 -58908 -42201 -48610 -24618 -32217 -41958 -23392 -32383 -40132 -36503 -33606
1688 -33606 -38768 -25327 -24330 -45151 -49104 -30196 -39423 -48282 -42240 -29930 -20958 -25994 -12033 -8077
1674 -8077 -1416 -24919 -41712 -37318 -41034 -37232 -43394 -45441 -27882 -11662 -14008 -21388 -31256 -21887
1660 -21887 -38888 -49568 -30505 -22221 -21091 -39278 -40316 -40716 -57795 -56106 -57234 -46494 -52775
1647 -52775 -64851 -54873 -38538 -45405 -28871 -26372 -21177 -37994 -48841 -54099 -51243 -18648 -273
1634 -273 -25497 -52076 -23810 2024 320 -1930 9200 -5043 6431 9736 -23023 -21426 7594
$$ packed form
1728c5832J2771j3507K273J9760O05m0831J7090K3039r723j625O46j715j5106
1715d2155J1469K0698N836j8839N80j1387p145J369L052J6854r250o325k802k7695
1701f5740K2705j4820j053J6707o409K3992p599r741J8566q991p749L629K897
1688c3606n162J3441R97k0821l953J8908r227q859O042J2310Q972n036J3961L956
1674h077O661k3503j6793M394l716L802o162k047J7559J6220k346p380r868R369
1660b1887j7001j0680J9063Q284J130j8187j038m00j7079J689j128J0740o281
1647e2775j2076R978J6335o867J6534K499N195j6817j0847n258K856L2595J8375
1634b73k5224k6579K8266K5834j704k250J1130j4243J1474L305l2759J597K9020
$$ plain form
1621 7594 -13630 -10804 -50144 -64950 -43785 -38485 -43267 -39083 -34640 -6895 -15701 -22013 -13607 -12624
1607 -12624 -22592 -33093 -10684 -25661 -12509 4814 3251 -30203 -27039 -28450 -34658 -41192 -46122
1594 -46122 -26089 -50305 -69558 -76076 -39533 -29197 -38670 -15193 -21341 -17239 -19565 -14083 -31514
1581 -31514 -49449 -35449 -53715 -62090 -53926 -45938 -50143 -27129 -23626 -23647 -15844 -26577 -37096 -10575
1567 -10575 -20216 -42982 -26245 -13839 -6143 -5616 -26338 -8210 12118 -8187 -40102 -36915 -37223
1554 -37223 -48082 -38546 -35061 -28166 -9188 9495 6324 -13372 -10571 -44153 -82827 -47702 -14668
1541 -14668 -12226 -14126 -25731 -45094 -19481 -21153 -16421 -16365 -14442 -20307 -20802 -22753 -47783 -25576
1527 -25576 -17950 -18768 -22058 -20580 -34166 -31333 -49051 -48282 -51746 -44786 -19208 -38621 -37566 -7298
$$ packed form
1621G594k1224K826l9340j4806K1165N300m782M184M443K7745q806o312Q406R83
1607a2624r968j0501K2409j4977J3152J7323j563l3454L164j411o208o534m930
1594d6122K0033k4216j9253o518L6543J0336r473K3477o148M102k326N482j7431
1581c1514j7935J4000j8266q375Q164P988m205K3014L503k1P803j0733j0519K6521
1567a0575r641k2766J6737J2406P696N27k0722J8128K0328k0305l1915L187l08
1554c7223j0859R536L485O895J8978J8683l171j9696K801l3582l8674L5125L3034
1541a4668K442j900j1605j9363K5613j672M732N6J923n865m95j951k5030K2207
1527b5576P626q18l290J478j3586K833j7718P69l464O960K5578j9413J055L0268
$$ plain form
1513 -7298 -9258 -3158 -23979 -54917 -28493 -25462 -15700 4828 14570 -16542 -21042 -17848 -12496 -18646
1499 -18646 -24873 8163 -7009 -10538 -1062 -19063 -35425 -28480 -30446 -55889 -44495 -37419 -31923
1486 -31923 -36881 -12245 -32952 -48375 -46687 -38366 -12516 -5931 -16033 -8546 -20467 -41481 -21487
1473 -21487 -12654 5014 8309 -9519 -27288 -52547 -51058 -35506 -24517 -25396 -15188 -10062 -59462
1460 -59462 -40787 -36169 -23327 -25040 -18469 -10011 -15959 -18493 -17935 -19197 -32787 -40033 -39813 -18031
1446 -18031 -10926 -1810 -28072 -25024 -6170 -12641 -43715 -44126 -37416 -11083 -10282 -7486 -4512 3915
1432 3915 -12409 -9130 -21414 -35860 -2770 -8110 -20605 -1482 -8634 -19147 -35433 -35378 -465
1419 -465 10614 -12329 -7519 -15138 -32243 -29034 -26428 -34574 -17613 -27794 -18319 -3119 -12558 -31880
$$ packed form
1513g298j960O100k0821l0938K6424L031R762K0528R742l1112m500L194N352o150
1499a8646o227L3036j5172l529R476j8001j6362O945j966k5443J1394P076N496
1486c1923m958K4636k0707j5423J688Q321K5850O585j0102P487j1921k1014J9994
1473b1487Q833J7668L295j7828j7769k5259J489J5552J0989q79J0208N126m9400
1460e9462J8675M618J2842j713O571Q458n948k534N58j262j3590p246K20K1782
1446a8031P105R116k6262L048J8854o471l1074m11O710K6333Q01K796K974Q427
1432C915j6324L279j2284j4446L3090n340j2495J9123p152j0513j6286N5L4913
1419d65J1079k2943M810p619j7105L209K606q146J6961j0181R475J5200r439j9322
$$ plain form
1405 -31880 -34325 -27559 -39283 -11528 -30321 -12698 -3464 -13651 -22203 5517 8367 -6407 -32494
1392 -32494 -37245 -33938 -31165 -26429 -22735 -8470 -8571 -36887 -50294 -64196 -54350 -55794 -48955 -27222
1378 -27222 -50794 -47437 -57018 -30108 -41846 -42956 -2532 6000 -19828 -8021 -6860 -19192 -23699
1365 -23699 -49163 -62387 -71128 -38778 -26915 -26114 -32194 -29513 -18884 -13271 -8270 8830 -3455
1352 -3455 -18413 -38062 -13872 -16172 -6742 -3840 -9376 5663 4737 -5191 11420 2029 -11182 -29951
1338 -29951 -36797 -33182 -21199 -8161 -23575 -16382 -21451 -25785 -9099 -2518 -4129 -11206 -14278 -35935
1324 -35935 -39762 1328 317 2374 -2531 13442 -3552 -24001 -7606 -40 -26252 -51335 -32603
1311 -32603 -16840 -8571 -5094 -35672 -31773 -38832 -22808 -6407 -31500 -18046 -10078 -4849 2575
$$ packed form
1405c1880k445O766j1724K7755j8793J7623R234j0187q552K7720K850j4774k6087
1392c2494m751L307K773M736L694J4265j01k8316j3407j3902R846j444O839K1733
1378b7222k3572L357r581K6910j1738j110M0424Q532k5828J1807J161j2332m507
1365b3699k5464j3224q741L2350J1863Q01o080K681J0629N613N001J7100j2285
1352c455j4958j9649K4190k300R430K902n536J5039r26r928J6611r391j3211j8769
1338b9951o846L615J1983J3038j5414P193n069m334J6686O581j611p077l072k1657
1324c5935l827M1090j011K057m905J5973j6994k0449J6395P566k6212k5083J8732
1311c2603J5763Q269L477l0578L899p059J6024J6401k5093J3454P968N229P424
$$ plain form
1298 2575 8446 -14134 -16162 5028 -5255 -14864 -8666 -20764 -26404 -32185 -8689 -8580 -1924 -22693
1284 -22693 -6377 -10150 -21190 -4991 -29745 -18184 -9837 -23623 -17272 6194 12555 30481 12387
1271 12387 -1587 -15143 761 30264 6876 -25924 2512 -23091 -23629 -22907 -39006 -41223 -22818
1258 -22818 -2928 -7010 -25162 -119 -18937 -16581 -24297 -39456 -25268 -7686 -5265 -3219 17720
1245 17720 8933 -5534 -21719 -18617 -24622 -1444 -286 -18617 -2479 13046 23156 29593 16401
1232 16401 -3948 22408 25462 -24712 -33823 -10198 21009 2799 -12976 -22914 -16311 -33895 -17315
1219 -17315 -7637 -14839 -23973 -10947 2213 -13986 -4581 1369 27021 23061 773 -15673 -9285
1206 -9285 -5396 -6365 -44786 -52874 -6380 -17019 -28466 -39091 -15988 -2087 -4093 -4776 -15020
$$ packed form
1298B575N871k2580k028K1190j0283r609O198j2098n640n781K3496J09O656k0769
1284b2693J6316l773j1040J6199k4754J1561Q347j3786O351K3466O361J7926j8094
1271A2387j3974j3556J5904K9503k3388l2800K8436k5603n38P22j6099k217J8405
1258b2818J9890m082j8152K5043j8818K356p716j5159J4188J7582K421K046K0939
1245A7720q787j4467j6185L102o005K3178J158j8331J6138J5525J0110O437j3192
1232A6401k0349K6356L054n0174r111K3625L1207j8210j5775r938O603j7584J6580
1219a7315R678p202r134J3026J3160j6199R405N950K5652l960k2288j6446O388
1206i285L889r69l8421q088M6494j0639j1447j0625K3103J3901k006o83j0244
$$ plain form
1193 -15020 5806 22857 8990 -4125 -4845 6654 -14570 -14036 -16759 -19342 -9761 -1530 9706
1180 9706 -24248 -11462 9909 39036 16121 -15006 -25690 -20353 -18472 -10878 -22749 -27744 -36019
1167 -36019 -46189 -29685 -39855 -29079 -4280 -11440 -9592 7075 16624 27509 -3724 -30150
1155 -30150 -20174 -19705 -19695 -9590 -12914 626 -8447 -19343 -7080 20148 5412 -6474 5501
1142 5501 -7678 -5317 -19530 -45953 -22830 -10498 -17115 -36076 -50844 -47896 -29202 -5205 -21224
1129 -21224 -26195 438 -7921 -7449 -265 -4960 -17737 -32359 -36207 -53713 -35182 -21567 -35560
1116 -35560 -7947 12477 -1970 -10284 -9120 -10610 -5056 -14710 -10119 17722 3234 12390 687
1103 687 -6923 -11242 7203 7681 -16868 485 -3567 -21331 -2688 22585 -4782 1637 17649
$$ packed form
1193a5020K0826J7051j3867j3115p20J1499k1224N34k723k583R581Q231J1236
1180I706l3954J2786K1371K9127k2915l1127j0684N337J881P594j1871m995q275
1167c6019j0170J6504j0170J0776K4799p160J848J6667R549J0885l1233k6426
1155c0150R976M69J0J0105l324J3540r073j0896J2263K7228j4736j1886J1975
1142E501j3179K361j4213k6423K3123J2332o617j8961j4768K948J8694K3997j6019
1129b1224m971K6633q359M72P184m695j2777j4622l848j7506J8531J3615j3993
1116c5560K7613K0424j4447q314J164j490N554r654M591K7841j4488R156j1703
1103F87p610m319J8445M78k4549J7353m052j7764J8643K5273k7367O419J6012
$$ plain form
1090 17649 17186 27993 8889 7036 10586 20302 9194 10637 -3324 -10859 -6171 -15392 10071 10424
1076 10424 15908 -872 -3260 410 -6429 -21540 -14506 -15215 -5134 -17000 -6358 -9149 -28464
1063 -28464 4664 -14901 -24282 4735 784 24010 -6460 -27504 -10713 8995 -1342 -16345
1051 -16345 -18774 -9805 -12085 -21898 1111 6623 -125 -9264 -27879 -3560 5670 -2091 22243 3666
1037 3666 -25307 -15529 23879 8298 -6979 -593 5668 -472 1339 6445 16594 -6997 -8256
1024 -8256 11651 12491 -950 -18594 -2428 3450 1848 13814 32055 14153 11995 15966 28452
1011 28452 27487 21944 26549 20486 27061 -759 -11453 -17921 -3163 -18385 963 13131 12104
998 12104 12205 25083 21132 1178 18064 32001 125 -11546 -549 17027 14632 -2641 5255
$$ packed form
1090A7649m63J0807j9104j853L550R716j1108J443j3961p535M688r221K5463L53
1076A0424N484j6780k388L670o839j5111P034p09J0081j1866J0642k791j9315
1063b8464L3128j9565r381K9017l951K3226l0470k1044J6791J9708j0337j5003
1051a6345k429Q969k280r813K3009N512o748r139j8615K4319R230p761K4334j8577
1037C666k8973R778L9408j5581j5277O386O261o140J811N106J0149k3591j259
1024h256J9907Q40j3441j7644J6166N878j602J1966J8241j7902k158L971J2486
1011B8452r65n543M605o063O575k7820j0694o468J4758j5222J9348J2168j027
998A2104J01J2878l951j9954J6886J3937l1876j1671J0997J7576k395j7273P896
$$ plain form
985 5255 -3595 -21681 -10541 -3034 7156 36949 30820 32747 34601 13966 22378 27941 45482 42108
971 42108 17909 33905 18330 17030 12029 7642 -3596 -16527 -7067 -4816 106 -16152 -18877
958 -18877 -4795 -3467 6873 11722 12014 145 -9054 -30830 -21346 5880 28259 9807 1799
945 1799 -2808 -12489 18641 29730 28039 4709 2650 9210 1440 -5116 14542 24015 18065 -16960
931 -16960 -7094 11145 29 -3301 8091 -15167 -16590 -7058 1247 15605 2769 -2516 -16921
918 -16921 5354 18074 3584 13010 33495 7991 14315 9215 8603 23803 29575 4970 -3182
905 -3182 -4357 -11500 -2926 -918 -10846 -769 9080 4073 22225 18945 10953 27687 18597 -10169
891 -10169 -6457 19630 14340 3291 25132 21030 -2228 -3365 13709 20667 3888 -23529 1062
$$ packed form
985E255q850j8086J1140P507J0190K9793o129J927J854k0635Q412N563J7541l374
971D2108k4199J5996j5575j300n001m387j1238j2931R460K251M922j6258k725
958a8877J4082J328J0340M849K92j1869r199k1776R484K7226K2379j8452q008
945A799m607r681L1130J1089j691k3330k059O560p770o556J9658R473n950l5025
931a6960R866J8239j1116l330J1392k3258j423R532Q305J4358j2836n285j4405
918a6921K2275J2720j4490R426K0485k5504O324n100o12J5200N772k4605q152
905c182j175p143Q574K008r928J0077R849n007J8152l280p992J6734r090k8766
891a0169L712K6087n290j1049K1841m102k3258j137J7074O958j6779k7417K4591
$$ plain form
878 1062 7956 3862 27303 27471 16185 9541 1872 -21262 -8624 2678 -8522 14132 -847
865 -847 -21922 -12931 -20209 4896 16159 23537 33470 42659 21104 22226 18967 -1318 9550 -7383
851 -7383 13625 24291 28919 -681 3452 12794 15768 16297 17740 32779 14407 24093 697 -6576
837 -6576 -3236 8075 2158 13134 11050 31922 27220 33221 24384 19820 13413 -2928 1193 -18691
823 -18691 -15549 -17294 -17425 2158 -7502 -19725 -10946 7255 27546 28502 33525 42483 24230 7494
809 7494 8149 16881 24709 33812 30634 12191 -8240 -21939 13072 8565 -8405 -4845 28123 31010
795 31010 -9923 -7381 -18397 -7684 14213 3439 9500 11499 25500 21451 12429 14408 17073
782 17073 15154 39712 24803 39147 19532 -8892 -19382 6092 9465 -25727 -25917 -8308 15169
$$ packed form
878A062O894m094K3441J68j1286o644p669k3134J2638J1302j1200K2654j4979
865h47k1075Q991p278K5105J1263P378R933R189k1555J122l259k0285J0868j6933
851g383K1008J0666M628k9600M133R342K974N29J443J5039j8372R686k3396p273
837f576L340J1311n917J0976k084K0872m702O001q837m564o407j6341M121j9884
823a8691L142j745j31J9583r660j2223Q779J8201K0291R56N023Q958j8253j6736
809G494O55Q732P828R103l178j8443k0431j3699L5011m507j6970L560L2968K887
795C1010m0933K542j1016J0713K1897j0774O061J999J4001m049r022J979K665
782A7073j919K4558j4909J4344j9615k8424j0490K5474L373l5192j90J7609K3477
$$ plain form
769 15169 18722 -3081 14585 21730 18525 5853 -4745 13698 -6288 11816 21716 18503 39990
756 39990 29810 39289 22878 11293 4784 -22017 -21595 -13077 13073 38940 19873 5923 13500
743 13500 -10071 -14588 15087 28310 14633 29261 33844 19584 -9778 -13938 7129 24336 -2200
730 -2200 29193 34106 15062 4680 4967 -9175 -9709 -9894 -10465 -14694 16867 25297 11842 25109
716 25109 14604 13927 1212 17184 33194 11433 4579 7669 1111 12206 11097 16132 26120 42144
702 42144 28408 13006 -8843 12661 21302 5493 -3611 14523 10863 24013 -1659 -1334 -13866
689 -13866 -12876 -3188 9258 3084 23664 21996 31778 39745 31789 52287 33465 33130 9824 5543
675 5543 1781 -25282 -1904 13215 -16360 -11811 -4375 -723 -5272 13203 28651 27118 -1449
$$ packed form
769A5169L553k1803J7666P145l205j2672j0598J8443j9986J8104R900l213K1487
756C9990j0180R479j6411j1585o509k6801M22Q518K6150K5867j9067j3950P577
743A3500k3571m517K9675J3223j3677J4628M583j4260k9362m160K1067J7207k6536
730b200L1393M913j9044j0382K87j4142n34j85n71m229L1561Q430j3455J3267
716B5109j0505o77j2715J5972J6010k1761o854L090o558J1095j109N035R988J6024
702D2144j3736j5402k1849K1504Q641j5809r104J8134l660J3150k5672L25j2532
689a3866R90R688J2446o174K0580j668R782P967p956K0498j8822l35k3306m281
675E543l762k7063K3378J5119k9575M549P436L652m549J8475J5448j533k8567
$$ plain form
662 -1449 9810 -8485 -3137 27770 19746 8336 17791 -548 14898 9321 3448 11601 34614
649 34614 19482 20349 35719 35478 33543 22905 20261 -1516 11106 22508 12803 6565 -3793 -11474
635 -11474 3239 17297 25298 -8099 -8907 19245 -6248 -6920 1675 4331 27818 31930 36500 34003
621 34003 14132 30085 33879 15504 11534 21873 25138 21813 25771 16591 13061 11383 25472 52418
607 52418 34073 17883 11456 25358 19047 1519 1828 13806 29466 22541 28249 32449 16234
594 16234 20717 6140 13645 15703 28661 29444 12848 29806 8965 -540 26601 16502 14863
581 14863 6136 21096 24289 -9388 -7375 6655 23173 26214 -5207 13814 17337 -5954 5927
568 5927 28432 23801 6449 7770 6713 6196 19225 28264 23048 25455 24753 18404 -7647 -6842 2572
$$ packed form
662a449J1259j8295N348L0907q024j1410R455j8339J5446n577n873Q153K3013
649C4614j5132Q67J5370k41j935j0638k644k1777J2622J1402r705o238j0358p681
635a1474J4713J4058Q001l3397q08K8152k5493o72Q595K656K3487M112M570k497
621C4003j9871J5953L794j8375l970J0339L265l325L958r180l530j678J4089K6946
607E2418j8345j6190o427J3902o311j7528L09J1978J5660o925N708M200j6215
594A6234M483j4577P505K058J2958P83j6596J6958k0841r505K7141j0099j639
581A4863q727J4960L193l3677K013J4030J6518L041l1421J9021L523k3291J1881
568E927K2505m631j7352J321j057n17J3029R039n216K407p02o349k6051Q05R414
$$ plain form
553 2572 31686 30006 32478 14603 11843 13267 363 20311 38663 5268 5307 8162 27838 19672
539 19672 4226 3740 23715 21770 45762 36588 16362 755 -16359 19664 49008 34120 4643
526 4643 8420 21201 39652 29803 19989 18912 26790 21507 6368 1737 2947 18231 18720 34442
512 34442 50198 34618 17057 37125 17169 13070 25087 15827 3093 -17874 -8607 511 5081
499 5081 11023 11351 11565 16749 31658 42038 17830 1168 13851 4993 34754 30062 18614 21844
485 21844 18685 16897 3380 4440 -10281 -12303 43441 44186 29267 19524 22819 46272 61808 61358
471 61358 33070 46314 43834 14300 22544 15034 -1661 19937 14644 10163 -3837 36855 32548
458 32548 32700 11557 -19731 -23638 -3345 14140 31959 9179 -2715 -11568 -17697 5450 19307
$$ packed form
553B572K9114j680K472j7875k760J424j2904J9948J8352l3395L9K855J9676q166
539A9672j5446m86J9975j945K3992r174k0226j5607j7114L6023K9344j4888k9477
526D643L777J2781J8451r849r814j077P878n283j5139m631J210J5284M89J5722
512C4442J5756j5580j7561K0068j9956m099J2017r260j2734k0967R267R118M570
499E081N942L28K14N184J4909J0380k4208j6662J2683q858K9761m692j1448L230
485B1844l159j788j3517J060j4721k022N5744P45j4919r743L295K3453J5536m50
471F1358k8288J3244k480k9534Q244p510j6695K1598n293m481j4000M0692m307
458C2548J52k1143l1288l907K0293J7485J7819k2780j1894q853o129K3147J3857
$$ plain form
445 19307 28263 21517 -9057 -122 1315 6912 12107 1885 15595 21898 -2157 683 -3885 -1703
431 -1703 14574 38715 29373 33655 28686 28083 81234 44017 32670 27597 31231 13637 16649 28870
417 28870 36989 52915 31475 17208 24916 41115 29567 38409 45934 55332 42511 38569 31646
404 31646 20403 22980 2888 18587 26072 10355 20421 20979 17379 -17557 6308 24124 -3121
391 -3121 4892 -7682 -9048 -8205 -4704 -8448 -7857 5150 7863 16563 -9596 4430 8193 20512
377 20512 32622 8510 27504 -5216 -17621 -980 23236 36859 16862 -7942 1805 26565
365 26565 36852 42783 32459 18810 16981 5613 -14479 8393 35358 62210 43731 31320
353 31320 30483 10671 6189 13612 25788 5323 -2366 9510 15222 16053 16668 24406 32911 22380
$$ packed form
445A9307Q956o746l0574Q935J437N597N195j0222J3710O303k4055K840m568K182
431a703J6277K4141r342M282m969o03N3151l7217j1347n073L634j7594L012J2221
417B8870Q119J5926k1440j4267P708J6199j1548Q842P525R398j2821l942o923
404C1646j1243K577k0092J5699P485j5717J0066N58l600l4936K3865J7816k7245
391c121Q013j2574j366Q43L501l744N91J3007K713Q700k6159J4026L763J2319
377B0512J2110k4112J8994l2720j2405J6641K4216J3623j9997k4804R747K4760
365B6565J0287N931j0324j3649j829j1368k0092K2872K6965K6852j8479j2411
353C1320q37j9812m482P423J2176k0465p689J1876N712Q31O15P738Q505j0531
$$ plain form
339 22380 13247 20387 7864 2112 -13590 -9431 7090 18354 30321 13326 18097 38383 41812
326 41812 24547 37925 18726 -12628 5828 14350 24368 21362 12734 35683 45704 36487 15666
313 15666 24784 4966 15015 17321 27171 32356 34894 24662 10877 4974 11746 8267 27578 11313
299 11313 22914 12637 15706 17531 10025 18917 17124 27100 31210 14802 11210 23663 20059 12583
285 12583 15055 19291 36505 34294 24096 20218 39482 34909 29910 40309 13446 -24653 7707
272 7707 15762 12655 42059 40446 42268 27717 26073 19233 15954 20092 26948 36669 38268 15421
258 15421 30644 28371 9888 1488 22429 21060 42087 37198 53239 42808 19858 41470 31165
245 31165 22907 54069 28056 28406 33113 32996 30832 17457 20606 12628 1553 12399 31452 24424
$$ packed form
339B2380r133P140j2523n752j5702M159J6521J1264J1967j6995M771K0286L429
326D1812j7265J3378j9199l1354J8456Q522J0018l006q628K2949J0021r217k0821
313A5666R118j9818J0049K306R850N185K538j0232j3785n903O772l479J9311j6265
299A1313J1601j0277L069J825p506Q892j793R976M110j6408l592J2453l604p476
285A2583K472M236J7214k211j0198l878J9264m573m999J0399k6863l8099L2360
272G707Q055l107K9404j613J822j4551j644o840l279M138O856R721J599k2847
258A5421J5223k273j8483q400K0941j369K1027m889J6041j0431k2950K1612j0305
245C1165q258L1162k6013L50M707j17k164j3375L149p978j1075J0846J9053p028
$$ plain form
231 24424 17570 18995 14405 14756 17517 15795 -9579 -604 -6994 5270 9714 19120 -3656 -19631
217 -19631 4324 2069 5728 18867 9496 13816 -10321 -3971 826 -15078 721 27920 8851
204 8851 35023 35068 28966 33088 22923 31714 36566 19393 -9538 -11691 -16202 -457 -4367 -6273
190 -6273 12113 3510 932 12887 1217 -2074 -17693 -16994 -15860 6937 -17082 -9920 9714 33060
176 33060 25147 1596 -17390 2072 -3673 643 2006 -12082 -19511 -8367 -939 -10635 5398
163 5398 1499 -21985 -21912 -19650 -15734 -14519 -15068 -7249 -7973 -17981 -25884 -35769 -16362 -16492 -19291 -4950
147 -4950 -7542 -12548 -13643 -7682 -5320 -1571 4445 2292 -16088 -357 -143 -19098 -19333 -12639 -9195
132 -9195 -20014 -26306 -39088 -55631 -31891 -12423 -14072 -11296 -20123 -25996 -47667 -42120 -31413
$$ packed form
231B4424o854J425m590L51K761j722k5374Q975o390J2264M444R406k2776j5975
217a9631K3955k255L659J3139r371M320k4137O350M797j5904J5799K7199j9069
204H851K6172M5o102M122j0165Q791M852j7173k8931k153m511J5745l910j906
190f273J8386q603k578J1955j1670l291j5619O99J134K2797k4019P162J9634K3346
176C3060p913k3551j8986J9462n745M316J363j4088p429J1144P428r696J6033
163E398l899k3484P3K262L916J215n49P819p24j0008p903r885J9407j30k799J4341
147d950k592n006j095N961K362L749O016k153j8380J5731K14j8955k35O694L444
132i195j0819o292j2782j6543K3740J9468j649K776q827n873k1671N547J0707
$$ plain form
119 -31413 -19604 12964 -32409 -38473 -43974 -45039 -50647 -53578 -37984 -39257 -45830 -44720 -40847 -26532
105 -26532 -21792 -28849 -29667 -46994 -46198 -46661 -48362 -63306 -57672 -48208 -30025 -70674 -68081 -48243
91 -48243 -43782 -34380 -34347 -57778 -67851 -61402 -81120 -83260 -65774 -65050 -81007 -80824 -69214 -67410 -62856
76 -62856 -56562 -64688 -66083 -66456 -65427 -84629 -84916 -81826 -80457 -93747 -99671 -85526 -63949 -50624
62 -50624 -81533 -71494 -37486 -42809 -74558 -88943 -77150 -83731 -87960 -69937 -59239 -59300 -69803
49 -69803 -94238 -95516 -69890 -74150 -66120 -88097 -91988 -79105 -68441 -93867 -108163 -103139 -117195
36 -117195 -102968 -87248 -89222 -90299 -78462 -98494 -106478 -112783 -97003 -80875 -83395 -112052 -127109
23 -127109 -127923 -111662 -124908 -122555 -116916 -111243 -110641 -107596 -120833 -126103 -123831 -113997 -117901 -131380
$$ packed form
119c1413J1809L2568m5373o064n501j065n608k931J5594j273o573J110L873J4315
105b6532M740p057q18j7327P96m63j701j4944N634R464J8183m0649K593J9838
91d8243M461R402L3k3431j0073O449j9718k140J7486P24j5957J83J1610J804M554
76f2856O294q126j395l73J029j9202k87L090J369j3290n924J4145K1577J3325
62e0624l0909J0039L4008n323l1749j4385J1793o581m229J8023J0698o1j0503
49f9803k4435j278K5626m260Q030k1977l891J2883J0664k5426j4296N024j4056
36a17195J4227J5720j974j077J1837k0032p984o305J5780J6128k520k8657j5057
23a27109q14J6261j3246K353N639N673O02L045j3237n270K272R834l904j3479
$$ plain form
9 -131380 -123163 -132625 -132005 -128706 -121867 -115288 -117944 -125873 -131466
0 -131466
$$ packed form
9a31380Q217r462O20L299O839O579k656p929n593
0a31466
$$ Imaginary data points
##PAGE= N=2
##DATA TABLE= (X++(I..I)), XYDATA
$$ plain form
16383 -817048 -815322 -811573 -801585 -773840 -750518 -745384 -726371 -690349 -699082 -692836 -669777 -657022 -650515
16370 -650515 -641433 -599270 -603541 -589835 -569731 -548790 -545978 -541267 -523553 -515889 -521451 -513977 -488173
16357 -488173 -476069 -460357 -463314 -448004 -431732 -401945 -384823 -377178 -374136 -377186 -358041 -331895
16345 -331895 -321287 -324023 -308195 -290866 -287137 -273512 -250716 -247518 -245813 -223892 -219541 -198574
16333 -198574 -173339 -155511 -146131 -143352 -148091 -133222 -124417 -101201 -87682 -82691 -66691 -42817
16321 -42817 -39193 -32615 -19000 -618 -14150 -7559 11402 31140 43182 45113 61591 85807
16309 85807 103738 90060 82373 103489 115895 122889 139483 151597 166500 167139 166606 194278 207060
16296 207060 210436 240415 255123 262290 265080 267710 275022 306338 319799 318934 321711 329719 334664
$$ packed form
16383h17048J726L749R988K7745K3322N134J9013L6022q733O246K3059J2755O507
16370f50515R082M2163m271J3706K0104K0941K812M711J7714P664n562P474K5804
16357d88173J2104J5712k957J5310J6272K9787J7122P645L042l050J9145K6146
16345c31895J0608k736J5828J7329L729J3625K2796L198J705K1921M351K0967
16333a98574K5235J7828R380K779m739J4869Q805K3216J3519M991J6000K3874
16321d2817L624O578J3615J8382j3532O591J8961J9738J2042J931J6478K4216
16309H5807J7931j3678p687K1116J2406O994J6594J2114J4903O39n33K7672J2782
16296B07060L376K9979J4708P167K790K630P312L1316J3461q65K777Q008M945
$$ plain form
16283 334664 355463 366632 343734 339460 381796 396224 416508 423392 430115 427332 432551 448024
$$ packed form
16283C34664K0799J1169k2898m274M2336J4428K0284O884O723k783N219J5473
$$ [...]
##END NTUPLES=NMR SPECTRUM
##END=
