##TITLE=1H_EC-3296(VI-3)
 CDCl3
 8 sc, 
 15.6.2023
##JCAMPDX= 6.0         $$ Bruker NMR JCAMP-DX V2.0
##DATA TYPE= NMR SPECTRUM
##DATA CLASS= NTUPLES
##ORIGIN= UXNMR, Bruker Analytische Messtechnik GmbH
##OWNER= root
$$ XWIN-NMR		Version 3.5
$$ Thu Jun 15 11:15:29 2023 Russian Standard Time (UT+4h)  she@DPX200
##.OBSERVE FREQUENCY= 200.13135
##.OBSERVE NUCLEUS= ^1H
##.ACQUISITION MODE= SIMULTANEOUS
##.ACQUISITION SCHEME= undefined
##.AVERAGES= 8
##.DIGITISER RES= 18
##SPECTROMETER/DATA SYSTEM= spect
##.PULSE SEQUENCE= zg30
##.SOLVENT NAME= Acetone
##.SHIFT REFERENCE= (INTERNAL, Acetone, 0, 15.7689)
##AUDIT TRAIL= $$ (NUMBER, WHEN, WHO, WHERE, WHAT)
$$ ##TITLE= Audit trail, XWIN-NMR		Version 3.5
$$ ##JCAMPDX= 5.01
$$ ##ORIGIN= Bruker BioSpin GmbH
$$ ##OWNER= she
$$ F:/spectra/data/she/nmr/H-F/1/pdata/1/auditp.txt
$$ ##AUDIT TRAIL=  $$ (NUMBER, WHEN, WHO, WHERE, WHAT)
(   1,<2023-06-15 11:13:12.96 +0400>,<she>,<DPX200>,
      <created by zg, POWCHK disabled, PULCHK disabled
       configuration hash MD5:
       00 E9 B6 7A A2 85 ED C7 34 08 36 98 17 FE 4E 26
       data hash MD5: 16K
       79 1C 06 FD 9F 5A BF 8B 58 19 AA 46 CF EE 74 7D>)
(   2,<2023-06-15 11:13:30.50 +0400>,<she>,<DPX200>,
      <Start of raw data processing
       efp BC_mod = 2 LB = 0.24 FT_mod = 6 PKNL = 1 PHC0 = -20625.63 PHC1 = 11.05272 SI = 16K 
       data hash MD5: 16K
       D9 40 DC FC D6 B3 EB 70 76 44 BC C0 52 2D B1 7F>)
(   3,<2023-06-15 11:13:51.51 +0400>,<she>,<DPX200>,
      <pk PHC0 = -157.6516 PHC1 = 0 
       data hash MD5: 16K
       FC 4C F5 0C 75 B4 6F EF 5D D4 06 79 8C 1F D7 BB>)
(   4,<2023-06-15 11:13:55.45 +0400>,<she>,<DPX200>,
      <abs ABSG = 5 
       data hash MD5: 16K
       7F 17 09 7E 78 EF FA 16 76 23 F7 34 68 A7 97 8B>)
$$ ##END=
$$ 
$$ hash MD5
$$ 4D 87 CB 5B 96 5F 0F A0 FC 95 D8 0F 39 99 6F B7
##$RELAX= 
##$RELAX= 
##$RELAX= 
##$RELAX= 
##$RELAX= 
##$RELAX= 
$$ Bruker specific parameters
$$ --------------------------
##$DU= <F:/spectra>
##$EXPNO= 1
##$NAME= <H-F>
##$PROCNO= 1
##$TYPE= <nmr>
##$USER= <she>
##$AMP= (0..31)
100 100 100 100 100 100 100 100 100 100 100 100 100 100 100 100 100 100 
100 100 100 100 100 100 100 100 100 100 100 100 100 100 
##$AQSEQ= 0
##$AQ_mod= 1
##$AUNM= <au_zg>
##$AUTOPOS= <>
##$BF1= 200.13
##$BF2= 200.13
##$BF3= 200.13
##$BF4= 200.13
##$BF5= 200.13
##$BF6= 200.13
##$BF7= 200.13
##$BF8= 200.13
##$BYTORDA= 1
##$CFDGTYP= 0
##$CFRGTYP= 5
##$CHEMSTR= <none>
##$CNST= (0..31)
1 1 145 1 1 1 1 1 1 1 1 1 1 1 1 1 1 1 1 1 1 1 1 1 1 1 1 1 1 1 1 1 
##$CPDPRG= <>
##$CPDPRG1= <>
##$CPDPRG2= <>
##$CPDPRG3= <>
##$CPDPRG4= <mlev>
##$CPDPRG5= <mlev>
##$CPDPRG6= <mlev>
##$CPDPRG7= <mlev>
##$CPDPRG8= <mlev>
##$CPDPRGB= <>
##$CPDPRGT= <>
##$D= (0..31)
0 1.2 0 0 0 0 0 0 0 0.06 0 0.03 0 0 0 0 0.0002 0 0 0 0 0 0 0 0 0 0 0 0 
0 0 0 
##$DATE= 1686813192
##$DBL= (0..7)
120 120 120 120 120 120 120 120 
##$DBP= (0..7)
150 150 150 150 150 150 150 150 
##$DBP07= 0
##$DBPNAM0= <>
##$DBPNAM1= <>
##$DBPNAM2= <>
##$DBPNAM3= <>
##$DBPNAM4= <>
$$ [...]
##$SUBNAM3= <"">
##$SUBNAM4= <"">
##$SUBNAM5= <"">
##$SUBNAM6= <"">
##$SUBNAM7= <"">
##$SUBNAM8= <"">
##$SUBNAM9= <"">
##$SW= 18.05172834244
##$SWIBOX= (0..15)
0 0 2 0 0 0 0 0 0 0 0 0 0 0 0 0 
##$SW_h= 3612.71676300578
##$TD= 16384
##$TD0= 1
##$TE= 0
##$TE2= 300
##$TE3= 300
##$TEG= 300
##$TL= (0..7)
0 120 120 120 120 120 120 120 
##$TP= (0..7)
150 150 150 150 150 150 150 150 
##$TP07= 0
##$TPNAME0= <>
##$TPNAME1= <>
##$TPNAME2= <>
##$TPNAME3= <>
##$TPNAME4= <>
##$TPNAME5= <>
##$TPNAME6= <>
##$TPNAME7= <>
##$TPOAL= (0..7)
0.5 0.5 0.5 0.5 0.5 0.5 0.5 0.5 
##$TPOFFS= (0..7)
0 0 0 0 0 0 0 0 
##$TUNHIN= 0
##$TUNHOUT= 0
##$TUNXOUT= 0
##$USERA1= <user>
##$USERA2= <user>
##$USERA3= <user>
##$USERA4= <user>
##$USERA5= <user>
##$V9= 5
##$VALIST= <valist>
##$VCLIST= <CCCCCCCCCCCCCCC>
##$VD= 0
##$VDLIST= <DDDDDDDDDDDDDDD>
##$VPLIST= <PPPPPPPPPPPPPPP>
##$VTLIST= <TTTTTTTTTTTTTTT>
##$WBST= 1024
##$WBSW= 4
##$XGAIN= (0..3)
0 0 0 0 
##$XL= 0
##$YL= 0
##$YMAX_a= 251041
##$YMIN_a= -335773
##$ZGOPTNS= <>
##$ZL1= 120
##$ZL2= 120
##$ZL3= 120
##$ZL4= 120
##$ABSF1= 15.73146
##$ABSF2= -2.32039
##$ABSG= 5
##$ABSL= 3
##$ALPHA= 0
##$AQORDER= 0
##$ASSFAC= 0
##$ASSFACI= 0
##$ASSFACX= 0
##$ASSWID= 0
##$AUNMP= <proc_1d>
##$AZFE= 0.1
##$AZFW= 0.1
##$BCFW= 0
##$BC_mod= 2
##$BYTORDP= 0
##$COROFFS= 0
##$CY= -3
##$DATMOD= 1
##$DC= 0
##$DFILT= <>
##$DTYPP= 0
##$F1P= 0
##$F2P= 0
##$FCOR= 1
##$FTSIZE= 16384
##$FT_mod= 6
##$GAMMA= 0
##$GB= 0
##$INTBC= 1
##$INTSCL= 3.70164e-10
##$ISEN= 128
##$LB= 0.24
##$LEV0= 0
##$LPBIN= 0
##$MAXI= 10000
##$MC2= 0
##$MEAN= 0
##$ME_mod= 0
##$MI= 1.114404
##$NCOEF= 0
##$NC_proc= -5
##$NLEV= 6
##$NOISF1= 3.799351
##$NOISF2= 2.8
##$NSP= 0
##$NTH_PI= 0
##$NZP= 0
##$OFFSET= 15.76893
##$PC= 1
##$PHC0= -20783.28
##$PHC1= 11.05272
##$PH_mod= 1
##$PKNL= yes
##$PPARMOD= 0
##$PSCAL= 0
##$PSIGN= 0
##$REVERSE= no
##$SF= 200.130000522673
##$SI= 16384
##$SIGF1= 3
##$SIGF2= 2
##$SINO= 5.538805
##$SIOLD= 16384
##$SREGLST= <1H.CDCl3>
##$SSB= 0
##$STSI= 16384
##$STSR= 0
##$SW_p= 3612.71676300578
##$SYMM= 0
##$S_DEV= 0
##$TDeff= 16384
##$TDoff= 0
##$TI= <>
##$TILT= no
##$TM1= 0
##$TM2= 0
##$TOPLEV= 0
##$USERP1= <user>
##$USERP2= <user>
##$USERP3= <user>
##$USERP4= <user>
##$USERP5= <user>
##$WDW= 1
##$XDIM= 16384
##$YMAX_p= 331951094
##$YMIN_p= -102892
$$ End of Bruker specific parameters
$$ ---------------------------------
##NTUPLES= NMR SPECTRUM
##VAR_NAME=  FREQUENCY,     SPECTRUM/REAL,   SPECTRUM/IMAG
##SYMBOL=    X,             R,               I
##VAR_TYPE=  INDEPENDENT,   DEPENDENT,       DEPENDENT
##VAR_FORM=  AFFN,          ASDF,            ASDF
##VAR_DIM=   16384,         16384,           16384
##UNITS=     HZ,            ARBITRARY UNITS, ARBITRARY UNITS
##FACTOR=    0.220516191357247, 1,           1
##FIRST=     3155.8360562347, 0,             0
##LAST=      -456.88070677108, 0,            0
##MIN=       -456.88070677108, -102892,      0
##MAX=       3155.8360562347, 331951094,     0
$$ Real data points
##PAGE= N=1
##DATA TABLE= (X++(R..R)), XYDATA
$$ [...]
6581i8366J891K1459J014O607j0185Q204l703j5098o732J7072K5959n822J2375
6568d5325j2378j7078M453K482n302k483R85M254L91P007k6610J3445j835N840
6554g2154r53J520N874k0713p922J2757K1882j306r176j1205Q541l577M79J8369
6540e7584j4796K230k525N128k1544p130J7178K3031M540q518N824L611k1468
6527g2023K158j01j2686K0735Q78j3017r498J2029N194q757L490p243P69J581
6513g6491o44n031j0128L079K2738p536l483J8843K988q621j0202r009o801N648
6499h4650M407M923Q712l278j5699J1723j980R096k51m71k413J644j0102K2385
6485e5954j8496n970J6117m695J0483J402L144R72j7259j0555N263j1664K699
$$ plain form
6581 -98366 -96475 -75016 -74002 -67395 -77580 -69376 -73079 -88177 -94909 -77837 -51878 -57700 -45325
6568 -45325 -57703 -74781 -70328 -67846 -73148 -75631 -74646 -70392 -70001 -62994 -89604 -76159 -77994 -72154
6554 -72154 -73107 -71587 -65713 -86426 -94348 -81591 -59709 -61015 -70191 -81396 -72855 -76432 -75953 -57584
6540 -57584 -72380 -70150 -72675 -67547 -89091 -96221 -79043 -56012 -51472 -59990 -54166 -50555 -72023
6527 -72023 -69865 -69966 -82652 -61917 -61039 -74056 -83554 -71525 -66331 -75088 -71598 -78841 -78072 -76491
6513 -76491 -77135 -82166 -92294 -89215 -66477 -74013 -77496 -58653 -55665 -64286 -74488 -83497 -90298 -84650
6499 -84650 -80243 -75320 -66608 -69886 -85585 -73862 -75842 -66746 -66997 -67468 -69881 -68237 -78339 -55954
6485 -55954 -74450 -80420 -64303 -68998 -58515 -57113 -53969 -52997 -70256 -80811 -75548 -87212 -84513
6472h4513M078Q351K0646k011n483L209J270q94m462J964q981m455L41j921K740
6457g0121p84k072k783O718J1624l944q40j9961l834K2795O161j4970R94M238
6443f6779n830j753p777n438P274K0307j0093r424N882L225J1761K568q108n749
6429f9934j488r178n212l639K8672L538j6220n871n01J3026j697m885r286O079
6415g6596J882N849O071J7260m513r785R963j5324J4020L642q02N013m002o258
6401e3580j1350K2909p127j6799J1102J378j524m178j4824J5889k086M033k761
6388e8918m107l167P73q39P228n23N679m702j3238J2677j773L419M720r339o438
6373f8548O608n976j432J6659K2347k2126Q470p36M331q233j5955j4083K2316
$$ plain form
6472 -84513 -80435 -72084 -51438 -53449 -58932 -55723 -54453 -55347 -59809 -57845 -66826 -71281 -70940 -72861 -70121
6457 -70121 -70905 -72977 -75760 -69042 -57418 -61362 -62202 -82163 -85997 -63202 -57041 -72011 -71017 -66779
6443 -66779 -72609 -74362 -82139 -87577 -80303 -59996 -70089 -79513 -73631 -70406 -58645 -56077 -64185 -69934
6429 -69934 -71422 -80600 -85812 -89451 -60779 -57241 -73461 -79332 -79833 -66807 -68504 -73389 -82675 -76596
6415 -76596 -74714 -68865 -62794 -45534 -50047 -59832 -49869 -65193 -51173 -47531 -48333 -43320 -47322 -53580
6401 -53580 -64930 -42021 -49148 -65947 -54845 -53467 -54991 -59169 -73993 -58104 -60190 -56157 -58918
6388 -58918 -63025 -66192 -65419 -66258 -59030 -59553 -53874 -58576 -71814 -59137 -60910 -57491 -52771 -62110 -68548
6373 -68548 -61940 -67916 -69348 -52689 -30342 -52468 -43998 -44734 -40403 -48636 -64591 -78674 -56358
6360e6358j071j6575J0126p994l950K2920k155j0430J4266j7407O270j436J1858
6347e1936j4340o165M526L336L010K6l762n288J0445Q92L105j2382N540P227N812
6332d9954P194p943n211j5329Q28J7472J2806m578P764N01j0407j8912j805K2804
6318d4770j2242k3771K1334J694j3722J3625K4168j8144k1752K9417j1722n692
6306f1577J7105J0494j3369J013r253j1114Q980O6L159J5222j2736K424M335j192
6292d6443n908k2585O121M200J5426O32k792n172k884O036o097K965k082M655
6278e3928K0375j0890j9695Q008o93j647J3755j9880J6734K994n936N11m725l59
6264e5376K358K11j0615L425P774Q500O972j0639j3823l119k977L688Q032r214
$$ plain form
6360 -56358 -57429 -74004 -63878 -71872 -75822 -52902 -55057 -65487 -51221 -68628 -62358 -63794 -51936
6347 -51936 -66276 -72441 -67915 -64579 -61569 -61543 -65305 -70593 -60148 -59256 -56151 -68533 -62993 -55766 -49954
6332 -49954 -42760 -50703 -55914 -71243 -70415 -52943 -40137 -44715 -36951 -36450 -46857 -65769 -67574 -44770
6318 -44770 -57012 -80783 -59449 -57755 -71477 -57852 -33684 -51828 -73580 -44163 -55885 -61577
6306 -61577 -44472 -33978 -47347 -46334 -55587 -66701 -57721 -57655 -54496 -39274 -52010 -49586 -45251 -46443
6292 -46443 -52351 -74936 -68815 -64615 -49189 -48557 -51349 -56521 -59405 -53369 -59466 -56501 -58583 -53928
6278 -53928 -33553 -44443 -64138 -56130 -56823 -58470 -44715 -64595 -47861 -44867 -50803 -50292 -55017 -55376
6264 -55376 -53018 -52807 -63422 -59997 -52223 -43723 -36751 -47390 -61213 -64332 -67309 -63621 -55589 -64803
6250f4803k341K3628p147k7347n262kK5448J4003j7146R322Q48o579j0402J3338
6236e4442j2266k565K303q81j1405J2618O642M835J3309n03j8056R279j4427Q288
6222e7271N16j3258M37k258P36N876J8308M508o699j5578L020M360k441j5282
6208g5026J8724N247j9703L896K953J657R01M571K712K093Q876j7288K42J6423
6194d3722O563k11p646N623j128j1664q619p279J3755n743R034R567k736j1328
6180e5534J7257K563j8264j5215J0852J2745j1401J4793K7020j4749q289j1713
6168d9935J114r0J581P153O715j6804p850P508L004k83o478j5519J9521r41K025
6153d9279N271j5423p284o241Q930J8468J6064j3413N864j4906p184J8149l841
$$ plain form
6250 -64803 -67144 -43516 -50663 -78010 -83272 -83274 -57826 -43823 -60969 -51647 -50799 -57378 -67780 -54442
6236 -54442 -66708 -69273 -66970 -67851 -79256 -66638 -59996 -55161 -41852 -42355 -60411 -51132 -65559 -57271
6222 -57271 -56755 -70013 -69576 -71834 -71098 -65222 -46914 -42406 -49105 -64683 -61663 -57303 -59744 -75026
6208 -75026 -56302 -51055 -70758 -66862 -63909 -62252 -61351 -56780 -54068 -51975 -43099 -60387 -60145 -43722
6194 -43722 -37159 -37370 -45016 -39393 -40521 -52185 -60804 -68083 -54328 -60071 -51037 -41470 -44206 -55534
6180 -55534 -38277 -35714 -53978 -69193 -58341 -45596 -56997 -42204 -15184 -29933 -38222 -49935
6168 -49935 -48821 -48911 -47330 -40177 -33462 -50266 -58116 -50608 -47604 -47887 -54365 -69884 -50363 -51304 -49279
6153 -49279 -44008 -59431 -66715 -72956 -64026 -45558 -29494 -42907 -37043 -51949 -59133 -40984 -44825
6140d4825k747m826k881j058L12J1314Q364q901k254k062K492L673Q099j4363
6126d9663k714Q130o585P307l027m277O862r952O199J7193j6937J5689r805m095
6112d5675j173n2Q460j8475r178K1604r27l279K736k046J2606O417j0704K361
6098c7325j427P4J3781R962k4238k673K39K6088j5692q784J3733j8886o168n95
6084e1911J1660p70j6837J7608l864j1840J6146l560m011J7418O891J0988j3547
6071b5629j9904J3049m866Q614k784J2793j2692j4273K0604L702j113j0081j131
6058c3711l040j8893N826L65q848K3683J084J410J2863j2191j0175l786O629J6168
6044b2616m35n288J608j0778j0198J1218L185j7495l553K9178J4735j5334k17
$$ plain form
6140 -44825 -47572 -52398 -55279 -56337 -56025 -44711 -36347 -45248 -47502 -49564 -47072 -43399 -35300 -49663
6126 -49663 -52377 -44247 -50832 -43525 -46552 -50829 -43967 -53919 -47720 -30527 -47464 -31775 -41580 -45675
6112 -45675 -46848 -46900 -38440 -56915 -66093 -44489 -45416 -48695 -45959 -48005 -35399 -28982 -39686 -37325
6098 -37325 -38752 -38678 -24897 -14935 -39173 -41846 -41607 -15519 -31211 -39995 -26262 -45148 -51316 -51911
6084 -51911 -40251 -41021 -57858 -40250 -44114 -55954 -39808 -43368 -47379 -29961 -23070 -12082 -25629
6071 -25629 -45533 -32484 -37350 -28736 -31520 -18727 -31419 -45692 -25088 -21386 -22499 -32580 -33711
6058 -33711 -36751 -55644 -49818 -49453 -58301 -34618 -33534 -32124 -19261 -31452 -41627 -45413 -38784 -22616
6044 -22616 -23051 -28339 -26731 -37509 -47707 -36489 -33304 -50799 -54352 -25174 -10439 -25773 -25990
6031b5990m73J0599j0999M92J4859j1361r698R324j0394Q22K077M802M310p992
6017b9622K711j1756m902M891k528n80Q753J4272J771q747p308j1232J2268J8506
6003a3503j1925o299J1849n489J096J0041k6553O56J2134j2878J1745L733p480
5990c2873r829p2r28Q16J7892J017m00Q491l282o177O150n342l764J7594k0605
5975c1312q670K294Q933J209O194J1496r664j2410J0892j5487J4859L490o920
5962b5096N298q245k90p604J6132L010L536m679J2657j3940O351Q511j1100j126
5948a6585L827o895N777J1930n88j1612o614Q136J2534l069j8042j7385J519R353
5934b7714K0288J628j3291K624P628k900R25j3107l307L513L177J1531J0829j0478
$$ plain form
6031 -25990 -26463 -15864 -26863 -26371 -11512 -22873 -32571 -23247 -33641 -32819 -30742 -25940 -21630 -29622
6017 -29622 -26911 -38667 -43569 -38678 -41206 -41786 -33033 -18761 -16990 -25737 -33045 -44277 -32009 -13503
6003 -13503 -25428 -31727 -19878 -25367 -24271 -14230 -40783 -40127 -27993 -40871 -29126 -25393 -32873
5990 -32873 -42702 -42774 -43702 -42886 -24994 -23977 -24377 -15886 -19168 -25345 -19195 -24537 -28301 -10707 -31312
5975 -31312 -39982 -37688 -28755 -27546 -21352 -9856 -19520 -31930 -21038 -36525 -21666 -18176 -25096
5962 -25096 -19798 -28043 -28333 -35937 -19805 -16795 -13259 -17938 -5281 -19221 -12870 -4359 -15459 -16585
5948 -16585 -12758 -19653 -13876 -1946 -2534 -14146 -20760 -12624 -90 -3159 -21201 -38586 -37067 -27714
5934 -27714 -7426 -5798 -19089 -16465 -8837 -11737 -10812 -23919 -27226 -23713 -20536 -9005 1824 -8654
5920h654j1071J0348J168j2161P578o160K0655J653j2980M167J5631j1268k44
5907a338j9986m524J1955j0366J3935j2735J9601n659p731L477l173Q633j503
5894i414M115n743L389J006r831Q554r856o592k286Q823r842K0538J45q159J3834
5879a319K96q684k016n318J5245p140j2110K3392L53o69M143k2168M443l572l482
5864a8606J627O308P063J2782j9076j5598K304J1332J5911j1786J9431J3210j3074
5851A1828q840j4192K671J1245N350j3658J3647r369n026J3301J2812r338p756
5838B675q436j3271J4922j946p766r211K454O202J887J2813p63j112r251n247
5824a6050M970j459n344j0998L041j176L656l136J6467J8918j3352j6971J5982
$$ plain form
5920 -8654 -19725 -9377 -8209 -20370 -12792 -18952 1703 3356 -9624 -5457 10174 -1094 -1338
5907 -1338 -21324 -25848 -13893 -24259 -10324 -23059 -3458 -9117 -16848 -13371 -16544 -7911 -9414
5894 -9414 -5299 -11042 -7653 -6647 -16478 -7924 -17780 -24372 -26658 -17835 -27677 -7139 -6994 -15153 -1319
5879 -1319 -1023 -9707 -11723 -17041 -1796 -8936 -21046 2346 2699 2030 6173 -15995 -11552 -15124 -18606
5864 -18606 -16979 -10671 -3608 9174 -9902 -25500 -23196 -11864 4047 -7739 11692 24902 11828
5851 11828 2988 -11204 -8533 2712 8062 -5596 8051 -1318 -6344 6957 19769 10431 2675
5838 2675 -5761 -19032 -4110 -6056 -13822 -23033 -20579 -14377 -12490 323 -440 -1552 -10803 -16050
5824 -16050 -11080 -12539 -17883 -28881 -25840 -27016 -23360 -26496 -10029 8889 -4463 -21434 -5452
5811e452J2979P116o341r949J0933k457q177J2631n834j6247O194J314J236n711
5797g765J09N925O428L691j5801O986k771M516R272J3246m723q425p652J0801
5783A3837r378O628J5577P983J26j3599j5012J474m725j129L371J2508J9599j1664
5769B5596J158j3282n982O422O955p93N124J027q544K236Q63J6761J3652j0762
5755D0431k874O868j1465o804K565R027J872j7492J0004R433k3431m379J0754
5742B4509N596j118L985o156J1454K037J2179j6297j2904J1622R494j280o877
5729C6244M337j590j1167J06J2861J0720Lr824L725o533j9297j1127J4011L350
5715B5819J0513j498l612j4063N991K3328j544j3947j4185J0460J6813j7350j5893
$$ plain form
5811 -5452 7527 14643 8302 -1647 9286 6829 -1348 11283 5449 -10798 -4604 -3290 -2054 -7765
5797 -7765 -7656 -1731 4697 8388 -7413 -427 -3198 1318 10590 23836 19113 10688 3036 13837
5783 13837 4459 11087 26664 34647 34773 21174 6162 7636 2911 1782 5153 17661 37260 25596
5769 25596 26754 13472 7490 13912 20867 20074 25198 26225 17681 19917 20780 37541 51193 40431
5755 40431 37557 44425 32960 26156 28721 37748 39620 22128 32132 41565 18134 13755 24509
5742 24509 30105 28987 32972 26816 38270 40307 52486 36189 23285 34907 44401 43121 36244
5729 36244 40581 38991 27824 27930 40791 51511 51514 41690 45415 38882 19585 8458 22469 25819
5715 25819 36332 34834 31222 17159 23150 46478 44934 30987 16802 27262 44075 26725 10832
5702A0832m645J4411J1847j5268j0386j334O707Q217N037K4123j561n462j7828
5689B4690j1154j408K714J5091M442M718R65l309j7417K245N514J4814P683j6383
5675C3205q838K869o160J6041P970k5730L151R666l28r332j536L386K1479L407
5661D9250j1514j5075J1131J0000m020r297O203O696p233n558R180O738r211l369
5647C3921K423k423k544J0910R039j0130l996J4380P83j2574J347K847J2964l412
5633E3535Q312J825R97m788J630n429j0990R057j9325Q245J2975j1447j052J6741
5619F0286k2835J0665R677J831j0767P246J765J485l239M451l33M041O616j3047
5605E7842n554o27J2222m151J5265K0467J729k5862J2722o726o310K235m47M815
$$ plain form
5702 10832 6187 20598 32445 17177 6791 5457 12164 20381 25418 49541 47980 42518 24690
5689 24690 13536 12128 14842 29933 34375 39093 40058 36749 19332 21577 27091 41905 49588 33205
5675 33205 24367 27236 21076 37117 45087 19357 22508 32174 31846 22514 20978 24364 45843 49250
5661 49250 37736 22661 33792 43792 39772 30475 36678 43374 36141 30583 39763 46501 37290 33921
5647 33921 36344 33921 31377 42287 51326 41196 37200 51580 52363 39789 41136 43983 56947 53535
5633 53535 61847 63672 64669 59881 61511 56082 45092 54149 34824 43069 56044 44597 43545 60286
5619 60286 37451 48116 57793 59624 48857 56103 57868 59353 56114 60565 60232 64273 70889 57842
5605 57842 52288 51661 63883 59732 74997 95464 97193 71331 84053 77327 71017 73252 72805 77620
5591G7620O312O077J233R071j0778N244J8267J5866j5251L923J7980P54p49L2
5577A35601K186J0464J7658O311O89J1922N107N054J1707j982k6371j5382k909
5564A60055J2706j3902r070J6003j336k787Q839j5140K4310J7849j5805K1052
5552B02774K010O039Q007k685J5557J5135J2554j20J6013K5401j343O18n916n914
5538B88130J438J2133p991o9l4497L227k412n383Q657k4002M602N095n064j313
5524B42551J0428P21n420l419J297k544J901p916J4856M634O028m338N935J4714
5510B79428J1943J4209J0954R564Q342k243j8048J3786m970k813j4127j6119p100
5497B82806M295j1516o261J399n471n50J5925j2177m218J5196k32j8798m199K2577
$$ plain form
5591 77620 83932 90009 91242 100313 89535 94779 113046 128912 113661 117584 135564 136318 135569 135601
5577 135601 137787 148251 165909 172220 172909 184831 189938 194992 206699 204717 178346 162964 160055
5564 160055 172761 158859 149789 165792 164456 161669 170508 155368 179678 197527 181722 202774
5552 202774 204784 210823 218830 216145 231702 246837 259391 259271 275284 300685 299342 299960 294044 288130
5538 288130 289568 301701 293710 293641 259144 262371 259959 254576 263233 239231 243833 248928 243864 242551
5524 242551 252979 253700 248280 244861 246158 243614 245515 237599 252455 257089 263117 258779 264714 279428
5510 279428 291371 305580 316534 326098 334440 332197 314149 327935 322965 320152 306025 289906 282806
5497 282806 287101 275585 269324 270723 265252 264702 280627 268450 264232 279428 279196 260398 256199 278776
5483B78776K867M948R679J2261q499L120Q940j108l315k875M773R570M90l277
5469C16350q649L265J8128j937M753P142m1652O140K0275j2586L166J2807R548
5456C36750K0215l179k1597J2836K3682O662P127Q918J3477J9327J3966Q598J5349
5443D62131K0558L1328L1988L9136M3104M1585P1008P8595N8121N3012O6315K1125
5431A018006k3770m6785o5454p7111n1062k0599k5849k7881j5238M747j1468L522
5419F61058K252o564L2729J8701J6613L4289N3079N3314M6869O6418R4148J00279
5407A173185J21640J39623J55532J80337J60062J85780J34602K1319q6367k05758
5397A979955k58027k28894j84489j40563j00661r3154o2045m1810k2233n707j2978
$$ plain form
5483 278776 281643 286591 296270 308531 300032 303152 312092 310984 307669 304794 309567 319137 319627 316350
5469 316350 307701 310966 329094 327157 331910 339052 297400 303540 323815 311229 314395 327202 336750
5456 336750 356965 353786 332189 345025 368707 375369 382496 391414 404891 424218 438184 446782 462131
5443 462131 482689 514017 546005 585141 628245 669830 740838 819433 877554 930566 996881 1018006
5431 1018006 994236 947451 881997 804886 753824 733225 707376 679495 664257 669004 657536 661058
5419 661058 663310 656746 689475 708176 724789 759078 812157 865471 912340 978758 1072906 1173185
5407 1173185 1294825 1434448 1589980 1770317 1930379 2116159 2250761 2272080 2185713 1979955
5397 1979955 1721928 1493034 1308545 1167982 1067321 974167 912122 870312 848079 842372 829394
5386H29394j5026l64k539L7821J6971L0718M2445O4115O9303R5391R8265R5445
5374A361939J46255J56989J59572J51422J76861J44027J3414j55074k57136k54783
5364A643486k19704j90045j57107q9994r0765n8034o1623p4579j6728l5887k7039
5353F21981j5747j7781Q316J0221j3108k992J4380L2771J2542L8895M3979L8007
5341G71464N2472M5626M4129N1513M3764l6756n7444p7585r7031q2954n5767l7984
5329E63447m4048l8582m1983l0113j0056n797k6453J3069j2745o741j4205j475
5317C44318j8883j1704K747m192p665J7547o672k0291j7739q627J8387m208L287
5304B86305k586j6564K176Q492j1960l388j3148P164J4512k837o131k17L581m856
$$ plain form
5386 829394 814368 814004 811465 849286 866257 896975 939420 1003535 1072838 1168229 1266494 1361939
5374 1361939 1508194 1665183 1824755 1976177 2153038 2297065 2310479 2155405 1898269 1643486
5364 1643486 1423782 1233737 1076630 986636 895871 837837 776214 701635 684907 649020 621981
5353 621981 606234 588453 596769 606990 593882 590890 605270 638041 650583 689478 733457 771464
5341 771464 823936 869562 913691 965204 1008968 972212 914768 837183 740152 657198 601431 563447
5329 563447 519399 480817 438834 408721 398665 392868 366415 379484 366739 359998 345793 344318
5317 344318 325435 313731 316478 312286 304621 322168 315496 295205 277466 268839 287226 283018 286305
5304 286305 283719 267155 269331 277823 265863 262475 249327 256491 271003 268166 262035 261818 265399 260543
5290B60543k3303J8389J0231J201k032J493l762k1693J50J9269Q404O660j4P211
5276B82747Q72n015J5663j631m724q133p48J4749J2032l931o661L070r708j9635
5262B68947Q413R247j249q721N348m274j2093O153R723n07k815L1005K548k2498
5248B89227J3319N408j2981L748J2237J237j8367R144N924J1988O65Q031N751
5235C35331j569J629j5254J3181J8268J0905l147j0566J4755K6146R333P891N337
5222D12240r053j97J8413J7060P429K1718K2477l275J7723O199J8425L559r189
5209E23529K0961J1025J2491J9718J8027J7131J6137M467l186J3123J6300P505
5197F77228Q229K2899K7174K8467J8197K2375P699J1915J6977P240K2707K4554
$$ plain form
5290 260543 237240 255629 265860 267061 265029 266522 262760 241067 241217 260486 268890 275550 275536 282747
5276 282747 283619 278604 294267 292636 287912 279779 279031 293780 305812 301881 295220 298290 288582 268947
5262 268947 277360 286607 285358 276637 281985 277711 265618 271771 281494 280987 278172 309177 311725 289227
5248 289227 302546 307954 294973 298721 310958 312195 293828 302972 308896 320884 321549 329580 335331
5235 335331 333762 335391 320137 333318 351586 362491 359344 348778 363533 389679 399012 406903 412240
5222 412240 403187 402990 421403 438463 445892 467610 490087 486812 504535 510734 529159 532718 523529
5209 523529 544490 555515 568006 587724 605751 622882 639019 643486 640300 653423 669723 677228
5197 677228 685457 708356 735530 763997 782194 804569 812268 824183 841160 848400 871107 895661
5185H95661K2526J6052K1461K3866L2538K7486L2883K9511M0974L2812L2444K6945
5173A235159L1872L3358K2615M8987L3817M6352N1589N2360M8521M3478P5848
5162A723956N9201P4234P5516J04243R6579J15248J28515J44595J61026J72523
5152B855636K24403K46987K42453K53830K80439K83324K26409J07368l5376j00064
5142D585409q4103j9603P0585J32347K26966L19208L88042M71671N86822P00240
5132G377584P74061R17102J047084J084972J131422J152121J098022Q77302N29441
5123A5989111J43202k59032o27518r86335j297931j423749j394468j335972j184542
5114G622766r81971q20113o70164n30957m55073l76646l14435k75987k49845j92645
$$ plain form
5185 895661 918187 934239 955700 979566 1012104 1039590 1072473 1101984 1142958 1175770 1208214 1235159
5173 1235159 1267031 1300389 1323004 1371991 1405808 1452160 1503749 1556109 1604630 1648108 1723956
5162 1723956 1783157 1857391 1932907 2037150 2133729 2248977 2377492 2522087 2683113 2855636
5152 2855636 3080039 3327026 3569479 3823309 4103748 4387072 4613481 4720849 4685473 4585409
5142 4585409 4501306 4481703 4552288 4684635 4911601 5230809 5618851 6090522 6677344 7377584
5132 7377584 8151645 9068747 10115831 11200803 12332225 13484346 14582368 15459670 15989111
5123 15989111 16132313 15873281 15245763 14259428 12961497 11537748 10143280 8807308 7622766
5114 7622766 6640795 5820682 5150518 4619561 4164488 3787842 3473407 3197420 2947575 2754930
5104B754930j71774j58887j43207j47196j17181j18801r0609q2721p2875p6587
5094A575092n5489o0263k8341o3089o4176m4828m1506l9699l2447l0076l1603
5083A083575m3816j8127k6614k9309j7075k3998k8763j9183k4635r578j4912n0002
5071G77563k0310j4182K966J405k6687j3887k5277l379r459k0399k6680r533K23
5058F12364O105n496k0001j1868J0211J9852L908m424P598K7779L123J1714K2745
5045F83610K5490k07n693p88Q735j8187l399j0071j6688k978o659n984L37j3179
5031F34339J0698j5092n646J8534K6016Q139J5463K4558O505J77j1308R083j8435
5018G03031j9899j4540j7023n476P576o678j4633r74J1899R424l389O960K92K0778
$$ plain form
5104 2754930 2583156 2424269 2281062 2133866 2016685 1897884 1807275 1724554 1651679 1575092
5094 1575092 1519603 1459340 1430999 1367910 1303734 1258906 1217400 1177701 1145254 1115178 1083575
5083 1083575 1039759 1021632 995018 965709 948634 924636 895873 876690 852055 842477 827565 777563
5071 777563 757253 743071 746037 747442 720755 706868 681591 678212 668753 648354 621674 612141 612364
5058 612364 618469 612973 592972 581104 591315 611167 615075 610651 618249 646028 649151 660865 683610
5045 683610 709100 708893 703200 702412 711147 692960 689561 679490 662802 659824 653165 647181 647518 634339
5031 634339 645037 629945 624299 642833 668849 676988 692451 717009 723514 723691 712383 721466 703031
5018 703031 683132 668592 651569 646093 653669 646991 632358 631384 643283 652707 649318 656278 656570 677348
5004F77348o669m328k233o736N95k0618k4688j6131q370O367N275j7805j5067
4991E66940N842j6922M161K5184p539R770K94q580N916l516k0061k4977k7766
4978E08746j9910j0061j6095j2581k0813k6493j9109l0400p544M62q408Q063L0648
4965C76505Q154k3871j630k0167j5807L283n240P972L653j9241J820n718J615
4952C11328N741L782k1010Q386R266J177m513j5343k523o839J5899j3725L909
4939B95535J4590m607j0071O88j1751j679R001O31j0306j1080n563k439P989J649
4925B72587r361P121q701N939K0613N906k0130j3408Q139R40L724p112K43J4599
4911B81099k1l682j2999P5n782M530q362j507K2048j3181j41J395J0809j0755
$$ plain form
5004 677348 670679 666351 664118 657382 657977 637359 612671 596540 588170 594537 599812 582007 566940
4991 566940 572782 555860 560021 585205 577666 587436 587730 579150 585066 581550 561489 536512 508746
4978 508746 488836 478775 462680 450099 429286 402793 383684 353284 345740 346202 337794 345857 376505
4965 376505 384659 360788 359158 338991 323184 326467 321227 329199 332852 313611 315431 309713 311328
4952 311328 317069 320851 299841 308227 317493 318670 314157 298814 296291 289452 305351 291626 295535
4939 295535 310125 305518 295447 296135 284384 282705 291706 292337 282031 270951 265388 262949 270938 272587
4925 272587 263226 270347 261646 267585 288198 294104 273974 260566 268705 269645 273369 266257 266500 281099
4911 281099 281078 277396 264397 264472 258690 263220 254858 253351 275399 262218 262077 263472 274281 263526
4897B63526J0833J0088j1538R994j4666k5042J5109R586j1733k102j326j2667
4885B40062n317J0309M956L473M384n872j6997J4810p464P180Q118j0902j2500
4872B34240J1602p970j543m514Q926J9703M721j6627M969L09l1593J5684J1322
4859B49229j955K057J1892m934j522r49q30l519l797J5207K7830l79j5888k3887
4845B48555j9281M21O123N731J180M472m456L660L640J9329K808j1547K427J6531
4831B79593o384j3444N142J053J8821R641J066J3339J7520j227n328k9898L0781
4818C20675J2130j8504L217M292K405k8198q683p175J2418j3430k5410k176k164
4805B49397j3613j658R357j358J51j1908K2230J5125n879j0219n361P769J6397
$$ plain form
4897 263526 274359 284447 272909 282903 268237 243195 258304 267890 256157 254055 252729 240062
4885 240062 234745 245054 250010 253483 257867 251995 234998 249808 242344 249524 257642 246740 234240
4872 234240 245842 237872 236329 231815 240741 260444 265165 248538 253507 253816 222223 237907 249229
4859 249229 247274 249331 261223 256289 254767 253818 252988 249469 245672 260879 288709 288330 272442 248555
4845 248555 229274 229695 235818 241549 242729 247201 242745 246405 250045 269374 272182 260635 263062 279593
4831 279593 273209 259765 264907 265960 284781 294422 295488 308827 326347 325120 319792 289894 320675
4818 320675 332805 314301 317518 321810 324215 296017 287334 280159 292577 279147 253737 251561 249397
4805 249397 235784 234126 243483 242125 242276 230368 252598 267723 261844 251625 246264 254033 270430
4792B70430j4348o071r313q83K2055k1085k162O600j1093l185L315J2421l032
4779B43649q263L298j5820N198M776L338m110j2152R874J659J6033L158q525k1875
4765B20238J583N709J0676l638j240j5145L706P124L230K234q46O431m285J3861
4751B49638j1995m573k308J1765Q794n509o85M8L305L318J496j4064N516N711
4737B50457l869j164n733o612k0309M448J3648N050N114O755o11j5355K0414q131
4723B44102j7154J7375L523K43j2443J8955L729j9693P513J8274P43L360j6956
4710B51571k741L873m758R206j2283L982L699j892N263n388O515o775N499Q052
4696B63823k55L601L87K084J421L264Q127m287j1445K466o833p685K4926m106
$$ plain form
4792 270430 256082 250011 240698 239815 261870 240785 238623 245223 234130 230945 234260 246681 243649
4779 243649 235386 238684 222864 228062 232838 236176 232066 219914 229788 231447 247480 250638 242113 220238
4765 220238 221821 227530 238206 234568 233328 218183 221889 229013 232243 234477 233631 240062 235777 249638
4751 249638 237643 233070 230762 242527 251321 245812 245127 245175 248480 251798 253294 239230 244746 250457
4737 250457 246588 245424 239691 233079 212770 217218 230866 235916 241030 247785 247174 231819 252233 244102
4723 244102 226948 244323 247846 248089 235646 254601 258330 238637 246150 264424 265167 268527 251571
4710 251571 248830 252703 247945 257151 244868 248850 252549 250657 255920 250532 257047 250272 255771 263823
4696 263823 263568 267169 267556 269640 271061 274325 282452 278165 266720 269186 262353 254668 279594 275488
4682B75488l388J501j932M906N216K0658n142j2476O687L378q295M959M682o67
4668B95575n96N358P022K213O41j9110K351K442K905K431N131J2400Q9R829N702
4653C34383p166J1173N616j0552J2429j573M927k827K460m262j0354J7420l30
4640C51344o309J0832M958O684J1405j0946j9781K4377N401j4474J6447K906J623
4627C84467j3975k1404Q649m229J393J999J6885Q514L375L082o805J0352j1371
4614C80932j89J037J7064q327j4926k750J0900l424O40J3550j6851k0715J5245
4601C72186r318q662J5886L858j390l665L392R575M053M804J0006o382J973J7411
4587D13727j7111k1404J4233j086p765N380l079K111J702j4785J2659j9863m43
$$ plain form
4682 275488 272100 273601 271669 276575 281791 302449 297307 284831 291518 294896 286601 291560 296242 295575
4668 295575 294979 300337 307359 309572 310213 291103 293454 295896 298801 301232 306363 318763 318852 328681 334383
4653 334383 327217 338390 344006 333454 345883 344310 349237 346410 348870 344608 334254 351674 351344
4640 351344 345035 355867 360825 367509 378914 367968 348187 372564 377965 363491 379938 382844 384467
4627 384467 370492 349088 357737 353508 354901 356900 373785 382299 385674 388756 381951 392303 380932
4614 380932 380743 381780 398844 390517 375591 372841 383741 380317 380957 394507 377656 356941 372186
4601 372186 362868 354206 370092 373950 372560 368895 372287 381862 385915 390719 400725 394343 396316 413727
4587 413727 396616 375212 389445 388359 380594 385974 382895 385006 386708 371923 384582 364719 364276
4574C64276J4827q622j40R231K0852N490k0043L132o043Q08J8311j3295j6930
4561C71854L4359J1243o330R091l101P420j015j1283J6274N692n104m94j9401
4548D09205L887J5451m418j427L11j0211k2256K1078J3504k1146J2658R894L615
4535D30145o62j092J140j1130J5880P211q844n605M467m58K0588j97j2563J4739
4521D53619M610J7209n613j8503N79R948K1264j4733J2288P401J641r971J0964
4508D90703J3133j0002J3891n127J9636R766k0624P471r037O63K3373J018o89
4495E34175k1957J0433J3141J741k540m828N490R996o279J5859N629j0880J8354
4482E68334n065p56L1966L784j4876o098K1002m272Q224j983K1009J5978r000
$$ plain form
4574 364276 379103 370481 370341 379572 400424 405914 385871 389003 382960 383768 402079 388784 371854
4561 371854 406213 417456 411126 420217 417116 424536 423521 412238 428512 434204 429100 428606 409205
4548 409205 413092 428543 424125 422698 423009 412798 390542 411620 425124 403978 416636 426530 430145
4535 430145 429483 428391 429531 418401 434281 441492 432648 427043 431510 431052 451640 451443 438880 453619
4521 453619 458229 475438 469825 451322 451901 461849 483113 468380 480668 488069 489710 479739 490703
4508 490703 503836 493834 507725 502598 522234 532000 511376 518847 509810 510473 533846 534864 534175
4495 534175 512218 522651 535792 537533 534993 530165 535655 545651 539372 555231 560860 549980 568334
4482 568334 563269 562513 594479 598263 583387 577289 598291 594019 602243 600260 621269 637247 628247
4469F28247J3958o651J1575J6859m767K757n432O016L4951M369N959K1155k281
4456G26715J5000Q706J0424Q64J0468J0931J9745J0836J3830J7309q462J8712
4444H55078K5335m986K2129J0449O179J1239J3761L7134K1514J9441K2099J0786
4432A050158J0565K1336M2415K7209K2995K9767J7531L8319K9407K0550J2490
4421A322742J7341L4771K8363L8701M1635M0421M4406M1401L9223L7465K3789
4410A710258K9152O7045O1629N5496N1240O8405N1586N1531O5268N8789Q3863
4399B354262Q2742Q3966J05932R5417J00011J26760J27699J25727J33848J56519
4389C492883J44609J75644J80006J65431J77389J60221J83203J66873J49837J36783
$$ plain form
4469 628247 642205 635554 647129 663988 659221 661978 656546 662562 697513 701882 707841 728996 726715
4456 726715 741715 750421 760845 761709 772177 783108 802853 813689 827519 844828 836366 855078
4444 855078 880413 875427 897556 908005 914184 925423 939184 976318 997832 1017273 1039372 1050158
4432 1050158 1060723 1082059 1124474 1151683 1174678 1204445 1221976 1260295 1289702 1310252 1322742
4421 1322742 1340083 1374854 1403217 1441918 1483553 1523974 1568380 1609781 1649004 1686469 1710258
4410 1710258 1739410 1806455 1868084 1923580 1974820 2043225 2094811 2146342 2211610 2270399 2354262
4399 2354262 2437004 2520970 2626902 2722319 2822330 2949090 3076789 3202516 3336364 3492883
4389 3492883 3637492 3813136 3993142 4158573 4335962 4496183 4679386 4846259 4996096 5132879
4379E132879J09871R2610J15207P2630P4472P2053M6331M7937O1948R2534R8102
4368F016574J09587J35599J66372J74183J98119K19720K40224K65727K74362K89805
4358H090272K85183K39807J74977J19813Q1613Q0515M5930L4736j1912k3024k0189
4347I097721k0303o1307m0110j4195l4296l7366k4618p5514q9885j29630j42675
4336H427822j36480j31728j16123p9378p0578n2305Q175M0896M6848N9831O6746
4325H063726O5702M3427N021j0467m9460p7330j03912j50368k04257k11742k36026
4314G134314k61500k97190k86235k98408k65005k69037k34663k18324j99428j92899
4304D611625j85942j64037j34481j26074j24968j14369q8015r0450q7538p8156
$$ plain form
4379 5132879 5242750 5335360 5450567 5523197 5597669 5669722 5716053 5763990 5825938 5918472 6016574
4368 6016574 6126161 6261760 6428132 6602315 6800434 7020154 7260378 7526105 7800467 8090272
4358 8090272 8375455 8615262 8790239 8910052 8991665 9072180 9118110 9152846 9140934 9117910 9097721
4347 9097721 9077418 9016111 8976001 8961806 8927510 8890144 8865526 8790012 8700127 8570497 8427822
4336 8427822 8291342 8159614 8043491 7964113 7893535 7841230 7849405 7890301 7937149 7996980 8063726
4325 8063726 8129428 8172855 8177876 8167409 8117949 8040619 7936707 7786339 7582082 7370340 7134314
4314 7134314 6872814 6575624 6289389 5990981 5725976 5456939 5222276 5003952 4804524 4611625
4304 4611625 4425683 4261646 4127165 4001091 3876123 3761754 3673739 3583289 3495751 3417595
4294C417595n7169n2797m1686n4803l0783k9589j9184j3592j4339l251m438j5321
4282C080643k4991K8065M183l3859K6788L2236K6691K667R858K7565P946Q962
4270C196754K1624M4474J0218K5070O0920M5490O7637O7313N2190N7668P6966
4259C726324R1266Q8515R6598R9835J08900J18870J23880J22143J29228J33052
4249D838611J27767J45977J27643J69685J55128J36653J58167J58882J63382J59834
4239F341729J73964J68480J42901J44174J65251J34136J16254Q6090O1477O2382
4229G596838O6640K0721K2388L480J9192q786Q736K1813j1637J2735K2669N013
4217G779802K6922L9294L8902L0862K2265L7451N5049M1988K9075K2365M6937
$$ plain form
4294 3417595 3360426 3307629 3265943 3211140 3180357 3150768 3131584 3117992 3103653 3100402 3095964 3080643
4282 3080643 3055652 3083717 3087900 3054041 3080829 3113065 3139756 3142423 3152281 3179846 3187792 3196754
4270 3196754 3218378 3262852 3273070 3298140 3359060 3404550 3472187 3539500 3591690 3649358 3726324
4259 3726324 3817590 3906105 4002703 4102538 4211438 4330308 4454188 4576331 4705559 4838611
4249 4838611 4966378 5112355 5239998 5409683 5564811 5701464 5859631 6018513 6181895 6341729
4239 6341729 6515693 6684173 6827074 6971248 7136499 7270635 7386889 7472979 7534456 7596838
4229 7596838 7663478 7684199 7706587 7710067 7729259 7720473 7729209 7751022 7739385 7752120 7774789 7779802
4217 7779802 7806724 7846018 7884920 7915782 7938047 7975498 8030547 8072535 8101610 8123975 8170912
4206H170912N1939M9651M1667N3016L6579K3442K562k9818n1039r4875j30464
4195H123572j21875j58555j79420j73785j88441j55562j76725j61097j47540j47468
4185F513104j37851j09597j13805r6172q4351r6778r6436r9615q6280q0560r8770
4174E412889j01736p0949q8874r6731j02950r7675r3801r5825j09551r4349r5367
4163D365081q8473j07979j02634r4043r7764p4912q5147p2312o2531p1657p5364
4152C432265n0451l2574n9238o2697m3307l6741l7136l6776m2502m3756k6259
4141B960828l9901l4387m5513m4053m5610j2889l9800n3524l6049j8143j8143
4130B572816p079j2353j519j2394J896L2504J2102J1812J0781K3122K3236J6669
$$ plain form
4206 8170912 8222851 8272502 8314169 8367185 8403764 8427206 8429768 8399950 8348911 8254036 8123572
4195 8123572 8001697 7843142 7663722 7489937 7301496 7145934 6969209 6808112 6660572 6513104
4185 6513104 6375253 6265656 6151851 6055679 5971328 5874550 5778114 5678499 5592219 5511659 5412889
4174 5412889 5311153 5240204 5151330 5054599 4951649 4853974 4760173 4664348 4554797 4460448 4365081
4163 4365081 4276608 4168629 4065995 3971952 3874188 3799276 3714129 3641817 3579286 3507629 3432265
4152 3432265 3381814 3349240 3290002 3227305 3183998 3147257 3110121 3073345 3030843 2987087 2960828
4141 2960828 2920927 2886540 2841027 2796974 2751364 2738475 2698675 2645151 2609102 2590959 2572816
4130 2572816 2565737 2553384 2551865 2539471 2541367 2573871 2585973 2597785 2608566 2631688 2654924 2671593
4118B671593L7128K9651K4371J3856K1267K2581L0422K0008J3831P724m833J7089
4106B904688R016L0010J0192K9782L0211L1075N7026O0523Q5057N1474O1971Q2730
4094C443755J09728Q5566Q9350J03708P8618N6947L0260M5448j0288k3653j8190
4083C991249K537J3533P29J154j1594j2808j0277p249o002K082K2780M795K1170
4070D012099L3124N5451N8158M3713N0281P6892Q7767J01152Q1243R7049J17321
4059D814250J03628J25804J66865J36120J56420J66299J77687J76776J63345J84452
4049F371646K01861K30003K34385K48432K58087K54619K72366L40782L98776M69704
4039I280661N14472N87345O98747Q19417R70006J163449J353255J589634J790345
$$ plain form
4118 2671593 2708721 2738372 2762743 2776599 2797866 2820447 2850869 2870877 2884708 2892432 2887599 2904688
4106 2904688 2913704 2943714 2953906 2983688 3013899 3044974 3102000 3162523 3247580 3299054 3361025 3443755
4094 3443755 3553483 3639049 3728399 3832107 3910725 3967672 3997932 4043380 4033092 4009439 3991249
4083 3991249 3993786 4007319 4008048 4009202 3997608 3984800 3974523 3967274 3961272 3963354 3986134 3990929 4012099
4070 4012099 4045223 4100674 4158832 4202545 4252826 4329718 4417485 4518637 4599880 4696929 4814250
4059 4814250 4917878 5043682 5210547 5346667 5503087 5669386 5847073 6023849 6187194 6371646
4049 6371646 6573507 6803510 7037895 7286327 7544414 7799033 8071399 8412181 8810957 9280661
4039 9280661 9795133 10382478 11081225 11900642 12870648 14034097 15387352 16976986 18767331
4030A8767331J998486K290393K475434K287947J969815J650628R82757j19094
4022C2303697j191503j971728k326280k497484k442858k090453j714164j339135
4014A6730092r51309o87472m79598l12025j46769n3580L3457J05599J32044J69361
4004A4539800J30270J11087R0345P6416Q4115J15153J80989K48088K64971K30742
3994A6071976J51130P2682l4115j29161j58969q4916k5046Q1443J66589K68967
3984A6380580L53492M30198M74534N15184N33684M56099M12653M13990M92215
3975B0462629O29357P83389R33657J062593J223102J372967J527047J679982J827374
3966C1502097J966208K017077K052600K042604J856846J604665J218596O65246
$$ plain form
4030 18767331 20765817 23056210 25531644 27819591 29789406 31440034 32422791 32303697
4022 32303697 31112194 29140466 26814186 24316702 21873844 19783391 18069227 16730092
4014 16730092 15778783 15091311 14611713 14299688 14152919 14099339 14132796 14238395 14370439 14539800
4004 14539800 14670070 14781157 14871502 14947918 15032033 15147186 15328175 15576263 15841234 16071976
3994 16071976 16223106 16295788 16261673 16132512 15973543 15888627 15863581 15945024 16111613 16380580
3984 16380580 16734072 17164270 17638804 18153988 18687672 19143771 19556424 19970414 20462629
3975 20462629 21091986 21875375 22809032 23871625 25094727 26467694 27994741 29674723 31502097
3966 31502097 33468305 35485382 37537982 39580586 41437432 43042097 44260693 44925939
3958D4925939N0994m49946q16141r35703q62136n86119k02712K33882P23048J210346
3948D3291452J739584K327941K756215K828795K726439K494018J289990j170036
3940E8284398l662395m996882n018423m517220l722937k952524k322783j812819
3932B9278415j419020j117821q65770o51488n12739m17807l47942l03422l08856
3923B3333550k80637k52919k67780k70314k95924l26790l83523m40095m68596
3914B0346972n05446n40910n16878m94223m71857l96064l04202k45505j71618
3905A6700269r8139m6380r613j3362k3691m3509q3774j25582j53954j49426j01149
3894A5851690k3503O3553J35619J90671K80367L42975L44514L67970L46632K87832
$$ plain form
3958 44925939 44976933 44526987 43710846 42775143 41913007 41326888 41124176 41358058 42081106 43291452
3948 43291452 45031036 47358977 50115192 52943987 55670426 58164444 59454434 58284398
3940 58284398 54622003 49625121 44606698 40089478 36366541 33414017 31091234 29278415
3932 29278415 27859395 26741574 25875804 25224316 24711577 24293770 23945828 23642406 23333550
3923 23333550 23052913 22799994 22532214 22261900 21965976 21639186 21255663 20815568 20346972
3914 20346972 19841526 19300616 18783738 18289515 17817658 17421594 17117392 16871887 16700269
3905 16700269 16602130 16555750 16546137 16532775 16509084 16465575 16381801 16256219 16102265 15952839 15851690
3894 15851690 15828187 15891740 16027359 16218030 16498397 16841372 17185886 17553856 17900488 18188320
3884A8188320K23354J16321J095q7871j85393l04963l98303m90918n38450o07143
3874A5916049o25188o12672n73982n00798m33814l26772k91047j93922k10624
3865A2147230j54862j72544k17481k56450l18250l78933m24520m16614m25311
3856I382265l94015l52839k99486k53176j98184j61419j08916p4246l8761J6509
3846G517732K7478M5292N2514l904m4008j40390j53129j70428j88450j74449j75047
3835F593211j53499j27624j16664p2278n5616j3352J2362K0042O3510P5662J07157
3824F332911Q6778J13137J17743J26340J17715Q9894P7926O4174M3599K9837K7676
3813G227730M2277P2079J13108J65025J96684K48153K74266L14796L39857L17803
$$ plain form
3884 18188320 18411674 18527995 18529090 18441219 18255826 17950863 17552560 17061642 16523192 15916049
3874 15916049 15290861 14678189 14104207 13603409 13169595 12842823 12551776 12357854 12147230
3865 12147230 11992368 11819824 11602343 11345893 11027643 10648710 10224190 9807576 9382265
3856 9382265 8988250 8635411 8335925 8082749 7884565 7723146 7614230 7539984 7501223 7517732
3846 7517732 7545210 7590502 7643016 7639112 7595104 7454714 7301585 7131157 6942707 6768258 6593211
3835 6593211 6439712 6312088 6195424 6123146 6067530 6054178 6066540 6086582 6150092 6225754 6332911
3824 6332911 6419689 6532826 6650569 6776909 6894624 6984518 7062444 7126618 7170217 7200054 7227730
3813 7227730 7270007 7342086 7455194 7620219 7816903 8065056 8339322 8654118 8993975 9311778
3803I311778K79730K32968J41605L0915q8638j92708k65630l00725l11096k79224
3793H558975k69158k07310j41527j02032k5608k4688K8360Q4510J07095J73579
3783H182196J94541K44488K92585K99249L19452L44744L13784K65225J62236K5665
3773A0644165o5130j39921k04914j66045j10613n8402K9570Q8066J42795J73449
3763A0333020K20554K12322J87998J62672J42909J16985N6130M0919j6607p0624
3753A1386278j35514k08630k71907l35465l57071l62311l56121l26707k85977
3744H746575k13604j69547j35576r7633m8867j3905R170M2043M2989N3412P6157
3733H291214L3705P385J2213k6713l4902r717Q839K7629Q2171J50381K01078K44777
$$ plain form
3803 9311778 9591508 9824476 9966081 9996996 9908358 9715650 9450020 9149295 8838199 8558975
3793 8558975 8289817 8082507 7940980 7838948 7813340 7788652 7817012 7901522 8008617 8182196
3783 8182196 8376737 8621225 8913810 9213059 9532511 9877255 10191039 10456264 10618500 10644165
3773 10644165 10579035 10439114 10234200 10068155 9957542 9899140 9928710 10016776 10159571 10333020
3763 10333020 10553574 10765896 10953894 11116566 11259475 11376460 11432590 11473509 11456902 11386278
3753 11386278 11250764 11042134 10770227 10434762 10077691 9715380 9359259 9032552 8746575
3744 8746575 8532971 8363424 8227848 8130215 8081348 8067443 8076613 8118656 8161645 8215057 8291214
3733 8291214 8324919 8332304 8344517 8317804 8282902 8273185 8282024 8309653 8391824 8542205 8743283 8988060
3721H988060L06428L11405L14781K93326K06713O7593q8199l06988m54106n52669
3711I086344n80323n60624n20454m54381l82196l21343k77418k25781j62996j32244
3701E468584j09755o7533m4872r146K6543L9242M6587N9548O8885L7011N1770
3690E566864J7747l8444o1976n3287m1728l3351j2927J3342K0694l911m038n9978
3678E309007j01119j37316j86957j99984k17268k09617j91398j63217j33680j23622
3668C644829j23778o8339m8517l1104k3646j6069j4143j058K4637K5945M080k1480
3656C351357j8794q060k1R420K5201K2666L9481L8716L7233k5868j11086j67492
3644C192753k05787j83461j85335j58373j31188j14522q9265r5876o0798n3302
$$ plain form
3721 8988060 9294488 9605893 9920674 10214000 10420713 10488306 10400107 10093119 9639013 9086344
3711 9086344 8506021 7945397 7424943 6970562 6588366 6267023 5989605 5763824 5600828 5468584
3701 5468584 5358829 5291296 5246424 5237278 5263821 5303063 5349650 5409198 5478083 5515094 5566864
3690 5566864 5584611 5546167 5484191 5430904 5389176 5355825 5342898 5356240 5376934 5373023 5368985 5309007
3678 5309007 5207888 5070572 4883615 4683631 4466363 4256746 4065348 3902131 3768451 3644829
3668 3644829 3521051 3452712 3404195 3373091 3349445 3333376 3319233 3318175 3342812 3368757 3372837 3351357
3656 3351357 3332563 3324503 3324482 3333902 3359103 3381769 3421250 3459966 3497199 3471331 3360245 3192753
3644 3192753 2986966 2803505 2618170 2459797 2328609 2214087 2124822 2028946 1968148 1914846
3634A914846n4739o2366m0038m1046l3058l4492j3750J278J2538k5620n585J3428
3622A631396K2883J2977J9133L1374L2282J5812K4517P701m78k6535n2536n0468
3610A668058n3477o5390n9024m6264k1365n5400m3802l0820k4247m2104j4927
3599A211238n932l7531j9161j349k16j0681j1064M357K086M613m760m088K8556
3586A156068Q989J3938Q852K6324J8311J3719q503n286j3694j5535l3100k0829
3574A149254l035k2400k3663j2214l971j4805j8353K337R715j9209j1696R10p327
3561A025543O849J9202K0499k9347j6899m635J9041R377J3263J465p121j0281
3549A046956M678J8154j124m792J1777n73r236j1601L750j924Q503K025J1934
$$ plain form
3634 1914846 1860107 1797741 1757703 1716657 1683599 1649107 1635357 1636635 1649173 1623553 1617968 1631396
3622 1631396 1654279 1667256 1686389 1717763 1750045 1765857 1790374 1798075 1797597 1771062 1718526 1668058
3610 1668058 1614581 1549191 1490167 1443903 1422538 1367138 1323336 1292516 1268269 1226165 1211238
3599 1211238 1205306 1167775 1148614 1147265 1147049 1136368 1125304 1129661 1131747 1136360 1131600 1127512 1156068
3586 1156068 1165057 1178995 1187847 1214171 1232482 1246201 1237698 1232412 1218718 1203183 1170083 1149254
3574 1149254 1146219 1123819 1100156 1087942 1083971 1069166 1050813 1053150 1062865 1043656 1031960 1032870 1025543
3561 1025543 1032392 1051594 1072093 1042746 1025847 1021212 1040253 1049630 1062893 1064358 1057237 1046956
3549 1046956 1051634 1069788 1068664 1063872 1075649 1075076 1065840 1054239 1057989 1056065 1064568 1066593 1078527
3536A078527L243J1411J7857J5523k0522j2890N707K3648j983K3799L4814P109
3524A186243L0867J010K2801P838J0142P339J5593J0743K4747J6998K4233L5644
3512A394198L2800N4102O4735O4090N4495P3349O5683O8659Q5924R6824Q6972
3501B141831R1545Q9373R4348Q7654O6160L9902q086k3262p2488j20274j23080
3490B263623r9956j05813q7890r3192r2168n5784n1743o5300l6179k6789m2992
3479A505817l1973p895m067p128l336p605k4761j1355j089j2661k7961j8830K542
3466A349698o823J0747j2244m977K6312J0725q371J0933n85j9321P452m298K3785
3453A383033K7O90j3347j3222R908n60J3119J6604J6910N709o522O900K3231R632
$$ plain form
3536 1078527 1081770 1093181 1111038 1126561 1106039 1093149 1098856 1122504 1120521 1144320 1179134 1186243
3524 1186243 1217110 1218120 1240921 1248759 1258901 1266240 1281833 1292576 1317323 1334321 1358554 1394198
3512 1394198 1426998 1481100 1545835 1609925 1664420 1737769 1803452 1872111 1958035 2054859 2141831
3501 2141831 2233376 2322749 2417097 2504751 2570911 2610813 2602727 2579465 2506977 2386703 2263623
3490 2263623 2163667 2057854 1969964 1876772 1784604 1728820 1677077 1611777 1575598 1548809 1505817
3479 1505817 1473844 1465949 1461882 1454754 1451418 1443813 1419052 1407697 1406608 1393947 1365986 1347156 1349698
3466 1349698 1342875 1353622 1341378 1336401 1362713 1373438 1365067 1376000 1375415 1356094 1363546 1359248 1383033
3453 1383033 1383060 1383750 1370403 1357181 1367089 1366529 1379648 1396252 1413162 1418871 1412349 1419249 1442480 1452112
3439A452112J9827O706k861J8179k505P232o51q788j5781N061o096Q69J6114J5616
3425A505034K4227K9120J8478K3360K9847K9068K5236J0363K4276K3481k610R347
3413A749227L0574K9222J7213K8344M3656K3643L8680M8039J9135L4554N2262
3402B114549L6955K3643K0417K9637J4260K3715K1539K3599K9810M9959O8108
3391B456191P2437N7461O4606P1999P1615O6339N2807O2903N5906M4746O2210
3380C139220O1024O3566J01913J12325P7102Q2675P5878Q2047Q5101Q3748R0166
3369D054765J12956J13462Q3585R4967Q0330R8244J13912J06295J22029J01294
3359E081839Q5169R9545P2163P3479P3174P9762O8807P1759R8142J20270J13186
$$ plain form
3439 1452112 1471939 1478645 1475784 1493963 1491458 1498690 1498039 1489251 1473470 1478531 1472435 1473304 1489418 1505034
3425 1505034 1529261 1558381 1576859 1600219 1630066 1659134 1684370 1694733 1719009 1742490 1739880 1749227
3413 1749227 1779801 1809023 1826236 1854580 1898236 1921879 1960559 2008598 2027733 2062287 2114549
3402 2114549 2151504 2175147 2195564 2225201 2239461 2263176 2284715 2308314 2338124 2388083 2456191
3391 2456191 2528628 2586089 2650695 2722694 2794309 2860648 2913455 2976358 3032264 3077010 3139220
3380 3139220 3200244 3263810 3365723 3478048 3555150 3637825 3713703 3795750 3880851 3964599 4054765
3369 4054765 4167721 4281183 4364768 4459735 4540065 4638309 4752221 4858516 4980545 5081839
3359 5081839 5167008 5266553 5338716 5412195 5485369 5565131 5633938 5705697 5803839 5924109 6037295
3348F037295J01067J01069R3910R0529J11807J07698J19087J52517J45661J75501
3338G236141J61132J64046J68081J96764K17377K17068K19464K18483K29333K20668
3328I248557K48106K79239L33588L35432L36963L83324M04352L77691M07764M44621
3318A2799637M57196N25692O01088O30999O79074Q05244Q77303J021491J176809
3309A9574533J351936J575008J831558K113718K369233K729789L133652L652292
3301C8331719M285981N321497O421172O698939O743902P487782N982625K91800
3293H1565417o261460r728379r413657p937242n951972m256179l153937k369822
3285C2492769j800816j414690j140872q77253o44463m33264k81405j15175L6738
$$ plain form
3348 6037295 6138362 6239431 6333341 6423870 6535677 6643375 6762462 6914979 7060640 7236141
3338 7236141 7397273 7561319 7729400 7926164 8143541 8360609 8580073 8798556 9027889 9248557
3328 9248557 9496663 9775902 10109490 10444922 10781885 11165209 11569561 11947252 12355016 12799637
3318 12799637 13256833 13782525 14383613 15014612 15693686 16498930 17376233 18397724 19574533
3309 19574533 20926469 22501477 24333035 26446753 28815986 31545775 34679427 38331719
3301 38331719 42617700 47939197 54360369 61059308 67803210 75290992 81273617 81565417
3293 81565417 75303957 65575578 56161921 48224679 42272707 38016528 34862591 32492769
3285 32492769 30691953 29277263 28136391 27259138 26614675 26181411 25900006 25784831 25821569
3276B5821569J32327K46619L43487M32595N55053O62712Q07619R63323J183655
3267C1148959J376299J587440J703076J751183J485888Q06526j6571m60736m82080
3258C8899984l30188l19791m67506n47060m35359k64100k0456K05673L92245N82436
3248C7695878P41727Q51079J002101J109414J197454J285192J383511J478765
3240D6745121J622989J760151J871118J990518K149372K349562K590779K861793
3232F3941403L228121L646930M126321M713204N321478N999354O799585P693475
3224A05469871Q716914R854993J1020970J2127665J3180986J4273419J5452299
3217A90097117J6720071J8044275J9569872K1134870K1718976K0353000J6790814
$$ plain form
3276 25821569 25953896 26200515 26544002 26976597 27531650 28194362 29001981 29965304 31148959
3267 31148959 32525258 34112698 35815774 37566957 39052845 39859371 39842800 39382064 38899984
3258 38899984 38569796 38250005 37782499 37235439 36800080 36535980 36515524 36721197 37113442 37695878
3248 37695878 38437605 39288684 40290785 41400199 42597653 43882845 45266356 46745121
3240 46745121 48368110 50128261 51999379 53989897 56139269 58488831 61079610 63941403
3232 63941403 67169524 70816454 74942775 79655979 84977457 90976811 97776396 105469871
3224 105469871 114186785 124041778 135062748 147190413 160371399 174644818 190097117
3217 190097117 206817188 224861463 244431335 265566205 287285181 307638181 324428995
3210C24428995P522099q924318k5577006l4327866l4852836l0921877k5415693
3203A71931498k0472079j6520708j3547884j1245760r500791q099364o929737
3196H5615175n922143n152457m593133m278510m007683l674226l362469l057384
3188E1567170k790240k603307k461253k283530k071516j818505j587146j419450
3180C4532223j254310j125725j093714j197952j288026j260603j179687j074420
3172B5057786r85105r27187q73604q57993q23534p59322p06914o68000o24106
3163A7832021n77960n07044m59613m38028m01270l84315l44135l20601k60015
3154A4139040k46474j89557j44518n0632r052j1463N2134J40130o6716m56405
$$ plain form
3210 324428995 331951094 323026776 297449770 263121904 228269068 197347191 171931498
3203 171931498 151459419 134938711 121390827 110145067 100644276 92544912 85615175
3196 85615175 79693032 74540575 69947442 65668932 61661249 57987023 54624554 51567170
3188 51567170 48776930 46173623 43712370 41428840 39357324 37538819 35951673 34532223
3180 34532223 33277913 32152188 31058474 29860522 28572496 27311893 26132206 25057786
3172 25057786 24072681 23145494 22271890 21413897 20590363 19831041 19124127 18456127 17832021
3163 17832021 17254061 16747017 16287404 15849376 15448106 15063791 14719656 14399055 14139040
3154 14139040 13892566 13703009 13558491 13507859 13498807 13487344 13539478 13679608 13612892 13156487
3144A3156487q04406q22877p18431o61236n46845m52241m26285l41432k99523
3135H083211k70739k30935k08653j84149j59980j60468j61156j45571j23453j11272
3125F326835r3362o1610n2175m465J117M2403R2003J06152J11062J31290J41353
3114F740603K7286j59186l11683l11296k83773k78233k06609j76188j51414j11755
3104D777752p7076o6951q4766p4442n2687p2062q0910o1849q3263p8707q7034
3093C958005j10712j07720r2889r0241j00568q8895q7396p8411o6244p7052o5811
3082B992066p5479p7848m3425p0289o3145n3039o6254p5055r3164p1522m9185
3071B253661m8466n7776n6909k4987k1992k9269l9007m1700k8298j022j4898j7805
$$ plain form
3144 13156487 12352081 11529204 10810773 10149537 9602692 9150451 8724166 8382734 8083211
3135 8083211 7812472 7581537 7372884 7188735 7028755 6868287 6707131 6561560 6438107 6326835
3125 6326835 6233473 6171863 6119688 6115223 6116340 6158743 6250746 6356898 6467960 6599250 6740603
3114 6740603 6767889 6608703 6297020 5985724 5701951 5423718 5217109 5040921 4889507 4777752
3104 4777752 4700676 4633725 4548959 4474517 4421830 4349768 4268858 4207009 4123746 4045039 3958005
3093 3958005 3847293 3739573 3646684 3556443 3455875 3366980 3279584 3201173 3134929 3057877 2992066
3082 2992066 2916587 2838739 2795314 2725025 2661880 2608841 2542587 2467532 2374368 2302846 2253661
3071 2253661 2205195 2147419 2090510 2065523 2043531 2014262 1975255 1933555 1905257 1904235 1889337 1871532
3059A871532j2963k2040m215J1420k7258j3370Q716L873k3779k3621q122R220
3047A769393J0472j4309k0066j7315j121L546J7097j822j9728k9803l0306k5216
3035A640822l4672j7383j3835m991q019K742k4348L475P455P316o765j0765l4521
3022A506511m5383k5679k9912j9468j0354o735j6458P550J4202L1P727K3300M2734
3009A448066J0647K2292J4419J2171n893j7204m1067m6111l6616l4813j6607j6809
2997A292475j8990k443k8105j6337k063m316j6341j6499j2473k6172l5349m6313
2985A067074l5364j0832j4054O77j0265r195J5550n660j3309R486m843l0790O987
2972I65462k8748j7267k2910l419j3401l3918j7344m523l994p056J079Q629j8692
$$ plain form
3059 1871532 1858569 1836529 1832314 1843734 1816476 1803106 1811822 1815695 1791916 1768295 1760173 1769393
3047 1769393 1779865 1765556 1745490 1728175 1727054 1730600 1747697 1745875 1726147 1696344 1666038 1640822
3035 1640822 1606150 1588767 1574932 1569941 1561922 1564664 1540316 1543791 1551246 1558562 1551797 1541032 1506511
3022 1506511 1461128 1435449 1405537 1386069 1375715 1368980 1352522 1360072 1374274 1374305 1382032 1405332 1448066
3009 1448066 1458713 1481005 1495424 1507595 1501702 1484498 1443431 1397320 1360704 1325891 1309284 1292475
2997 1292475 1273485 1271042 1242937 1226600 1224537 1220221 1203880 1187381 1174908 1148736 1113387 1067074
2985 1067074 1031710 1020878 1006824 1007501 997236 988041 1003591 997931 984622 994108 989265 958475 965462
2972 965462 936714 919447 896537 893118 879717 845799 828455 823932 819938 812882 813961 822590 803898
2959H03898r494j5681N013l4971p196O488R758q062o302r717J7066M835O237q06
2945G61066R781P477J2492J0458J8746J0247K5233N3002L3542K5278M7709M8020
2933A063051O6126O7262O4352P7810Q2524J05592R6104R2680Q2538P8415O0136
2922A936590L299k6298o0700j00514j07446j38133j25757j22939r9180p0222p7181
2911A011519p3779n1466n6690l2672m8517k0073k0921l0690k5787j6230j1278
2900F23416k5022k7149k1968r839L073j8917K498l672j1244j5640m312j2128m008
2887D75088J3072p863k5105j1110J647K2209K55N492Q698j9837N401J349j7782
2874D51514k0220K327j2263j8236j2704j3126J3020k3274k2594R079Q301J917
$$ plain form
2959 803898 794404 778723 783736 748765 741569 748057 757815 749753 743451 733734 750800 755635 761872 761066
2945 761066 770847 778324 790816 801274 820020 830267 855500 908502 942044 967322 1015031 1063051
2933 1063051 1129177 1196439 1260791 1338601 1421125 1526717 1622821 1715501 1798039 1876454 1936590
2922 1936590 1939889 1913591 1852891 1752377 1644931 1506798 1381041 1258102 1158922 1088700 1011519
2911 1011519 937740 886274 829584 796912 748395 728322 707401 676711 650924 634694 623416
2900 623416 598394 571245 549277 539438 542511 523594 526092 522420 511176 495536 491224 479096 475088
2887 475088 488160 480297 455192 444082 445729 467938 468193 473685 482383 462546 467947 469296 451514
2874 451514 431294 433621 421358 403122 390418 377292 390312 367038 344444 353523 361824 363741
2862C63741M045j0801j0841j251k7646k241J604J0046L289J935Q905q561m712
2849C27512J692J8815K852M345k0084J888r198M140J4351p347j909m00r369Q16
2835C28104j1299o086J6038M33M610o203l6675r132J0877N193K132N584k3080
2822B80496j9762k647j2149J0784J0652M185o311r436L580j6906j1617J3322P377
2809B51568k3q752o656q963J5617j4082J1828N868j6712k3514j5176J048J6405
2796B08456J305p189J087P417j1320j0187K344q664j155l487r881n462l0044J3784
2782A47004J2344O06j907j8155n52J4464m958P509k0345p809j0514J3030j884
2769A28833j6781J4558P193j1494j9096J8156j2042R180Q923o111K139J4720k399
$$ plain form
2862 363741 367786 356985 346144 344893 317247 315006 316610 326656 329945 331880 340785 332224 327512
2849 327512 329204 348019 350871 355216 335132 337020 327822 331962 346313 338966 337057 336657 327288 328104
2835 328104 316805 310719 326757 327190 331800 325597 288922 279790 290667 295860 297992 303576 280496
2822 280496 260734 258087 245938 256722 267374 271559 265248 255812 259392 242486 230869 244191 251568
2809 251568 251545 242793 236137 227174 242791 228709 240537 246405 229693 206179 191003 192051 208456
2796 208456 209761 202572 203659 211076 199756 189569 191913 183249 182094 178607 168726 163264 133220 147004
2782 147004 159348 159954 158047 139892 139340 153804 148846 156355 136010 128201 117687 130717 128833
2769 128833 112052 126610 133803 122309 103213 121369 109327 118507 127430 121319 123458 138178 135779
2756A35779k835O404p040j0789r69J1552j0834q99j651j8936q66L473J6280j8943
2742I9726Q15j965j0934o959J0122J9349n739r159n45J1425L504j284j034O165
2728A13487j0944j2969P091j0756q071q695k177J1043R357m885m49L610j2626
2715G3016J3316j7576j4255J6325l100J3261l7871k1226J8370K2738r115q833
2703D5050O041N724q098j2075L327K599P295j3421J1379J1246r904j4351J2710
2690D7522Q090j399j1872n324J6852O919m984r41j3883n858R647j5705P585J2780
2676D9429l92l211J8168n148j4879p724p074j2736k629J601K129N011J7054K555
2662D2154J416J781J1543j0348j1093J7887k3824k764J0593M463M46K013L898
$$ plain form
2756 135779 132944 139348 132308 121519 120550 132102 121268 120369 118718 99782 98916 102389 118669 99726
2742 99726 100541 98576 87642 80683 90805 110154 104415 95256 94711 106136 109640 108356 107322 113487
2728 113487 102543 89574 96665 85909 77838 69143 66966 78009 87366 82481 82032 85642 73016
2715 73016 86332 68756 54501 70826 67726 80987 43116 21890 40260 62998 53883 45050
2703 45050 51091 56815 48717 36642 39969 42568 49863 36442 47821 59067 49163 34812 47522
2690 47522 55612 54213 42341 37017 53869 60788 55804 54863 40980 35122 44769 29064 36649 49429
2676 49429 49037 45826 63994 58846 43967 36243 29169 16433 13804 15405 17534 22545 39599 42154
2662 42154 43570 45351 56894 46546 35453 53340 29516 26752 37345 41808 42254 44267 48165
2649D8165L110K076J5063q737R705k684o780J98j4151j468j1246M284j347q239
2635B7949L3573j3578p717j0752L795o015K566K0915r986m407j1543K333J091
2622B8224o867M668L357N380J886r425j1089j227q546J3200J9071L674M933p058
2608D0181q288J4955r707L165J716m58r812r508K0622O401j203J355r645k7786
2594A1988n466J5591J1468J835J48M35O517m456M614N208J271q179p848J2468
2580D5594j883j8050j9147l50K0533j0169J1739J2303j482j6528L581o220p06
2567A9215m039j323m89J1837j0116p115K53J2355R604q388k326P387m39n112O83
2552B1987k522O709j4258o995K2675o8P701k416j6485l463j145K419K4139K31
$$ plain form
2649 48165 51275 53351 68414 59677 69382 66698 59918 60116 45965 44497 33251 37535 36188 27949
2635 27949 61522 47944 40227 29475 33270 27255 29821 50736 40750 36343 24800 27133 28224
2622 28224 21357 26025 29382 34762 36648 27223 16134 14907 6361 19561 38632 42306 47239 40181
2608 40181 31893 46848 37141 40306 42022 41564 31752 22244 42866 49267 48064 49419 39774 11988
2594 11988 6522 22113 33581 35416 35564 35999 42516 38060 42674 47882 49153 40974 33126 45594
2580 45594 43711 25661 6514 6164 26697 16528 28267 40570 39088 22560 26141 19921 19215
2567 19215 15176 13853 13364 25201 15085 7970 8223 20578 30182 21794 19468 26855 26416 21304 21987
2552 21987 19465 26174 11916 4921 27596 27528 35229 32813 16328 12865 11720 14139 38278 38509
2538C8509m766o981j5072R37M732M359K3372J720k0014N373J404n02l560j0927
2524A8584l479J0219j0289N960l157M356j973Q177J207j2405j4340K0349J4065
2511C7274l4517J3497J3996O107j6076P836K705k3139j890j3120P575p701J3645
2498F192j7193j5775J2104K4764P707K626N941r379L172L223M948O880j2476J684
2484B4418J393J2930O436k638Q385j2581n022K746j3379O559K754j426n051J6627
2470D2151k4451j0985j006R146R43q140J705J051k918j884n447p386k443K286
2456g378J3484J3534l988l0801J4700Q958j364j3434q91J9014k4979J260J4122
2443B237p766J3387j2625K372j777O925R733m04j2824o420J3693o298j347r769
$$ plain form
2538 38509 33743 26762 11690 12627 17359 21718 45090 46810 26796 32169 33573 33071 29511 18584
2524 18584 15105 25324 15035 20995 17838 22194 20221 28398 29605 17200 2860 23209 37274
2511 37274 2757 16254 30250 36357 20281 28117 30822 7683 5793 -7327 248 -7453 6192
2498 6192 -11001 -26776 -14672 10092 17799 20425 26366 16987 20159 23382 28330 35210 22734 24418
2484 24418 25811 38741 45177 42539 50924 38343 33321 36067 22688 29247 32001 30575 25524 42151
2470 42151 17700 6715 5709 14855 15798 7658 9363 10414 7496 5612 165 -7221 -9664 -7378
2456 -7378 6106 19640 15652 -15149 -449 8509 7145 -6289 -7180 11834 -13145 -11885 2237
2443 2237 -5529 7858 -4767 -2395 -4172 2753 12486 12082 -742 -7162 6531 233 -1114 -10883
2429a0883j3469q578O668K5385L08K2469q828L441j1209n101K1963j1446K40o886
2415D074P837j7702p871j813P35P931j066J0967N405O958q418K2125L178k8108
2401D232o983N210j1889K238J5633O054l335J1200j7108J2549j0689j346m358
2388A408j6306J255M653K162R6J0218j0582M508J4895q114o650n740j4344l34
2374b2875J6307R67K178J223m338O13l707O552p045J3626j042r660l837J722M415
2359d901J611k0940J491J1570J3048r370j2817q65J3932p135J7880P834r997M907
2345F248q563J6872M490j488R653P639j7145K7L69j0145n374Q959j9259J0050
2331B333k542l739K456J7466l484P365l510j5116J0255R207j378n600l952l680
$$ plain form
2429 -10883 -24352 -32930 -26262 -877 -569 21900 13072 16513 5304 203 22166 10720 10960 4074
2415 4074 11911 -5791 -13662 -15475 -14740 -6809 -7875 3092 8497 15455 7037 29162 32340 4232
2401 4232 -2751 2459 -9430 -7192 8441 14495 11160 22360 5252 17801 7112 5766 1408
2388 1408 -14898 -13643 -8990 -6828 -6732 3486 -7096 -2588 12307 4193 -2457 -8197 -22541 -22875
2374 -22875 -6568 -5601 -3423 -2200 -6538 -5925 -9632 -3080 -10125 3501 2459 -7201 -11038 -9316 -4901
2359 -4901 -3290 -24230 -22739 -11169 1879 -7491 -20308 -21173 -7241 -14376 3504 11338 1341 6248
2345 6248 -2315 14557 19047 17559 27212 34851 17706 17733 18102 7957 2583 11542 -7717 2333
2331 2333 -209 -3948 -1492 15974 12490 19855 16345 1229 11484 20691 19313 13713 9761 6081
2317F081J7076k271m629N30n005K158l732n014k402j5810J551J9287J0390o283
2303A1927K570j909N844j4934J0388o839P272j0176P432r324m399l780R032j0893
2289g789J1561N834N838j5798K61n34j1180j30m339M4J1048Q191o171O562Q92
2274D290o365o336J497K522J1297L050k321j582M343j0217p765m517P5n080m369
2259b1478Q282M917L817Q94R2J8046m35q240j181J2300K642m604L42q686m725
2244A983L766o811J3414k35R684k1784J0019R418J4321k0396N055Q263k1276k627
2230B794o34m024J1803l929l077P485r995L872n885p244O646R374j6647j4137
2216b3598j673K0097M267K789j9112j374L1344j5808Q545J1809j4579k722O969
$$ plain form
2317 6081 23157 20886 16257 16787 11782 13940 10208 5194 2792 -13018 -11467 7820 18210 11927
2303 11927 14497 12588 18432 3498 13886 7047 14319 4143 11575 2251 -2148 -5928 3104 -7789
2289 -7789 3772 9606 15444 -354 -93 -627 -11807 -11937 -16276 -16232 -5184 3007 -3164 3398 4290
2274 4290 -2075 -8411 -6914 -4392 6905 9955 7634 6052 10395 178 -7587 -12104 -12029 -17109 -21478
2259 -21478 -13196 -8279 -4462 -3568 -3476 14570 14135 5895 4714 17014 19656 15052 15394 6708 1983
2244 1983 5749 -1062 12352 12117 21801 17 10036 19454 33775 13379 18434 26697 5421 2794
2230 2794 2160 -1864 9939 6010 2933 10418 423 4295 -1590 -8834 -2188 7186 -9461 -23598
2216 -23598 -25271 -5174 -907 1882 -17230 -18604 12740 -3068 5477 17286 2707 -15 6954
2203F954k190j8568J222J0598M985J4849M611k305j2661R952N452j1862j0348
2190F89o481q371m022R830J9680M341m836N54k3268l217K3173R992j79J5422J169
2175C4476j7656J8366L892j140K139k4401O553p704J0773M70J0232N808k532J0424
2161D9700M598l384O316N00k0716J665P202K695O793M06J1403q628j2075L57n575
2146D1257M772q10Q652j804J5622j2706M782k405J3248J4003J1561L401j8973
2133H0600J2692j04p447o295M266J5581N102J754Q245O705j1706P002K1334m860
2119A32869Q978R811R012Q606L800P21L481R571K3070r390P894L5038J8213k608
2105B59066l806K2353K3433m422O129m97L790K4254K9284J521K5903K2061M4321
$$ plain form
2203 6954 4764 -13804 -12582 -1984 3001 17850 22461 20156 7495 17447 22899 11037 689
2190 689 -5792 -14163 -18185 -8355 11325 15666 10830 11384 -11884 -15101 8072 18064 17885 33307 34476
2175 34476 16820 35186 39078 37938 40077 15676 22229 14525 25298 25768 36000 41808 39276 49700
2161 49700 54298 50914 57230 57730 37014 38679 45881 48576 55369 55775 67178 58550 46475 46832 41257
2146 41257 46029 45219 53871 52067 67689 54983 59765 57360 70608 84611 96172 99573 80600
2133 80600 93292 93188 85741 79446 83712 99293 104395 106149 114394 121099 109393 116395 137729 132869
2119 132869 141847 151658 160670 169276 173076 173797 177278 186849 209919 200529 208423 243461 261674 259066
2105 259066 255260 277613 301046 296624 302753 302256 306046 330300 359584 361105 387008 409069 453390
2092D53390N1879L6204L5304N6921K4640M0826O6565N4631O9446R6386J24758
2081A110950J52217J96927K31289L13582M18759N50127N85091O27670K91704n24616
2071C953700q69488p34485n18722l27459k50533j87122j53301j07243p6787n4772
2061F73788m2911m1510k7355j788o2622o5982k4988m2334k1555j2430j4638k0875
2049B94800k5148k2279j2549p407j3997j4083l5020K584P752l730O479j0989r537
2036A56876L431J147j2911J5709o417k3973r178j5190l730j884r238J1548L582
2023A09772j5181j0813n817K134p804o728O719m442p831j5179J0509p804r615
2010C7920K864l523Q23j1231J3040q913K147m165k666r49Q875j3195o95o835P889
$$ plain form
2092 453390 505269 541473 576777 633698 658338 699164 765729 820360 889806 986192 1110950
2081 1110950 1263167 1460094 1691383 2004965 2423724 2973851 3558942 4186612 4478316 3953700
2071 3953700 3084212 2349727 1831005 1503546 1253013 1065891 912590 805347 728560 673788
2061 673788 630877 589367 562012 560224 497602 431620 406632 364298 342743 330313 315675 294800
2049 294800 269652 247373 234824 227417 213420 199337 164317 166901 174653 170923 177402 166413 156876
2036 156876 160307 161454 148543 164252 157835 133862 124684 109494 105764 103880 94642 106190 109772
2023 109772 94591 83778 77961 80095 72291 65563 72282 67840 60009 44830 55339 47535 37920
2010 37920 40784 37261 38084 26853 39893 30980 33127 28962 26296 25347 34222 21027 20332 13497 21386
1995B1386j4575M568J7916J068r237j3997R82n121J5598q003n112N246J4930N10
1981B6159j8359p960J6435O423p637M38o879j2711L917K2044o004j0742n103M366
1967D387M228J1797l838p798J5093j0147r736R143j5597j189J5903j0285Q711
1954A0672p909J750P06j613P477R740j8321p227K606m961k957J4040J2456r663
1940F796j5648k10J9799l146l331j0068j1001P926J7007k0700J1516j0394n870
1927a7324n017o54J1944j94K627m262O244Q929J1712j1893N597L440j9273p221
1913a5345m359N511J704L77K0769k4062J592M673L569j035J2130p338o616j3299
1899b1729N203L423o720r850M044P527J8104J6047j8007j2519r662l540Q780M586
$$ plain form
1995 21386 6811 11379 29295 30363 21126 7129 8111 2990 18588 10585 5473 10719 25649 26159
1981 26159 7800 -160 16275 22698 15061 15499 8620 -4091 -174 21870 15866 5124 21 4387
1967 4387 8615 20412 16574 8776 23869 13722 3986 13129 -2468 -3657 12246 1961 10672
1954 10672 2763 4513 5219 3606 11083 20823 2502 -4725 -2119 -7080 -10037 4003 16459 6796
1940 6796 -8852 -9062 10737 7591 4260 -5808 -16809 -8883 8124 -12576 -1060 -11454 -17324
1927 -17324 -22341 -22995 -11051 -11245 -8618 -12880 -6636 2293 14005 2112 7709 11149 -8124 -15345
1913 -15345 -19704 -14193 -12489 -12112 8657 -15405 -13813 -9140 -5571 -6606 5524 -1814 -8430 -21729
1899 -21729 -16526 -13103 -19823 -29673 -25629 -18102 2 16049 -1958 -14477 -24139 -27679 -18899 -14313
1885a4313K835o300l309K4076j5466q961J4083O891n945p388J8267J456Pj6282
1871a0349k2085J7355K50r273k225K0062o272p88J6569p935k380n19k0935J0306
1857a8219L977j666R846p003n704j9411K6088O685j2575M406L097q551j6028K612
1843c2446J0875J2607q674J3885L411j03Q065j6710J5652r558j5376N56L164J1637
1829c015L87q982j3264Q055k516P125r224K965K910j3854J0195J8151j3852J259
1815a3660N070l915o199K219O899l490L536n216J5298j199p356Q84M155k297L740
1800a531l949p145J5912q233J143j2918j2118n646L987M340K0816q86j833k253
1786a0314j6408R865m606K775M637j2595L810J0347K257J5692j7861o037j583
$$ plain form
1885 -14313 -11478 -17778 -21087 2989 -12477 -21438 -7355 -464 -6409 -13797 4470 5926 5933 -10349
1871 -10349 -32434 -15079 -14829 -24102 -26327 -6265 -12537 -13325 3244 -4691 -7071 -7590 -28525 -18219
1857 -18219 -14242 -15908 -6062 -13065 -18769 -38180 -12092 -5407 -17982 -13576 -10479 -19030 -35058 -32446
1843 -32446 -21571 -8964 -17638 -3753 -342 -445 7620 -9090 6562 -2996 -18372 -17816 -14652 -3015
1829 -3015 -2628 -11610 -24874 -16819 -19335 -12210 -21434 -18469 -15559 -29413 -19218 -1067 -14919 -13660
1815 -13660 -8590 -12505 -18704 -16485 -9586 -13076 -9540 -14756 542 -657 -8013 -7129 -2974 -5271 -1531
1800 -1531 -5480 -12625 3287 -4946 -3803 -16721 -28839 -34485 -30498 -26158 -5342 -6228 -8061 -10314
1786 -10314 -26722 -16857 -21463 -18688 -14051 -26646 -22836 -12489 -10232 5460 -12401 -18438 -20021
1773b0021K718J9706p31j870r583l908n436K597K676O235l967O35Q869J0945q412
1758D53j193j5310N909n880k3282P880O329R759N402K151o234J0132K5995l016
1744A9095k6142j2276J2531j3416l686j09Q330K4691j1233o813n314j647j5390
1731c1379J912Q557m752n556Q220n333n25M008L663m471R4L741M81N204p759j2785
1715c6680p245j286J4618P025J6715P053K253k270j392n803J3021N3k5787R233
1701a0492m861K164K0424m162j0979r762r214Q759K985J751o42j3403k544J5203
1687a4773O279j7574M898j232J2918j7895l748J002j7860P936L805j202K5614
1674a1832Q309j253l973j6021o311R773o831l250R621Q052M944J0848j0779q305
$$ plain form
1773 -20021 -17303 2403 1672 -198 -9781 -13689 -19125 -16528 -13852 -7617 -11584 -10949 -2080 8865 453
1758 453 -740 -16050 -10141 -16021 -39303 -31423 -25094 -15335 -9933 -7782 -14016 -3884 22111 19095
1744 19095 -7047 -19323 -6792 -20208 -23894 -24003 -15673 9018 -2215 -9028 -14342 -15989 -31379
1731 -31379 -29467 -20910 -25662 -31218 -22998 -28331 -28856 -24848 -21185 -25656 -25562 -21821 -21340 -16136 -23895 -36680
1715 -36680 -43925 -45211 -30593 -23568 -6853 200 2453 183 -1209 -7012 6009 6062 -19725 -10492
1701 -10492 -15353 -13189 7235 3073 -7906 -17668 -26882 -18123 -15138 -13387 -14029 -27432 -29976 -14773
1687 -14773 -8494 -26068 -21170 -22402 -9484 -27379 -31127 -30125 -47985 -40049 -36244 -37446 -11832
1674 -11832 -3523 -4776 -8749 -24770 -31081 -21308 -28139 -31389 -21768 -13716 -8772 2076 -8703 -17008
1660a7008q584J3942J2497j2238k520J530K7687j2212N54k853j2233O501j4693
1647a9630j1349k988j4550K1855K4000j0620o598K4571k3138j5363J2585K1595
1635C70K78j1676K1960R852j2874j6130k8440J2609K6205J2967k4890p218K337
1622a4650J175k2598O668o288j1892J3092n83J3022k570j3702J9334l797M330
1609a8459J0915q177j162J1114P433k3452m780l937K562O216J6310K314q264m1
1595a1408n680k1032j363K2023J6607m840j0700l24J3248N336j0176j6127J6610
1582g826m226L631o564M424l408P939Q191j3825j5051l080k958Q514N374j0404
1568b9269j6236P516J3858L360k475J977J0582k044M731k0154K1680O499j4016
$$ plain form
1660 -17008 -25592 -11650 847 -11391 -13911 -12381 15306 3094 3648 795 -11438 -4937 -19630
1647 -19630 -30979 -33967 -48517 -26662 -2662 -13282 -19880 4691 -18447 -33810 -21225 370
1635 370 648 -11028 10932 20784 7910 -8220 -36660 -24051 2154 15121 -9769 -16987 -14650
1622 -14650 -13475 -36073 -29405 -35693 -47585 -34493 -35076 -22054 -24624 -38326 -18992 -22789 -18459
1609 -18459 -7544 -15721 -16883 -5769 1664 -21788 -26568 -30505 -27943 -21727 -5417 -3103 -11367 -11408
1595 -11408 -17088 -38120 -39483 -17460 -853 -5693 -16393 -16717 -3469 1867 -8309 -24436 -7826
1582 -7826 -12052 -8421 -14985 -10561 -13969 -6030 2161 -11664 -26715 -29795 -32753 -24239 -18865 -29269
1568 -29269 -45505 -37989 -24131 -20771 -23246 -21269 -10687 -12731 -8000 -28154 -6474 25 -13991
1555a3991J59O088o663k217j54r151J1145j736N286J0242j6122J0822n966O062
1541f196m657J0462r972j3471J5496L744k70L426r288K596J2002j3029l852k470
1527a5479M35q67P153M994q887L01j59L203J374j2926J481l686J3778j5753j979
1512b7017N266j4562J0591j2277M060n231k656J5459J8957k493r280j4839M295
1499b9727k370Q417M025q620O080K966J1156j1693J3289o115j4408j5564J1451
1486c1113O893K1797M171m528j2587L61j438R57K0118n915j9530j1481j7123K3320
1472b6098J5675j6731o657K3934M975l184N279L600r928r096J3967N163r966n683
1458a4750j2458J773K449O07M982j273P053k0670M586J4937q115J661J0783J2993
$$ plain form
1555 -13991 -13832 -7744 -14407 -16624 -16778 -25929 -14784 -16520 -11234 -992 -17114 -6292 -12258 -6196
1541 -6196 -10853 -391 -10363 -23834 -8338 -4594 -4864 -1438 -10726 -8130 3872 -9157 -13009 -15479
1527 -15479 -15044 -15911 -8758 -3764 -12651 -12350 -12509 -9306 -7932 -20858 -19377 -23063 -9285 -25038 -27017
1512 -27017 -21751 -36313 -25722 -37999 -33939 -39170 -41826 -26367 -7410 -9903 -19183 -34022 -29727
1499 -29727 -32097 -23680 -19655 -28275 -22195 -19229 -8073 -19766 -6477 -12592 -27000 -42564 -31113
1486 -31113 -24220 -2423 1748 -2780 -15367 -15006 -16444 -15487 4631 -1284 -20814 -32295 -49418 -26098
1472 -26098 -10423 -27154 -33811 -9877 -4902 -8086 -2807 793 -9135 -18231 -4264 899 -9067 -14750
1458 -14750 -27208 -25435 -22986 -22379 -17397 -18670 -11617 -32287 -27701 -12764 -20879 -19218 -8435 4558
1444D558k0055j4938k180q532K1806J1188L920k646P327j2410R974N006L747j8024
1430a1259o348L405n057j544o449k541R489Q727l446Q73R542j2580N896J5016
1416C724n519j9662j3115M779R900j2375R09L203J0894m13o971N550j1556j0363
1402d1015N982P775k2631J5060J4276P802l424o059K501P845j790q357k146o607
1388c0788j304J1108j0899m739K4396J074q760P474q059N678K702o034J1278m146
1374a1019L441J771n636j8052N714r27n009q744J5000J7262l921J189M907k095
1360f119l928o173j3760K1197M841j1471p22J2994M414j3918J880j3543l152Q962
1346a8498q242N362n565K7025K82k6464L843J1093R257j190k325J894N242j1437
$$ plain form
1444 4558 -15497 -30435 -32615 -41147 -19341 -8153 -4233 -6879 448 -11962 -1988 3018 6765 -11259
1430 -11259 -17607 -14202 -19259 -20803 -27252 -29793 -20304 -11577 -15023 -14150 -4608 -17188 -11292 3724
1416 3724 -1795 -21457 -34572 -29793 -19893 -32268 -31359 -28156 -17262 -17675 -24646 -19096 -30652 -41015
1402 -41015 -35033 -27258 -49889 -34829 -20553 -12751 -16175 -22234 -19733 -11888 -13678 -22035 -24181 -30788
1388 -30788 -32092 -20984 -31883 -36622 -12226 -11152 -19912 -12438 -20497 -14819 -12117 -18151 -6873 -11019
1374 -11019 -7578 -5807 -11443 -29495 -23781 -24708 -29717 -38461 -23461 -6199 -10120 -8931 -4024 -6119
1360 -6119 -10047 -16220 -29980 -8783 -3942 -15413 -16135 -3141 1273 -12645 -10765 -24308 -27460 -18498
1346 -18498 -26740 -21378 -26943 82 364 -26100 -22257 -11164 -1907 -3097 -5422 -3528 1714 -9723
1332i723j4055r664K1523K486j5044l189j3023r981J5000R382O887O529n755l830
1318b2457M72n331j1874J9706J5644j381j5837J9545j683k7897Q663P276o513
1305b1667J2010N428J1415p228j5883j485r051K3810M858k646j4365n564J7445
1292b923o586J0082J6187j9970l0291J7070n380j2763J3381M608j541M615N059
1279h452m249P908l016j1590j0J134m987r625R754J1585J9366n840j2887k81Q057
1264c133J08L762k2735M704j328K826J2126j0541J2274q17p634j7656R484q458
1250b7018J3718M171l028k72k2909J198J2600J2710J1098j0328K041j5672m226
1237b5917K867O945l308M59O780J0006M699j8986J064P560m772J602j3123l239
$$ plain form
1332 -9723 -23778 -33442 -11919 -9433 -24477 -27666 -40689 -50670 -35670 -26288 -19401 -12872 -18627 -22457
1318 -22457 -21985 -27316 -39190 -19484 -3840 -5221 -21058 -1513 -3196 -31093 -22430 -15154 -21667
1305 -21667 -9657 -4229 7186 -42 -15925 -17410 -26461 -2651 2207 -439 -14804 -20368 -2923
1292 -2923 -9509 573 16760 -3210 -33501 -16431 -21811 -34574 -21193 -16585 -18126 -13511 -8452
1279 -8452 -12701 -4793 -7809 -19399 -19409 -18275 -23262 -32887 -23133 -11548 7818 1978 -10909 -11190 -3133
1264 -3133 -3025 737 -21998 -17294 -18622 -15796 -3670 -14211 -1937 -2754 -10388 -28044 -18560 -27018
1250 -27018 -13300 -9129 -12157 -12429 -35338 -34140 -21540 -8830 2268 -8060 -6019 -21691 -25917
1237 -25917 -23050 -16105 -19413 -18954 -12174 -2168 2531 -16455 -15391 -7831 -12603 -11001 -24124 -27363
1223b7363J2503J4024J4874k5825p046K847L604j188N350J0674L189j5916P358
1210b915P885l387P710j1137m448n597n508Q938q754n650M252N219K241k798j2040
1195b5989K544J6203o78k727j3929j5747n406K8518J3978j0816J4795N550j7290
1182a0994j7075j2324K7609J935m947N132p210M093R292j3998L218J69j745j6727
1168c3572J694K0900K1840J6540M946K706k0804l376j2305j233j6839p197K5937
1155g63j7499m750J0312k21N053p292q477O024K637O762M254O762j2238J235K722
1140e479l65j2856k2003K0731L855J1460l154l437L315m204j535J308j4464N2
1126b6776J3419K425q078J3041J519j4476l848r5r481P099j0456J1938L339K793
$$ plain form
1223 -27363 -14860 -836 14038 -11787 -18833 -15986 -12382 -13570 -8220 2454 5643 -10273 -2915
1210 -2915 4970 1583 9293 -1844 -6292 -11889 -17397 -8459 -17213 -22863 -18611 -13392 -11151 -13949 -25989
1195 -25989 -23445 -7242 -7920 -10647 -24576 -40323 -45729 -17211 -3233 -14049 746 6296 -10994
1182 -10994 -28069 -40393 -12784 -10849 -15796 -10664 -17874 -13781 -4489 -18487 -15269 -15100 -16845 -33572
1168 -33572 -31878 -10978 10862 27402 32348 35054 14250 10874 -1431 -2664 -19503 -26700 -763
1155 -763 -18262 -23012 -12700 -12921 -7868 -15160 -23637 -17613 -14976 -8214 -3960 2802 -9436 -8201 -5479
1140 -5479 -5844 -18700 -40703 -19972 -16117 -4657 -7811 -11248 -7933 -12137 -13672 -12364 -26828 -26776
1126 -26776 -13357 -10932 -19010 -5969 -4450 -18926 -22774 -22869 -32350 -25251 -35707 -23769 -20430 -17637
1112a7637J8847k111p116j0107n835Q481J2720K575r2J499j7259r738J3314k908
1098a5367K974K19q435O428O878J190O180J5452j5412j7839J2559l695p489o261
1084b2618J024r363J1760P220J2768L083k0604J5228J6181q384k3559J599J0582
1071e083R181O98l171J1351j4760j4297M60m199r181R887N467o489R615N124K525
1056b872m681p248L908j1351J3926J8805j1241j5151Q717q555o320J6966q492
1043a3589M798k153m691k891l688J0853j318j1573j0318O413O234l587N667N150
1029a4693o169J2507P445P42n422l95j3814j5175J768N425K1864o472l360l895
1015a9644j690J3854j1608J4221Q950r853k0956L537J1661k577j0045n136K0559
$$ plain form
1112 -17637 1210 -901 -8017 -18124 -23959 -15478 -2758 -183 -275 1224 -16035 -25773 -12459 -15367
1098 -15367 -12393 -12174 -20609 -14181 -7303 -6113 67 15519 107 -17732 -5173 -8868 -16357 -22618
1084 -22618 -21594 -30957 -19197 -11977 791 3874 -16730 -1502 14679 6295 -17264 -15665 -5083
1071 -5083 4098 4796 1625 12976 -1784 -16081 -15621 -19820 -29001 -19114 -13647 -20136 -10521 -5397 -2872
1056 -2872 -7553 -14801 -10893 -22244 -8318 10487 -754 -15905 -7188 -15743 -22063 -5097 -13589
1043 -13589 -8791 -10944 -15635 -18526 -22214 -11361 -12679 -24252 -34570 -28157 -21923 -25510 -19843 -14693
1029 -14693 -20862 -8355 -910 -168 -5590 -5985 -19799 -34974 -33206 -27781 -5917 -12389 -15749 -19644
1015 -19644 -21334 -7480 -19088 -4867 4083 -5770 -26726 -23189 -11528 -14105 -24150 -29286 -8727
1002h727r531J643J5260m921k324K0705j0663j0025J355L487L647j5969J926J0890
988c247J1037J3416N241k0522j5583j0647M735J2647j0235M110O93J3118M719
975I482j9996J5457k0519J2094P013k5121J0232m457k138j039J264m015K59J8464
961c020J0209k1725J3345P928j8504J0332Q473j6365K239J0959j4049R147l985
948e016K116K234j1696N449M221m727k501M182P58M178j318l330N45o860R884
933a881l441k989j2719k738L430p349J2976J2347L168r089p625P17Q011N863N347
918D028p937j277j0674r267K254J250p987J0674J3144R139j4052P491J286J0472
904H544n648K975k257n02k10l865M653j1595r063J8425O659l382l006n126N795
$$ plain form
1002 -8727 -18258 -16615 -1355 -6276 -8600 12105 1442 -8583 -7228 -3741 -94 -16063 -14137 -3247
988 -3247 7790 21206 26447 5925 -9658 -20305 -15570 -2923 -13158 -9048 -8355 4763 9482
975 9482 -10514 4943 -15576 -3482 3531 -21590 -11358 -15815 -17953 -18992 -17728 -21743 -21484 -3020
961 -3020 7189 -14536 -1191 6737 -11767 -1435 7038 -9327 -7088 3871 -10178 -1031 -5016
948 -5016 -2900 -666 -12362 -6913 -2692 -7419 -9920 -5738 -4980 -802 -2120 -5450 -4905 -11765 -1881
933 -1881 -5322 -8311 -21030 -23768 -20338 -27687 -14711 -2364 804 -8285 -15910 -15193 -7182 -1319 4028
918 4028 -3909 -5186 -15860 -25127 -22873 -21623 -29610 -18936 -5792 3347 -10705 -3214 -1928 8544
904 8544 2896 5871 3614 3112 2902 -963 3690 -7905 -16968 1457 8116 4734 1728 -3398 2397
889B397l654q328o955N148Q237k0002n59J6458j999K191m944L898l964r414N785
874a5705L1413k5253p591Q410O244P976M9j6723N661J4704m18j5451o200l682
860a6566l111K529l247J4223j004m211N961R678Q074k146J4211j5381j5701M257
846b434p49j0605j2386P906n596q124J7847P164J586M644N114l253Q322j1313
832a877n083J6471p65p962k7555N917N703o965l54O540J440O760m133R936N79
817a348n312m711J1821N348L506m577j400j762k2386K5005l577j202J6322j2498
803C229k197k055j3344J4616j5821K2434O842Q291j9994p491P528q690J3821j5442
789h273P21M668m630R279M360O823J155O200j8620R605P603p552Q426l903Q124
$$ plain form
889 2397 -1257 -9585 -16540 -11392 -3155 -23157 -23716 -7258 -9257 -7066 -12010 -8112 -12076 -21490 -15705
874 -15705 15708 -9545 -17136 -8726 -2482 5494 5543 -11180 -5519 9185 8767 -6684 -12884 -16566
860 -16566 -19677 -17148 -20395 -6172 -7176 -11387 -5426 4252 12326 10180 24391 9010 -6691 -2434
846 -2434 -3183 -13788 -26174 -18268 -23864 -31988 -14141 -6977 -5391 -747 4367 1114 9436 -1877
832 -1877 -6960 9511 8746 784 -26771 -20854 -15151 -22116 -22470 -15930 -14490 -7730 -11863 -1927 -1348
817 -1348 -6660 -11371 450 5798 9304 4727 3327 1565 -20821 4184 607 -595 15727 3229
803 3229 1032 -1023 -14367 249 -15572 6862 13704 21995 2001 -5490 2038 -6652 7169 -8273
789 -8273 -7552 -2884 -7514 1765 6125 12948 14103 20303 1683 11288 18891 11339 19765 15862 23986
774B3986k8377n168P004O279n179k371J348m931Q335M938m696K744q406J9164
760A4670m328j9923j6862K0686J2073L618j2617j5058M591Q600J086O175N069
747G780j4160j0033J4025j85k1043O362J5711j5098J1795R576l256o12k5597q243
733c2978K9093k56r188P524k1888O946L381J0897O836l446P936N276L057J3715
719B6905j4446j43k471q432J7176k786R68k261j5824k649J3781j1140J1161m674
705E165q651M145j5235k801K3084R045J626k670N012l978j7738J738P812Q114
691A4668o222j359j195q517n387j252Q316J5540j5632N446K458K761N927j1434
677D118M530r940J604R020o930K1009P158k294R824j1431j4712O20j6718J5419
$$ plain form
774 23986 -4391 -9559 -2555 3724 -1455 -3826 -2478 -7409 926 5864 1168 3912 -4494 14670
760 14670 10342 -9581 -26443 -5757 6316 9934 -2683 -17741 -13150 -4550 -3464 2711 7780
747 7780 -6380 -16413 -2388 -2573 -23616 -17254 -1543 -16641 -4846 4730 1474 862 -24735 -32978
733 -32978 -3885 -4141 -13329 -5805 -27693 -20747 -17366 -6469 367 -3079 4857 10133 13190 26905
719 26905 12459 12316 9845 1413 18589 15803 16771 14510 -1314 -3963 9818 -1322 9839 5165
705 5165 -3486 659 -14576 -17377 5707 14752 16378 13708 18720 14742 -2996 -1258 6554 14668
691 14668 8446 7087 5892 -2625 -8012 -9264 -948 14592 -1040 4406 6864 9625 15552 4118
677 4118 8648 -1292 312 9332 2402 23411 30569 28275 38099 26668 11956 12576 -4142 11277
663A1277j2118n771N46n270Q291R557L233j5579k08J4128o977j8261p126K2435
649a843j81p881j1572J2781j1135J0455R472j5662J0589N608P644L445n883l575
635B262R06M545L165j4178N845j0180R311R02J946k806J6112o692J0282j947k6234
620f761K570Q493K615R219k487l411l477O98J955n733p933K060L91J4854q74p664
604D515J2499r788N649o318J010O899l543l769L903Q905J7783j2355m711j347
590A9332k5146J123J2800j726O354j2930q943R669M888o337J0224O522j8326K976
576D80j4297N566J925j1714K408K7596L790j934o421N034N051j2K222J4850m133
561C0411k5308J8523j0745q205J965L988n586L101l97j5322L947p858m87J7177
$$ plain form
663 11277 -841 -6612 -6066 -11336 -3045 6512 9745 -5834 -6042 8086 1109 -17152 -24278 -1843
649 -1843 -2024 -9905 -21477 -8696 -19831 -9376 96 -15566 -4977 631 8275 11720 5837 2262
635 2262 3168 7713 10878 -3300 2545 -7635 1676 2578 4524 1718 17830 11138 21420 19473 -6761
620 -6761 -4191 4302 6917 16136 13649 10238 6761 7459 9414 3681 -4252 -2192 -1801 13053 12179 4515
604 4515 17014 7226 12875 6557 7567 14466 10923 7154 11057 19962 37745 25390 20679 19332
590 19332 -5814 -4691 8109 6383 12737 -193 -9136 533 5421 -916 9308 15830 -2496 480
576 480 -13817 -8251 -6326 -18040 -15632 11964 15754 13820 7399 12433 17484 17472 19694 34544 30411
561 30411 5103 23626 12881 4676 6641 10629 5043 8144 7747 -7575 -3628 -11486 -11973 5204
547E204J7897q372k0911L421J0430J874n283N239m114o228N111J6809j112R327
533B9292j196m397Q53j5162M850q701r00P882J1789j1153n092O89j3567J3910
519I097K4Q565r91l936J3861q390j3966N753N364j1935O3n811r616R545O563J2238
503A6428o944M801j905n020J57o88k500K2142K0559l766j0461j3904O778j3659
489A2018l939r017N285J967J2306N160r451O540p54l828o118j5758R465R454j3575
474b45K01P866m955Q820j5243M852J6612j4272J47Q741P069n231k345j6135n943
459a0061R985M04J7135N284k4303o815L86R174P676j588r799M331O072q424j5486
444a6029q12O212J4133L0294j331j5371r307q51K139j071j2548K072J0582M428
$$ plain form
547 5204 23101 14729 -6182 -2761 7669 9543 4260 9499 5385 -843 4268 21077 19965 29292
533 29292 28096 23699 24552 9390 14240 5539 4639 12521 24310 13157 8065 8754 -4813 9097
519 9097 9121 17686 16695 12759 26620 18230 4264 10017 15381 3446 3509 -2302 -11918 -2373 4190 16428
503 16428 9484 14285 12380 7360 7517 6829 4329 26471 47030 43264 32803 18899 25677 12018
489 12018 8079 -938 4347 6314 18620 23780 14329 20869 20115 16287 10169 -5589 3876 13330 -245
474 -245 -44 7822 2867 11687 -3556 1296 17908 3636 3783 12524 19593 14362 12017 -4118 -10061
459 -10061 -76 328 17463 22747 -1556 -8371 -7985 1189 8865 7277 -2522 1809 7881 -543 -16029
444 -16029 -16841 -10629 3504 33798 32467 17096 7789 6938 9077 8006 -4542 -2470 8112 12540
430A2540j325m041P550j9489J1253N555j1256J0279J3944k3305j2374K8154K93
417A7778q782r826L514O019J0040M297j1965j2721M691J515N739J3349j9884j0470
403f706k313k718Q556j515J2748J3249r700J2664N190k967q167m60O216j8549
389E528l416J2239q404J6575O733K28P678j1841j1433j1843Q750l630l550R129
375A2743K712P675r974j2349J4959p187n214j4306P673J6563l199J807M186m606
361A1483j999j5609P801J7251j5071k56Q328n206M821L957O196L341j7932M481
347A1586m274mr581j2653K5491m885j5263J3268J3134J8076j4159r704K626j6103
333b445J9511O56o102M690r135L738J858J5555j5107m951o816J7062N702j5650
$$ plain form
430 12540 11215 7174 14724 -4765 6488 12043 787 11066 25010 1705 -10669 17485 17778
417 17778 8996 -830 2684 8703 18743 23040 11075 -1646 3045 4560 10299 23648 3764 -6706
403 -6706 -9019 -11737 -3181 -4696 8052 21301 11601 24265 29455 26488 18321 17861 24077 5528
389 5528 2112 14351 5947 22522 29255 29483 37161 25320 13887 2044 10794 7164 3614 12743
375 12743 15455 23130 13156 807 15766 8579 3365 -10941 -3268 13295 10096 11903 16089 11483
361 11483 9484 -6125 1676 18927 3856 3600 11928 6722 11543 15500 21696 25037 7105 11586
347 11586 7312 7308 -2273 -14926 10565 5680 -9583 3685 16819 34895 20736 11032 13658 -2445
333 -2445 17066 17722 11620 16310 7175 10913 12771 28326 13219 8268 1452 18514 24216 8566
319H566k102N0j835l237J5815R136L982j2503m184J2043L776j3335l91J2731j1312
304A7200j6388j155M020O188R521j2232Q248M032m379K2631Q774n210j1251l633
290B6366j0583m437p356M411P37m326K766o336L964m47L111J2219J503j9438l001
275h47N200K276K676m891J5251O640j900j2609j4094J3018m391n256O567o89N243
260A2194j08R614j703m978m905J6827p967M664j8113j1835N218O009J7031k814
246A9134R898j0647q350J0933l3r588Q91N576m980Q719P996m932j9522L635N822
231A4552P262k492o286M212J706o208k641P239j2125J3314J65N529k240j7059
217D928q26J3663J389j4299Q059p68K84n114k287Q501J1869p760q638R657j4105
$$ plain form
319 8566 6464 6514 4679 1442 17257 26393 30375 17872 13688 25731 29507 16172 15781 28512 17200
304 17200 812 -343 3677 9865 19386 7154 15402 19434 15055 37686 46460 41250 29999 26366
290 26366 15783 11346 3990 8401 9138 4812 7578 1242 5206 4759 7870 20089 21592 2154 -847
275 -847 4353 6629 9305 4414 19665 26305 24405 11796 -2298 10720 6329 1073 7640 6951 12194
260 12194 12086 21700 19997 15019 10114 26941 18974 23638 5525 -6310 -1092 4917 21948 19134
246 19134 29032 18385 10035 20968 20935 11347 12238 17814 12834 21553 29549 24617 5095 8730 14552
231 14552 21814 19322 13036 17248 18954 12746 10105 17344 5219 18533 18698 24227 21987 4928
217 4928 4102 17765 19154 4855 12914 12146 12430 7316 5029 13530 25399 17639 9001 18658 4553
202D553K198n023K2700r868q173k80J454J6518k747L167j0907j560p012P832K177
187A5029p750R636n799O944q00J062p884J640j1030J859J0598O436Q035l632J1039
172C5383Q307j2030j5680J3331O651q313K370N888j0708j0359k597j7L895j731
158A4390O9k370K825k047O877j986N040K360L618q7K066n703j73J936J981n170
142B3626n524j3982O021O067j1836o91j2935O787O455J1352n38r28M119J3679
128C1672L65K495K503o842j4710k524P062J570q798k56j829J0726j0q923k121
113A0380k012j0862j581M340J0743m125r591R366M055N686Q035l930m599l162
99A2743J3616j2616M795J4352r569j7715l295Q588J4054n907j17P482N79l133
$$ plain form
202 4553 6751 1728 24428 14560 6387 6107 7561 24079 21332 24499 13592 12032 5020 12852 15029
187 15029 7279 16915 11116 18060 17260 18322 10438 12078 1048 2907 13505 19941 27976 24344 35383
172 35383 43690 31660 15980 29311 35962 27649 30019 35907 25199 14840 12243 12226 16121 14390
158 14390 14459 12089 14914 12867 19744 17758 22798 25158 28776 28689 30755 25052 24879 26815 28796 23626
142 23626 18102 4120 10141 16208 4372 3681 -9254 -2467 3988 15340 14802 13874 17993 31672
128 31672 32037 34532 37035 30193 15483 12959 20021 21591 12793 12537 10708 21434 21424 12501 10380
113 10380 8368 -2494 -4075 265 11008 6883 -2708 6658 10713 16399 24434 20504 15905 12743
99 12743 26359 13743 18538 32890 23321 5606 2311 10899 24953 19046 18929 26411 26990 23857
85B3857J376P195R421N826k3802L862n233j5107N857m723O593J5757J1019j174
71D0724j5209j2899O064O044k026N547k57k814n152J3615j5757R879O899n963
57B8695l117j6279M456R620j0157n189k772K905J2688j928o628L792P7m552N919
42A7530k462O695k204j096L993k597j769Q76p92j2522m750P946N448R904o907
27A7293o717R642k396L65j973J2469k333k840o070P733J893j928j3252P209K545
12B1640j1780J0583O511O35k01j336o355m689O183J4881p991q66
0B7215
$$ plain form
85 23857 25233 32428 41849 47675 23873 27735 22502 7395 13252 8529 15122 30879 41898 40724
71 40724 25515 12616 18680 24724 22698 28245 27988 25174 20022 33637 17880 27759 34658 28695
57 28695 25578 9299 13755 23375 13218 8029 5257 8162 20850 18922 12294 16086 16163 11611 17530
42 17530 15068 21763 19559 18463 22456 19859 18090 18966 18174 5652 902 8848 14296 24200 17293
27 17293 10576 20218 17822 18187 16214 28683 26350 23510 17440 25173 27066 25138 11886 19095 21640
12 21640 9860 20443 26954 27589 27388 26052 19697 15008 21191 36072 28081 27215
0 27215
$$ Imaginary data points
##PAGE= N=2
##DATA TABLE= (X++(I..I)), XYDATA
16383f18340J1191J1704L714Q337K1419J0382J3961L059L725M754J0522J4618
16371e00954K469J6884J0733J319J3149K3926J4026N590J1923O165J4758R002
16359c71010J2768Q148M452J853P091J6701P560L966J1619M400K276J5460K5365
16346b49351J3077Q654J1389M003J6992P283N738M836J3105J9255Q181r445J3057
16333a33226J9825M653K0298P548l310J0196n34J3823J6926j1003J6220O987N915
16320b5682J4227K1841J2105J4743R473m066Q555N355J3523L294M455N950J6972
16307A00745Q515M992J2090K912j0401J2224J9245R067O82J4891J2018N141J1026
16294B03147K0577J5175n084O498J1513K0271j143k097R917O496J051J280J2034
$$ plain form
16383 -618340 -607149 -595445 -591731 -583394 -561975 -551593 -537632 -534573 -530848 -526094 -515572 -500954
16371 -500954 -498485 -481601 -470868 -469549 -456400 -432474 -418448 -412858 -400935 -394770 -380012 -371010
16359 -371010 -358242 -350094 -345642 -343789 -336698 -319997 -312437 -308471 -296852 -292452 -290176 -274716 -249351
16346 -249351 -236274 -227620 -216231 -212228 -195236 -187953 -182215 -177379 -164274 -145019 -136838 -146283 -133226
16333 -133226 -113401 -108748 -88450 -80902 -84212 -74016 -74550 -60727 -43801 -54804 -38584 -31597 -25682
16320 -25682 -11455 10386 22491 37234 46707 42641 51196 56551 70074 73368 77823 83773 100745
16307 100745 109260 114252 126342 129254 118853 131077 150322 159389 160071 174962 186980 192121 203147
16294 203147 223724 238899 233815 240313 251826 272097 270954 268857 278774 285270 286321 287601 299635
16281B99635J2783J8639M56r167J9459J5229k240R165K0775K4303Q16k973J624
16268D08504q366N948R667J0760L673J6351o337l153L331K491J3378Q835k972
16255D62110J6461J2195O011R134O457O739q167R430K322Q619K597j404J1538
16242E44042K413k926M06J2500Q599O341K1344m652M206J4565J7557J3462J1279
16229F49136j6607j1201J3985l02m675J2552Q877J262p664J1196K3613R036J4550
16216G03758p506j5260J444O799J9061J8829k529P655r204M438l43O052O534Q17
16202G40545R5J4825k214j598j497K280L0518p008M564Q216K269q924M914M304
16188G91289K17L69O573R690l076J6406k6007K3J5416Q255O115K606R827Q865
$$ plain form
16281 299635 312418 331057 331513 322346 341805 357034 354794 363959 384734 409037 409853 406880 408504
16268 408504 400138 406086 415753 426513 430186 446537 440200 437047 440378 442869 456247 465082 462110
16255 462110 478571 490766 496777 505911 512368 519107 510940 520370 522692 531311 533908 532504 544042
16242 544042 546455 543529 543935 556435 565034 571375 592719 588067 592273 606838 624395 637857 649136
16229 649136 632529 621328 635313 635011 630336 642888 651765 653027 645363 656559 680172 689208 703758
16216 703758 696252 680992 682436 689235 708296 727125 724596 732251 723047 727485 727142 733194 739728 740545
16202 740545 740640 755465 753251 751653 750156 752436 782954 775946 780510 788726 790995 782071 786985 791289
16188 791289 791506 791875 798448 808138 805062 821468 795461 795484 810900 819155 825270 827876 837703 846568
16174H46568O767j8790p33J5013j1336P175K3231j0841K30n263m921K139Q994
16161H58233J8284o107m379r2P231J345J0735n823M990K0743k935m979p898J0854
16147I00202J2423p295j8947L369O577O016p531L549J4770J570J593j446l643
16134I11207J4588p848k477J2572N961k218n206J3546M806j0302R011K743k3767
16121I22616P353J1582j5899O838p024J2736k972L622K0182o279m549L334M478
16108I56018j1695j1741M975K6710j4379j7181P632M484M029R713l625L875r034
16095I49781p062J8147R548p319k5315J4232J888P802R557j1700O79M622P651
16082I72511p286Q018M209n70n662o775r547r891P46J9111L007O09j2832N243
$$ plain form
16174 846568 853335 834545 833812 848825 837489 844664 867895 857054 857284 852021 847100 849239 858233
16161 858233 876517 870410 866031 865939 873170 874515 885250 879427 884417 905160 902225 897246 889348 900202
16147 900202 912625 905330 886383 889752 896329 902345 894814 898363 913133 914703 916296 914850 911207
16134 911207 925795 917947 915470 928042 934003 931785 926579 940125 944931 934629 943640 946383 922616
16121 922616 929969 941551 925652 932490 925466 938202 935230 938852 959034 952755 948206 951540 956018
16108 956018 944323 932582 937557 964267 949888 932707 940339 944823 948852 958565 954940 958815 949781
16095 949781 942719 960866 970414 963095 937780 952012 953900 961702 971259 959559 960238 964860 972511
16082 972511 965225 973243 977452 976882 971220 964445 954898 945007 945753 964864 967871 968480 955648 960891
16068I60891Q151O975J7P486M563q575J927l005r435R426J0534M568l882O485
16054I96126j6504K541J0043l029P11m598p607l99J2828j0025m762l180K5095
16041I97240k777j1640p959j880J850j309J8059r75j0654J17Q725j2622P28J4114
16027I91017n324o506P616m533j4559J7923L497n1r783k410K0548M775k0132J4708
16013I96786j6053j5079Q300J4061l861n799L661P967N977j2204n965m014J1836
16000I85613J4055j0966q690o342J3044j4496L915O458R957n180l060n242K421
15987I81487N421j3022l653K335L1078m908j5456O151M81r506J3724K411k97j505
15973I94741j3357M578j0208L728L24k049J6354o558J5270O239l053l826j1807
$$ plain form
16068 960891 969042 976017 976034 983520 988083 979508 981435 978430 968995 978421 988955 993523 989641 996126
16054 996126 979622 982163 992206 989177 989888 985290 977683 977284 990112 980087 975325 972145 997240
16041 997240 994463 982823 974864 972984 974834 973525 991584 990609 979955 980072 988797 976175 976903 991017
16027 991017 985693 979187 986803 982270 967711 985634 989131 989080 979297 976887 997435 1002210 982078 996786
16013 996786 980733 965654 973954 988015 984154 978355 982016 989983 995960 983756 977791 973777 985613
16000 985613 999668 988702 980012 973670 986714 972218 976133 982591 992548 987368 984308 979066 981487
15987 981487 986908 973886 970233 972568 1003646 998738 983282 989433 989914 980408 994132 996543 996246 994741
15973 994741 981384 985962 975754 979482 979806 977757 994111 987553 1002823 1009062 1006009 1002183 990376
15960I90376R796J0646q900m548j0327K413j946N92Q971j551j0054P576q887J6762
15946A000919j427L339J0471m183k3574o51p446J5875R486o870j2297J3007J735
15933I98384l029p029l977J5330j7953J0208m187J0805J3019k7710L10J7246r130
15920I92287J0568L233j126j5579O347K57m078L590j8986J5543L235J3695J3470
15907A022456j0754j2181R929j6705J3767L242l654O501j6851K793L072O564j2823
15894I95356O441p805Q937j1069P442N086n235m372J7978k3015m076J2672j69
15881I98171J1926P334j8279J2585R534l468j0799J3158N080Q223o469l560l761
$$ plain form
15960 990376 1000172 1010818 1001918 997370 987043 989456 987510 988102 997073 995522 985468 993044 984157 1000919
15946 1000919 999492 1002831 1013302 1009119 985545 984894 977448 993323 1002809 995939 983642 996649 998384
15933 998384 995355 988326 984349 999679 981726 991934 987747 998552 1011571 983861 984171 1001417 992287
15920 992287 1002855 1006088 1004962 989383 995730 995987 991909 995499 976513 992056 995291 1008986 1022456
15907 1022456 1011702 999521 1009450 992745 1006512 1009754 1006100 1012601 995750 998543 1001615 1008179 995356
15894 995356 1001797 993992 1002929 991860 999302 1004388 999153 994781 1012759 989744 985668 998340 998171
15881 998171 1010097 1017431 999152 1011737 1021271 1017803 1007004 1020162 1025242 1033465 1026996 1023436 1019675
$$ [...]
##END NTUPLES=NMR SPECTRUM
##END=
