##TITLE=1H_EC-3296(VI-2)
 CDCl3
 8 sc, 
 15.6.2023
##JCAMPDX= 6.0         $$ Bruker NMR JCAMP-DX V2.0
##DATA TYPE= NMR SPECTRUM
##DATA CLASS= NTUPLES
##ORIGIN= UXNMR, Bruker Analytische Messtechnik GmbH
##OWNER= root
$$ XWIN-NMR		Version 3.5
$$ Thu Jun 15 11:21:30 2023 Russian Standard Time (UT+4h)  she@DPX200
##.OBSERVE FREQUENCY= 200.13135
##.OBSERVE NUCLEUS= ^1H
##.ACQUISITION MODE= SIMULTANEOUS
##.ACQUISITION SCHEME= undefined
##.AVERAGES= 8
##.DIGITISER RES= 18
##SPECTROMETER/DATA SYSTEM= spect
##.PULSE SEQUENCE= zg30
##.SOLVENT NAME= Acetone
##.SHIFT REFERENCE= (INTERNAL, Acetone, 0, 15.7766)
##AUDIT TRAIL= $$ (NUMBER, WHEN, WHO, WHERE, WHAT)
$$ ##TITLE= Audit trail, XWIN-NMR		Version 3.5
$$ ##JCAMPDX= 5.01
$$ ##ORIGIN= Bruker BioSpin GmbH
$$ ##OWNER= she
$$ F:/spectra/data/she/nmr/H-F/1/pdata/1/auditp.txt
$$ ##AUDIT TRAIL=  $$ (NUMBER, WHEN, WHO, WHERE, WHAT)
(   1,<2023-06-15 11:20:02.31 +0400>,<she>,<DPX200>,
      <created by zg, POWCHK disabled, PULCHK disabled
       configuration hash MD5:
       00 E9 B6 7A A2 85 ED C7 34 08 36 98 17 FE 4E 26
       data hash MD5: 16K
       2B FD 06 59 5C 82 0A 72 53 98 16 B5 D5 8D AE E3>)
(   2,<2023-06-15 11:20:04.81 +0400>,<she>,<DPX200>,
      <Start of raw data processing
       efp BC_mod = 2 LB = 0.24 FT_mod = 6 PKNL = 1 PHC0 = -20783.28 PHC1 = 11.05272 SI = 16K 
       data hash MD5: 16K
       6B EA AE C7 00 BB 1D 8C 56 32 51 B9 FB 53 E6 69>)
(   3,<2023-06-15 11:20:23.48 +0400>,<she>,<DPX200>,
      <pk PHC0 = -0.3447457 PHC1 = 0.4 
       data hash MD5: 16K
       DA 43 3E 82 EB C6 50 FE 2E 81 19 05 19 ED DF 87>)
(   4,<2023-06-15 11:20:27.76 +0400>,<she>,<DPX200>,
      <abs ABSG = 5 
       data hash MD5: 16K
       27 7A 35 A4 B3 CE 05 FA 2B C7 56 A9 98 11 D8 A0>)
$$ ##END=
$$ 
$$ hash MD5
$$ 76 82 13 89 9F E2 3D F7 BE 89 06 3F 54 07 5B 4C
##$RELAX= 
##$RELAX= 
##$RELAX= 
##$RELAX= 
##$RELAX= 
##$RELAX= 
$$ Bruker specific parameters
$$ --------------------------
##$DU= <F:/spectra>
##$EXPNO= 1
##$NAME= <H-F>
##$PROCNO= 1
##$TYPE= <nmr>
##$USER= <she>
##$AMP= (0..31)
100 100 100 100 100 100 100 100 100 100 100 100 100 100 100 100 100 100 
100 100 100 100 100 100 100 100 100 100 100 100 100 100 
##$AQSEQ= 0
##$AQ_mod= 1
##$AUNM= <au_zg>
##$AUTOPOS= <>
##$BF1= 200.13
##$BF2= 200.13
##$BF3= 200.13
##$BF4= 200.13
##$BF5= 200.13
##$BF6= 200.13
##$BF7= 200.13
##$BF8= 200.13
##$BYTORDA= 1
##$CFDGTYP= 0
##$CFRGTYP= 5
##$CHEMSTR= <none>
##$CNST= (0..31)
1 1 145 1 1 1 1 1 1 1 1 1 1 1 1 1 1 1 1 1 1 1 1 1 1 1 1 1 1 1 1 1 
##$CPDPRG= <>
##$CPDPRG1= <>
##$CPDPRG2= <>
##$CPDPRG3= <>
##$CPDPRG4= <mlev>
##$CPDPRG5= <mlev>
##$CPDPRG6= <mlev>
##$CPDPRG7= <mlev>
##$CPDPRG8= <mlev>
##$CPDPRGB= <>
##$CPDPRGT= <>
##$D= (0..31)
0 1.2 0 0 0 0 0 0 0 0.06 0 0.03 0 0 0 0 0.0002 0 0 0 0 0 0 0 0 0 0 0 0 
0 0 0 
##$DATE= 1686813601
##$DBL= (0..7)
120 120 120 120 120 120 120 120 
##$DBP= (0..7)
150 150 150 150 150 150 150 150 
##$DBP07= 0
##$DBPNAM0= <>
##$DBPNAM1= <>
##$DBPNAM2= <>
##$DBPNAM3= <>
##$DBPNAM4= <>
$$ [...]
##$SUBNAM3= <"">
##$SUBNAM4= <"">
##$SUBNAM5= <"">
##$SUBNAM6= <"">
##$SUBNAM7= <"">
##$SUBNAM8= <"">
##$SUBNAM9= <"">
##$SW= 18.05172834244
##$SWIBOX= (0..15)
0 0 2 0 0 0 0 0 0 0 0 0 0 0 0 0 
##$SW_h= 3612.71676300578
##$TD= 16384
##$TD0= 1
##$TE= 0
##$TE2= 300
##$TE3= 300
##$TEG= 300
##$TL= (0..7)
0 120 120 120 120 120 120 120 
##$TP= (0..7)
150 150 150 150 150 150 150 150 
##$TP07= 0
##$TPNAME0= <>
##$TPNAME1= <>
##$TPNAME2= <>
##$TPNAME3= <>
##$TPNAME4= <>
##$TPNAME5= <>
##$TPNAME6= <>
##$TPNAME7= <>
##$TPOAL= (0..7)
0.5 0.5 0.5 0.5 0.5 0.5 0.5 0.5 
##$TPOFFS= (0..7)
0 0 0 0 0 0 0 0 
##$TUNHIN= 0
##$TUNHOUT= 0
##$TUNXOUT= 0
##$USERA1= <user>
##$USERA2= <user>
##$USERA3= <user>
##$USERA4= <user>
##$USERA5= <user>
##$V9= 5
##$VALIST= <valist>
##$VCLIST= <CCCCCCCCCCCCCCC>
##$VD= 0
##$VDLIST= <DDDDDDDDDDDDDDD>
##$VPLIST= <PPPPPPPPPPPPPPP>
##$VTLIST= <TTTTTTTTTTTTTTT>
##$WBST= 1024
##$WBSW= 4
##$XGAIN= (0..3)
0 0 0 0 
##$XL= 0
##$YL= 0
##$YMAX_a= 207427
##$YMIN_a= -247574
##$ZGOPTNS= <>
##$ZL1= 120
##$ZL2= 120
##$ZL3= 120
##$ZL4= 120
##$ABSF1= 15.76893
##$ABSF2= -2.282919
##$ABSG= 5
##$ABSL= 3
##$ALPHA= 0
##$AQORDER= 0
##$ASSFAC= 0
##$ASSFACI= 0
##$ASSFACX= 0
##$ASSWID= 0
##$AUNMP= <proc_1d>
##$AZFE= 0.1
##$AZFW= 0.1
##$BCFW= 0
##$BC_mod= 2
##$BYTORDP= 0
##$COROFFS= 0
##$CY= -3
##$DATMOD= 1
##$DC= 0
##$DFILT= <>
##$DTYPP= 0
##$F1P= 0
##$F2P= 0
##$FCOR= 1
##$FTSIZE= 16384
##$FT_mod= 6
##$GAMMA= 0
##$GB= 0
##$INTBC= 1
##$INTSCL= 3.70164e-10
##$ISEN= 128
##$LB= 0.24
##$LEV0= 0
##$LPBIN= 0
##$MAXI= 10000
##$MC2= 0
##$MEAN= 0
##$ME_mod= 0
##$MI= 1.114404
##$NCOEF= 0
##$NC_proc= -5
##$NLEV= 6
##$NOISF1= 3.799351
##$NOISF2= 2.8
##$NSP= 0
##$NTH_PI= 0
##$NZP= 0
##$OFFSET= 15.77664
##$PC= 1
##$PHC0= -20783.62
##$PHC1= 11.45272
##$PH_mod= 1
##$PKNL= yes
##$PPARMOD= 0
##$PSCAL= 0
##$PSIGN= 0
##$REVERSE= no
##$SF= 200.129998980108
##$SI= 16384
##$SIGF1= 3
##$SIGF2= 2
##$SINO= 5.538805
##$SIOLD= 16384
##$SREGLST= <1H.CDCl3>
##$SSB= 0
##$STSI= 16384
##$STSR= 0
##$SW_p= 3612.71676300578
##$SYMM= 0
##$S_DEV= 0
##$TDeff= 16384
##$TDoff= 0
##$TI= <>
##$TILT= no
##$TM1= 0
##$TM2= 0
##$TOPLEV= 0
##$USERP1= <user>
##$USERP2= <user>
##$USERP3= <user>
##$USERP4= <user>
##$USERP5= <user>
##$WDW= 1
##$XDIM= 16384
##$YMAX_p= 314603344
##$YMIN_p= -61100
$$ End of Bruker specific parameters
$$ ---------------------------------
##NTUPLES= NMR SPECTRUM
##VAR_NAME=  FREQUENCY,     SPECTRUM/REAL,   SPECTRUM/IMAG
##SYMBOL=    X,             R,               I
##VAR_TYPE=  INDEPENDENT,   DEPENDENT,       DEPENDENT
##VAR_FORM=  AFFN,          ASDF,            ASDF
##VAR_DIM=   16384,         16384,           16384
##UNITS=     HZ,            ARBITRARY UNITS, ARBITRARY UNITS
##FACTOR=    0.220516191357247, 1,           1
##FIRST=     3157.37893477242, 0,            0
##LAST=      -455.337828233364, 0,           0
##MIN=       -455.337828233364, -61100,      0
##MAX=       3157.37893477242, 314603344,    0
$$ Real data points
##PAGE= N=1
##DATA TABLE= (X++(R..R)), XYDATA
$$ [...]
6793D3698l975j4239J0211P943j9518M817Q825K433J525j7282P704k126N665k444
6779C3237j5929L290O746j5658J2648k80l904Q39L160l741j2027K865J1319L243
6765B5808j3902P756k396k181r874o152J1662R667R405J0817j0981j2259Q780
6752B6150l594n80k401k559J8824n239P901n868l066J3516L478K686J904L1923
6738H3075j491k543o497r733J6821m257j5521R319r999j7164K7436p905l3515
6725B8026p39O001j0562j548J9420m370j3116k1962M639Q478o825j1737q060K3479
6711A1124l788l575J75J0464L055m199R406r074j4965Q000M402m079m620L123
6697E449J8936O165M411j1022N330J2783J2226p401p058j4325o235j921M093N914
$$ plain form
6793 43698 39723 25484 35695 43638 24120 28937 37762 40195 41720 24438 32142 30016 35681 33237
6779 33237 17308 20598 27344 11686 24334 24054 20150 20989 24149 20408 8381 11246 22565 25808
6765 25808 11906 19662 17266 15085 5211 -941 10721 20388 29793 40610 29629 17370 26150
6752 26150 22556 21976 19575 17016 35840 30601 38502 32634 29568 43084 46562 49248 51152 83075
6738 83075 81584 79041 72544 62811 79632 75375 59854 69173 59174 42010 69446 61541 28026
6725 28026 27287 33288 22726 21178 40598 36228 23112 1150 5789 14267 7442 -4295 -12355 11124
6711 11124 7336 3761 3936 14400 17455 13256 22662 13588 -1377 6623 11025 6946 2326 5449
6697 5449 24385 30550 34961 23939 29269 42052 54278 46877 39819 25494 19259 17338 21431 27345
6683B7345m756l83K838j1851k0613J7334l221J1126k881j0405n733j7458K184
6670a6474l622m078J8712J7139j4137k0585J4166K696j0106q196J0659l778k011
6657a9615L962o9K8693m904q602L731K498M0j8214o989K410p520j6487J5106J1840
6642a4120j1070j594j1331N541J4917j5326j0149J0763M367O027m856R24J4033
6629a1874J58o659L389k114p954q62J1777K746r892Q793k717j7921r694k608J1691
6614c3741K191N690J0013j8970q110J1257m089j7604O908K5266P217n437J941
6601a7468N292j6319o699R951m088n255k879k109K3397j174o639k725k618J3852
6587a5481j4337k5067J0766J6363j9716K758J8237L317l965j774p410O551J1924
$$ plain form
6683 27345 22589 22206 25044 13193 -7420 9914 6693 17819 14938 4533 -1200 -18658 -16474
6670 -16474 -20096 -24174 -5462 11677 -2460 -23045 -8879 -6183 -16289 -24485 -13826 -17604 -19615
6657 -19615 -15653 -15722 12971 8067 -535 3196 5694 5734 -12480 -19469 -17059 -24579 -41066 -25960 -14120
6642 -14120 -25190 -26784 -38115 -32574 -17657 -32983 -43132 -32369 -28002 -21975 -26831 -25907 -11874
6629 -11874 -11716 -18375 -14986 -17100 -25054 -25916 -14139 -11393 -21285 -12492 -15209 -33130 -42824 -45432 -33741
6614 -33741 -31550 -25860 -15847 -34817 -42927 -31670 -35759 -53363 -46455 -21189 -13972 -19409 -17468
6601 -17468 -12176 -28495 -35194 -25243 -29331 -34586 -37465 -39574 -16177 -17351 -23990 -26715 -29333 -15481
6587 -15481 -29818 -54885 -44119 -27756 -47472 -44714 -26477 -23160 -27125 -28899 -36309 -29758 -17834
6574a7834J2243J295l461k5956r145m86k286P908n57M551k672j1232N458J971
6560d0203J8801J0635j3832n141j243j3158J2409O107N647j5865o706O972j270
6547c6847j951Q954j5726j0252J0043p712K5705l005m434J7249k775j9126j518
6534d1395j9705K0454K1168q705M037J794j5575P732r452J3842M087m306j9173
6521d5197P230O171M836j7305N680p778q890j544J3031J8699k07j357q70J736
6507b5765r902J1318M459o904n269k679J6432m205J299k118N13J405j2918J1663
6493b2671J1281q937l363J5980j3318j2029J0252J4897k1407l15j4055K000J6731
6480b4954L376J55J0291j5369K82N197q654K239n510j07K0663n228j1593l684
$$ plain form
6574 -17834 -5591 -4296 -7757 -33713 -42858 -43344 -45630 -37722 -38279 -33728 -36400 -47632 -42174 -40203
6560 -40203 -21402 -10767 -24599 -29740 -30983 -44141 -31732 -25625 -19978 -35843 -42549 -35577 -36847
6547 -36847 -38798 -29844 -45570 -55822 -45779 -53491 -27786 -30791 -35225 -17976 -20751 -39877 -41395
6534 -41395 -61100 -40646 -19478 -28183 -24146 -22352 -37927 -30195 -39647 -25805 -21718 -26024 -45197
6521 -45197 -37967 -31796 -26960 -44265 -38585 -46363 -55253 -56797 -43766 -25067 -25274 -26631 -27501 -25765
6507 -25765 -35667 -24349 -19890 -26794 -32063 -34742 -18310 -22515 -21216 -23334 -22821 -21416 -34334 -22671
6493 -22671 -11390 -20327 -23690 -7710 -21028 -33057 -22805 -7908 -29315 -29630 -43685 -41685 -24954
6480 -24954 -21578 -21423 -11132 -26501 -26219 -21022 -29676 -27437 -32947 -33054 -12391 -17619 -29212 -32896
6466c2896J1923J0401O789o748p367j7393O68R580j0715N762o46K3295j7240j5251
6452c9838J2551j5212J1319r504j99O634L185j595p778J168k261m770Q2j0404
6438e6622L331j902P056J2759j1108L31J699O818J2564l203p365j3710K2510l409
6424c0251j076M098l928J1932m134J2333j3745j6553J1361M971J0424k780o648
6411b3996o923k170J9159q089r863J4024M371j5964R349m644p217l076R253J561
6397b4225j3687j4357J1540J9018J787n723j851q9J096m093l369J2648k956j563
6383b5824j2115M254r548r570l83J5658J1904r773O329K077L428M210J263j9446
6369c7536O733j839J0699Q481j5729r239k0159J1422L970Q199J3879n944O440
$$ plain form
6466 -32896 -20973 -10572 -3783 -10531 -17898 -35291 -34623 -25043 -35758 -29996 -30642 -7347 -24587 -39838
6452 -39838 -27287 -42499 -31180 -40684 -40883 -34249 -31064 -32659 -40437 -39269 -41530 -46300 -46218 -56622
6438 -56622 -53291 -55193 -48137 -35378 -46486 -46155 -44456 -37638 -25074 -28277 -35642 -49352 -26842 -30251
6424 -30251 -31327 -27229 -31157 -19225 -23359 -11026 -24771 -41324 -29963 -24992 -14568 -17348 -23996
6411 -23996 -30919 -33089 -13930 -22019 -31882 -17858 -13487 -29451 -20102 -24746 -31963 -35039 -25786 -24225
6397 -24225 -37912 -52269 -40729 -21711 -19924 -25647 -27498 -27587 -26491 -30584 -33953 -21305 -24261 -25824
6383 -25824 -37939 -33685 -43233 -52803 -53186 -37528 -25624 -35397 -29068 -26991 -23563 -19353 -18090 -37536
6369 -37536 -30803 -32642 -21943 -13462 -29191 -38430 -58589 -47167 -43197 -34998 -21119 -27063 -20623
6356b0623Q576K731j2970q007k343K0443q819p907P364O873l5044M798L2989p0
6342a2009j2369m549o609N71J5244J68k711L226p319j4674o382L228R491l220
6328c7914J0229Q851l1j6068q928K5257M029n21o066j1798j084R475K3952j7276
6314a7893j0175l82K2360q695q340K2395p669k1976m41J1516N1M673n631j6852
6300c7059O402J2657M868J9390J1618P555j117N391n594l673j2783j1923j7971
6287b2239q17K642l700p055k716K3718r91j3862J0589j4132M922l015j89J6532
6273a0313J1857P466o775j6823j377o102j515p954K239P576K695J3900j6261n976
6259b7363j3306k781P927L092j3059K2092J737k691L297r925M853l031j2877J1665
$$ plain form
6356 -20623 -12047 -9316 -22286 -30293 -32636 -12193 -21012 -28919 -21555 -14682 -49726 -44928 -11939 -12009
6342 -12009 -24378 -28927 -35536 -34965 -19721 -19553 -22264 -19038 -26357 -41031 -47413 -44185 -34694 -37914
6328 -37914 -27685 -18834 -18865 -34933 -43861 -18604 -14575 -15096 -21162 -32960 -34044 -24569 -617 -17893
6314 -17893 -28068 -28450 -6090 -14785 -23125 -730 -8399 -30375 -30816 -19300 -19249 -14576 -20207 -37059
6300 -37059 -30657 -18000 -13132 6258 17876 25431 24314 29705 24111 20438 7655 -4268 -22239
6287 -22239 -23056 -20414 -24114 -31169 -33885 -10167 -11158 -25020 -14431 -28563 -23641 -26656 -26845 -10313
6273 -10313 1544 9010 2235 -14588 -15965 -22067 -23582 -31536 -29297 -21721 -19026 -5126 -21387 -27363
6259 -27363 -40669 -43450 -35523 -32431 -45490 -23398 -21661 -24352 -21055 -30980 -26127 -29158 -42035 -30370
6245c0370M999J2816J281j4520j3686K6830m569o623j8227L454r43J3540P95o678
6231c1901q587O199l018J3321J5279k461n345r043j1064O934M83n220J170k39
6217c3492K0760R009j4109j9718J0403L902J3431O042k502j7385j6051R318N051
6204b5341r522J504l421q682J742k290J0886K1739j0826K462j0081M91J2171K280
6190a6888N63j3472k2708L224K519J2143m072k344K806J1975O817l170m364P536
6176a9435k711j4726j437J4115q874o45k425J1940o403o599Q460k044N387L339
6162b2058j8710O746N536R3M864l163k0460K449P041j5563K8559J8624j6255Q809
6148a3488q395n234m713k1339J2472J2187N44j4660R474Q275M076M100j0201M262
$$ plain form
6245 -30370 -25371 -12555 -11274 -25794 -39480 -12650 -17219 -23842 -42069 -38615 -39558 -26018 -25223 -31901
6231 -31901 -40488 -34289 -37307 -23986 -8707 -11168 -16513 -25556 -36620 -29686 -29203 -34423 -33253 -33492
6217 -33492 -12732 -3723 -17832 -37550 -27147 -23245 -9814 -3772 -6274 -23659 -39710 -30392 -25341
6204 -25341 -34863 -33359 -36780 -45462 -43720 -46010 -35124 -13385 -24211 -21749 -31830 -31339 -19168 -16888
6190 -16888 -16325 -29797 -52505 -49281 -46762 -34619 -38691 -41035 -38229 -26254 -19437 -22607 -26971 -19435
6176 -19435 -22146 -36872 -38309 -24194 -33068 -33713 -36138 -24198 -30601 -37200 -28740 -30784 -25397 -22058
6162 -22058 -40768 -34022 -28486 -28393 -23529 -26692 -47152 -44703 -37662 -53225 -24666 -6042 -22297 -13488
6148 -13488 -21883 -27117 -31830 -53169 -40697 -28510 -27966 -42626 -33152 -24877 -20801 -16701 -26902 -22640
6134b2640Q081j8790q662J243N088R90k280Q993J757J5226k754q594p084j0394
6120c9820l049P731J7810M22J1931j0147j4134J3812K353p427M257O280l496R00
6106a2577j7416K402m01q313r569n706K4193K3294j7030k3331K175L927J7475
6093b0877j3840Q904j6577Q895J1594N279J4465o44M17j4089j0930p749Q37K326
6079c1989r901J0101q067O304J3983k857R653l965j6040L044N01o055q600P395
6065c6493q333N690J930r024MJ6662J0147N600j0173j0606Q385L792n472j0073
6051c7964J0762Q256j3685r246R318j0208l581L746P938P436r188m750R800q177
6037c9543J2934k0083J6609J2489j7565q746J3895K070L814J6882k329J150o820
$$ plain form
6134 -22640 -14559 -33349 -42011 -40768 -35680 -34690 -36970 -27977 -26220 -10994 -13748 -22342 -29426 -39820
6120 -39820 -42869 -35138 -17328 -16906 -4975 -15122 -29256 -15444 -13091 -20518 -16261 -9981 -13477 -12577
6106 -12577 -29993 -27591 -27992 -36305 -45874 -51580 -27387 -4093 -21123 -44454 -42279 -38352 -20877
6093 -20877 -34717 -25813 -42390 -33495 -21901 -16622 -2157 -2801 -2384 -16473 -27403 -35152 -34315 -31989
6079 -31989 -41890 -31789 -39856 -33552 -19569 -22426 -12773 -16738 -32778 -29734 -29233 -35288 -43888 -36493
6065 -36493 -44826 -39136 -37206 -46230 -46226 -29564 -19417 -13817 -23990 -34596 -26211 -22419 -27891 -37964
6051 -37964 -27202 -18946 -32631 -41877 -32559 -42767 -46348 -42602 -34664 -27228 -36416 -41166 -31366 -39543
6037 -39543 -26609 -46692 -30083 -17594 -35159 -43905 -30010 -27940 -24126 -7244 -9573 -8423 -15243
6024a5243r886K948p912J9317J3002m452k3180o534O482M833J1168R697k400k347
6010d507j8830p216L783M002Q996j0481N683m609K310L86L52l473Q608K93j169
5995a5872J0184J5693q565J2193j9135j5920j162J4073r00j6899j690l120J4490
5982a6630n954R642J3422Q372j3615j5850l896J4633J119j6232m792k662R343
5969b3100j3368K0007j3R372q606j3528J5521N039P238n031L060K80Q211l6420
5955c1338L918L4214r466j328M970j4197j1479K2114k554k3717j62Q45j1J7892
5941a0299k3144j016J004k381N841J0758n332j725o205j1579P031q23J0148L483
5927b4239K332p146n341K791N566J595R466q015J1018j2074N489Q974n966O99
$$ plain form
6024 -15243 -25129 -22181 -30093 -10776 2226 -2226 -25406 -31940 -25458 -20625 -9457 240 -2160 -4507
6010 -4507 -23337 -30553 -26770 -22768 -13772 -24253 -18570 -23179 -20869 -20483 -20131 -23604 -14996 -14703 -15872
5995 -15872 -5688 10005 1440 13633 -5502 -21422 -22584 -8511 -9411 -26310 -28000 -31120 -16630
5982 -16630 -22584 -12942 480 8852 -4763 -20613 -24509 -9876 -8757 -24989 -29781 -32443 -23100
5969 -23100 -36468 -16461 -16474 -7102 -15708 -29236 -13715 -8676 -1438 -6469 -3409 -3129 5082 -31338
5955 -31338 -27420 6794 -2672 -4000 970 -13227 -24706 -2592 -5146 -28863 -29025 -28180 -28191 -10299
5941 -10299 -33443 -34459 -33455 -35836 -29995 -19237 -24569 -26294 -32499 -44078 -37047 -37870 -27722 -24239
5927 -24239 -21907 -29053 -34394 -31603 -26037 -24442 -14976 -22991 -11973 -24047 -18558 -9584 -15550 -14851
5913a4851N072p746m654L040P654R169k4122P661J1007j0567n138N243O310O92
5899a1230k724p007Q181j5098Q844R590M036r917m704o487J4367L699r583k765
5885b0798K398j0440O957J1796q858N02l611N346J0486O173p203j0016J4487o109
5871h890j1738J8629M802p649J0780p164j6145l196J0350n655r340J2328r969
5858b2857R514q466m651j166L809L511J9449K881k092o403J224N84J5104j4763
5844d322q346O272J8376J2300R482r627k6921N494N427r711j2649K408P587j996
5830f226j9792N485J8137k3193K1797r630j6495K1065O72N437R54O190j5671r929
5816b1199j2885k750J4459M677j4594j0564J510K3466N04l866K516R11R955J076
$$ plain form
5913 -14851 -9779 -17525 -22179 -19139 -11485 -2316 -26438 -18777 -7770 -18337 -23475 -18232 -11922 -11230
5899 -11230 -13954 -20961 -12780 -27878 -19034 -9444 -5408 -15325 -20029 -26516 -12149 -8450 -18033 -20798
5885 -20798 -18400 -28840 -21883 -10087 -18945 -18443 -22054 -16708 -6222 -49 -7252 -17268 -2781 -8890
5871 -8890 -20628 -1999 2803 -4846 5934 -1230 -17375 -20571 -10221 -15876 -25216 -12888 -22857
5858 -22857 -13343 -21809 -26460 -27626 -23817 -20306 -857 2024 -68 -6471 -5247 -4663 10441 -4322
5844 -4322 -12668 -6396 11980 24280 33762 24135 -2786 2708 8135 -1576 -14225 -11817 -4230 -6226
5830 -6226 -26018 -20533 -2396 -25589 -3792 -13422 -29917 -8852 -8180 -2743 -1789 4401 -11270 -21199
5816 -21199 -34084 -36834 -22375 -17698 -32292 -42856 -41346 -17880 -17376 -21242 -18726 -17815 -7860 -6784
5802f784O001M851r882J0095L81n413Q829o320o116J753J3268M033j2158r945
5788g407j2892o107Q123J1067J5505j1641j9831P488J2710K4L232j2231n820M83
5774a7297Q694K9639j2841j0579j5193o671K265K4399m996K543P599r693j781
5761c912p268m201k678Q306j5681J5498J1165j0024l736j1813O260L081l102K306
5747a5799r293M294J1292N04j2106J1156J9001J3321j5005r719K408J2983j7646
5734d609n728J278q269Q726P793j2368j7717L138q382J6347J4036L885l576j2398
5720a7844j340O830j446j50p850j5314K8349M418L87O942j0538m807L37j176P820
5705e382J4135k2453k119O477n208J6709L39K178M702j4896J1036j4303l032N961
$$ plain form
5802 -6784 -783 4068 -5814 4281 4662 -751 8078 1758 -4358 -2605 10663 14696 2538 -7407
5788 -7407 -20299 -26406 -18283 -7216 8289 -3352 -23183 -15695 -2985 -2961 271 -11960 -17780 -17297
5774 -17297 -8603 21036 8195 -2384 -17577 -24248 -21983 2416 -2580 -37 7562 -2131 -3912
5761 -3912 -11180 -15381 -18059 -9753 -25434 -9936 1229 -8795 -12531 -24344 -18084 -15003 -18105 -15799
5747 -15799 -25092 -20798 -9506 -9002 -21108 -9952 9049 22370 7365 -2354 54 13037 -4609
5734 -4609 -10337 -9059 -17328 -8602 -809 -13177 -30894 -27756 -36138 -19791 -5755 -1870 -5446 -17844
5720 -17844 -19184 -12354 -13800 -13950 -21800 -37114 -8765 -4347 -3960 2982 -7556 -12363 -12026 -13202 -5382
5705 -5382 8753 -13700 -15819 -9342 -14550 2159 2498 4676 9378 -5518 5518 -8785 -11817 -5856
5691e856M69P206k877P022J2195j2139p024k533K1120j3298j2952Q619k37j3417
5677a3702J635J6005j4032M311N492j4670k280J7039o148l503J8919j1961l726
5664f621n800J5748L843j2351Q407O561P227j4263P207N578j2948M490Q378Q540
5650B3996q544j9318m918R766K817J866k0380P548M099m149O268J2456j158j4826
5636d477j126j0556K665M669J551j157L313J2871r48m129r103j282j5494R298
5622a3905K0059o867J3882o009p402M513J0953r063K7162r204m475o207n056Q962
5608A7343M070m047j928j2285J7007J0716Q176j0031r021n063J4052m872j8595
5595E522j558j243J3009j0896j9225J9968k615N292P113L548o405r813J934q921
$$ plain form
5691 -5856 -5387 1819 -1058 5964 18159 6020 -1004 -3537 17583 4285 -8667 -48 -285 -13702
5677 -13702 -12067 3938 -10094 -5783 -291 -14961 -17241 -202 -6350 -9853 9066 -2895 -6621
5664 -6621 -12421 3327 7170 -5181 3226 9787 17014 2751 9958 15536 2588 7078 15456 23996
5650 23996 15452 -3866 -8784 982 3799 5665 -14715 -7167 -3068 -7217 -949 11507 10349 -4477
5636 -4477 -5603 -16159 -13494 -8825 -7274 -8431 -5118 7753 6805 2676 -6427 -7709 -23203 -13905
5622 -13905 6154 -713 13169 7160 -242 4271 15224 6161 33323 24119 19644 13437 8381 17343
5608 17343 21413 17366 15438 3153 20160 30876 39052 29021 20000 14937 28989 24117 5522
5595 5522 3964 2721 15730 4834 -14391 5577 2962 8254 15367 18915 12510 2697 4631 -4290
5581d290J0427J810j7467J1782J3235n180l063J215L28J1763J3224q327j3833
5568A1624j5705J5838J2596m794j456M127p522J0610j991O006n60L937p684J038
5554B6064N328J731j9062M610M978o483R164M970N125J1407j4069O854j1687j1914
5540A7016O300J025P7O218j3897K920J6006j807L983l682j4538J6864j936j3835
5526B0714J6931K228j4232Q027M606k270j6438J0725Q509O339M882j3060m196
5513C2765N342j447J624q089l893l22k698M371n932J6600n717J2092M474j1599
5499C7571P052P950j1596M223R955r376J2016Q529j0019J253q476M209O899J0440
5485G0630m951n279k146J1140K365J963r470P856q960L477J5247K185q594M333
$$ plain form
5581 -4290 6137 7947 -9520 2262 15497 10317 7254 8469 8797 20560 33784 25457 11624
5568 11624 -4081 11757 24353 19559 18103 22230 14708 25318 23327 29333 28773 32710 25026 26064
5554 26064 31392 33123 14061 18671 23649 17166 26330 31300 36425 47832 33763 40617 28930 17016
5540 17016 23316 24341 24418 30636 16739 19659 35665 33858 37841 34159 19621 36485 34549 20714
5526 20714 37645 39873 25641 33668 38274 36004 19566 30291 38800 45139 50021 36961 32765
5513 32765 38107 36660 38284 30195 26302 25980 23282 27653 21721 38321 32604 44696 49170 37571
5499 37571 44623 52573 40977 45200 55155 45779 57795 66324 56305 57558 49082 53291 60190 70630
5485 70630 65679 60400 58254 69394 71759 73722 64252 72108 63148 66625 81872 84057 75463 79796
5471G9796L821j085J4513J3135r83j4852j4661R77L469J453O854J8671M741o079
5457A09770o455J0163J874L369J1077J4500N63J1161j2373J8928J4554J3517J2977
5444B03625j1719K1037N48K5772K5615J9524K9898N0264L4201P381J6747K9458
5432D52351l100n393q821q649m1234m4039n2192j2043k6412k4790j9716j4363
5420A91599p11N020P969n247k2394P651R494j4045j9482N340r26m775J630L720
5406A64843N196j4202M123k0971J909J8166J4293l986r035q46j6132q816J3075
5393A47617m361J8813j124k6411n626L0176L2386p64k298J4401n534j0905M55
5380A86825l890J1368O059l1252L266R417j4456K140J2201R598j156m873J1759
$$ plain form
5471 79796 83617 82532 97045 110180 109197 94345 79684 80661 84130 85583 92437 111108 115849 109770
5457 109770 103315 113478 115352 118721 129798 144298 144861 156022 143649 162577 177131 190648 203625
5444 203625 191906 212943 213491 239263 264878 284402 314300 364564 398765 406146 422893 452351
5432 452351 449251 443858 435037 426388 385154 341115 288923 276880 250468 225678 205962 191599
5420 191599 190888 195908 203877 198630 176236 183887 193381 179336 159854 165194 164268 159493 161123 164843
5406 164843 170039 155837 159960 138989 140898 159064 173357 169371 160336 159490 143358 134542 147617
5393 147617 143256 162069 160945 134534 128908 159084 191470 190706 188408 202809 197275 186370 186825
5380 186825 182935 194303 200362 169110 172376 181793 167337 169477 181678 191276 190120 185247 197006
5367A97006p556k0227K3663O562L364L268R854m699j24j8017K493J4996J4786
5354B25369K0587l49j1487r052k950K0084O146m65j5844Q018J7714j3889j0000
5341B33882k531O659N748J3752O250R710l746J8286j9392j0933K708K0711J912
5328B83016j2283K4008J5023j7211j1806K5816K4160J865J83K0995R377K378J0965
5315C76486p091j6443j3889Q470o406j9225r9j192L573o092M641J0460Q741M481
5301C46415J4785K2072O490J515K5785P759M448K252n461K7123J2598J3695K767
5288D82243K200L614Q217L430P646O91Q332N517j1689o492J0922J1345J7515J7953
5274E61444J5010j0870o732J9061O261J1042J0517J4100j2768J0356J7314J4802
$$ plain form
5367 197006 189450 169223 192886 199448 202812 206080 215934 211235 211111 193094 195587 210583 225369
5354 225369 245956 245607 234120 225068 222118 242202 248348 247883 232039 240057 257771 243882 233882
5341 233882 231351 238010 243758 257510 263760 273470 269724 288010 268618 257685 260393 281104 283016
5328 283016 270733 294741 309764 292553 280747 306563 330723 332588 332771 353766 363143 365521 376486
5315 376486 369395 352952 339063 347533 341127 321902 321803 320611 324184 318092 322733 333193 341934 346415
5301 346415 361200 383272 389762 391277 417062 424821 429269 431521 426060 453183 465781 479476 482243
5288 482243 484443 488057 496274 499704 507350 508041 516373 521890 510201 503709 514631 525976 543491 561444
5274 561444 576454 565584 558852 577913 584174 595216 605733 619833 607065 617421 634735 649537
5262F49537o931K401J5634L469J2352J9288L283K0923L3731K704K4380J2720K9361
5249H22852L0436l413L3014K9138J7513L1344K2006O278K3985K8675J9699K4302
5237A085829K5802L9559K5920K7901K9953J3821J7006K1738K7511K8762J4532
5226A358334M2473J2215M235M189k73K3150K7689K0044L1546K9540L5760N2031
5214A640933N4005M0551M3717L7134L6026N7380M3233P0096K4707M7687N5769
5203B151238N3215L7214K9934M4988O1178M9768L4115O0862O0626N5886Q2115
5192B721139Q1664P4508P0091Q0966J01470J00275Q8694P6974Q9332Q0260J00849
5181C666222J06337J28091R7977J10833J25076J30877J52920J61145J83710J68223
$$ plain form
5262 649537 642606 645007 660641 664110 676462 695750 699033 719956 753687 756391 780771 793491 822852
5249 822852 853288 849875 882889 912027 929540 960884 982890 989168 1013153 1041828 1061527 1085829
5237 1085829 1111631 1151190 1177110 1205011 1234964 1248785 1265791 1287529 1315040 1343802 1358334
5226 1358334 1400807 1413022 1417257 1421446 1421173 1444323 1472012 1492056 1523602 1553142 1588902 1640933
5214 1640933 1694938 1735489 1779206 1816340 1852366 1909746 1952979 2023075 2047782 2095469 2151238
5203 2151238 2204453 2241667 2271601 2316589 2377767 2427535 2461650 2522512 2583138 2639024 2721139
5192 2721139 2802803 2877311 2947402 3028368 3129838 3230113 3318807 3395781 3485113 3565373 3666222
5181 3666222 3772559 3900650 3998627 4109460 4234536 4365413 4518333 4679478 4863188 5031411
5171E031411J72776J99231J98121J75324J72147J99768J86201J86060K11055K15664
5161F947758K07894K19163K74020K86366L09151L31707L54450L97229M52922N20634
5151A0301294O17543O77651P99711R05330J056190J191870J355862J555151J769924
5142B0230526K030137K458797L027595L650463M378159N258964O071109O010089
5134E3115839N481965N447815L664023r4668j823518k650834n345806p462447
5126E0332369p326782o638383o040300n100307m008562l020797k283530j800792
5118A4112916j431103j185727r76418q49240p11389o39674n58761m66926m52359
5109F841319m26775l80165l53829l24106k79748k50502k39851k13165k19685j69317
$$ plain form
5171 5031411 5204187 5403418 5601539 5776863 5949010 6148778 6334979 6521039 6732094 6947758
5161 6947758 7155652 7374815 7648835 7935201 8244352 8576059 8930509 9327738 9780660 10301294
5151 10301294 10918837 11596488 12396199 13301529 14357719 15549589 16905451 18460602 20230526
5142 20230526 22260663 24719460 27747055 31397518 35775677 41034641 47105750 53115839
5134 53115839 58597804 64045619 67709642 67614974 65791456 63140622 57794816 50332369
5126 50332369 43005587 36367204 30326904 25226597 21218035 18197238 15913708 14112916
5118 14112916 12681813 11496086 10519668 9670428 8959039 8319365 7760604 7293678 6841319
5109 6841319 6414544 6034379 5680550 5356444 5076696 4826194 4586343 4373178 4153493 3984176
5099C984176j76669j58637j56524j60322j43489j36802r8747j13915j12749j26885
5089B599437q5445r0651o7382r2863r5426p8721p9642q1069r1361p7625n6157
5078A703095o9070o9684n1367m6703m8344m2807n2415l0017k5976m7680k7328
5067A191704j4834l596k6165k335m254l4698m9380l2594K039k5723k0138o893
5055I73133l0538k2315j1299j7746j3562q569l7158q332k8693n327r956l353k1362
5042G54923n973r855j7326k4834k5839k9419k8226j8675l2231k8768l6263l1796
5030D65718l0266j0778k3601o109M258j0636o803K512j0453K796j9295j102o389
5017C49852M548l006M800n07j7323J1585K0422r0j7012q763M608j4531j757L262
$$ plain form
5099 3984176 3807507 3648870 3492346 3332024 3188535 3051733 2952986 2839071 2726322 2599437
5089 2599437 2513992 2423341 2355959 2263096 2167670 2088949 2009307 1928238 1836877 1759252 1703095
5078 1703095 1634025 1564341 1512974 1466271 1417927 1375120 1322705 1292688 1266712 1219032 1191704
5067 1191704 1176870 1173274 1147109 1144774 1140520 1105822 1056442 1023848 1025887 1000164 980026 973133
5055 973133 942595 920280 908981 891235 877673 869104 831946 823614 794921 789594 779638 776285 754923
5042 754923 748950 739095 721769 696935 671096 641677 613451 594776 562545 533777 497514 465718
5030 465718 435452 424674 401073 394964 399222 388586 381783 384295 373842 376638 357343 356241 349852
5017 349852 354400 351394 356194 355687 338364 349949 370371 370281 353269 344506 349114 334583 332826 336088
5003C36088k0712l398j5400p197J0081j3858j4425q537M927K754r926j8373R939
4990B51963O739j0658j8820Q647O320j2322j4870j0090J2279Q691j0027j6225
4978B01627o405M924J269p546k43q85k850J0182k409Q466r519J3792m203q371
4964A97829J1399M558j60L390P068l681J3883l349k4113Q972o472j6264N210j1965
4950A86305n367q113j1975k5627K438j200L715j275j531p582j798J1030K1742
4937A60762R452q816k533J689R553J890L200j4427o501J0889j0805J6582j9237
4924A51698l493J194J020q71j1627o678m811K6626J2186O856j808r418n871j6144
4910A38859P291J2128j7498j6809j2664J7957J1400o718j0785L1687J807j6137
$$ plain form
5003 336088 315376 311978 296578 289381 299462 285604 271179 262642 267569 270323 260397 242024 251963
4990 251963 258702 248044 229224 237871 244191 231869 216999 206909 219188 227879 217852 201627
4978 201627 195222 200146 201415 193869 193626 192741 189891 200073 197664 206130 196611 210403 206200 197829
4964 197829 209228 213786 213626 217016 224084 220403 234286 230937 206824 215796 209324 193060 198270 186305
4950 186305 180938 172825 160850 135223 137661 136461 140176 138901 137370 129788 127990 139020 160762
4937 160762 170214 161398 158865 160554 170107 171997 175197 160770 154269 165158 154353 170935 151698
4924 151698 148205 149399 150419 149548 137921 131243 126432 153058 165244 172100 170292 160874 155003 138859
4910 138859 146150 158278 140780 123971 111307 129264 140664 133946 123161 154848 156655 140518
4898A40518Q910j5324j0160Q888R663R352L061N350K881r682M263J6335l896k5129
4884A45030m487O700k921l050O391P206l463n881M84L898m08p684J0850j570K016
4869A53111k205O691m644o284m478n837M523Q281O758o937m024J5936j2682J6965
4855A65174q547j4589K0612M544j8201j4088Q800K0199J1318P680r515p396K726
4842A68717J3959J6484L0399N873k9705J7619K3198K1211J5762K8917L8360M5562
4830C96356K7991N291K1601R990j4032k7168l4416k1477l4506k9510k4270k4491
4818B51359j5036l5955j6938o348j6363r484R354k1075l0165J5391Q446P18K863
4805A36767k23k3646j5122k268K3012L225J0815k406n764l2266J9571M683j43
$$ plain form
4898 140518 149428 134104 123944 132832 142495 151847 154908 160258 163139 153457 157720 174055 170159 145030
4884 145030 140543 147243 144322 141272 147663 154869 151406 145525 146009 149907 149499 141815 152665 151095 153111
4869 153111 150906 157597 152953 146669 142191 136354 140877 149158 155916 148979 144955 160891 148209 165174
4855 165174 156627 142038 162650 167194 148993 134905 143705 163904 175222 182902 173387 165991 168717
4842 168717 182676 199160 229559 235432 205727 223346 246544 267755 283517 312434 350794 396356
4830 396356 424347 429638 451239 461229 447197 420029 385613 364136 329630 300120 275850 251359
4818 251359 236323 200368 183430 177082 160719 151235 160589 139514 109349 124740 133186 133904 136767
4805 136767 136544 112898 97776 95508 118520 121745 132560 130154 124390 92124 111695 116378 116235
4792A16235j0341O640J6903j6447j5235R079K0404R10j9209J8515j075j959L281
4779A27701k0528J435k759K007j7757J3572O819n59j1349J3977j1716m440L4918
4766A31321k076l6336J4241k487L092J1261j4689j2519K1170K0201j2619N307
4754A25867N042j281M191k4515N592K461j1487O472N680J2289J168m074n821K0842
4740A42426j1780N507J128k1248k759O895j4711Q406J6818P036J0484j802M794
4727A51194j12K643L938m448o59l898M200j5925j5522m997P637j0502j0208j1290
4713I2051j336J0165K2062N996o794M810q663J0086m172m057J0282L2304j4002
4700A48732m138P920J1479j5537q493O07j24P163J3733L043q19j3497j43l817
$$ plain form
4792 116235 105894 112534 129437 112990 97755 106834 127238 128148 108939 127454 126379 124420 127701
4779 127701 107173 108608 105849 107856 90099 103671 110490 109931 98582 112559 100843 96403 131321
4766 131321 129245 92909 107150 104663 107755 119016 104327 91808 112978 133179 120560 125867
4754 125867 130909 129628 133819 109304 114896 117357 105870 112342 118022 130311 131479 127405 121584 142426
4740 142426 130646 136153 137281 116033 113274 120169 105458 113864 130682 137718 148202 146400 151194
4727 151194 151082 153725 157663 153215 152556 148658 152858 136933 121411 116414 124051 113549 103341 92051
4713 92051 90715 100880 122942 128938 122144 126954 118291 128377 124205 120148 130430 162734 148732
4700 148732 144594 152514 163993 148456 139963 140570 140446 147609 161342 164385 163566 150069 149926 146109
4686A46109j4012Q903L596J5544O368k0921j4508K0278J8935p780n949j5488m140
4673A36935J9891K925m968J4164j453o563J2107R765J8267l6969n100k488j565
4660A54948K614j0926J9575n69J961L88p583k3954P60m664J3942O090J762j0240
4646A44104J4602R285J871j6781o290j4372l354K0457Q104K837k2029l59P209
4633A45284R912J3439j6556j6634K0749J6198J1666k4585N12J0981N512j8375
4621A58103k773J0015J3878q856q453Q418q315J4357L377p209L307j4626N835
4608A67058O6K4725K475o324j5372m85J2313l311J439k1938l300L530L085j631
4594A62330P800m525n662o959L923J6652n694P842J952m54K000P378O367j4234
$$ plain form
4686 146109 132097 141000 144596 160140 166508 145587 131079 151357 170292 162512 156563 141075 136935
4673 136935 156826 159751 154783 168947 167494 160931 173038 182803 201070 164101 159001 156513 154948
4660 154948 157562 146636 166211 165642 167603 167991 160408 136454 137214 132550 146492 152582 154344 144104
4646 144104 158706 167991 169862 153081 146791 132419 129065 149522 157626 160463 138434 138075 145284
4633 145284 155196 168635 152079 135445 156194 172392 184058 159473 159985 170966 176478 158103
4621 158103 155330 165345 179223 170367 161914 170332 162017 176374 179751 172542 175849 161223 167058
4608 167058 167124 191849 194324 188000 172628 172143 184456 181145 182584 160646 157346 160876 163961 162330
4594 162330 170130 165605 159943 152984 156907 173559 167865 175707 177659 177205 179205 186583 192950 178716
4580A78716N765m263q723J4199p86o310j2414j4048J0984K1284J3115j459M376
4567B00436J8988k8881j0809M846R011J7092j2738K876J4880j8195o684N758K43
4554A96823J237M744L875J5509Q445j7040J4286O84q955K489p849j581J1276J181
4540B25124R980Q438j1990J3534Q018j1722K790p144P031N666J2723O694k929
4527B66213j1603R731l228m370o846M561J5718k886q240k036Q119q099J3515N327
4513B75876j1545l41L35J6465P596l382K541P321M506J575J8640O319j0185p430
4499C08291j723p925l634k166J0558K1498p382r45L927l097j134J797J0945n63
4485C28447j0917j598K7282L78j189q09R443J261q744J6594J1694p747q85O976
$$ plain form
4580 178716 184481 180218 171495 185694 184908 178598 166184 152136 163120 184404 197519 196060 200436
4567 200436 219424 190543 179734 184580 193591 210683 197945 200821 215701 197506 190822 196580 196823
4554 196823 198060 202804 206679 222188 230633 213593 227879 228563 219608 222097 214248 212667 223943 225124
4540 225124 235104 243542 231552 245086 253104 241382 244172 237028 244059 249725 262448 269142 266213
4527 266213 254610 264341 261113 256743 249897 254458 270176 267290 259050 257014 265133 257034 270549 275876
4513 275876 264331 263990 264325 280790 288386 285004 287545 294866 299372 300947 319587 325906 315721 308291
4499 308291 306568 298643 295009 292843 303401 324899 317517 316572 320499 317402 316268 318065 329010 328447
4485 328447 317530 315932 343214 343592 342403 341594 351037 352298 343554 360148 371842 364095 363210 370186
4471C70186J6720O55j6397p856j174r23j0825M726J0779o005J2334q249P675L0796
4457D02442O516K645n197J412j5142J5763K277L807j0118Q728N065j5638o240
4444C96320N763K9781l888K8577R505l424n43r233J2300N032N264J2256J049m10
4430D88349n010j629Q529O568N29J553O531J7575J2420P955J2952j0183q855j3516
4416E23768q802o259J4012J9574J134J0246p140N207N439K671n592j9947K1470
4403E55781J3916l977j3213J7535J6275N956j311J4307K0275J1247J41j3044p57
4390F23131J9100L168K435O449o686j259R924j9782J1691J1755j6105R534p85
4377F52570J2863M126m362Q275N924J4138J1574k2453j5758o409N451J2097N06
$$ plain form
4471 370186 386906 387561 371164 363308 362134 361211 350386 355112 365891 359886 372220 363971 371646 402442
4457 402442 408958 411603 406406 407818 392676 408439 410716 414523 404405 413133 418198 402560 396320
4444 396320 402083 431864 427976 456553 466058 462634 462091 452858 465158 470190 475454 487710 488759 488349
4430 488349 483339 481710 490239 496807 497336 498889 505420 522995 535415 543370 556322 546139 537284 523768
4416 523768 514966 508707 522719 542293 543427 553673 546533 551740 557179 559850 554258 534311 555781
4403 555781 569697 565720 552507 570042 586317 592273 590962 605269 625544 636791 636932 623888 623131
4390 623131 642231 645399 647834 654283 647597 646338 656262 636480 648171 659926 643821 653355 652570
4377 652570 665433 669559 665197 673472 679396 693534 705108 682655 666897 660488 665939 678036 678542
4364F78542r973L3956L4558m241j6690q985K1065R550J0276K44J5468j2450j6615
4351G34705O245M903P367N710j8879j1602O837q028j40l382j5711p493m091o895
4337F89546K2495j138p739J3808l654l223J2505q545J0241o087J4240J7020K748
4324G52217M040K3992m546o86K7311L9044Q697O896M1360L6145L0280N1407N2659
4311A068816M9059O5629N2276K8301J9538n093n1683p2931n0204o8878n8330k3998
4299I52502l1731k5371l0366l205K263k2394n976k002N578j2510k562R062k4375
4286H08913m005j4107j924J7543l860p110k344J446K598j446j9841K5669J4780
4273H16312k813j4072M120k879Q383J0884m448J6479n222q150j918J8157J9300
$$ plain form
4364 678542 668569 702525 737083 732842 716152 707167 728232 737782 748058 748302 763770 751320 734705
4351 734705 740950 745853 753220 758930 740051 728449 735286 727258 727118 723736 708025 700532 696441 689546
4337 689546 712041 710903 703164 716972 713318 710095 722600 714055 724296 718209 732449 749469 752217
4324 752217 756257 780249 775703 775017 802328 841372 850069 856965 898325 934470 964750 1016157 1068816
4311 1068816 1117875 1183504 1235780 1264081 1283619 1278526 1226843 1153912 1103708 1034830 976500 952502
4299 952502 920771 895400 865034 861829 864092 841698 835722 833720 839298 826788 824226 833288 808913
4286 808913 804908 790801 788877 806420 802560 795450 793106 794552 797150 795704 775863 801532 816312
4273 816312 813499 799427 803547 800668 809051 819935 815487 831966 826744 818594 816676 834833 854133
4260H54133Q694Q96R732N293J2989J8887O709J4476L1886J8066K0221k3350l0161
4247I48471n400m875J1641O650l5072j332M330l709p189J1070k983P32o38l282
4233I18414J6439K7320j4726K167J1630M395L608n816J3449J6391K1394J332L358
4220A019355J2523N225q772l23J1701R049J9118J3630J7104O861K6486K0391L3641
4207A185989K6857L1587K6113L5667N0150L7336L0743L6868M1440M4723O4320
4196A611793O8396J05869J34440J68522J91474K03360J84718J54963P2278l2699
4186B863114j01673j71132k03442k00237j75562j52500j21350j17580m0018l3285
4176A546335l1663M613j2476J1823k9782n009n791m100k255J5555j575j6557K3567
$$ plain form
4260 854133 862827 863723 873455 878748 891737 910624 917333 931809 963695 981761 1001982 978632 948471
4247 948471 943071 938196 949837 956487 921415 920083 924413 920704 913515 924585 921602 922334 921696 918414
4233 918414 934853 962173 947447 949614 961244 965639 969247 963431 976880 993271 1014665 1015997 1019355
4220 1019355 1031878 1037103 1028331 1028008 1039709 1048758 1067876 1081506 1098610 1105471 1131957 1152348 1185989
4207 1185989 1212846 1244433 1270546 1306213 1356363 1393699 1424442 1461310 1502750 1547473 1611793
4196 1611793 1680189 1786058 1920498 2089020 2280494 2483854 2668572 2823535 2895813 2863114
4186 2863114 2761441 2590309 2386867 2186630 2011068 1858568 1737218 1619638 1579620 1546335
4176 1546335 1514672 1519285 1506809 1518632 1488850 1483841 1478050 1473950 1471695 1487250 1485675 1469118 1492685
4163A492685Q534Q048K8269MK7315J2724p610R115K098J1958k341m894K7089K8022
4149A641016K6088L9049P454J3063K0531R38K5936J1204R181K6420J8750K2957
4137A862587M6300L4555K1077L6808L7820L0003N9074M4844M2466M3014O0474
4126B319022L8337M4633M2892N3064O3258O2875L2228L7612O5564N7123N9242
4115B875850M6766N4225N7705M0116M4396L1031K3126M1193N9152M4822M6372
4104C364754P1658P0789P4361Q4274O8579P4279R0788J06685P7801J00519J13817
4093D298304Q2068Q4371R6633R5068P9953J18684J04671J16049J28675J26593
4083E331069J21478J49511J36940J69617J68414K06410K47049K53946K84594K72302
$$ plain form
4163 1492685 1501219 1509267 1537536 1537540 1564855 1577579 1569969 1579084 1581182 1593140 1590799 1585905 1612994 1641016
4149 1641016 1667104 1706153 1713607 1726670 1747201 1748139 1774075 1785279 1794460 1820880 1839630 1862587
4137 1862587 1908887 1943442 1964519 2001327 2039147 2069150 2128224 2173068 2215534 2258548 2319022
4126 2319022 2357359 2401992 2444884 2497948 2561206 2624081 2656309 2693921 2759485 2816608 2875850
4115 2875850 2922616 2976841 3034546 3074662 3119058 3150089 3173215 3214408 3273560 3318382 3364754
4104 3364754 3436412 3507201 3581562 3665836 3734415 3808694 3899482 4006167 4083968 4184487 4298304
4093 4298304 4380372 4464743 4561376 4656444 4736397 4855081 4959752 5075801 5204476 5331069
4083 5331069 5452547 5602058 5738998 5908615 6077029 6283439 6530488 6784434 7069028 7341330
4073G341330K88385L34421L26146L85404M02855M53088N41589O45482P47840R24811
4063A2391351J066446J158989J200574R75093N08058J8834l85617p63246r06675
4054A5263807p74413n25245l39267k12754p5876j4020K9061R3032J79889K23376
4044A3847590K66052L47171M01206M43404M82545N78173O56593P32262Q31972
4035A8586968R58273J108773J303114J460918J596488J872294K137228K451393
4027C1475449K903258L474406M207587N252647O666797Q103615R475600J1162371
4019H2721730J1526076Q354349N871825M745918j872895r754486j1508109j1396476
4011G8687932j2329674j1737697r449527p004626n084555l854494l084835k518871
$$ plain form
4073 7341330 7629715 7964136 8290282 8675686 9078541 9531629 10073218 10718700 11466540 12391351
4063 12391351 13457797 14616786 15817360 16792453 17300511 17319345 16933728 16170482 15263807
4054 15263807 14489394 13964149 13624882 13412128 13336252 13322232 13351293 13444325 13624214 13847590
4044 13847590 14113642 14460813 14862019 15305423 15787968 16366141 17022734 17754996 18586968
4035 18586968 19545241 20654014 21957128 23418046 25014534 26886828 29024056 31475449
4027 31475449 34378707 37853113 42060700 47313347 53980144 62083759 71559359 82721730
4019 82721730 94247806 102602155 108473980 113219898 111347003 101592517 90084408 78687932
4011 78687932 66358258 54620561 45171034 38166408 33081853 29227359 26142524 23623653
4003B3623653j975995j576464j241413r90169q09605o75234o01614o02160n47886
3994A4603113m76366m14203l96833l46085k76083k83977k64801k67034k24989
3985A1652742k49291k03636j72899j48271r2836j8402n748R1037J41123K20036
3975A1213855K74866L05327L65451L86355M29922M90788N66699O62688P92843
3966A5488794R64500J222926J540732J929069K240531K296398K028216Q66027
3958B8577193j412978l020350l158499k615112j982038j493781j109793q03435
3950A2981207n79518m42391l34590k77531k44661k27890k19035k13938k38639
3941A0203014k57464l14145l52841l74437l64069l48750l01095k35369j86328
$$ plain form
4003 23623653 21647658 20071194 18829781 17839612 17030007 16354773 15753159 15150999 14603113
3994 14603113 14126747 13712544 13315711 12969626 12693543 12409566 12144765 11877731 11652742
3985 11652742 11403451 11199815 11026916 10878645 10785809 10767407 10761659 10852696 10993819 11213855
3975 11213855 11488721 11794048 12159499 12545854 12975776 13466564 14033263 14695951 15488794
3966 15488794 16453294 17676220 19216952 21146021 23386552 25682950 27711166 28577193
3958 28577193 27164215 24143865 20985366 18370254 16388216 14894435 13784642 12981207
3950 12981207 12401689 11959298 11624708 11347177 11102516 10874626 10655591 10441653 10203014
3941 10203014 9945550 9631405 9278564 8904127 8540058 8191308 7890213 7654844 7468516
3932G468516j09126q9321l2546P850L9128Q9430J03335J11725R8755P2080j0099
3921G749727r4399p2933n9824m2147o930O3914Q8789M7548K9332n8669j06014
3910G538394j72250j97188j71443j25104r9534o0530l0896k8274j9338p5404j53994
3899F404439k09537k73877k96594k89212k79350k61721k15636j77160j61267j23363
3889D116722q9855o8112l8715k6447l702L4927O0408P8984N6226J8193m6666p7274
3877D014689j45881j59360k01159j64733j32635r7077p4663o2063m3203k9165
3867B904750j3994l324J9855L9719M2529N0001O2248K4314j5090l8528r1111j25474
3855B855895j00431j09878q4410n6783l1622k14p234N381L0942N8841O8143P1962
$$ plain form
3932 7468516 7359390 7270069 7237523 7245373 7284501 7373931 7477266 7588991 7687746 7759826 7749727
3921 7749727 7655328 7582395 7522571 7480424 7473494 7537408 7626197 7673745 7703077 7644408 7538394
3910 7538394 7366144 7168956 6997513 6872409 6772875 6712345 6681449 6653175 6633837 6558433 6404439
3899 6404439 6194902 5921025 5624431 5335219 5055869 4794148 4578512 4401352 4240085 4116722
3889 4116722 4026867 3958755 3920040 3893593 3889891 3924818 3985226 4064210 4120436 4138629 4091963 4014689
3877 4014689 3868808 3709448 3508289 3343556 3210921 3113844 3039181 2977118 2933915 2904750
3867 2904750 2890756 2887432 2907287 2947006 2989535 3039536 3101784 3126098 3111008 3072480 2981369 2855895
3855 2855895 2755464 2645586 2561176 2504393 2472771 2472557 2465323 2470704 2501646 2560487 2628630 2700592
3843B700592N6577O8689M7899K0378l222l7536k2134m3299m3623m6856k6261k9821
3831B641383j9031M816K6534L4321O0073Q4351J12567J23365J57507J79479K00889
3820C606254K01185K13026K01338J55858R0721j454r6213j58008k03756j84631
3810C824320k02979j64882j49307j22226q4272o2623k3158l6294j0594L3060N3697
3799C054742N8767R9073J25863J44341J79037K26769K31334K18628J73790N8726
3789D571070n7422j75777k16527j88663j60715j18533o9763l0595J5875N4541
3779C623491O7385R7381J21675J36648R2070M4301r603l0807n3004q1127o6063
3768C942347m0909r061J1859N3258P9314J13208J56824J61222J29301R9404M3404
$$ plain form
3843 2700592 2757169 2825858 2873757 2894135 2890913 2853377 2831243 2787944 2744321 2697465 2671204 2641383
3831 2641383 2622352 2627168 2653702 2688023 2748096 2832447 2945014 3068379 3225886 3405365 3606254
3820 3606254 3807439 4020465 4221803 4377661 4468382 4466928 4370715 4212707 4008951 3824320
3810 3824320 3621341 3456459 3307152 3184926 3100654 3038031 3014873 2978579 2967985 3001045 3054742
3799 3054742 3113509 3212582 3338445 3482786 3661823 3888592 4119926 4338554 4512344 4571070
3789 4571070 4513648 4337871 4121344 3932681 3771966 3653433 3583670 3553075 3568950 3623491
3779 3623491 3690876 3788257 3909932 4046580 4138650 4182951 4173348 4142541 4089537 4008410 3942347
3768 3942347 3901438 3892377 3904236 3957494 4036808 4150016 4306840 4468062 4597363 4696767 4740171
3757D740171j5965r3709j34815j55661j67121j02631o6074n9083l9608m6530o9601
3746C789373q1767j05076j28538j37747r9229j16478q8305m5947m0253q740K7847
3735B965140K0994O1435P4252Q4977J10666J44577J62218K14129K10355K37981
3725D286724K19121J92698J38443R3963M7974k9750j03572j93190k90694l36731
3715D024986l46399l24706k77022k14919j56441j48697j18072q3364n7438n3052
3705B244876k5707k2173j5184O971M276O2186P6019N9129N2241N8215M1351R861
3693B552061j2104j9376k6985k5550J6729J5998K6840M2260Q792p506n2490j03324
3681B415345j27934j31306j17564j12945j02295r0740o0584l6266p481k3965j5825
$$ plain form
3757 4740171 4724206 4630497 4495682 4340021 4172900 4070269 4004195 3945112 3905504 3858974 3789373
3746 3789373 3707606 3602530 3473992 3336245 3237016 3120538 3032233 2986286 2946033 2937293 2965140
3735 2965140 2986134 3047569 3121821 3206798 3317464 3462041 3624259 3838388 4048743 4286724
3725 4286724 4505845 4698543 4836986 4930949 4978923 4949173 4845601 4652411 4361717 4024986
3715 4024986 3678587 3353881 3076859 2861940 2705499 2556802 2438730 2355366 2297928 2244876
3705 2244876 2219169 2196996 2181812 2188783 2193059 2255245 2331264 2390393 2442634 2500849 2542200 2552061
3693 2552061 2539957 2520581 2493596 2468046 2484775 2500773 2527613 2569873 2578665 2571159 2518669 2415345
3681 2415345 2287411 2156105 2038541 1925596 1823301 1732561 1671977 1635711 1628230 1604265 1588440
3670A588440J9819J6020J3963M8554K4938N5004K3717j8950m8196q0898m1580
3659A600831o2920n6262o656m700L0435L5109N5985N3635M2143K845n3605q3136
3647A553704r2118r5037q5143q1211m8665l8101j9474k3254l4513m7734j2277
3636I76177p013m683q11l240l005J0287M036J8179L7307qJ878K4936L8494K7629
3622A120163K5530J2920J6671J7383l980q639k2852j9792m8610n1695j9510j2851
3610A004738j1629r055P712J9064K6019J8089J0463L0883K9730M0389O0880O6618
3598A293901O8077Q7096J06858J40791J17085J30019R6074J2753n4204r5583j48861
3587A754006j53827j45711j30835r8126r3386p0243l9907l7815l8792l1755k3624
$$ plain form
3670 1588440 1608259 1624279 1638242 1686796 1711734 1766738 1790455 1771505 1723309 1642411 1600831
3659 1600831 1537911 1481649 1474993 1470293 1500728 1535837 1591822 1645457 1687600 1690445 1636840 1553704
3647 1553704 1461586 1366549 1281406 1200195 1151530 1113429 1093955 1070701 1036188 988454 976177
3636 976177 969164 964481 963670 960430 957425 967712 971748 989927 1027234 1027226 1029104 1054040 1092534 1120163
3622 1120163 1145693 1158613 1175284 1192667 1188687 1180048 1157196 1137404 1088794 1037099 1017589 1004738
3610 1004738 993109 984054 991766 1010830 1036849 1054938 1065401 1096284 1126014 1166403 1227283 1293901
3598 1293901 1361978 1449074 1555932 1696723 1813808 1943827 2039901 2052654 1998450 1902867 1754006
3587 1754006 1600179 1454468 1323633 1225507 1132121 1061878 1021971 984156 945364 913609 889985
3576H89985j7467k2657j3094k4527N021m452m119p164k8178K115k176J1958K8934
3563H14179P621j0165l388j233j9186j0492P770r302J3927L6948l651K6024j0095
3550H38957J0893J3910J8031o957O461l589N291l116J9037j344J033J4429R064
3537I22100J2865J0792J7160O341J6738J7678O235P265J2066M274l681L5348L3306
3524A098487r740J4970M2693J918j3307O304K0986q217L9649J5039Q507L3670
3512A250959K8936J2518J6685J5866J6882K4057L9729K6975O5197N1140N6251
3501A605195N6984M3226P7911P1049M7423L8921J6710K0559n305l7570n7917q8902
3489A788284p1414n9773m0785j8969j7966m6080m8138p083j4952q785K9218L5353
$$ plain form
3576 889985 872518 849861 836767 812240 817261 812809 808690 801526 773348 775463 773287 785245 814179
3563 814179 821800 811635 808247 807014 787828 777336 785106 775804 789731 826679 823028 849052 838957
3550 838957 849850 863760 881791 874834 881295 877706 882997 879881 898918 897574 898607 913036 922100
3537 922100 934965 945757 962917 969258 985996 1003674 1009909 1017174 1029240 1033514 1029833 1065181 1098487
3524 1098487 1088747 1103717 1146410 1148328 1135021 1141325 1162311 1154094 1193743 1208782 1217289 1250959
3512 1250959 1279895 1292413 1309098 1324964 1341846 1365903 1405632 1432607 1497804 1548944 1605195
3501 1605195 1662179 1705405 1783316 1854365 1901788 1940709 1957419 1977978 1972673 1935103 1877186 1788284
3489 1788284 1716870 1657097 1616312 1597343 1579377 1533297 1485159 1478076 1463124 1454339 1483557 1518910
3477A518910O0130N0349L3014K9173L5634J7301J2119J8402J1575L6810M1358
3466A864775M3403N0230J7776L0305K2483K9997J3176J5474j1501K4819K4359
3455B125296o944J3567K6314L1163L4765K4858O2555M3247M5832K1883L104L742
3443B429382K3928L2172M3167N4475N1157K8718K7051P001K5366K8887L1899K6291
3431B809494L7739L6514N6524N6426Q2196N7748Q4664P3726Q1240Q9634R7475
3420C563380R5389R5450P5911J02655P0032P3544Q9152J20446J11659R7227P4655
3409D569500O0382J05276R4242J25485J43172J14131Q3126O3435N2882K6294N0511
3398E488436O4864P1954M9270L5835Q4747J09641J26207J25065J84306J89203
$$ plain form
3477 1518910 1579040 1629389 1662403 1691576 1727210 1744511 1756630 1775032 1786607 1823417 1864775
3466 1864775 1908178 1958408 1976184 2006489 2028972 2058969 2072145 2087619 2076118 2100937 2125296
3455 2125296 2118352 2131919 2158233 2189396 2224161 2249019 2311574 2354821 2400653 2422536 2425640 2429382
3443 2429382 2453310 2485482 2528649 2583124 2634281 2662999 2690050 2697051 2722417 2751304 2783203 2809494
3431 2809494 2847233 2883747 2940271 2996697 3078893 3136641 3221305 3295031 3376271 3465905 3563380
3420 3563380 3658769 3754219 3830130 3932785 4002817 4076361 4165513 4285959 4397618 4494845 4569500
3409 4569500 4629882 4735158 4829400 4954885 5098057 5212188 5295314 5358749 5411631 5437925 5488436
3398 5488436 5553300 5625254 5674524 5710359 5795106 5904747 6030954 6156019 6340325 6529528
3388F529528J93776J71878J59357J65388J71810J76361J80699J92138J70093J63058
3378H274086J52563J40197J65582K11115J91138J84186J74860J61862K09810K05523
3368A0070922K55531K74201K95050K85618L07146L34195L09263L17893L04160
3359A2753979L35258L50506L40328L59889L49635L70155M07883M57704N03536
3350A6228873N69131N72487N79250O20572O79693P30834P64376P85173P22582
3341B2252971O71736O84354O79099O65869O55208P67334Q11584Q64599R71874
3332B9024628J124603J180151J221291J262587J382924J574753J922647K195170
3324D0888754K503750K895466L468477M024065M691874N248812N671466O158836
$$ plain form
3388 6529528 6723304 6895182 7054539 7219927 7391737 7568098 7748797 7940935 8111028 8274086
3378 8274086 8426649 8566846 8732428 8943543 9134681 9318867 9493727 9655589 9865399 10070922
3368 10070922 10326453 10600654 10895704 11181322 11488468 11822663 12131926 12449819 12753979
3359 12753979 13089237 13439743 13780071 14139960 14489595 14859750 15267633 15725337 16228873
3350 16228873 16798004 17370491 17949741 18570313 19250006 19980840 20745216 21530389 22252971
3341 22252971 22924707 23609061 24288160 24954029 25609237 26376571 27188155 28052754 29024628
3332 29024628 30149231 31329382 32550673 33813260 35196184 36770937 38693584 40888754
3324 40888754 43392504 46287970 49756447 53780512 58472386 63721198 69392664 75551500
3316G5551500O895413Q003061R630224J1755245J4576247J8352117K4227127L1839150
3308B00830084L7809771L8458148L4122230L383111m0905626n5642403m7014457
3301A71040858l4045527k4003644j7517593j3098066r649892p583126o539672
3294E8603338n833839m951829m079668l241040k607043k164144j869603j657889
3286C2198283j582537j446038j347284j290618j293205j155203r15025p07223
3278B2461150n95829n34691n13216m75622l64442k72346k44284j40828j02920
3269A9216972j51946k71787m40229n45456n55242m93212l65872k79462k33596
3260A5880170k17036j92022j49949j56191j45445r2739p0362m5242K899J3707
$$ plain form
3316 75551500 82446913 90449974 100080198 111835443 126411690 144763807 168990934 200830084
3308 200830084 238639855 277098003 311220233 314603344 273697718 218055315 171040858
3301 171040858 136995331 112991687 95474094 82376028 72726136 65143010 58603338
3294 58603338 52769499 47817670 43738002 40496962 37889919 35725775 33856172 32198283
3286 32198283 30615746 29169708 27822424 26531806 25238601 24083398 23168373 22461150
3278 22461150 21865321 21330630 20817414 20341792 19977350 19705004 19460720 19319892 19216972
3269 19216972 19065026 18793239 18353010 17807554 17252312 16759100 16393228 16113766 15880170
3260 15880170 15663134 15471112 15321163 15164972 15019527 14926788 14856426 14811184 14814083 14827790
3250A4827790N7594J35244J63776K15110K32540K54526K71310K51740K74473L07295
3240A6991398L19357L66275M28063N03969N40980N92035O24708O23800O88114
3231B1678699P69281Q77501J035979J258319J505723J793538K028269K278228
3223C3225537K539339K845398L257140L824805M602252N616933O871260Q607678
3215G1390342J0880932J3249804J4514664J3265149P418191m587431j5575777
3208A10555874j8753980j6544097j2940684r803934p479504n762737m464837l659738
3200C1146363l127750k703530k277124j883819j549851j317020j152604j020508
3192A6114157q81866q06322p30487p00201o85887o76598n82954m76934m18437
$$ plain form
3250 14827790 14885384 15020628 15184404 15399514 15632054 15886580 16157890 16409630 16684103 16991398
3240 16991398 17310755 17677030 18105093 18609062 19150042 19742077 20366785 20990585 21678699
3231 21678699 22447980 23325481 24361460 25619779 27125502 28919040 30947309 33225537
3223 33225537 35764876 38610274 41867414 45692219 50294471 55911404 62782664 71390342
3215 71390342 82271274 95521078 110035742 123300891 130719082 126131651 110555874
3208 110555874 91801894 75257797 62317113 52513179 45033675 39270938 34806101 31146363
3200 31146363 28018613 25315083 23037959 21154140 19604289 18287269 17134665 16114157
3192 16114157 15232291 14425969 13695482 12995281 12309394 11632796 11049842 10572908 10154471
3183A0154471l98214l91602m07669l31402l32969l33322l38780l33336l13703
3174F973474k58319k33697k24643j96258j49469j63423j55045j86681j73760j46592
3164E085587j46122j53635j44884j19651j23397j44511j39005j65939j46647j42565
3154C659231j40225j05667q9129n9111n8077n9419p1736n4716l3896n3906m1676
3143B891673j9993j0393n8031m9714l8971p8190l7695p716j3883p340j66j0515
3131B559066n5771m1475l9699n5467o0493o8263q0239o7422o8171q1466n8752
3120A881848p3648o3143m8674P786m465k0219n0504o4804m0286j0180k0976j7840
3108A474895k0656j9084l6972k2305k6327j7104l1236j1667r636k4548J3465j2597
$$ plain form
3183 10154471 9756257 9364655 8956986 8625584 8292615 7959293 7620513 7287177 6973474
3174 6973474 6715155 6481458 6256815 6060557 5911088 5747665 5592620 5405939 5232179 5085587
3164 5085587 4939465 4785830 4640946 4521295 4397898 4253387 4114382 3948443 3801796 3659231
3154 3659231 3519006 3413339 3324210 3265099 3207022 3147603 3075867 3021151 2987255 2933349 2891673
3143 2891673 2871680 2861287 2803256 2753542 2714571 2636381 2598686 2590970 2577087 2569747 2569581 2559066
3131 2559066 2503295 2461820 2422121 2366654 2306161 2237898 2157659 2090237 2022066 1940600 1881848
3120 1881848 1808200 1745057 1696383 1704169 1699704 1679485 1628981 1564177 1523891 1513711 1492735 1474895
3108 1474895 1454239 1435155 1398183 1375878 1349551 1332447 1301211 1289544 1279908 1255360 1268825 1256228
3096A256228r487K720m765p077r216j3471n441j2338j835n39j1132l104j281j6976
3082A162286l4102m3725r927k4766k0577K0877j8556J6292q08j1828l713k5242
3070A006211j2148j3744K4127n29j1150n016k0871P839p843p293p513j2943j2218
3057I26909j433l507p131m176n441k86o754J241P638R186K2622Q080R613L91O161
3042I63113r002m138O761J0511J6672k674j907K6855q073n263j2621j3001M331
3029I71564Q225J9171L6278L2449M1541P8186J01334J29614J26940J39294J27752
3018A812348O0651M7529l0509j05259j36022j79398j61139j39602j20904p9900
3008I67795p2968m4654l3148l1382k2104k0355j7289k2656j2239j0581q065j6347
$$ plain form
3096 1256228 1246741 1249461 1244696 1237619 1228403 1214932 1209491 1197153 1195318 1194779 1183647 1180543 1179262 1162286
3082 1162286 1128184 1084459 1074532 1049766 1029189 1050066 1031510 1047802 1046994 1035166 1031453 1006211
3070 1006211 994063 980319 1004446 1003917 992767 987751 966880 974719 966876 959583 952070 939127 926909
3057 926909 925476 921969 914838 910662 905221 904935 898181 899422 907060 916246 938868 946948 956561 956952 963113
3042 963113 954111 949973 956734 967245 983917 981243 979336 1006191 998118 992855 980234 967233 971564
3029 971564 979789 998960 1035238 1067687 1109228 1187414 1288748 1418362 1545302 1684596 1812348
3018 1812348 1872999 1920528 1890019 1784760 1648738 1469340 1308201 1168599 1047695 967795
3008 967795 894827 850173 817025 785643 763539 743184 725895 703239 691000 680419 672354 656007
2996F56007k9314l1004j6825o36O660j980j542k222o177k3622j8768M49n850m229
2982E20947lK409J9685M622n913p484q292j4613j6673l219j6476p514J3664m775
2968D76365j2818k711m009M856Q460n086j2312o173R452P648J0252p180k9090
2955D37654j1540K0890P303j2296N744l071k706M629j0555L754n339K0738K985
2942D58190o171J1094n706J7285J8711k707R790J135k465J9405K0656Q744J7347
2929E65308K2530L0070N8421N7154M6779N7683L010j2928k1370m7353o3336o1614
2917F34354o9795m1272k6327l7574l8606k3682k1594m071J1227j8516k6195j0147
2905C27802j5582M655j1186p476j5345j3308p758J2285j064L554k11j2326k7728
$$ plain form
2996 656007 626693 595689 578864 578228 584888 582908 581366 579144 572967 549345 530577 531026 525176 520947
2982 520947 520944 523353 543038 547660 541747 534263 525971 511358 494685 491466 474990 467476 481140 476365
2968 476365 463547 460836 456827 461683 470143 465057 452745 446572 456024 463672 473924 466744 437654
2955 437654 426114 447004 454307 442011 447755 444684 441978 446607 436052 439806 434467 455205 458190
2942 458190 452019 463113 457407 474692 493403 490696 500486 501621 499156 518561 539217 547961 565308
2929 565308 587838 617908 676329 733483 780262 837945 840955 828027 806657 759304 695968 634354
2917 634354 564559 523287 496960 459386 420780 397098 375504 371433 382660 364144 337949 327802
2905 327802 312220 316875 305689 298213 282868 269560 261802 274087 273023 276577 276366 264040 236312
2892B36312j4690Q747l07J6924l542n812k3651R251N585m15p81p909L404K360
2878B25476j9436j487J2684J4986m664q168j544j537O775Q063K841n139K2150
2865B51000k733p788m895K053r399j7731p978N214J1788O923o921j8674q143K430
2851A95146o076j6237j3053K9742k26k3583m158K1645J8660k5882o86O027j348
2838A79971q689n55j3003Q541m875p98K183j646J006J4773l3768n067J810J2924
2824A52807J6940p283j2610J4828M601o228m441j9697M53j850m261Q492j874o753
2810A33124k516J1116l335j5126n022O140j7947k595p618J1203Q345j6558n061
2797I4150n108k170j382L262j266J1936j135L922m281J4861J448p779J3442k8972
$$ plain form
2892 236312 221622 230369 230062 246986 243444 237632 213981 223232 228817 228402 227621 219712 223116 225476
2878 225476 206040 204553 217237 232223 227559 219391 217847 216310 223085 231148 233989 228850 251000
2865 251000 248267 240479 235584 237637 228238 210507 202529 207743 219531 226454 219533 200859 192716 195146
2851 195146 189070 172833 159780 189522 189296 165713 161555 183200 201860 175978 175292 181319 179971
2838 179971 171282 170727 157724 166265 161390 160592 162775 161129 162135 176908 143140 138073 139883 152807
2824 152807 169747 162464 149854 164682 169283 163055 158614 138917 139370 137520 133259 141751 139877 133124
2810 133124 130608 141724 138389 123263 118241 124381 106434 103839 96221 107424 115769 99211 94150
2797 94150 89042 86872 85490 88752 87486 99422 98287 102209 97928 112789 114237 106458 119900 90928
2783I0928r320m04j135J4686k147q991M412M920q709j4814M256P219J5692k2588
2769G4005O591N105l335j277n8J182M634K4463j3938r443k6984k791j8102Q867
2755D8919R944j0242n858j738Q602j149n094l133R193j32j052J2002j5241J046
2741D6067k2279m5P891j471M364j0194n860k497J8944L1852m444j0567P392L338
2727F2491j7972k2217j0903K2173J7988j220p918L934m139P52j5491o129P379
2714B8728K003p472P906N402k313M534n15k539Q26m240J4109Q04k169q76J2956
2699E7144q81j5557o434O330m189j3903J634P89O355M313p34J16o767j2201Q895
2684B4910j0777M285Q297M078M566o996m872K0409J383j3446j5818O208K99P31
$$ plain form
2783 90928 81608 81204 80069 94755 92608 83617 88029 92949 84240 69426 73682 80901 96593 74005
2769 74005 80596 85701 82366 81089 81031 82213 86847 111310 97372 87929 60945 58154 40052 48919
2755 48919 58863 48621 42763 41025 49627 48478 43384 40251 49444 49312 48260 60262 45021 46067
2741 46067 23788 23743 31634 30163 34527 24333 18473 15976 34920 66772 62328 51761 59153 62491
2727 62491 44519 22302 11399 33572 51560 50340 42422 46356 42217 42969 27478 21349 28728
2714 28728 30731 23259 31165 36567 34254 38788 38273 35734 36560 32320 46429 47233 45064 44188 57144
2699 57144 56263 40706 34272 40602 36413 22510 24144 24933 31288 35601 34867 34983 28216 16015 24910
2684 24910 14133 18418 26715 30793 35359 28363 23491 43900 45283 31837 16019 22227 22526 23257
2670B3257N572o26J5895L484J1458j1298j8134l456J1622j538k0676K1734P385
2657D4679k632k004n16l730j5533p990N946r71L590m589n376N743J8774m066j6697
2642A4628M832j199p159J4285j5861R539l221R855O411k1793J5649P434N018j2426
2628B5992j0724l643R228L088l356o345j7336J3155J2065q2j4749j1261J293L486
2614H11L09l057j232j1927Q66J1331J1592l842j6711L40K3543N412M545L799J2581
2599C8360P28o724P10K010j551l006L369J0434k5736k2572m940p066J0462m056
2585i578J0100J0704q332J0809j3905p909J3438m111J0138M928P146l416n361
2572A4651N824M005p236o223M032r410l67K312n49j0906J1463J3603M483k153
$$ plain form
2670 23257 28829 28203 44098 47582 59040 47742 29608 26152 37774 36236 15560 37294 44679
2657 44679 42047 40043 39527 35797 20264 12274 18220 17249 20839 16250 10874 16617 35391 31325 14628
2642 14628 19460 18261 11102 25387 9526 19065 15844 25699 32110 10317 25966 33400 38418 25992
2628 25992 15268 11625 20853 23941 20585 14240 -3096 10059 22124 22042 7293 -3968 -2675 811
2614 811 1120 -1937 -3169 -15096 -14230 -2899 8693 4851 -11860 -11520 12023 17435 21980 25779 38360
2599 38360 39088 32364 33074 35084 33533 30527 33896 44330 18594 -3978 -8918 -15984 -5522 -9578
2585 -9578 522 11226 2894 13703 -202 -8111 5327 1216 11354 16282 23428 20012 14651
2572 14651 20475 24480 17244 11021 15053 5643 5276 7588 7039 -3867 7596 21199 25682 23529
2558B3529O18j0318o15O823J385k86j8335j2778L225K5539M80j1022L599j456
2544A0388j4900M011j4836J5620k599J8060J822j1589J483p32O86m890o007M817
2530A334Q780r997j863k692K0797p519o986L898j1306J0855J0674J1445j6789
2517A0631k3310j1445J4642r782q069J0858J7764n500k77k388K342J5101M892
2504A5459j0161J1380J7285J805l600l70k7410k3493J3214P554P653j2090J0431
2491G657n1J4253j3687J3626K095o383q495j942L759J085L533k306j4059l148
2477d063O205O309n735j1846K3491j1512r892O941m815l703O226J0298j1079r383
2463a2558k365J0777P093j3886K37J2689j2925J0999L165O168p637j1721m380
$$ plain form
2558 23529 24147 13829 13214 20037 21422 21136 2801 -9977 -6752 18787 19267 8245 11844 10388
2544 10388 -4512 -501 -15337 283 -2316 15744 17566 5977 7460 6728 7414 2524 -3483 1334
2530 1334 10114 117 -1746 -4438 16359 8840 1854 5752 -5554 5301 15975 27420 10631
2517 10631 -12679 -24124 -9482 -19264 -27333 -16475 1289 -4211 -4488 -6876 -4534 10567 15459
2504 15459 5298 16678 33963 35768 32168 31798 4388 -19105 -5891 1663 9316 -2774 7657
2491 7657 7606 21859 8172 21798 23893 17510 9015 7073 10832 11917 15450 13144 -915 -4063
2477 -4063 2142 8451 2716 -9130 14361 2849 -7043 -102 -4917 -8620 -2394 7904 -3175 -12558
2463 -12558 -14923 -4146 2947 -10939 -10702 1987 -10938 61 3226 9394 1757 -9964 -14344
2450a4344N058J8094k011o278K4278j8437R334j6854l462L536r710J1085P137
2437G426Q233n840J757l90j7870O41j1265Q717n685l871q906K833K6063j3857
2423a2014K349q464M81J6457M454j1561N859O243M204j5870q150J8006j5708j3709
2409b7423J3079J0306J208K408J488N195o543R67Q635r024m080M862J7032p093
2395A1017j168L205r334j6216K1997o01j7059k137m094J6466m959k0899R502J8807
2381D527P484p562K448k1536L558j824J0502R41k076K111L743j349L923L291n333
2366B848j2692J1119P678K582j2043j4327J0592M176n872P155j734o438o367Q204
2352e119m056J0126o708J02N63K0057K260K171J117j8042p749J1097L293l04o901
$$ plain form
2450 -14344 -9286 8808 6797 519 24797 6360 15694 -1160 -4622 -1086 -10796 289 7426
2437 7426 15659 9819 11576 11186 -6684 -6043 -17308 -8591 -14276 -18147 -27053 -24220 1843 -12014
2423 -12014 -9665 -18129 -17648 -1191 3263 -8298 -2439 3804 8008 -7862 -16012 1994 -13714 -27423
2409 -27423 -14344 -4038 -2830 -422 1066 6261 -282 685 9320 296 -3784 1078 18110 11017
2395 11017 9849 13054 3720 -12496 9501 8900 -8159 -10296 -14390 2076 -2883 -23782 -14280 4527
2381 4527 12011 4449 6897 -14639 -11081 -12905 -2403 -1462 -3538 -1427 2316 967 4890 8181 2848
2366 2848 -9844 1275 8953 11535 -508 -14835 -4243 -67 -5939 1216 -518 -6956 -13323 -5119
2352 -5119 -9175 951 -5757 -5655 -5092 14965 17225 19396 20513 2471 -5278 5819 9112 8808 1907
2337A907J6391j0675n549J9787M069K907j0031m014J2690P546l1084n773j1058
2324a2887N670N014L885n25o471L955J0894R646j0373K412J916p960l482k1477
2310a9783M914L798J6807q15l758o955Q230j3806J3211N235j0101q326k407N282
2296h474K0342j7596N13k509o760Q734N811Q49j1701J132J4713k991Q545J825
2282A2433j3167n599M67O77K429K1047j540o707p599j8114O470N166q220L252
2268i005r9M475k0230j172J7989J3747j159j491m064j1291K0118j418J4136O196
2254B6732j1942K08O231J1019o348j1051k888Q00l48N616N425k36L48k1205J0551
2239A2912o311J0816j1991j1534Q435L140l826n725J4134J4370j6096k611q65
$$ plain form
2337 1907 18298 7623 2074 21861 25930 28837 18806 14792 27482 35028 3944 -1829 -12887
2324 -12887 -7217 -2203 1682 1157 -5314 -1359 9535 19181 8808 11220 13136 5176 1694 -19783
2310 -19783 -14869 -11071 5736 4921 1163 -5792 2438 -11368 1843 7078 -3023 -11349 -13756 -8474
2296 -8474 11868 -5728 -5215 -7724 -14484 -5750 61 910 -10791 -9659 5054 2063 10608 12433
2282 12433 -734 -6333 -5866 -5189 -2760 18287 16747 10040 2441 -15673 -9203 -4037 -12257 -9005
2268 -9005 -9104 -4629 -24859 -26031 -8042 5705 4546 3055 -1009 -12300 7818 6400 20536 26732
2254 26732 14790 14998 21229 32248 25900 14849 11961 12761 12413 18029 23454 23218 23566 2361 12912
2239 12912 6601 17417 5426 -6108 2327 5467 1641 -4084 10050 24420 8324 5713 4848
2226D848k949L966K924J8998n839J572l974p356q756j4028J2070J5063l731K744
2212A5552n186j0229J5602M03q000J615j2486K2552J694j4094M411J4865J723
2199B8422K964j6437N267J117m818j676n7q41M777k943J9390m358k829J480M584
2184C4042j5263j780l234J4912j3301k32Q525J4473M334j4742O656m322J2532
2171D2600O636k0649L849J1064j1674j0311K5449j671j5401M460L933L5436p163
2158F6558J3756L939k8301J947L763o02L982J1293q449j4256J3246K2641J34j3904
2144G5747l682P877j021N668R52j845j5079j650M249k737L250j1482L14K0372
2130H0933J1984j0150J468R25L0469j8465K000J1725J2254L530N567P21J2351
$$ plain form
2226 4848 1899 5865 8789 27787 21948 23520 19546 12190 3434 -10594 1476 16539 12808 15552
2212 15552 10366 137 15739 16142 8142 9757 -2729 19823 21517 7423 11834 26699 28422
2199 28422 31386 14949 20216 21333 16515 14839 14782 13941 18718 15775 35165 30807 27978 29458 34042
2184 34042 18779 16999 13765 28677 15376 15144 23669 38142 42476 27734 34390 30068 42600
2171 42600 49236 28587 32436 43500 31826 21515 46964 45293 29892 34352 38285 73721 66558
2158 66558 80314 84253 55952 57899 61662 61060 65042 76335 67886 53630 66876 89517 89651 75747
2144 75747 72065 79942 78921 84589 85541 83696 68617 66967 71216 68479 71729 60247 60561 80933
2130 80933 92917 82767 84235 85160 115629 97164 99164 110889 123143 126673 132240 132961 145312
2117A45312q365M005K895m082L886r310K2223J0178M423l26J4293K9709J2091
2104B26932q720j1341J2600R625J7538O861J7734M898L649k843M773K5689K1364
2091C28759J2021M908Q159N689J8176L7855M3326K7079L2977N1438N5316N2012
2079F77715L6870N3965M0272M5739P1238R1189J18242J86673J94028K41605L74335
2068B131871N07464O27966O85845M45320m95645r69835p55417m87007l37207k34156
2058A119199j85464j41968r2346o2391n0673o0021k9089j7125j4435k8458l8973
2047C98256k5288l5899l3586k3096k8292m252j3461l9070j652k97p784l327j9650
2034A62602p221j2607N23O688n979p051p770j3569L889j3042m863q906k035j4124
$$ plain form
2117 145312 136947 140952 143847 139765 143651 134341 156564 166742 171165 170839 185132 214841 226932
2104 226932 218212 206871 219471 229096 246634 253495 271229 276127 279776 276933 281706 307395 328759
2091 328759 340780 345688 353847 359536 377712 415567 458893 485972 518949 570387 625703 677715
2079 677715 714585 768550 808822 854561 925799 1016988 1135230 1321903 1515931 1757536 2131871
2068 2131871 2639335 3267301 3953146 4398466 3902821 2932986 2177569 1690562 1353355 1119199
2058 1119199 933735 791767 699421 637030 586357 526336 497247 480122 465687 437229 398256
2047 398256 372968 337069 303483 280387 252095 247843 234382 195312 193660 193363 185579 182252 162602
2034 162602 155381 142774 143297 149985 144006 136955 129185 115616 119505 106463 101600 92694 90659 76535
2020G6535q3J719o882k106n443M301o256k570J914N496M102q830N090m99R72n292
2004F2168k634k467k8152J4508o712l209J115j261R230q352k448n265M121R38
1990C1580P53K527r96J4025O239j1328k063j2468k4687L216J8904O821J1461j2496
1976C1488m583n773j0108K980J0938j2941k607n606K716M493P817o284q290p285
1962c045Q023J7997Q813M809o208j6607j3029J8636K543q043j2621l811j586j2802
1948a6931K621J5831Q836m155k569k547K3357j0786j2601J3405m234P297j1267
1935F257K623l336J2067J460k3199R64O183J6490L150j8106J7773q808j4626j1867
1921a2975k921P586J3768k4924J7732J5692J873k2015K927o40j1538o747P443
$$ plain form
2020 76535 76452 78171 71289 69183 63740 68041 61785 59215 61129 66625 70727 61897 66987 66488 67460 62168
2004 62168 59534 57067 28915 43423 36711 33502 34617 33356 42586 34234 31786 26521 30642 31580
1990 31580 32333 34860 33864 47889 54128 42800 40737 28269 3582 6798 25702 32523 43984 31488
1976 31488 26905 21132 11024 14004 24942 12001 9394 3788 6504 10997 18814 12530 4240 -3045
1962 -3045 4978 22975 31788 36597 30389 13782 753 19389 21932 13889 1268 -2543 -4129 -16931
1948 -16931 -14310 1521 10357 6202 3633 1086 24443 13657 1056 14461 10227 17524 6257
1935 6257 8880 5544 17611 19071 -4128 -3164 3019 19509 22659 4553 22326 13518 -1108 -12975
1921 -12975 -15896 -8310 5458 -19466 -1734 13958 15831 -6184 -3257 -3897 -15435 -22182 -14739
1908a4739J4367m473J1657m091M224j5497M950J828l420P820M364L261J433j1451
1894B33j8932L000J1940k525n953R59q261J0276j784L878J4592j8202M051O512
1880b16l283o036M871Q047j2877p774m721J4095K4331q155j0681k142L794l443
1866d190j1405k754J402l097J5572J5718r755m364j1807O124M557j197j388q693
1852a5277M500j3222M723k92M213J0589J1550k0395Q903L308j0177L920P126o557
1838g088r999J1407M265J422m302l165M288N981k620k426j4253J2341P860j3344
1824i633l543N191K2069p840n756n98L430O620p572P391o041j8917R118l196M139
1809e138P018j4111r504L865J7392L472J213O430j4856j068J3079l86J0765M119
$$ plain form
1908 -14739 -372 -4845 6812 2721 6945 -8552 -3602 -1774 -5194 2626 6990 10251 11684 233
1894 233 -18699 -15699 -3759 -6284 -12237 -11278 -19539 -9263 -11047 -7169 7423 -10779 -6728 -216
1880 -216 -3499 -9535 -4664 3383 -9494 -17268 -21989 -7894 16437 8282 -2399 -4541 -747 -4190
1866 -4190 -15595 -18349 -16947 -20044 -4472 11246 1491 -2873 -14680 -8556 -3999 -5196 -6584 -15277
1852 -15277 -10777 -23999 -19276 -19568 -15355 -4766 6784 -13611 -4708 -1400 -11577 -7657 -531 -7088
1838 -7088 -17087 -5680 -1415 7 -4295 -7460 -3172 2809 189 -2237 -16490 -4149 3711 -9633
1824 -9633 -13176 -7985 14084 6244 488 -110 3320 9940 2368 9759 3718 -15199 -6081 -9277 -5138
1809 -5138 1880 -12231 -21735 -17870 -478 2994 4207 10637 -4219 -5287 7792 7406 18171 22290
1795B2290k7432R495p20j7027L462J0351J043r988j440l059N798L459M666p980
1781g082J0801j2328q877O553O59j238r41N510q238p054J1620o299n041J7963
1767c992j789p325J035K0784l949j8420m460L599M481r08n45o570r308j0541N903
1752c2005O211l184J3875J5994K570k425l484l121N744R950J1060j3389Q024m406
1738A1414N103J0933j1222k8673p663K0574o665n646N779p42j9249J7243Q87j343
1724i270p67N022n416L588l021o604j457M73j4286Q031j136J8986k144r50J0936
1709A985N198K0440l2025j9367K0984L310n326Q33k820n219p403k132J617J3809
1695f116j0020m520J1912o63R389R450K820R013k3037k117l652r212o055O745
$$ plain form
1795 22290 -5142 4353 3633 -13394 -9932 419 1462 -8526 -9966 -13025 -7227 -3768 898 -7082
1781 -7082 3719 -8609 -17486 -10933 -10274 -11512 -12453 -6943 -15181 -22235 -10615 -16914 -21955 -3992
1767 -3992 -5781 -13106 -12071 8713 4764 -13656 -18116 -14517 -10036 -10944 -11489 -18059 -27367 -37908 -32005
1752 -32005 -25794 -28978 -15103 891 3461 1036 -2448 -5569 175 10125 21185 7796 15820 11414
1738 11414 16517 27450 16228 -12445 -20108 466 -6199 -11845 -6066 -6808 -26057 -8814 -7927 -9270
1724 -9270 -10037 -5015 -10431 -6843 -9864 -16468 -17925 -17452 -31738 -23707 -24843 -5857 -8001 -8951 1985
1709 1985 7183 27623 -4402 -23769 -2785 525 -4801 -3968 -6788 -12007 -19410 -21542 -19925 -6116
1695 -6116 -16136 -20656 -8744 -9407 -18 9432 12252 21265 -1772 -3889 -7541 -16753 -22808 -16063
1681a6063P59j608Q999L989r275K995K435o66j1767J2133j4347r755J0024K897
1667a9250J2997n048j210J8219j699r317J5169k4869O823L488m922j1296m384
1654b5299m867N89k865P135J3031J641J5135k863o803o115k891j1760K877l144
1640b6199j2335J1992m24K724k973L2144L32j9879j0469o704l11n683L3301J1411
1626F927R05q015n032j588j6227r785L102Q453J0473J1757M258p156p488o524
1612a5940j2187M883Q967l681O488m444J4043m433j479K852Q404n536j0809J5038
1598B166m998j5458m184M244N88Q700N590j4579n349J8643P352r341j0855J0001
1584g480J1283j2521J084j0717j252J186J696m275J7323M959j2493q465j089q253
$$ plain form
1681 -16063 -15304 -16912 -7913 -3924 -13199 -10204 -7769 -8435 -20202 -8069 -22416 -32171 -22147 -19250
1667 -19250 -6253 -11301 -12511 5708 4009 -5308 9861 -15008 -8185 -4697 -9619 -20915 -25299
1654 -25299 -30166 -29577 -32442 -25307 -12276 -10635 4500 1637 -5166 -11281 -14172 -25932 -23055 -26199
1640 -26199 -38534 -26542 -26966 -24242 -27215 4929 5261 -14618 -25087 -31791 -32102 -37785 -4484 6927
1626 6927 7832 -183 -5215 -6803 -23030 -32815 -29713 -21260 -10787 970 5228 -1928 -9416 -15940
1612 -15940 -28127 -23244 -14277 -17958 -11470 -15914 -1871 -6304 -7783 -4931 3473 -2063 -12872 2166
1598 2166 -2832 -18290 -22474 -18230 -17642 -8942 -3352 -17931 -23280 -4637 2715 -6626 -17481 -7480
1584 -7480 3803 -8718 -7634 -18351 -19603 -18417 -16721 -20996 -3673 1286 -11207 -19672 -20761 -29014
1570b9014M615J1014p348q381J063K1342M761J3769n40j5851j2390m46l79q75
1556a8660M845l516J903q5J6840o365j7217j271J5034n340Q400J4595q155J5572
1542A6580o643p111j8328N85O859l169J316j0192J968J3301j5233K6631j0791
1529d227k433P590M024q443l308j6432J7525R969j9578n562J075n447P264J888
1515a6095L286N154K973j622k361j9544n795K9093q712R855j0320K40n327r63
1501b0138O125O934l432j5895P155R998L430J1994j9193k439n835o305J456J5776
1487a0369J561j4750O537J3672q821K5193J9830M890Q21l892k3181o227K880j2752
1473d608l704k005j0440k828Q124k790J1132J953K435j3644r613J7969J578j2053
$$ plain form
1570 -29014 -24399 -13385 -20733 -29114 -28051 -6709 -1948 11821 11281 -4570 -16960 -17406 -17785 -18660
1556 -18660 -13815 -17331 -15428 -15513 1327 -5038 -22255 -23526 -8492 -13832 -5432 9163 1008 16580
1542 16580 9937 2826 -15502 -14917 -8058 -11227 -9911 -20103 -18135 -4834 -20067 6564 -4227
1529 -4227 -6660 930 4954 -3489 -6797 -23229 -5704 4265 -15313 -20875 -19800 -25247 -17983 -16095
1515 -16095 -12809 -7655 -4682 -6304 -8665 -28209 -34004 -4911 -13623 -3768 -14088 -13848 -19175 -20138
1501 -20138 -14013 -7079 -10511 -26406 -19251 -9253 -5823 6171 -13022 -15461 -21296 -27601 -26145 -10369
1487 -10369 -8808 -23558 -17021 -3349 -12170 13023 32853 37743 38564 34672 11491 5264 8144 -4608
1473 -4608 -8312 -10317 -20757 -23585 -15461 -18251 -7119 -5166 -2731 -16375 -25988 -8019 -6441 -18494
1459a8494o090L292q829J3563j290j1558k621O32J807k045J1146q565J1632n17
1445a7937j597N699J72J86j337r500l262K1858N82n095N783q526k0629l276K9673
1430g206J659K782K306M315j6375k068J1953R641r720J760L099k4788M142J0486
1416h014J3382j1602N728o32j4522j3335O289J2589N799K308o416p144P451J0793
1402B674l224R828L068j6068k681L31n401o285l420J4262k018J8058M089j269
1388A1944k146J1026p543k0646q457L075O67p863j92L588O934r219k013J0168
1374a0677j1573j833K6482J0302k2582k0993J4366J7786j6835n389Q818Q846N286
1361B004q488m802l009J2017N913n174n629m70R977o153j972J1535r217j3967
$$ plain form
1459 -18494 -24584 -21292 -30121 -16558 -17848 -29406 -32027 -31395 -29588 -31633 -20487 -29052 -17420 -17937
1445 -17937 -19534 -13835 -13663 -13477 -14814 -24314 -27576 -5718 -5136 -10231 -4448 -12974 -33603 -36879 -7206
1430 -7206 -5547 -2765 -459 3856 -12519 -14587 -2634 7007 -2713 -953 2146 -22642 -18500 -8014
1416 -8014 5368 -6234 -506 -1138 -15660 -28995 -22706 -10117 -4318 -2010 -8426 -15570 -8119 2674
1402 2674 -550 9278 12346 -3722 -6403 -6072 -11473 -17758 -21178 -6916 -8934 9124 13213 11944
1388 11944 9798 20824 13281 -7365 -15822 -12747 -12080 -19943 -20135 -16547 -9613 -18832 -20845 -10677
1374 -10677 -22250 -24083 2399 12701 -9881 -30874 -16508 1278 -15557 -20946 -12128 -3282 2004
1361 2004 -6484 -11286 -14295 -2278 3635 -1539 -7168 -7638 2339 -3814 -5786 5749 -3468 -17435
1347a7435J3517j1238J086K1475l343j1187J4836m238k7471M393P740J878R703
1334b84q768n330J0184k314L795M706J8299O661o399k6246N368j3075o577J235
1320a8745j326K850J08M90P496j6120K1840J1265j0868n415P383N58j7131K419
1306a5196L786Q953O449j007K695j4451o250p536N567J0365q201K418m974K3282
1292E900M675j4495J044j886j379j694q20j945Q199R93k447Q264O173n881o722
1277b021j7549J3285L845j3274R54p924R788J6567J1505k6542J5272q22J0656
1264A3740n352l001n824p946r748j0912J2116K0903n779j8235N861Q812K309o909
1250i965J6599n920l327L302m350K306k836K0404K060j6438j2972q50N129K227
$$ plain form
1347 -17435 -3918 -15156 -14070 7405 4062 -7125 7711 3473 -23998 -19605 -11865 -9987 -284
1334 -284 -9052 -14382 -4198 -6512 -2717 1989 20288 26949 20550 -5696 -328 -13403 -19980 -18745
1320 -18745 -20071 -17221 -17113 -16623 -9127 -25247 -3407 7858 -3010 -8425 -1042 -484 -17615 -15196
1306 -15196 -11410 -2457 3992 2985 5680 -8771 -15021 -22557 -16990 -6625 -14826 -12408 -17382 5900
1292 5900 10575 -3920 -2876 -4762 -6141 -7835 -8655 -10600 -2401 -1408 -3855 4409 10582 4701 -2021
1277 -2021 -19570 -6285 -2440 -15714 -14760 -22684 -12896 3671 15176 -11366 3906 3084 13740
1264 13740 8388 5387 -437 -8383 -18131 -29043 -16927 3976 -1803 -20038 -14177 -5365 -3056 -9965
1250 -9965 6634 714 -2613 689 -3661 -1355 -4191 16213 18273 1835 -11137 -11987 -6858 -4631
1236d631m283j8608K2984R460r616j4203P798k63j3597M888K36o61J1160l538
1222a2874Q419J9110j9254o723Q820J9488j4761j3977L630J1472N382j1232j103
1209c603l457K727p43j3384J1533J318K391p143j0180L437k467Q016l370P886
1195g039n649j0088k015Q630K0097m004L027j881m697q540N401Q360k539K252
1181A315m026j769Q524J4185j0278m132p064L255M813o401j364j0368r363j225
1167b3898J8020N278J4593j7428j9461O144Q233J908O677k323j728N840M065l982
1153A938o925o543k784J3800p756M184j5052R078O547J1425N755j0816O371K921
1139A2143j58k970Q79j365q177P447j0459J1621p278n304N894m174q689P13l45
$$ plain form
1236 -4631 -8914 -27522 -4538 4922 -4694 -18897 -11099 -11362 -24959 -20071 -19835 -20496 -9336 -12874
1222 -12874 -4455 14655 -4599 -11322 -2502 16986 2225 -11752 -8122 3350 8732 -2500 -3603
1209 -3603 -7060 -4333 -5076 -18460 -6927 -5609 -3218 -10361 -20541 -17104 -19571 -11555 -14925 -7039
1195 -7039 -12688 -22776 -24791 -16161 3936 -68 2959 1078 -3619 -12159 -6758 1602 -937 1315
1181 1315 -2711 -4480 4044 18229 7951 3819 -3245 10 4823 -1578 -2942 -13310 -22673 -23898
1167 -23898 -5878 -600 13993 -3435 -22896 -16752 -8519 -6611 66 -2257 -3985 1855 5920 1938
1153 1938 -4987 -11530 -14314 -514 -8270 -4086 -19138 -10060 -3513 7912 13667 2851 9222 12143
1139 12143 11985 9015 9894 8529 352 7799 -2660 8961 1683 -3621 2273 -1901 -10590 -9877 -10222
1124a0222M070Q930K478j9259O229P049o29N700o12j0370k3607J1515K853J4791
1110a084K208Q51K22K98L941m2j7132J889j911j3428M012R558J6434Q588j6050
1095a646l974l720j459O404M322p620K0224j1974k474J8940p062j4419p900P861
1081d497N386j0839n710K511j2099J6165l25k8255J1298K0597N370J898R673J755
1067A2928j9966m84n01J4849k3K474m3r567o374n496m557P419K0948N273k4729
1052g849J229M479O454q29j4161J0668k883j3563j1123J1030J0786j0875q644
1039b5281K4483J1307j0454K482j0881j4618N417J9040j0562p0j215O211m909
1026i050n195P36L26K741J4478k65J889m77j7055P889J8438l848k4939M408K169
$$ plain form
1124 -10222 -6152 2778 5256 -14003 -7774 -725 -1354 4346 3734 -6636 -30243 -18728 -15875 -1084
1110 -1084 1124 1975 2197 2495 6436 6394 -10738 -8849 -10760 -24188 -20176 -10618 5816 14404 -1646
1095 -1646 -5620 -9340 -10799 -4395 -73 -7693 12531 557 -1917 17023 9961 -4458 -12358 -4497
1081 -4497 889 -9950 -15660 -13149 -25248 -9083 -9408 -37663 -26365 -5768 -398 1500 11173 12928
1067 12928 -7038 -7522 -8023 6826 6803 9277 9234 -333 -6707 -12203 -16760 -9341 11607 16880 -7849
1052 -7849 -6620 -2141 4313 3484 -10677 -9 -2892 -16455 -27578 -16548 -5762 -16637 -25281
1039 -25281 -798 10509 55 2537 -8344 -22962 -17545 1495 -9067 -9137 -10352 -4141 -9050
1026 -9050 -14245 -13509 -13183 -10442 4036 3771 5660 5183 -11872 -3983 14455 10607 -14332 -9924 -7755
1011g755L732K861Q167p970J0165l865k322r275J4467J3742j9133R935k906o544
997C299j1968j892L638r518J663J4236k090m321k058O662l445Q792Q928j4349
983b423k744R171p574j2159J3358R183J915j0273l458j436k238l27P84K136j519
968g604p342O278J7252J0702k3175j4617J1203M303j3305k534J029J7656j5017
955a5171j7723N288J5527j7377J3223J8296j0452J713K569K3808j0503j2292k77
942c371p002j0288J2661K499l330n357M559N440p978Q867j0990n11P199P030p885
927h457K4343k478l657K695j2114J2060k901M99j8328p034J435N435j068N095
913d475L272n001p477M333o305J7135R176j824L448o011Q8j3449n85o33j811p577
$$ plain form
1011 -7755 -4023 -1162 7005 -965 9200 5335 3013 -6262 8205 21947 2814 12749 9843 3299
997 3299 -8669 -10561 -6923 -16441 -14778 -542 -2632 -6953 -9011 -2349 -5794 2998 11926 -2423
983 -2423 -5167 4004 -3570 -15729 -2371 6812 8727 -1546 -5004 -6440 -8678 -9005 -8221 -6085 -7604
968 -7604 -14946 -8668 8584 19286 -3889 -18506 -7303 -3000 -16305 -18839 -17810 -154 -15171
955 -15171 -32894 -27606 -12079 -29456 -16233 2063 -8389 -6676 -4107 19701 9198 -3094 -3371
942 -3371 -10373 -20661 -8000 -5501 -8831 -14188 -9629 -4189 -12167 -3300 -14290 -14801 -7602 -572 -8457
927 -8457 15886 13408 9751 12446 332 12392 9491 9990 -8338 -15372 -13937 -8502 -9570 -4475
913 -4475 -1203 -6204 -13681 -9348 -15653 1482 10658 8834 12282 6271 6359 -7090 -7675 -8308 -10119 -17696
897a7696J044M319k202r605J2714J2762r358m590o18J9317lL048j8998j1161N309
882a5718R385K466N762l013J811q514O628J9284J7006P74l826j8520k4256r176
868a9907N437O039K0407R993j5669j1193O742k677n010o256J6313J802j2716J0668
854C973M925j1069r314P036j5635J5739p665p912m966K0669P387r500Q019Q81
840B568J3279L662j0731o480r188Q852J8601k1662j2753j381M003Q406j633R920
826E463j677K56L186k321j8338N892o754J3940R562j2594O819j899q928P81O702
811I0r214j92j2559J5367J5721k2896j8449J378J3884K777j1826J8398l472r907
797b0900P690K485J6126R180j6090j913K666l202r569N978Q007j2539J4082N991
$$ plain form
897 -17696 -16652 -12333 -14535 -24140 -11426 1336 -8022 -12612 -13230 6087 6084 9132 -9866 -21027 -15718
882 -15718 -6333 -3867 1895 -1118 693 -7821 -1193 18091 35097 35871 32045 13525 -10731 -19907
868 -19907 -14470 -8431 11976 21969 6300 -4893 1849 -828 -5838 -12094 4219 6021 -6695 3973
854 3973 8898 -2171 -11485 -4449 -20084 -4345 -12010 -19922 -24888 -4219 3168 -6332 1687 2568
840 2568 15847 19509 8778 2298 -6890 1962 20563 -1099 -13852 -15233 -11230 -2824 -4457 5463
826 5463 3786 4042 7228 4907 -13431 -7539 -14293 -353 9209 -3385 3434 1535 -7393 -6612 90
811 90 -9124 -9316 -21875 -6508 9213 -13683 -32132 -30754 -16870 -14093 -25919 -7521 -10993 -20900
797 -20900 -13210 -10725 5401 14581 -1509 -3422 -756 -3958 -13527 -7549 458 -12081 2001 7992
783G992n663N956k355k347M98J2057k420j7379J1860n018j0428j0755N211M061
769h730q24K679P719P817N557o139N893l808l411K027n05n380r266J0444j7246
754a3173k752J2096J698J1851j3732p761N158J8802k322L553P938K413J419j0567
740A4621q198M344m132k455P59n894Q735J068j0443L02k936O654p071q499J1765
725a380J3521k769j080j1090N696L884q825K116J1285R749j1865k1682q008J0768
711i680R87J0609P503K752j1919m900O334J0646K4231j8177k7401M716k108m132
697a0539K444J2346m237Q158K101j1167p052p444M470K6730r172o826R825N205
683A4842o439P780n443j2308o528J229m729j0995L44O462n438K1575O999l70o463
$$ plain form
783 7992 2329 8285 5930 3583 4081 16138 13718 -3661 8199 3181 -7247 -18002 -12791 -8730
769 -8730 -9554 -6875 844 8661 14218 8079 13972 10164 6753 8780 8275 2895 -6371 4073 -13173
754 -13173 -15925 -3829 -2131 9720 -4012 -11773 -6615 12187 9865 13418 21356 23769 25188 14621
740 14621 6423 10767 6635 4180 4939 -955 7780 8848 -1595 -1293 -4229 2425 -4646 -13145 -1380
725 -1380 12141 9372 8292 -2798 2898 6782 -2043 73 11358 21107 9242 -12440 -20448 -9680
711 -9680 -8693 1916 9419 12171 252 -4648 1686 12332 36563 18386 -9015 -4299 -6407 -10539
697 -10539 -8095 4251 14 8172 10273 -894 -7946 -15390 -10920 15810 6638 -188 9637 14842
683 14842 8403 16183 10740 -1568 -8096 -6867 -11596 -22591 -22247 -15785 -21223 352 7351 6981 518
668E18r020J231O177M954p393K3398n948p447J5098p062p867j1074J3184R2J351
653A0192m59j6728P470K345m245J1139J211j0195P401P314P47J2504o95k5276
639B725o47J3467N49k16L194q67j8505o68L636m135q735p890J7955O89M958p801
623b291K1132J2418j5440j0089j1369j2925O055J2860l914K0120o752r525L828
610D108Q371p560M588N881j3418j6045N707N861R116l731M335M625L00r135m865
595a862J6128K071q341j7799N256K972m397o648l227m756K1590j8789P345K827
581g630J2076J6158k0136R767P31j0544j5661R859J7834j2937l691r19K0676l848
567A1735J8264j1629n195o420j2144N722N936P48K692j1094N181R216j4273J7578
$$ plain form
668 518 -8502 -7271 -1094 3860 -3533 19865 13917 6470 21568 14506 6639 -4435 8749 8841 10192
653 10192 9733 -6995 475 2820 -1425 9714 10925 730 8131 15445 16192 28696 28001 2725
639 2725 2078 15545 16094 15878 19072 18205 -300 -968 2668 -1467 -10202 -18092 -137 552 5510 -2291
623 -2291 18841 31259 15819 5730 -5639 -18564 -12509 351 -3563 16557 9805 280 4108
610 4108 12479 4919 9507 15388 1970 -14075 -8368 -2507 6609 2878 7213 11838 12138 3003 -1862
595 -1862 14266 16337 7996 -9803 -4547 -1575 -5972 -12620 -15847 -20603 987 -17802 -10457 -7630
581 -7630 4446 20604 468 10235 10966 422 -15239 -5380 12454 -483 -4174 -5093 15583 11735
567 11735 29999 18370 13175 6755 -5389 333 6269 7017 9709 -1385 3796 13012 -1261 16317
553A6317o125n588k313L539j984j747O103j6431L394P576N743J0217o621j2691
539f11P83j5167L404O415J743Q376r87N276J1262N907j2558j0222j2484J6639
525G776J1056l18o81j2514K3279j3821p125M059J0302O15k5399j0443n035K6061
511G812J4625P048r106J753j2029J4783J021q404O130j9858k176J916J1979l196
497A2298j1246n147o642K3159M012o90q326O330J7731M441j1530L081j9649j0875
483c053J8700J722N985J529j1262Q987k1044K178n726p185j074Q147j884R727
469E747L110o191l128m848L1499j1330q278j4287N545J0609J3387K632j9858J7471
455B2080L211j9744q774R167j128k2749R821L0913m975j3867k9989K9135J5375
$$ plain form
553 16317 10192 4604 2291 5830 3846 2099 8202 -8229 -4835 2741 8484 18701 12080 -611
539 -611 172 -14995 -11591 -5176 -3433 4943 3956 9232 20494 26401 13843 3621 -8863 7776
525 7776 18832 18514 17833 5319 28598 14777 7652 11711 22013 22628 -2771 -13214 -18249 7812
511 7812 22437 29485 20379 22132 10103 24886 25907 17503 23633 3775 1599 3515 15494 12298
497 12298 1052 -4095 -10737 12422 16434 15744 7418 13748 31479 35920 24390 27471 7822 -3053
483 -3053 15647 17369 23354 24883 13621 22608 1564 3742 -1984 -9169 -10243 -2096 -3980 5747
469 5747 8857 2666 -462 -5310 26189 14859 6581 -7706 -2161 8448 21835 24467 4609 22080
455 22080 25291 5547 -3227 5940 4812 -17937 -8116 22797 17822 3955 -26034 3101 18476
442A8476j2617m902K2667J0118j8627n723o739m525K727P648K824R695q816m986
428G220J732j2768q05K9987j2803P338n856Q736j0642N309j5126l844R258k782
414D954j863j3448K0318l893M438p434R583J1656P467K86k2560m594n306j1523
400a1919R474J7166j3103n948K2611J449J301k0093j3152K8783l618r24j330P389
386A8086q15K691M870J9626l805k1783l942r962n216J3104j0474J7699J3708o972
372B6815q878j3861j338L914p456m09J6718j3283j709P816J010J135L382J0066
358B3922J585j6819N931K753n865j4354L990J2735P562q101K990r280R549j6998
344d00o181L1288J4545p683j7327k072R341j5231M805J3582j0237m449j7436K0780
$$ plain form
442 18476 5859 957 23624 33742 15115 9392 2653 -1872 855 8503 11327 21022 12206 7220
428 7220 8952 -3816 -4621 25366 12563 19901 14045 22781 12139 17448 2322 -1522 7736 4954
414 4954 3091 -10357 9961 6068 10506 3072 12655 24311 31778 32064 9504 4910 -396 -11919
400 -11919 -2445 14721 1618 -4330 18281 19730 21031 938 -12214 16569 12951 12027 10697 18086
386 18086 17271 19962 24832 44458 40653 18870 14928 4966 -250 12854 2380 20079 33787 26815
372 26815 17937 4076 2738 6652 -804 -1213 15505 2222 513 8329 9339 10474 13856 23922
358 23922 25507 8688 14619 17372 11507 -2847 1143 13878 21440 13339 16329 7049 16598 -400
344 -400 -6581 24707 39252 31569 14242 12170 21511 6280 11085 24667 14430 9981 -7455 13325
330A3325J3827m620k839K188j4L530j4484r731j1148J3794j8765J695R322L716
316b04J9286k274j12M09j2096j1521J5327Q08j1270R975r315O262Q111Q103j757
301A9732j4214J7999p993L114j0328Q382N743N135N966p590O011Q998j4923o420
287A9612J88j5833%N357J8768N958l67k6635P455J4569l588Q128q328M728k343
272B7669j8789l632N350p849M56K4710J1497k1417j939n552m253J2167q476o203
258C739P563L02J8840j3271l979J2411j1168j5582J6050K1055O033j2001j5792
245A4200M982K81k1212N048n202J765O821o122L69r83m939N20m341L73K5071J3994
229C0625m266O907j5052m136R74p084N60J7460j491j277J0602O892l836j7165
$$ plain form
330 13325 27152 22532 19693 21881 21867 25397 10913 1182 -9966 3828 -14937 -13242 -3920 -204
316 -204 19082 16808 16696 17105 5009 -6512 8815 9623 -1647 8328 -987 5275 13386 21489 19732
301 19732 5518 23517 15524 18638 8310 16692 22435 27570 33536 25946 31957 40955 26032 19612
287 19612 19800 3967 3967 9324 28092 34050 33683 7048 14503 29072 25484 33612 25284 30012 27669
272 27669 8880 5248 10598 2749 3205 27915 39412 17995 16056 10504 6251 18418 9942 3739
258 3739 11302 11604 30444 17173 13194 25605 14437 -1145 14905 35960 41993 29992 14200
245 14200 19182 19463 -1749 3299 -1903 -138 6683 561 930 -53 -4992 -4472 -8813 -8440 16631 30625
229 30625 26359 33266 18214 14078 15052 7968 8528 25988 24497 23220 33822 40714 36878 19713
215A9713J2713o444j6252K848L479j3567N210J8688m115j4250O446j268J885P850
201B2936k473J111n410m475J3355K594J1171j5172j835l589O407j3077q686J396
187D253n143J1358J4858j0670j630J5014m381N243O790o103k0548O984J1838q973
173A8890L193M493q70j1167Q951m6K546m191m902j2925Q632K5849j4851K960l493
158B3069J2306k4082p356j198j049R371m801N163k761R338R516o226k94q855m687
143G454N963J3273l606j3846L712L651J2941l532j43o140n127n236k433O028L773
128A6732j2963J1877j1416K778M704j9727K761J1576N008Q246Q899R756p489q71
114B9871j3252l059K9940P751j4870j3334p868m656j5299J2981J0890j2127J1139
$$ plain form
215 19713 32426 25982 9730 12578 16057 2490 7700 26388 22273 8023 14469 13201 15086 22936
201 22936 20463 21574 16164 11689 25044 27638 38809 23637 21802 18213 24620 11543 2857 4253
187 4253 -890 10468 25326 14656 13026 28040 23659 28902 35692 29589 9041 16025 27863 18890
173 18890 22083 26576 25706 14539 23490 23444 25990 21799 16897 3972 12604 38453 23602 26562 23069
158 23069 35375 11293 3937 2739 1690 11061 6260 11423 8662 18000 27516 21290 20996 12141 7454
143 7454 13417 26690 23084 9238 12950 16601 29542 26010 25867 19727 14600 9364 6931 12959 16732
128 16732 3769 15646 4230 7008 11712 -8015 -5254 6322 11330 19576 28475 38231 30742 29871
114 29871 16619 13560 43500 51251 36381 23047 15179 10523 -4776 8205 19095 6968 18107
101A8107N250q101J1895o690r357J0990k550Q436l628n284q079P736R107N759
87C3591l72R3r607L882j6851Q641q281M041o611j995N077N466J0957J0893O165
72D5089j0509J354J665P997q637j4769q118O713M240N70k575k264K0955n482L419
57C9648m620o205K947o206j1439Q396p318J831o86n807M168K991P648m773J261
42B1836O11M537p058m369n744p636R303Q364j1966j365J2196M322o66j0562p335
27D468K450O023J3701j0314L026J0405K58r435O004p140L247M599K009J3O899
12C6213j12r452n38R988j8693k112K276L146J252n759Q507K879
0B7595
$$ plain form
101 18107 23357 15256 27151 20461 11104 22094 19544 27980 24352 19068 10989 18725 27832 33591
87 33591 33219 33312 23705 27587 10736 19377 11096 15137 8526 6531 11608 17074 28031 38924 45089
72 45089 34580 35934 37599 45596 36959 22190 14072 20785 25025 25595 23020 20756 41711 36229 39648
57 39648 35028 28823 31770 25564 14125 22521 15203 17034 16348 10541 14709 17700 25348 20575 21836
42 21836 22447 26984 19926 15557 9813 2177 11480 19844 7878 6513 18709 23031 22365 11803 4468
27 4468 6918 12941 26642 16328 19354 29759 30017 20582 26586 19446 22693 27292 29301 29314 36213
12 36213 36101 26649 26111 36099 17406 15294 17570 20716 21968 16209 24716 27595
0 27595
$$ Imaginary data points
##PAGE= N=2
##DATA TABLE= (X++(I..I)), XYDATA
16383d53001L140l662N787J5463Q775J1509M673J0771K6468n427j3235L764O383
16370c78592J4493R494J3848J1832j823J1321J3601J3294P394R959J0965P426
16358b56788Q30J4419J06k30J6046J250K0715J0622J1728M883n66M095J4447O432
16344a52011r855O816J8219J6331M716Q798J1745K653J3264J0357J1577L922j0386
16331f3854K8373J1851n597R651R616L661J1272J2362O893J923n282K025M86J3175
16317C6555R923K707J0062J9079M518K900Q175J0255J2231J889N318N189J7499
16304A46300J4510n731M132J2326R81N967j2695O231K1365J0189q394J8226R415
16291B22822Q339L268J208Q080l147L43J2751J0906O974J816J480J2043j174R083
$$ plain form
16383 -453001 -449861 -453523 -447736 -432273 -423498 -411989 -407316 -396545 -370077 -375504 -388739 -384975 -378592
16370 -378592 -364099 -354605 -340757 -328925 -330748 -319427 -305826 -292532 -285138 -275179 -264214 -256788
16358 -256788 -255958 -241539 -241433 -241663 -225617 -224367 -203652 -193030 -181302 -176419 -176985 -172890 -158443 -152011
16344 -152011 -161866 -155050 -136831 -120500 -115784 -106986 -95241 -92588 -79324 -68967 -57390 -53468 -63854
16331 -63854 -35481 -23630 -29227 -19576 -9960 -6299 4973 17335 24228 26151 20869 22894 23380 36555
16317 36555 46478 49185 59247 78326 82844 85744 93919 104174 116405 118294 123612 128801 146300
16304 146300 160810 155079 159211 171537 172518 178485 165790 172021 193386 203575 195181 213407 222822
16291 222822 231161 234429 235637 243717 240570 240913 253664 264570 271544 273360 274840 286883 285709 294792
16277B94792J1941J5634o711O625N547O17K1546K151n023o92J2242J5979q186
16264C66462J1846J2660o845m014K862J6843K8415r193R773j645K995j3465J5315
16251D32009J8562m086J3408k233J2747J2445L238J729M911K42K15l657J4826
16238E04356j5960J4761J4472P416J5062L687K198o019J0639j4501l004J8450
16226E51557O476j4040j930J737J2057K1371Q789M222j04n988o155P965O322J6473
16212F08752m344K913j1584J1006J8285k455q530K3880j7j670J801P751j523M056
16198F48321K254n775R980j8163P891J8120J7863J6954j2935j0631P619p367o020
16185F68111J4679L382Q80L312P546L388j755k468j667K813m093P283M19J7196
$$ plain form
16277 294792 306733 322367 315656 322281 327828 328445 349991 352142 347119 346427 358669 374648 366462
16264 366462 378308 390968 384123 380109 382971 399814 428229 419036 428809 427164 430159 416694 432009
16251 432009 450571 446485 459893 457660 470407 482852 486090 487819 492730 492972 493187 489530 504356
16238 504356 488396 503157 517629 525045 540107 543794 545992 539973 550612 536111 533107 551557
16226 551557 558033 543993 542063 543800 555857 577228 586017 590239 590135 584147 577992 585957 592279 608752
16212 608752 604408 607321 595737 606743 625028 622573 614043 637923 637906 636236 638037 645788 644265 648321
16198 648321 650575 644800 654780 636617 644508 662628 680491 697445 684510 673879 681498 674131 668111
16185 668111 682790 686172 687052 690364 697910 701298 699543 697075 695408 698221 694128 701411 701830 719026
16171G19026N540q640l041J443j0808J0410o99P446m886o15J9216q272J3323Q99
16157G40342p39R402q529J432q914P763L08L616r078j0671J7630q370P676R785
16143G51653K664r26M955l411l317J2249l163J3057n771k822j556J5319J896p264
16129G73563j8278Q293j9992N081J1871J2034n22j0664J8453O639j8373j3569
16117G54536J6815J5637J6K440j9451J0045n105m036J1881p790o168K6479J0479
16104H05778k6693Q553M159N94R38k383n731J0773j769Q818n656m352j699Q396
16090G99726o043M539P894l790j1465J7652o215j920K507N361K162j675m155k933
16076H01645k284K3065K837j3943J6183J691k6308J7856q190K62J76m074j0030
$$ plain form
16171 719026 724566 715926 712885 714328 703520 713930 713231 720677 715791 715176 734392 726120 739443 740342
16157 740342 739603 749005 740476 741908 732994 740757 741065 744681 735603 724932 742562 734192 741868 751653
16143 751653 754317 753391 758346 754935 751618 763867 760704 773761 767990 765168 763612 778931 780827 773563
16129 773563 755285 763578 743586 748667 760538 772572 772050 761386 779839 786478 768105 754536
16117 754536 771351 786988 787004 789444 769993 780038 774933 770897 782778 774988 768820 795299 805778
16104 805778 779085 787638 791797 792391 793329 790946 785215 795988 794219 803037 797381 793029 791330 799726
16090 799726 793683 798222 806116 802326 790861 808513 802298 800378 802885 808246 810408 808733 804578 801645
16076 801645 799361 822426 825263 811320 827503 829194 802886 820742 812552 812814 812990 808916 798886
16063G98886m281J9750J1159j1906O145l133K583J4861l0467J190J1175O182k30
16050H21914j769O732j559J903P231r490j7850J558J3714m347p097J2809j5074
16037H08675m006M356Q550J3919m785j816P779j2764o028k329Q499N128j6822
16024H08356m891J42N069J3211j7554J788K1491m100j3959n920R194m877P452
16011H15402K518L316n682J0163l715J0385J2399p735q600o915j7013K10N236
15998H09969M8K326J619M357n53P081R593k9384M467O451M63k692M404j161J0261
15983H27249l37J0433j6116j4342J9434m798j9401N351K98J4671J0954O423j1630
15970H28189j444N423k255R517M157j8850n884J2151m148k259j1186m280J3446
$$ plain form
16063 798886 794605 814355 825514 813608 819753 816620 819203 834064 803597 804787 815962 822144 821914
16050 821914 820145 826877 825318 827221 834452 824962 807112 808670 822384 818037 810940 823749 808675
16037 808675 804669 809025 817575 831494 826709 824893 832672 819908 813880 811551 820050 825178 808356
16024 808356 803465 803607 808676 821887 804333 806121 827612 823512 809553 803633 812827 807950 815402
16011 815402 817920 821236 815554 825717 822002 832387 844786 837051 828451 821536 804523 804733 809969
15998 809969 810017 812343 813962 818319 817766 824847 834440 805056 809523 815974 816437 813745 818149 816988 827249
15983 827249 826912 837345 821229 806887 826321 821523 802122 807473 807771 822442 833396 839819 828189
15970 828189 826745 832168 829913 839430 843587 824737 818853 831004 826856 824597 813411 809131 822577
15957H22577J0600J1669k410j0658O22j1487O815O560j2797p869q312L649J5911
$$ plain form
15957 822577 833177 844846 842436 831778 832400 820913 827728 834288 821491 813622 805310 808959 824870
$$ [...]
##END NTUPLES=NMR SPECTRUM
##END=
