##TITLE=1H_EC-3296(V-2)
 CDCl3
 8 sc, 
 9.6.2023
##JCAMPDX= 6.0         $$ Bruker NMR JCAMP-DX V2.0
##DATA TYPE= NMR SPECTRUM
##DATA CLASS= NTUPLES
##ORIGIN= UXNMR, Bruker Analytische Messtechnik GmbH
##OWNER= root
$$ XWIN-NMR		Version 3.5
$$ Fri Jun  9 14:01:12 2023 Russian Standard Time (UT+4h)  she@DPX200
##.OBSERVE FREQUENCY= 200.13135
##.OBSERVE NUCLEUS= ^1H
##.ACQUISITION MODE= SIMULTANEOUS
##.ACQUISITION SCHEME= undefined
##.AVERAGES= 8
##.DIGITISER RES= 18
##SPECTROMETER/DATA SYSTEM= spect
##.PULSE SEQUENCE= zg30
##.SOLVENT NAME= CDCl3
##.SHIFT REFERENCE= (INTERNAL, CDCl3, 0, 15.7766)
##AUDIT TRAIL= $$ (NUMBER, WHEN, WHO, WHERE, WHAT)
$$ ##TITLE= Audit trail, XWIN-NMR		Version 3.5
$$ ##JCAMPDX= 5.01
$$ ##ORIGIN= Bruker BioSpin GmbH
$$ ##OWNER= she
$$ F:/spectra/data/she/nmr/H-F/1/pdata/1/auditp.txt
$$ ##AUDIT TRAIL=  $$ (NUMBER, WHEN, WHO, WHERE, WHAT)
(   1,<2023-06-09 13:59:48.89 +0400>,<she>,<DPX200>,
      <created by zg, POWCHK disabled, PULCHK disabled
       configuration hash MD5:
       00 E9 B6 7A A2 85 ED C7 34 08 36 98 17 FE 4E 26
       data hash MD5: 16K
       67 55 F5 F4 75 A3 29 94 3B E6 C8 EF 08 A9 AA B7>)
(   2,<2023-06-09 13:59:51.06 +0400>,<she>,<DPX200>,
      <Start of raw data processing
       efp BC_mod = 2 LB = 0.24 FT_mod = 6 PKNL = 1 PHC0 = -20629.06 PHC1 = 15.65272 SI = 16K 
       data hash MD5: 16K
       91 70 27 21 7E 28 54 C0 18 15 F2 36 B7 C9 5F ED>)
(   3,<2023-06-09 14:00:15.56 +0400>,<she>,<DPX200>,
      <pk PHC0 = 4.0479 PHC1 = -5.2 
       data hash MD5: 16K
       7B A8 AE 03 B8 C0 68 CA 8C 6A 31 D7 59 58 D5 18>)
(   4,<2023-06-09 14:00:19.01 +0400>,<she>,<DPX200>,
      <abs ABSG = 5 
       data hash MD5: 16K
       0D 8E CD 9D 93 7E 8F 87 4F 7D 18 49 6E F8 51 62>)
$$ ##END=
$$ 
$$ hash MD5
$$ B7 0F D1 D9 B8 86 4F 1C 0F CB D6 D9 87 ED D3 D2
##$RELAX= 
##$RELAX= 
##$RELAX= 
##$RELAX= 
##$RELAX= 
##$RELAX= 
$$ Bruker specific parameters
$$ --------------------------
##$DU= <F:/spectra>
##$EXPNO= 1
##$NAME= <H-F>
##$PROCNO= 1
##$TYPE= <nmr>
##$USER= <she>
##$AMP= (0..31)
100 100 100 100 100 100 100 100 100 100 100 100 100 100 100 100 100 100 
100 100 100 100 100 100 100 100 100 100 100 100 100 100 
##$AQSEQ= 0
##$AQ_mod= 1
##$AUNM= <au_zg>
##$AUTOPOS= <>
##$BF1= 200.13
##$BF2= 200.13
##$BF3= 200.13
##$BF4= 200.13
##$BF5= 200.13
##$BF6= 200.13
##$BF7= 200.13
##$BF8= 200.13
##$BYTORDA= 1
##$CFDGTYP= 0
##$CFRGTYP= 5
##$CHEMSTR= <none>
##$CNST= (0..31)
1 1 145 1 1 1 1 1 1 1 1 1 1 1 1 1 1 1 1 1 1 1 1 1 1 1 1 1 1 1 1 1 
##$CPDPRG= <>
##$CPDPRG1= <>
##$CPDPRG2= <>
##$CPDPRG3= <>
##$CPDPRG4= <mlev>
##$CPDPRG5= <mlev>
##$CPDPRG6= <mlev>
##$CPDPRG7= <mlev>
##$CPDPRG8= <mlev>
##$CPDPRGB= <>
##$CPDPRGT= <>
##$D= (0..31)
0 1.2 0 0 0 0 0 0 0 0.06 0 0.03 0 0 0 0 0.0002 0 0 0 0 0 0 0 0 0 0 0 0 
0 0 0 
##$DATE= 1686304788
##$DBL= (0..7)
120 120 120 120 120 120 120 120 
##$DBP= (0..7)
150 150 150 150 150 150 150 150 
##$DBP07= 0
##$DBPNAM0= <>
##$DBPNAM1= <>
##$DBPNAM2= <>
##$DBPNAM3= <>
##$DBPNAM4= <>
$$ [...]
##$SUBNAM3= <"">
##$SUBNAM4= <"">
##$SUBNAM5= <"">
##$SUBNAM6= <"">
##$SUBNAM7= <"">
##$SUBNAM8= <"">
##$SUBNAM9= <"">
##$SW= 18.05172834244
##$SWIBOX= (0..15)
0 0 2 0 0 0 0 0 0 0 0 0 0 0 0 0 
##$SW_h= 3612.71676300578
##$TD= 16384
##$TD0= 1
##$TE= 0
##$TE2= 300
##$TE3= 300
##$TEG= 300
##$TL= (0..7)
0 120 120 120 120 120 120 120 
##$TP= (0..7)
150 150 150 150 150 150 150 150 
##$TP07= 0
##$TPNAME0= <>
##$TPNAME1= <>
##$TPNAME2= <>
##$TPNAME3= <>
##$TPNAME4= <>
##$TPNAME5= <>
##$TPNAME6= <>
##$TPNAME7= <>
##$TPOAL= (0..7)
0.5 0.5 0.5 0.5 0.5 0.5 0.5 0.5 
##$TPOFFS= (0..7)
0 0 0 0 0 0 0 0 
##$TUNHIN= 0
##$TUNHOUT= 0
##$TUNXOUT= 0
##$USERA1= <user>
##$USERA2= <user>
##$USERA3= <user>
##$USERA4= <user>
##$USERA5= <user>
##$V9= 5
##$VALIST= <valist>
##$VCLIST= <CCCCCCCCCCCCCCC>
##$VD= 0
##$VDLIST= <DDDDDDDDDDDDDDD>
##$VPLIST= <PPPPPPPPPPPPPPP>
##$VTLIST= <TTTTTTTTTTTTTTT>
##$WBST= 1024
##$WBSW= 4
##$XGAIN= (0..3)
0 0 0 0 
##$XL= 0
##$YL= 0
##$YMAX_a= 757425
##$YMIN_a= -880028
##$ZGOPTNS= <>
##$ZL1= 120
##$ZL2= 120
##$ZL3= 120
##$ZL4= 120
##$ABSF1= 15.84385
##$ABSF2= -2.208001
##$ABSG= 5
##$ABSL= 3
##$ALPHA= 0
##$AQORDER= 0
##$ASSFAC= 0
##$ASSFACI= 0
##$ASSFACX= 0
##$ASSWID= 0
##$AUNMP= <proc_1d>
##$AZFE= 0.1
##$AZFW= 0.1
##$BCFW= 0
##$BC_mod= 2
##$BYTORDP= 0
##$COROFFS= 0
##$CY= -3
##$DATMOD= 1
##$DC= 0
##$DFILT= <>
##$DTYPP= 0
##$F1P= 0
##$F2P= 0
##$FCOR= 1
##$FTSIZE= 16384
##$FT_mod= 6
##$GAMMA= 0
##$GB= 0
##$INTBC= 1
##$INTSCL= 3.70164e-10
##$ISEN= 128
##$LB= 0.24
##$LEV0= 0
##$LPBIN= 0
##$MAXI= 10000
##$MC2= 0
##$MEAN= 0
##$ME_mod= 0
##$MI= 1.114404
##$NCOEF= 0
##$NC_proc= -3
##$NLEV= 6
##$NOISF1= 3.799351
##$NOISF2= 2.8
##$NSP= 0
##$NTH_PI= 0
##$NZP= 0
##$OFFSET= 15.77664
##$PC= 1
##$PHC0= -20625.01
##$PHC1= 10.45272
##$PH_mod= 1
##$PKNL= yes
##$PPARMOD= 0
##$PSCAL= 0
##$PSIGN= 0
##$REVERSE= no
##$SF= 200.129998979437
##$SI= 16384
##$SIGF1= 3
##$SIGF2= 2
##$SINO= 5.538805
##$SIOLD= 16384
##$SREGLST= <1H.CDCl3>
##$SSB= 0
##$STSI= 16384
##$STSR= 0
##$SW_p= 3612.71676300578
##$SYMM= 0
##$S_DEV= 0
##$TDeff= 16384
##$TDoff= 0
##$TI= <>
##$TILT= no
##$TM1= 0
##$TM2= 0
##$TOPLEV= 0
##$USERP1= <user>
##$USERP2= <user>
##$USERP3= <user>
##$USERP4= <user>
##$USERP5= <user>
##$WDW= 1
##$XDIM= 16384
##$YMAX_p= 318836303
##$YMIN_p= -58688
$$ End of Bruker specific parameters
$$ ---------------------------------
##NTUPLES= NMR SPECTRUM
##VAR_NAME=  FREQUENCY,     SPECTRUM/REAL,   SPECTRUM/IMAG
##SYMBOL=    X,             R,               I
##VAR_TYPE=  INDEPENDENT,   DEPENDENT,       DEPENDENT
##VAR_FORM=  AFFN,          ASDF,            ASDF
##VAR_DIM=   16384,         16384,           16384
##UNITS=     HZ,            ARBITRARY UNITS, ARBITRARY UNITS
##FACTOR=    0.220516191357247, 1,           1
##FIRST=     3157.37893476183, 0,            0
##LAST=      -455.337828243951, 0,           0
##MIN=       -455.337828243951, -58688,      0
##MAX=       3157.37893476183, 318836303,    0
$$ Real data points
##PAGE= N=1
##DATA TABLE= (X++(R..R)), XYDATA
$$ [...]
9020 623892 609324 591559 584068 576171 561554 542593 517574 516953 499064 493320 484699 471530 483772
9007 483772 465830 466620 471784 470695 461367 457888 445970 427893 407635 409405 409157 396042 395138 381134
8993 381134 390469 385158 377440 376646 382652 372919 376097 386293 385275 391956 380457 372021 371833 369987
8979 369987 371978 377644 365370 341124 350388 365721 366392 365501 353842 358441 363397 358318 348654 358355
8965 358355 362354 364757 371407 367859 373618 385074 391675 384330 377054 371545 379080 392773 395062 391917
8951 391917 403844 389599 378628 387070 390739 391818 390596 400185 410888 405600 404804 409523 412740 420084
8937 420084 431860 432307 427953 430706 431879 437019 441394 440640 436307 454768 456052 464497 464055 468556 481606
8922 481606 487330 484064 497495 513280 514216 530917 533912 538036 537970 567887 558406 563628 566013 557864
8908 557864 570360 577364 589368 592340 583650 586719 583984 605528 613308 612086 623740 638125 634878
8895 634878 635402 636715 642732 654277 665876 671838 686627 700464 715772 736857 741416 756434 763645
8882 763645 762178 774830 787285 814884 838265 849782 872076 889445 908538 922572 950462 955654
8870 955654 963592 968848 998175 1014025 1014953 1037689 1065496 1080141 1085677 1099673 1117048 1154520 1174831
8857 1174831 1191275 1213280 1228796 1258659 1282037 1309150 1332961 1364351 1382908 1414157 1466465
8846 1466465 1496705 1515536 1557726 1610384 1659783 1705666 1767105 1812875 1857590 1912636 1975976
8835 1975976 2031357 2086908 2140803 2191210 2265130 2333678 2401373 2492000 2591524 2668187 2758321
8824 2758321 2871833 2975438 3102543 3247548 3418681 3605969 3839286 4118312 4440584 4799561
8814 4799561 5149084 5480311 5820464 6253333 6852339 7578783 8360238 9102888 9705849 10081388
8804 10081388 10123526 9797636 9280132 8746699 8365199 8166469 8133186 8156908 8145295 8021073
8794 8021073 7742049 7433874 7203281 7080856 7080045 7169214 7365912 7603683 7891332 8224878
8784 8224878 8654802 9161450 9688970 10231985 10796723 11461171 12268340 13213034 14258293
8775 14258293 15393858 16571133 17648336 18459524 18894908 18942078 18633837 18003913 17239143
8766 17239143 16548362 16016740 15483390 14715863 13729513 12731910 11889692 11220785 10683570
8757 10683570 10279942 9956277 9719754 9517954 9358859 9322525 9428669 9636665 9941609 10295262
8747 10295262 10729667 11201284 11690859 12177835 12634327 12985681 13144842 13143012 13166038 13389119
8737 13389119 13825762 14357689 14832000 15089114 14956525 14313892 13298776 12141260 11154904
8728 11154904 10428902 9933282 9604650 9367037 9134629 8859481 8548250 8280660 8089996
8719 8089996 7997966 7979641 8063033 8225624 8481270 8728832 9030346 9394881 9888513 10422621
8709 10422621 11037304 11695120 12499002 13437466 14690176 16306669 18740053 22482872 28364719
8700 28364719 34323908 36951181 33752337 26424642 20259924 16115926 13325834 11275947
8692 11275947 9794916 8693658 7845929 7100193 6516452 6035275 5658716 5312654 4996140
8683 4996140 4694420 4438530 4210143 3997000 3823969 3690521 3569904 3457141 3333164 3218644
8673 3218644 3085679 2973043 2871235 2811933 2766912 2728396 2652369 2593986 2528927 2457844 2408250
8662 2408250 2360110 2312225 2281709 2248307 2210531 2193717 2196197 2183833 2196993 2201603 2197430 2205594
8650 2205594 2212630 2224057 2231803 2244506 2253607 2259864 2264439 2280907 2299892 2317826 2321277 2334055 2356942
8637 2356942 2386957 2396613 2417949 2442383 2475399 2508022 2587687 2671670 2779282 2868578 2996165
8626 2996165 3139575 3330053 3577070 3859195 4206901 4633045 5128989 5591766 5946645 6241690
8616 6241690 6608643 7092572 7527138 7714736 7558524 7242681 7013092 6868425 6704902 6466075
8606 6466075 6148935 5782545 5470784 5244106 5109659 5061088 5054323 5041957 5052977 5095741 5158985
8595 5158985 5259769 5357394 5474527 5647912 5902220 6235038 6549021 6808871 7011208 7216982
8585 7216982 7547583 8071920 8754603 9469427 10027698 10270526 10074199 9500777 8759365 8026474
8575 8026474 7454989 7069345 6842748 6677392 6450005 6100866 5751293 5397544 5147475 5024730
8565 5024730 4979811 4981751 4979091 4923053 4815581 4657584 4504764 4359070 4252824 4213909 4282855
8554 4282855 4386359 4509487 4594830 4588266 4539650 4546665 4606063 4661336 4617805 4409485 4151712
8543 4151712 3925947 3736915 3556932 3352809 3112219 2869739 2656511 2476233 2370220 2302166
8533 2302166 2216939 2141461 2070169 2008066 1938822 1878737 1810315 1741893 1659457 1595278 1513818
8522 1513818 1444023 1377420 1294062 1222934 1149908 1085024 1028533 961034 910115 858416 817720
8511 817720 784583 739235 706703 674229 656264 619752 593577 578700 556910 527747 504793 491178
8499 491178 476986 459522 447630 450997 437620 408180 388947 383588 376417 367696 355271 340887
8487 340887 332766 322710 312923 311510 299300 287702 287261 271813 264696 270559 252806 241135 242267
8474 242267 258804 257153 248567 237517 232092 220041 217182 206521 210182 203752 200394 189887 185668
8461 185668 188579 192617 190726 199415 184368 178227 178858 191597 186451 172206 175659 158286 160402 163058
8447 163058 158096 161537 151773 156852 165954 159214 147637 148033 154179 145222 174968 183153 165214 162587
8433 162587 151916 151938 150545 155567 151567 153711 142639 133120 132609 135837 132697 121091 120525 118731 122596
8418 122596 116358 127731 130136 121191 126955 131810 130160 139013 131371 144689 133161 125125 133941 133049
8404 133049 134377 141439 147832 148510 141697 154517 137214 133850 137268 130379 122025 118090 117132 111243
8390 111243 118906 117055 112599 101431 99872 109517 93353 87765 94856 79082 80489 75627 81647 86664
8376 86664 94050 96932 98164 91403 88134 87043 86861 87321 84108 82004 75889 83891 73690 76408 85853
8361 85853 80269 75188 74381 70737 72011 64026 74548 76180 55548 65960 67196 60873 50526 45985
8347 45985 52539 40100 44505 33276 38689 37891 28070 32727 41034 31373 32058 17692 19924 34695
8333 34695 44644 47810 31476 28320 27724 36127 29693 32251 33799 34228 24006 15246 23433 28071 16269
8318 16269 16224 10066 13819 27460 34384 33752 29159 25258 15657 18897 21547 16287 18947 32549 37040
8303 37040 24588 20424 26681 21378 19507 24084 25139 29221 11958 21824 8117 3316 7160 14028
8289 14028 32151 22753 17328 5203 1081 -795 3804 10642 14119 26072 31613 18139 16769 1516
8275 1516 9625 12641 2515 -2786 19962 16787 12485 18454 15745 14366 24727 19414 6496 13199
8261 13199 18978 29946 24875 22611 19666 9924 19825 24339 22166 35527 40294 48074 40226 33879
8247 33879 46787 60283 43503 34852 42572 46603 46957 45885 48583 28957 24500 37463 40136 41068
8233 41068 37292 32475 34739 54153 69876 78052 70598 96401 105978 130437 154855 206317 229876
8220 229876 200274 164750 138273 116825 102982 92827 81161 69868 87528 76371 69547 59045
8208 59045 43694 47231 34374 38271 44709 49856 31851 30141 37626 23728 21300 19529 16475 -8775
8194 -8775 -5244 -47729 -58688 52577 63332 56355 29696 26078 31691 30792 39034 28788 30825
8181 30825 30687 44254 41331 30937 29593 20684 27055 17014 26170 28971 32271 26695 19264 26918
8167 26918 18105 22368 35856 36281 36579 47825 63931 45808 31988 19064 11540 16616 18419 13705
8153 13705 12279 7929 -3109 -2233 4647 -2297 -4376 -12648 -13746 -3970 -123 11754 1049 5288
8139 5288 -4270 -14275 -27666 -22693 -11100 7475 4419 -15235 -21526 -22226 -17416 -11568 -3568 16015
8125 16015 13412 894 -2948 3795 2579 -582 -816 -1999 -12744 -19259 -16292 -23941 -13374 -14967
8111 -14967 -30838 -28649 -20314 -28544 -24117 -7667 -15997 -19258 -20286 -22174 -14590 -20886 -18623 -16872
8097 -16872 -16981 -16775 -36488 -31918 -12853 -24648 -8117 -15155 1464 -8543 -28754 -18385 -13655
8084 -13655 -6845 2456 6803 4244 -5257 -6910 -18913 -23760 -19557 -14962 -5337 -2795 -7949 -27812
8070 -27812 -34485 -19424 -17230 -2016 -8819 -18984 -14266 -17558 -15228 -7743 -10395 -21643 -15818 -8650
8056 -8650 -1735 -11675 -11537 -9451 -17290 -23603 -22917 -15547 -6014 -13145 -2065 -8508 -8563 -16445 -7712 -1339
8040 -1339 -12295 -20108 -15962 -11396 -8216 -13391 -26558 -25915 -29531 -13494 -12464 -7975 -19436 -23393
8026 -23393 -20370 -23823 -32230 -38147 -33953 -30276 -24824 -19920 -16923 -7674 -3639 -11096 -7101 -10466 -9438
8011 -9438 -5474 -2588 4741 -328 -8437 -2148 -7745 3298 -4398 -5763 -5213 -8705 -10320 -4383 -19176
7996 -19176 -21060 -9207 -4268 -9498 -13313 -7459 -10313 -4871 -8030 -3456 2045 -16017 -15805 -10550
7982 -10550 -11139 -13104 -23360 -25367 -13474 -20920 -24615 -26762 -26653 -30803 -27640 -23325 -18862 -19601 -36565
7967 -36565 -25570 -18119 -24841 -27952 -25798 -14900 -11884 -25422 -21686 -18428 -23559 -19744 -20500 -17299
7953 -17299 -15058 -26716 -6679 -836 -519 -12730 -15514 -5890 -6428 -13551 -9381 -10956 -8376 3280
7939 3280 5903 -8764 -8184 -7993 -8456 -6781 2014 -9958 995 -7610 -13868 -21391 -24765 -10413 -5758
7924 -5758 -5055 -5324 999 -7879 -15858 -21280 -21021 -18377 -4100 -5711 4722 3620 -7156 -5674 10267
7909 10267 20982 7755 -915 -35 -11763 -4522 -8167 -5863 9667 3957 -3671 6491 19283
7896 19283 12233 15207 22367 17676 7713 7010 14957 759 -5968 -8001 2262 -6798 -6337 1162 -2826
7881 -2826 1453 -7289 1546 14594 8881 8669 6729 6058 5425 7718 -1149 -3129 7800 -3078 206
7866 206 736 6902 4515 -679 -1023 3026 13084 14907 19564 11579 1778 1796 -8037 3524 8820 -3856
7850 -3856 15172 24341 20839 15563 4953 8503 1909 5430 -868 555 -176 -1819 -1109 4973 4077
7835 4077 2707 2388 21639 27931 28906 37976 33642 21086 -441 15762 19897 22177 16534 16777 -237
7820 -237 -9158 9816 19906 14484 10713 -22123 22756 46555 33409 30958 21502 32145 22617
7807 22617 23707 37222 41687 29102 20145 22774 38543 48512 49296 28658 27628 23301 25978 28085
7793 28085 24325 33727 47348 33916 35605 37448 47212 48157 50512 59608 50218 54783 49961 54393
7779 54393 47729 48304 47742 45692 42468 54188 66713 66391 67781 73635 76134 58554 55194 71763
7765 71763 81474 80076 74855 85644 84353 76796 76234 79070 79091 76985 88355 90843 86668 86796 87714
7750 87714 102020 108033 112973 129880 136219 136969 136173 139033 124332 138172 154613 173838 178452 192005
7736 192005 211667 234062 250466 267828 309811 366127 447923 506239 540650 513054 466350 432777
7724 432777 427062 432637 461115 509397 550009 570661 541561 465828 394885 335091 307060 272977
7712 272977 248890 230149 215055 202403 189816 198395 192422 180578 170750 187809 188564 180428 185919
7699 185919 178702 163779 175447 187924 179826 186374 189166 189379 192536 190552 196021 196421 203674 214037
7685 214037 219877 224341 230501 221012 227701 229255 247948 254686 242849 265027 281084 286157 289673
7672 289673 294725 314531 314137 333734 336797 351039 373281 387300 400447 430612 466952 495456
7660 495456 535403 582755 650136 716419 814836 942020 1120410 1307788 1449028 1448001 1327313
7649 1327313 1191245 1106040 1091189 1113437 1205365 1340440 1428072 1405100 1241393 1046505 882391
7638 882391 766929 692338 638800 582255 535452 518700 512703 498046 475005 467740 458006 461020
7626 461020 457274 448373 448178 440770 442850 434630 422087 430571 440366 451125 466509 471381 468404 480327
7612 480327 490990 499334 515934 529112 535365 551660 568230 572340 585330 618013 630471 642963
7600 642963 668190 684805 712780 742579 775018 805102 834505 868322 920329 959598 1004801 1055527
7588 1055527 1103946 1164783 1235947 1325740 1411067 1525700 1652184 1814280 2020855 2232832
7578 2232832 2425095 2502425 2469356 2418496 2392029 2396764 2419897 2465114 2521002 2564916 2605137
7567 2605137 2620626 2624822 2596851 2549203 2479377 2386714 2281031 2174712 2052568 1942687 1830040
7556 1830040 1726841 1633093 1530896 1461458 1397685 1342878 1287714 1218412 1168412 1140278 1112040
7545 1112040 1105715 1094157 1083953 1071708 1075040 1083149 1107843 1165106 1237621 1357917 1525826 1661847
7533 1661847 1698383 1609074 1424263 1247748 1119742 1018823 958667 898926 871607 855843 845196
7522 845196 851211 848402 843881 838404 847215 840419 838027 846235 840545 833941 833309 831323 808218 788587
7508 788587 762266 746737 734916 726573 735486 755163 784684 787092 746785 666345 603235 565053
7496 565053 507838 478394 458560 427141 407386 383211 382465 370061 369562 361652 341127 325558 312549
7483 312549 306641 288123 300290 308083 293534 271379 262263 270150 288747 286087 279017 289693 297919
7470 297919 317601 324168 313797 319151 325056 317706 328738 358367 382802 420367 467757 520316
7458 520316 595990 643476 646025 582050 507666 433487 390762 363451 345500 325549 290050 273506
7446 273506 260097 260320 254133 262706 256731 243137 261052 258469 255765 252177 262500 274765 278303
7433 278303 280372 290685 297383 309556 319962 327884 324751 326331 353277 359057 379219 385602 378949
7420 378949 387630 386134 383678 378210 371401 370173 356853 338809 334435 324980 321008 309197 305247 303167
7406 303167 274897 260166 253699 253661 246730 233866 214079 208403 201964 187583 198320 206788 185211
7393 185211 177733 188486 192113 185795 183164 166429 171943 172327 179952 177601 172380 176218 166394 162584
7379 162584 157435 163317 173149 171558 171021 172075 171497 173334 178253 187837 191420 189207 193715 196880 206390
7364 206390 211838 185510 182156 186606 204273 210967 206772 206602 212882 209560 209526 207128 200487 206890 209119
7349 209119 217918 210573 185536 188898 193421 198940 209928 209956 204860 192834 215494 211567 211782 230019
7335 230019 228999 220497 223018 233975 228765 229035 240131 223591 221794 218876 240871 244271 241139 247866
7321 247866 258459 280850 287055 288258 287685 279453 277402 296243 293718 308275 312419 326298 332794
7308 332794 336374 347419 349924 359155 369729 360442 368956 383477 383647 403783 416292 429721 425224
7295 425224 446508 462842 464973 478359 478093 501915 524054 530585 550338 565696 584626 596507
7283 596507 587659 610129 644489 655646 660731 684807 700678 706028 720843 731671 726137 732272 741620
7270 741620 750831 743462 735291 718901 712814 711325 703923 692297 659034 651497 653861 643587 628543
7257 628543 609872 597587 574124 574019 551986 528365 524932 506802 507628 500806 482744 474163 459431
7244 459431 452197 435544 435676 427103 419907 418544 389279 388107 383833 383313 383762 382984 380118 357840 354011
7229 354011 365299 360586 354946 359739 360451 372224 378525 395049 406478 405365 401117 383236 370412
7216 370412 370545 373850 366627 348463 327916 317433 318170 312597 311981 310252 308529 314984 321481 310597
7202 310597 297523 318728 317533 311351 312205 310913 304169 316562 321631 314951 320840 316370 312389 320736
7188 320736 308826 313452 310518 324505 325789 328640 328286 327507 330795 344031 351675 349766 339016 333853
7174 333853 347535 352412 356433 356017 348595 341625 357045 364617 357484 368999 366071 359314 366256 380387
7160 380387 395129 397284 398880 395113 403665 413707 417496 422592 435049 435088 443952 441027 451978 457666
7146 457666 462365 477890 490163 491572 487237 497939 518723 528784 536178 534917 548917 570327 581979
7133 581979 581587 607788 643878 660369 675708 680785 694401 708738 719807 731803 756307 789146
7121 789146 816405 823988 838547 869545 889963 913522 933548 964297 1006980 1037878 1081587 1135210
7109 1135210 1210273 1305087 1435114 1579934 1736626 1870438 1910828 1846727 1762850 1711830 1694231
7098 1694231 1722443 1795153 1913193 2008988 2023874 1956217 1845767 1749990 1682137 1638710 1607577
7087 1607577 1597453 1611401 1613377 1612363 1623780 1646814 1676342 1708248 1739925 1776684 1791996 1838679
7075 1838679 1875425 1920323 1984819 2048324 2098039 2165978 2247344 2327075 2408624 2490354 2612014
7064 2612014 2731195 2874965 3034771 3221724 3415582 3577340 3657000 3684323 3710660 3773924
7054 3773924 3881821 4025659 4222890 4439759 4621684 4736323 4791969 4840684 4932817 5076677
7044 5076677 5242392 5413011 5630561 5875875 6164870 6473684 6809350 7185298 7596884 8051986
7034 8051986 8563803 9125642 9717063 10369717 11091571 11846420 12645706 13485586 14346440 15189999
7024 15189999 15948626 16602263 17093803 17378894 17444733 17243891 16787377 16144060 15355617 14472817
7014 14472817 13539329 12629363 11750229 10891598 10085177 9348010 8666666 8050335 7499495
7005 7499495 6987941 6528585 6116189 5735462 5379738 5066878 4779748 4528460 4290758 4061869
6995 4061869 3862576 3662281 3481957 3332610 3190976 3052890 2910129 2787620 2669314 2562844
6985 2562844 2487083 2367481 2275328 2194186 2118176 2029993 1952006 1880707 1822582 1761399 1697927
6974 1697927 1636241 1585905 1541223 1493646 1457521 1406972 1362516 1319980 1270581 1241991 1207222
6963 1207222 1172023 1138743 1102956 1074074 1043115 1021400 995458 946585 910849 909748 877899 837273
6951 837273 819420 787145 766538 753697 741267 719802 703568 694075 658118 646895 622541 612691
6939 612691 613380 593847 567601 555398 536130 531144 517247 499442 478323 462907 461136 457690 441543
6926 441543 438801 431141 413041 403927 404764 388418 370287 356090 351912 352155 350416 347519 344138 333660
6912 333660 323726 324362 314613 308334 319529 308297 285281 285671 285828 289543 296727 290311 283547 283141 274748
6897 274748 269385 272554 262366 257512 254332 257236 264252 255202 243112 239523 243083 243628 239957 232075
6883 232075 225387 230027 246326 243150 249274 233242 220941 231158 239365 258458 256477 251569 256078
6870 256078 259364 267317 260717 276101 281324 285754 274304 269247 261707 251688 235248 217634 202561
6857 202561 204286 202804 198061 184578 193167 168447 161588 170617 165060 151680 140988 141107 131678 139363
6843 139363 135457 126505 129656 116104 103637 116654 120926 112943 112705 121359 112807 121093 118175 111538
6829 111538 105437 107840 95746 107375 101429 109529 122098 128636 149000 161810 141315 126996 119856
6816 119856 116815 112492 102105 99226 92512 83811 73062 63836 62467 61578 68570 66067 58998 65391
6802 65391 61495 60885 66609 67985 53357 57304 57880 47676 53820 51136 71867 59283 51712 60816
6788 60816 57687 58269 54798 54405 46839 51446 63126 61638 45573 46909 40586 37672 40662 42047 43088
6773 43088 47189 51646 52287 49282 50900 44484 31439 30729 26386 23491 20874 22132 28363 19377 24156
6758 24156 30787 34168 26837 20803 33007 26665 14244 30950 47572 33278 24512 39997 39874
6745 39874 50018 56651 53875 54253 38682 39247 48911 38398 33647 34909 32599 19540 21593 34443
6731 34443 33266 34488 29659 22257 23938 25341 17284 15725 10715 20373 16651 17695 16820 7684 3245
6716 3245 9477 33478 28557 29176 22929 27348 32703 26728 24460 25906 22778 16839 20639 23806 8338
6701 8338 6610 2321 11073 9381 13115 12612 13606 17134 4106 14758 16156 22461 21894 20310 23167
6686 23167 24875 26168 29550 14033 16685 28556 23201 13019 15861 21219 4545 6661 22735
6673 22735 18918 13003 9472 10102 1852 1311 13107 14965 -6514 -7360 1447 -2295 -10123 -12794 -5999
6658 -5999 8489 12694 -2611 -2313 -476 -14369 -12670 -4211 -7775 -28445 -20085 -10868 5318 1085
6644 1085 3640 3091 -8601 6302 2974 414 -6557 -3678 11068 11788 2607 3807 -5485 3119 -658
6629 -658 -2820 770 -6492 -4536 -9969 4103 8703 -4988 1222 5278 11245 13548 4709 6203 12697
6614 12697 12591 5000 1593 -2597 -9765 -12213 -17006 -15170 -3572 -8582 -10520 -9645 -17551 -9133 6143
6599 6143 9781 2572 -1062 1347 -710 -16547 -10445 3070 4196 -5224 -4483 -9456 -13409 -18457 -17369
6584 -17369 -13632 -15204 -5949 7083 -5319 -14295 -6431 4110 4188 3558 -9083 -831 5591 -6759
6570 -6759 -14773 -20954 -7988 -11443 -671 14423 8222 -11444 -17084 -2765 -3147 -26971 -32491 -23391
6556 -23391 -14347 -12392 -21241 -16912 -14370 -19440 -18154 -12035 -12146 -18930 -16397 -8952 -23691 -30983 -4580
6541 -4580 -2546 -6478 -17477 -33664 -15238 -2392 -1403 -8643 -11251 -13631 -9531 -8361 -13834 -16909
6527 -16909 -17135 -13429 -21022 -14254 -15978 -33037 -32111 -26331 -7579 -383 -3321 -5369 -14183 -12763 -17739
6512 -17739 -12242 -11077 -15147 -18007 -13409 -10270 -15786 -27215 -10037 -8766 -13109 -12681 -9903 -9260 -4434
6497 -4434 -2409 -2504 -3632 -6504 -322 -3118 -9113 -12968 -10310 -15993 -10213 -10504 -8016 -15020 -14001 -7083
6481 -7083 -9742 -6979 -23259 -27753 -22766 -21829 -16268 -8069 -18325 -16502 -23369 -6719 3014 -10918
6467 -10918 -7438 -22079 -16775 -7201 -10579 -16327 -9184 -673 -6996 -21582 -28852 -23270 -27635 -33184
6453 -33184 -27359 -13266 -3648 -15237 -15804 -16159 -13824 -18548 -15757 -12618 -6317 -14414 -20997 -14710 -28959
6438 -28959 -35362 -35768 -24026 -22152 -14682 -19049 -22959 -18357 -12719 -16040 -14419 -9249 -12654 -4707 -5280
6423 -5280 -8429 -16124 -19757 -4981 -6828 -19817 -21552 -13719 1153 -987 -9187 -23199 -18831 -25207
6409 -25207 -38555 -30042 -24993 -22893 -13305 -12506 -21173 -13856 -11699 -18109 -8143 -24001 -28846 -15690
6395 -15690 -29247 -24999 -7724 -24803 -28413 -22540 -27171 -17636 -21386 -19838 -15760 -17068 -16342 -21773
6381 -21773 -11760 -32654 -37713 -32796 -43941 -25535 -6015 -6072 -18771 -8942 -10951 -24120 -8281
6368 -8281 -11394 -8160 -11348 -12116 -19551 -24455 -26097 -24118 -15357 -5803 -6922 -18964 -16770 -12170 -7794
6353 -7794 -10514 -22327 -22430 -18370 -14242 -14131 -27997 -10329 -13799 -18701 -19507 -19871 -4554 -166 -3997
6338 -3997 -14486 -23023 -15735 -13940 -12954 -26197 -33319 -24032 -14768 -30156 -23747 -18558 -10415 -14278
6324 -14278 -28303 -12316 -16249 -18774 -25762 -27843 -22118 -16678 -20213 -26833 -5316 -19839 -27772 -16021
6310 -16021 -10922 -7824 -14491 -19212 -22336 -26551 -26678 -5375 -3538 14806 4930 -2360 -4736 -22743
6296 -22743 -33396 -23572 -13924 -25852 -23533 -25116 -7997 -8072 -17538 -9137 -472 -6913 -9736 -12007
6282 -12007 -16098 -19079 -10459 -16170 -14606 -20363 -21102 -13231 -18916 -20130 -29589 -31018 -23957 -22552 -27662
6267 -27662 -21854 -18943 -16298 -5524 -931 -6810 -18071 -10950 -12722 -11491 -4779 -2352 -7732 -10076
6253 -10076 -19768 -13985 -8108 -7674 -12114 -23137 -21669 -23366 -24258 -17093 -13043 -12285 -8812 -24250 -30600
6238 -30600 -15876 -11444 -16820 -11887 -8180 -19095 -11605 -4546 -17595 -16164 -19827 -19774 -27897 -11727
6224 -11727 -21421 -28198 -14161 -3956 -3834 -8468 -18160 -13961 -22813 -11163 -16796 -20326 -4862 -17536
6210 -17536 -16404 -14056 -19602 -16604 -13130 -28096 -35878 -24794 -13445 -14048 -16388 -25971 -23402 -17573
6196 -17573 -24101 -23326 -11267 -4771 -18780 -17123 -18556 -17933 -16669 -19215 -15852 -15578 -15805 -15431 -7763
6181 -7763 -5097 4822 -5824 -20252 -23655 -29557 -21845 -14007 -17741 -28570 -16697 -1524 -8596 -14217
6167 -14217 -2272 1166 -5620 -21772 -29454 -23625 -23515 -26838 -32496 -11127 -9489 -12234 -24091 -32601
6153 -32601 -29526 -18917 -18568 -28497 -26755 -26281 -20778 -29126 -24344 -22667 -29200 -33556 -33651 -35214 -31993
6138 -31993 -18175 -18144 -9551 -14216 -18304 -23379 -27067 -33433 -40007 -23513 -16960 -27789 -17674 -11502
6124 -11502 -15214 -14093 -10931 -11700 -10816 -3845 -3772 -10248 -11400 -4259 -14282 -18431 -5571 -15810 -5573
6109 -5573 -11542 -15331 -8596 -8651 -3381 -10041 -10668 -1689 -6545 -9982 -3306 -12809 -20340 -26941 -22269 -20140
6093 -20140 -17438 -18985 -25613 -19975 -18449 -28167 -20373 -24437 -30243 -40685 -46978 -27979 -14543 -11879
6079 -11879 -3776 -11180 -16304 -21307 -32734 -22873 -14979 -17813 -28751 -24676 -22100 -19623 -15691 -8061
6065 -8061 -12122 -13923 -18079 -19465 -16633 -21573 -21827 -30854 -35627 -31128 -15310 -24269 -16529 -8163 -18258
6050 -18258 -8730 -14671 -23356 -25987 -17547 -21127 -17941 -15021 -25111 -24314 -19082 -12304 -9295 -17674 -12018
6035 -12018 -8850 -19723 -16046 -22488 -24742 -32166 -27331 -15864 -13825 -11638 -18125 -10093 -6164 -21916
6021 -21916 -21454 -30493 -33633 -30589 -29778 -40411 -41007 -20921 -8035 -9516 -28329 -25053 -25554 -23719 -17571
6006 -17571 -10689 -7650 -27226 -45545 -31425 -12546 -26459 -10338 -11586 -25252 -34708 -28969 -23552
5993 -23552 -22465 -21256 -18035 -10279 -7909 -13135 -23866 -19253 -16303 -12337 -4525 -10628 -21118 -6631
5979 -6631 -16737 -19794 -22047 -19112 -14935 -13754 -5564 -12272 -7169 -13444 -15608 -12504 -30256 -18035
5965 -18035 -17558 -24877 -28446 -17228 -17908 -29440 -19357 -16122 -10063 -19452 -33630 -16972 -11049 -10625
5951 -10625 -16355 -3865 -920 -19259 -15647 -24829 -21720 -13236 -14410 -24475 140 78 -10034 -22981
5937 -22981 -27558 -12292 1681 -4272 -17110 -14049 -16870 -10364 -15553 -8419 2197 -4615 -16045
5924 -16045 -10430 -8743 -25257 -32035 -34148 -31418 -24180 -27606 -19724 -21129 -31053 -31018 -22489 -15008 -14430
5909 -14430 -7855 -5621 -19137 -27869 -14807 -9381 -15749 -11344 -7532 1153 1015 -510 -2841 -9863
5895 -9863 -9028 -9562 -9344 -9938 -5637 -8533 -12943 -13472 -20078 -20888 -11734 -6879 -5642 -9345 -11227 -9946
5879 -9946 -18050 -19968 -9750 -21508 -16294 -22000 -11027 -12419 -7256 -2610 -14200 -8852 -4838 -5816
5865 -5816 -7638 4665 -2345 -12785 -12218 -1423 -1356 -549 -2366 -9515 -10119 -4735 -14866 115 -10570
5850 -10570 -14307 -2603 -12929 -19053 -19197 -1729 157 -9324 -16946 -2357 -2121 -15095 -7838 -19594
5836 -19594 -16557 -100 3838 -4277 2580 -1251 -8883 -15740 -12546 -9729 -1093 -4277 -8633 -2489
5822 -2489 -8079 -4067 -6677 -4607 -6459 -13657 -9051 -11856 -13982 -14572 -561 7269 -558 -15477 -12417
5807 -12417 -8254 -6032 1900 -7600 2749 -3735 -648 -11521 -5666 -18003 -13468 -11470 -12914 -7882
5793 -7882 -3966 -7688 -10896 -17978 -24032 -11433 -10517 -13102 -12262 -23144 -19127 -13575 -7772 -6470 -12944
5778 -12944 -2190 -1526 -139 -21452 -18012 -24760 -19987 -13330 -16242 -23440 -13452 -11271 -6797 -22711
5764 -22711 -10565 7794 -1326 2144 -7913 8443 10371 9864 5229 -6788 -11801 -9911 -18704 -21193
5750 -21193 -11376 -11313 114 -8386 -6686 -15464 -15189 1787 -3888 -6998 -11302 -10621 -13974 -16006 -17015
5735 -17015 -16761 -14630 -513 -12097 -24540 -16633 -12988 -5934 -2399 -12097 -17377 -9270 -10781 -16248
5721 -16248 -5560 630 -8711 -24519 -19569 -18924 -24223 -18155 -7004 -9454 705 -11865 -7460 -3387
5707 -3387 1875 -1264 -14990 -20632 -23494 -370 -1564 -5490 -15901 -8873 -7544 -12294 -12289 1021 5956
5692 5956 -1215 -4435 -6833 1967 -6213 -11752 -2406 -6143 -7347 -13720 -1873 -3521 -16059 -21147
5678 -21147 -12225 -19665 -21759 -18928 -16655 -6833 -18924 -7719 -3812 -7318 -6552 4933 -3966 -9630
5664 -9630 -8364 -14811 -16344 -14456 -6248 -6615 -8525 -6199 3883 6066 -599 -14353 -18504 -10201 -7805
5649 -7805 -169 -11399 -2679 -822 1821 -7925 -2307 6697 -10047 -6613 -8769 -7829 -4217 16231
5635 16231 6576 -4344 -6302 -1039 -5229 945 4912 3904 -11689 -14938 -3618 -1951 9631 8109
5621 8109 11943 6903 -2108 8787 7695 8902 4138 -3977 -5109 -1497 2139 -2982 -2975 -11967 4059
5606 4059 544 2196 9514 11426 7 5230 1937 -12644 -9622 -7963 3 8171 16440 5426
5592 5426 3910 4943 20196 28999 16248 21901 11465 6750 17663 10657 21022 35476 31618
5579 31618 16880 27587 21464 5087 8929 21975 26017 28602 31770 24856 26712 24250 15569 18499
5565 18499 28603 39064 41320 41556 38189 40607 49739 40449 30729 42017 37807 35002 58161 56394
5551 56394 65459 75689 80105 91678 84073 76932 75007 65391 69564 72133 68120 60900 67544 62552
5537 62552 46873 40709 45047 61097 63708 52963 70069 68662 53159 61084 43998 53080 53779
5524 53779 67196 68721 53095 57178 72087 83914 78213 82198 79365 81874 83233 95781 90459
5511 90459 87285 89424 76990 71324 68564 65232 57662 53835 54271 54993 48084 61940 66488 58784 52010
5496 52010 57236 51799 41365 28685 41281 42396 36575 45459 44822 57155 57190 61877 57089 55934
5482 55934 56969 62516 52719 45044 51408 53027 51934 40170 38020 40900 36043 54935 49605 39829
5468 39829 42664 47720 59532 46695 44587 43933 45241 47796 38298 51329 45994 36281 49324 51537
5454 51537 52905 44496 43731 43651 51682 49109 38957 34995 48031 56742 56753 56618 63845 80361 85265
5439 85265 91462 96637 113347 113996 118712 124260 143224 127421 133365 136543 124783 121561 123325 115219
5425 115219 112981 104775 109291 115884 106978 104477 92677 99022 98840 102930 111840 122375 126159 134602
5411 134602 154783 153314 142122 152945 186496 212328 240765 278412 304660 326871 314904 286294
5399 286294 261020 232391 199881 188660 166093 146810 140409 127790 123082 125424 109270 122426
5387 122426 126268 122332 120905 126666 136235 128803 134016 146443 140579 157259 180874 194608 212670
5374 212670 238819 268242 301827 312762 321566 311398 281443 260100 229373 199914 180143 159812
5362 159812 151694 134319 117471 111248 102231 102612 104026 111367 108584 94004 75728 76432 88673 91713
5348 91713 87344 89533 82749 98771 102276 104555 121487 125690 132834 140205 131265 132301 109310 103493
5334 103493 99326 88492 89439 78831 73891 71745 83607 68404 65614 65381 53904 54353 41577 50491
5320 50491 67842 62202 48818 43742 50377 54791 55625 51701 56181 44541 41057 45008 45754 54541
5306 54541 50638 45233 40451 43305 49716 43077 44517 57934 54623 38294 42512 48065 39871 39942 33060
5291 33060 41336 52820 54295 56272 49350 41585 40490 42169 48720 63008 50623 44501 54301 58813
5277 58813 63733 60255 55144 54890 44142 49515 63043 52529 39111 33516 37551 51136 49299 51895
5263 51895 49053 50849 61682 69925 66239 56311 48338 51656 49292 38819 45787 53195 46365 47030
5249 47030 62994 58624 50640 56048 59152 62916 65211 67692 66930 61287 66803 68005 77067 74274 83247
5234 83247 90437 84173 81204 89693 83688 84161 80570 94497 91747 94805 93662 94336 87167 97984 106414
5219 106414 121156 107249 94270 96194 104580 116089 123199 125118 117191 114078 114257 110183 117318 124426
5205 124426 123906 118574 120504 142683 138531 143442 145185 145006 150393 165646 177413 179357 175757 179078
5191 179078 177367 181483 184087 170866 181047 196978 187454 198434 199227 212322 211132 215700 194574
5178 194574 209140 238628 244154 246116 253587 273355 269524 276010 298897 297326 310611 319178 326303
5165 326303 345754 373419 385185 398922 391210 405747 431107 458725 475408 480293 508080 536633
5153 536633 539619 554292 585627 615523 640673 675075 711202 745625 786780 833913 893930 955140
5141 955140 1035290 1121326 1223312 1349605 1499765 1679370 1906416 2200672 2570075 2982570
5131 2982570 3437421 3915579 4366286 4654907 4777294 4753072 4602848 4278657 3799790 3295521
5121 3295521 2822187 2384895 2010720 1697822 1462924 1303819 1153520 1025989 940809 855444
5111 855444 779108 715041 667437 625960 570750 531579 500900 479842 446951 415402 393345 381856
5099 381856 377011 366178 354461 338565 329809 323872 314706 302080 291705 272251 256127 255883 244568
5086 244568 247216 246858 221796 225428 219369 207417 210967 204462 200711 212758 211512 192470 194602 202295
5072 202295 201130 197973 197228 190148 184837 200785 193970 184875 196677 201717 195233 199815 209084 226646
5058 226646 249904 255869 250030 251429 263034 265844 257124 242062 220787 212428 202706 207936 196033
5045 196033 188968 195973 190949 196879 206500 221391 234127 230796 241513 256869 247178 243451 252498
5032 252498 253508 239062 226365 211004 210273 211427 192576 178225 195359 195306 186015 199488 214199
5019 214199 229360 236027 234354 234216 242413 240282 232656 220862 213186 197314 183939 176875 169797 165070
5005 165070 157375 169178 175895 177593 186418 200886 210956 210692 211011 202330 208738 209868 193168 178564
4991 178564 174187 161873 137421 127891 126015 120052 111682 93209 83084 80733 67539 67758 68437 63566
4977 63566 69116 70130 64484 63325 58923 52984 55881 54884 50891 60123 53944 51332 50997 55545 53964
4962 53964 44856 40083 49824 55440 60500 41887 39792 37289 40198 50204 46661 40607 33808 52285
4948 52285 58623 61220 52125 47162 45678 39189 27366 34823 43303 32602 42304 44526 40371 41303
4934 41303 42531 42126 32567 37523 49231 51828 50763 39596 34475 43100 45017 34518 45452 57153
4920 57153 53183 35236 26413 39989 45142 42901 42893 42967 28748 37988 21414 15138 34815 40655 27983
4905 27983 30869 45808 36979 36423 27835 32260 26996 26947 30376 31288 33231 30136 36170 34590 28297
4890 28297 33152 26162 24405 39450 33377 31184 26318 21823 29736 32692 31303 32900 28925 21017
4876 21017 32089 27740 27790 16583 24524 28815 54889 47472 43432 40738 28835 32263 19254 31437
4862 31437 39266 32395 22073 36965 21593 10833 25782 28657 23213 26380 32092 48668 47343
4849 47343 35621 34374 41875 36002 41475 35085 36943 46304 45293 43055 50257 43258 45943 50190
4835 50190 46171 41979 54398 54498 51560 33691 32951 58733 72718 74734 63368 56383 57227 50594
4821 50594 53224 65595 59289 47409 46055 51900 51489 56364 38595 34904 37556 51973 45111 36879
4807 36879 44977 42410 50089 53521 50257 46418 46137 48021 44991 51293 38063 45377 51615 50177 47637
4792 47637 50581 60867 64250 53651 59787 64858 53302 54915 44371 44575 47867 56604 59475 58074
4778 58074 43775 44517 51020 43438 44508 43797 60010 61895 62633 61257 50475 65617 64057 70726
4764 70726 70215 69368 49957 51918 64910 59477 61779 68835 69775 69168 74876 69917 74145 70176 71246
4749 71246 86214 88630 80054 84527 95275 99013 78830 87477 110834 104061 99488 100971 102051 103491
4735 103491 120507 126705 135611 148036 143469 136028 139821 143557 141729 129301 124712 121935 123611 126024
4721 126024 132130 137086 134895 134634 133614 135417 126068 128148 128578 126843 122232 122338 138682 127446 134959
4706 134959 154122 149349 155677 155851 154690 171829 178724 181909 187535 184670 199630 205279 217567 225611
4692 225611 229785 225922 226224 249923 267311 248218 245544 258184 248154 226007 231934 238692 226306
4679 226306 221909 221892 216211 220147 211778 205615 200944 201221 202823 203317 204982 211640 202792 213554 213040
4664 213040 220435 231886 261511 268612 263643 265489 291699 283265 277901 278774 271170 273307 279409 286108
4650 286108 285972 285613 274495 271093 258492 270404 260758 260342 247581 236600 231335 247512 254278 246022
4636 246022 246172 251272 241728 257179 257608 262240 268870 269236 263836 276318 285408 289807 283482 270952
4622 270952 253384 251838 250593 249553 235462 242650 246135 248015 247127 246534 275921 263435 257984 268975
4608 268975 262575 268094 287859 306225 304796 321492 322629 314721 321070 312521 303223 301477 309704 313358
4594 313358 308684 286324 290403 291310 281820 273377 267830 272181 259719 253889 248793 237388 247329 243614
4580 243614 240755 245402 254891 261868 256070 246290 256814 274374 279751 279509 276929 291254 293911 284883
4566 284883 281935 278179 270682 275977 273312 261364 266930 268929 276708 274902 279430 295229 285218 276288
4552 276288 283289 284981 273222 274336 284830 289533 303354 302847 279926 283001 296424 312325 325318
4539 325318 320528 313843 319581 329254 343180 337873 340096 344156 346312 351970 356053 343444 348340 363268
4525 363268 366464 364798 367518 381721 385919 395349 392991 391804 400993 403244 398643 408342 405607 411858
4511 411858 429361 432008 432301 442047 453496 448634 456228 459208 448074 466194 462544 475695 483028
4498 483028 503657 496039 497743 508091 522244 518869 541172 547313 539497 548331 570409 582427 589117
4485 589117 595418 596303 604216 620503 636480 642995 642084 652207 661155 670058 687129 694541 698183 706886
4471 706886 740302 738565 754015 762773 767346 784488 812777 826187 836730 844608 867086 877296
4459 877296 880995 897233 900062 906360 922016 932865 961644 982926 1012734 1031152 1052249 1055813
4447 1055813 1063403 1095190 1113979 1149563 1164728 1189018 1209162 1235909 1274273 1280937 1295769 1323265
4435 1323265 1356785 1390323 1415183 1442173 1476567 1516298 1551946 1591754 1624244 1663370 1718642
4424 1718642 1769812 1825734 1892198 1956857 2048860 2132942 2233315 2339633 2448469 2548069 2642257
4413 2642257 2716229 2758145 2801305 2832720 2865394 2878998 2871588 2861363 2863548 2866569 2887862 2894914
4401 2894914 2944533 3014274 3096236 3187458 3289730 3391608 3493861 3597258 3680064 3730417 3757086
4390 3757086 3742257 3726372 3704275 3678057 3653066 3635982 3616849 3574507 3532055 3485356 3450255
4379 3450255 3416491 3401852 3422351 3466113 3529483 3604548 3680268 3745263 3762288 3747721 3725862
4368 3725862 3680690 3646804 3632771 3634416 3655142 3718606 3799267 3885128 3950933 3973381 3964911 3928202
4356 3928202 3850293 3770133 3670493 3526359 3367322 3168698 2980252 2788017 2620888 2490481
4346 2490481 2373906 2245732 2151120 2072120 1986680 1906872 1852898 1790577 1753408 1723645 1670920
4335 1670920 1625895 1593437 1565620 1539932 1530460 1518868 1510774 1490350 1473411 1467744 1458434 1458072 1467848
4322 1467848 1452501 1439366 1429893 1435411 1446405 1438570 1447297 1449072 1445323 1463314 1490477 1510700 1519852
4309 1519852 1552482 1583159 1608803 1642236 1668349 1698607 1730560 1778325 1810468 1852297 1874631
4298 1874631 1911154 1960295 2008467 2057891 2122685 2206503 2279946 2352785 2451198 2551819 2648629
4287 2648629 2748516 2863344 2976927 3068770 3168870 3244572 3303482 3357541 3400291 3433281 3441047
4276 3441047 3433941 3396894 3368157 3359359 3331631 3307455 3308080 3299523 3289094 3264592 3225037 3161113
4264 3161113 3093917 3056391 3028964 2987046 2958404 2954624 2956376 2958454 2956969 2972336 2978680 2992525
4252 2992525 3007025 3024956 3029780 3052869 3059827 3070479 3076592 3084435 3083780 3079292 3042809 2991719 2922960
4239 2922960 2849922 2763781 2695882 2641016 2572361 2516478 2466052 2434962 2400435 2386957 2368364
4228 2368364 2361110 2350818 2338297 2308893 2262205 2222042 2159172 2112960 2062649 2004741 1953081 1923233
4216 1923233 1892252 1847307 1821198 1794107 1769783 1742179 1725805 1720432 1716098 1718376 1726093 1720824
4204 1720824 1741404 1767322 1820823 1894758 1983971 2075477 2174344 2259063 2305848 2305203 2253400 2160820
4192 2160820 2046207 1913047 1784128 1686943 1592723 1518267 1483797 1450853 1419167 1394495 1376116
4181 1376116 1347281 1322986 1309434 1288101 1272818 1246136 1237877 1229255 1229075 1234832 1234293 1219928 1240448
4168 1240448 1253997 1263587 1259487 1269956 1270220 1272938 1273035 1264242 1267696 1251240 1252969 1259868 1253383 1245211
4154 1245211 1245341 1249889 1257910 1271481 1272950 1278389 1294442 1307254 1310668 1324386 1339063 1334366 1339147
4141 1339147 1347106 1360914 1375557 1390312 1403644 1437682 1462179 1475165 1495385 1517205 1528979 1552635
4129 1552635 1571222 1590652 1599881 1618079 1625635 1619969 1642118 1650686 1664434 1679642 1697470 1710944
4117 1710944 1728840 1747411 1770365 1810795 1834070 1877144 1913972 1961252 2022110 2072628 2110860
4106 2110860 2147158 2192956 2235625 2244447 2245046 2239493 2239960 2239479 2246010 2252471 2277398 2315503 2363918
4093 2363918 2420074 2479328 2555337 2617346 2698737 2760887 2811553 2842123 2849248 2874975 2919517 2958060
4081 2958060 2975009 3034475 3099611 3166189 3241642 3306076 3367462 3410003 3473068 3529796 3582015
4070 3582015 3657720 3753451 3865845 3980813 4110313 4246670 4385893 4536309 4652732 4759097
4060 4759097 4862806 4986614 5114483 5236135 5381743 5553964 5731119 5917650 6084929 6286240
4050 6286240 6508180 6735746 6985080 7259997 7529430 7814710 8133242 8520219 8991332 9580510
4040 9580510 10365653 11274380 12219789 13149026 13983196 14576839 14741039 14425756 13918192 13381091
4030 13381091 12864127 12443187 12203219 12197311 12404205 12828946 13438574 14215226 15142942 16088770
4020 16088770 17081218 18189626 19499231 21158929 23188196 25231642 26457191 26180294
4012 26180294 24536275 22532637 20956759 19871862 19014505 18168171 17246132 16405974 15754987
4003 15754987 15295122 14998749 14858525 14845957 14955289 15166965 15454462 15859564 16368926 16976794
3993 16976794 17637692 18351292 19051592 19764052 20534232 21398967 22399024 23613355 25127213
3984 25127213 27070777 29576993 32817782 36930351 42199308 48718756 55927048 61613568
3976 61613568 63144614 59401273 52287577 45027348 39028262 34387404 30850380 28212110
3968 28212110 26250141 24813077 23733892 22927696 22312013 21844067 21444383 21043504 20609977
3959 20609977 20117545 19530808 18943800 18395930 17957613 17658743 17467225 17385584 17413970 17476239
3949 17476239 17513323 17515037 17467564 17330302 17115080 16897339 16702639 16573626 16489501 16456117
3939 16456117 16386401 16227210 15969055 15594595 15149536 14688506 14272025 13906988 13632120 13473501
3929 13473501 13413703 13439382 13565736 13781535 14108493 14547776 15087384 15712075 16349653 16933796
3919 16933796 17381830 17647562 17700710 17549830 17221127 16742761 16116699 15398019 14675672 13999821
3909 13999821 13404139 12907458 12519033 12249480 12073129 11988333 11985100 12060036 12203211 12379334
3899 12379334 12582094 12751685 12802536 12686108 12374632 11890895 11303301 10674024 10053497 9482944
3889 9482944 8977538 8521275 8133044 7794981 7499581 7268127 7069448 6914205 6802948 6715913
3879 6715913 6661112 6617345 6600852 6631151 6676915 6791164 6950316 7156387 7384471 7623200
3869 7623200 7831097 7957139 7982161 7874167 7669481 7406978 7139942 6901235 6737432 6625710
3859 6625710 6539574 6480238 6407630 6301761 6190580 6083383 5997921 5980113 6008761 6088993 6220827
3848 6220827 6381533 6541023 6627505 6616171 6527544 6405751 6268237 6193483 6178241 6204398 6244299
3837 6244299 6293062 6297740 6243376 6137645 5985774 5797281 5632416 5487754 5368784 5284346
3827 5284346 5232776 5217756 5196262 5189042 5207617 5221633 5245515 5273463 5306435 5363225 5447112 5573517
3815 5573517 5720821 5914321 6146942 6416287 6734576 7103992 7532533 8010646 8527378 9070163
3805 9070163 9568742 9939650 10147350 10153189 9947928 9594841 9135388 8689302 8265753 7878639
3795 7878639 7563707 7308408 7110165 6978406 6919556 6913420 6963975 7031938 7180507 7392837
3785 7392837 7650047 7982923 8387840 8854854 9352038 9813627 10166533 10312720 10178770 9807903
3775 9807903 9332412 8872717 8474748 8193692 7984181 7876794 7858901 7916811 8054268 8254167
3765 8254167 8525633 8831817 9146134 9442708 9679440 9809149 9807874 9710446 9564685 9431468
3755 9431468 9356157 9361346 9425429 9581905 9835302 10166174 10543555 10898439 11179460 11310537
3745 11310537 11285975 11108349 10807160 10461478 10108460 9813628 9604222 9428681 9327203 9240618
3735 9240618 9129901 8998385 8812053 8559519 8261770 7978302 7689051 7449306 7263469 7126218
3725 7126218 7051556 7018026 7028935 7091941 7195255 7371883 7611387 7888391 8199805 8525181
3715 8525181 8841062 9107072 9289381 9370645 9366450 9334573 9326277 9361482 9460360 9568394 9578308
3704 9578308 9404793 9045289 8528705 7925824 7329096 6809038 6382745 6038227 5761115 5555323
3694 5555323 5389903 5253684 5178963 5125540 5122058 5143439 5189325 5288668 5433249 5609788 5816067
3683 5816067 6000373 6122696 6157637 6115410 6024217 5937526 5912339 5930380 5983016 6048063 6092539
3672 6092539 6096071 5999629 5804567 5555578 5243324 4908833 4584308 4301773 4068448 3875175
3662 3875175 3710805 3571998 3462122 3391477 3344961 3346564 3367634 3399034 3460635 3515626 3556724
3651 3556724 3568107 3521431 3443725 3320161 3203072 3108849 3031641 2984489 2979176 2987371 3049243
3640 3049243 3156625 3294936 3420808 3468684 3417972 3252089 3016300 2771785 2546918 2340599
3630 2340599 2181018 2054649 1957713 1876370 1803502 1751566 1711720 1689804 1653909 1622720 1584289
3619 1584289 1559319 1545058 1552379 1564047 1566956 1591948 1623486 1654235 1708704 1781917 1845320 1895739
3607 1895739 1920294 1934330 1922917 1848255 1750624 1654163 1547232 1448041 1363688 1284524 1231953
3596 1231953 1195356 1162983 1130239 1099062 1072493 1053781 1037692 1031269 1018393 1002331 993393 964365
3584 964365 931405 899736 886460 874137 857922 837325 824800 813208 809878 810203 799251 787676
3572 787676 793172 779289 777094 777065 783319 767714 755575 760886 764247 748535 733856 740947 740004 740832
3558 740832 748865 743403 747642 745005 753103 758219 772245 778383 766578 762411 768929 774978 775824 777409
3544 777409 786371 802046 797399 813984 831465 821513 836874 836905 834853 842419 842216 858224 881290 899273
3530 899273 911033 917556 921815 921633 928035 944774 944708 957232 964206 962333 961981 964866 968840 976828 995131
3515 995131 1006127 1016735 1031271 1044119 1065345 1078211 1094976 1124792 1159069 1203015 1237631 1293745
3503 1293745 1366645 1443012 1537867 1643330 1760272 1901148 2034047 2157652 2240218 2282287
3493 2282287 2258330 2176052 2056438 1917992 1798407 1667560 1567432 1474468 1393776 1327776
3483 1327776 1283230 1250898 1209453 1190895 1177399 1160925 1150491 1130039 1121267 1133662 1138642 1118164
3471 1118164 1119033 1127797 1141468 1136644 1127484 1141262 1134449 1118991 1110743 1113468 1110515 1098229 1099777
3458 1099777 1126417 1141671 1149264 1148435 1144881 1155853 1161829 1182964 1185677 1201366 1193473 1194029 1205059
3445 1205059 1216483 1227104 1249477 1276314 1298338 1299935 1303363 1321045 1326243 1335739 1356439 1372352
3433 1372352 1385256 1402890 1425830 1449668 1474094 1489327 1517347 1542809 1550010 1538302 1536781 1550179
3421 1550179 1553398 1584242 1609913 1638023 1649564 1671516 1687777 1699023 1718641 1727914 1741891 1765724
3409 1765724 1763131 1774118 1795230 1805992 1829995 1833031 1852428 1868581 1869208 1886612 1927495 1948986
3397 1948986 1983646 2021151 2040060 2041512 2030203 2027690 2031376 2043265 2072854 2130907 2162651 2225320
3385 2225320 2289123 2344388 2412119 2461928 2525694 2542981 2551970 2567512 2575249 2608294 2644429 2697352
3373 2697352 2745526 2806271 2863329 2915309 2967397 3009096 3060896 3111738 3180186 3242623 3285535
3362 3285535 3330494 3372476 3416483 3449193 3468786 3500554 3531000 3564160 3604184 3637238 3699117
3351 3699117 3767616 3853533 3943575 4034827 4133150 4233563 4307393 4377297 4457297 4540392 4641009
3340 4641009 4759331 4891694 5035829 5184903 5333723 5469323 5608550 5749170 5906300 6042159
3330 6042159 6193757 6347194 6498612 6641659 6790202 6974468 7195123 7447549 7707495 7973094
3320 7973094 8251816 8554041 8905570 9304218 9774296 10309656 10896725 11549128 12250918 13001636
3310 13001636 13872950 14920636 16247905 17937480 20166372 23195994 27190018 31182860
3302 31182860 33300917 32166700 28380413 24373778 21339996 19226003 17718904 16649913
3294 16649913 15913956 15415651 15037269 14744752 14548203 14442675 14428230 14466923 14575672 14768064
3284 14768064 15031295 15361317 15760032 16216080 16690159 17222085 17827859 18520365 19329612
3275 19329612 20275111 21440183 22829996 24370812 25742093 26538482 26567102 26058637 25491039
3266 25491039 25145683 25140135 25457638 26074080 26997154 28217348 29710854 31293857 32587698
3257 32587698 33267781 33399967 33454829 33799334 34477831 35427781 36579785 37890859 39333891
3248 39333891 40902663 42562665 44264516 45965024 47578321 48996550 50185251 51054052
3240 51054052 51614641 51924986 52017321 51966259 51799131 51595156 51460971 51505294 51771587 52328282
3230 52328282 53189720 54375596 55867112 57712743 59962391 62716792 66052578 70082558
3222 70082558 74937826 80720515 87437087 95134369 103966581 114379963 127061946 142948446
3214 142948446 163120468 188911339 221570987 260163342 297115799 318836303 314615076
3207 314615076 285124413 244011065 204801213 172470178 146950813 126973858 111336867
3200 111336867 98836477 88569643 79891705 72519759 66235806 60827652 56007089 51621086
3192 51621086 47674541 44182277 41130646 38519993 36305922 34383531 32677227 31073740
3184 31073740 29526338 28000120 26561654 25247898 24128113 23191073 22339295 21526467 20720358
3175 20720358 19936188 19159228 18398852 17644578 16910004 16194302 15548714 14948839 14397572
3166 14397572 13922154 13540446 13202020 12898084 12580067 12262883 11937924 11610651 11301743
3157 11301743 11017556 10759931 10550768 10400838 10246885 10018741 9636699 9184385 8788486
3148 8788486 8426897 8109059 7817549 7539552 7283432 7028417 6800809 6595654 6401722 6224072
3138 6224072 6060899 5898836 5763444 5664630 5575483 5480145 5370473 5264419 5159648 5035614
3128 5035614 4904713 4784985 4660471 4546831 4446062 4350767 4307041 4253708 4164749 4023428
3118 4023428 3885881 3753811 3637199 3541812 3446182 3353023 3238512 3105910 2969956 2856771
3108 2856771 2780796 2738660 2693431 2650752 2622017 2592166 2558975 2526212 2496895 2455940 2423465
3097 2423465 2385050 2348680 2322537 2293287 2267342 2241442 2209960 2162939 2128334 2098723 2058907
3086 2058907 2033137 1996313 1958043 1941127 1908329 1906707 1901054 1897482 1890935 1878116 1851327 1827222
3074 1827222 1786822 1748497 1707636 1652318 1628234 1609657 1590375 1576237 1567372 1532721 1502056 1471696
3062 1471696 1426390 1370277 1328438 1276085 1220185 1176192 1143037 1114181 1093325 1091512 1086905 1087964
3050 1087964 1090398 1077996 1077434 1062558 1062884 1057102 1048137 1051364 1037319 1013617 996624 968596 939703
3037 939703 912229 883608 890701 913539 948226 977722 983489 988622 979832 987348 983088 953831 925166
3024 925166 882510 834565 804473 800090 805877 811978 815768 821223 821145 816065 807823 802352 773789 758378
3010 758378 744858 709904 693016 662397 639017 630930 622258 604985 593946 586633 581407 583573 585752
2997 585752 583948 572637 577316 560359 545338 534421 536377 532340 545967 557474 559001 562562 558784
2984 558784 573207 573317 571231 571752 580179 575023 559501 555052 552745 568657 575334 587926 591024 592278
2970 592278 602835 588644 579805 591553 598533 609262 620990 621993 610542 613510 631904 641018 635786
2957 635786 635318 630601 628917 630690 641236 620114 600182 615065 618524 621661 621697 614279 617330 613695
2943 613695 618009 634936 637853 641268 638932 646494 665977 677964 692160 723668 747760 771311 807193
2930 807193 843444 882959 952348 1039714 1138280 1254721 1381533 1508211 1598365 1671630 1699203
2919 1699203 1650351 1558812 1439753 1300590 1180774 1066772 962728 877817 816835 753820
2909 753820 724216 682716 626864 594634 548926 541196 529387 512229 483314 476412 457678 454659
2897 454659 452801 431697 421054 409177 393950 387481 396493 390202 375550 358096 348120 355745 355892
2884 355892 350021 346993 343326 342153 335528 326199 332221 317597 316326 318357 317481 326871 314655 310603
2870 310603 310622 317698 326357 312180 305217 299212 294448 317537 316109 296776 295373 287952 281711 282321
2856 282321 270465 256188 242163 230892 224294 224406 228793 210116 219751 226466 227285 223643 223095 227581
2842 227581 225746 230615 236795 220530 217334 222316 224171 227847 220030 214865 212991 212957 213224 211922 205422
2827 205422 208876 222422 222705 218085 215431 208112 215018 219252 222557 211643 216218 227679 209975 202920
2813 202920 214223 213975 205513 191418 190820 197797 199718 174941 162645 163625 161729 160225 161659 166400
2799 166400 163489 157577 163432 137076 129010 129906 141555 135128 127506 138732 146001 139723 133866 127373
2785 127373 124342 124914 123611 133784 130152 117512 115085 116343 105593 118016 115634 117259 115897 120826
2771 120826 123659 117891 120057 114831 107279 104583 119376 113184 89864 92513 104476 98134 93056 89028
2757 89028 90465 81652 70797 76571 72559 74189 80899 83726 73947 68259 78139 91572 71054 70959
2743 70959 64408 61529 67365 73554 79673 82487 89992 92421 82215 89310 95557 73490 69492 78250
2729 78250 72023 66076 68740 68818 70468 59951 60465 72656 58840 52091 54178 52427 62201 53810 58921
2714 58921 62839 57932 51022 48594 57399 48365 54859 66928 58952 54180 52225 50929 44702 38008
2700 38008 42106 43570 40794 45440 36824 41806 38129 30551 44730 36710 37916 37955 31722 28938 23952
2685 23952 31800 37505 41502 36310 39391 45478 40765 44606 38337 30409 24848 26493 30581 23778 42292
2670 42292 47175 38360 39696 30001 29880 52832 55860 39982 34823 44007 24830 32510 34918 40582
2656 40582 45995 47481 31227 26562 30153 34001 40899 38131 43526 41729 40576 40444 42719 33519 36308
2641 36308 47726 31287 15184 17916 28117 27849 24138 27079 30954 45636 40767 22080 29717
2628 29717 31078 28379 29334 28251 25138 19144 28776 25359 22103 17094 23101 19961 23742 25674 35053
2613 35053 25279 31221 17364 26130 34338 25905 32941 38950 24296 21440 12074 9958 27471 21206
2599 21206 16627 23250 24352 32016 34157 31308 18791 7442 17323 14253 23458 23921 22294 29224
2585 29224 30293 18864 11651 8234 -4413 -1541 3033 3418 13409 16607 18623 17848 14574 5445 -7030
2570 -7030 -1847 15362 14086 3951 8908 8937 13418 24245 32435 21095 20318 25647 21059 18036 20097
2555 20097 24816 17072 9359 16779 19570 24643 19950 19524 16741 26311 18359 14061 16130 13443 14641
2540 14641 10233 16627 10558 8048 2142 -686 -11129 -9945 -14377 -20604 -14348 -3200 756 9754
2526 9754 10236 8479 8020 12746 15302 18325 6896 24700 30414 26683 13333 13429 8119 6541 6333
2511 6333 10395 5358 13610 30609 14007 20449 26918 32736 26697 13045 28172 24703 14398 18889
2497 18889 21118 25050 25541 23997 24809 24352 23851 7852 17266 14276 13770 7507 6538 12901 14587 15685
2481 15685 11064 19954 15326 16042 19922 23791 22927 18479 18624 16091 10727 3349 -6126 1065 9736
2466 9736 19669 15637 2812 4157 13121 28601 32147 20263 7211 6519 3659 -7935 -4189 -13567
2452 -13567 -6943 5203 10584 9359 13407 7188 -9899 3316 31397 16633 10839 17692 18330 11987
2438 11987 16991 1681 -2129 -2108 -5134 -8406 -1440 11274 87 -8127 -3952 3480 16977 12322
2424 12322 10804 4008 -5215 5340 -301 -4274 -16792 -10782 -11012 -17577 -10042 2364 -1273 -3150
2410 -3150 2788 9118 4235 1396 4702 532 -792 1302 5510 -3999 -929 205 -7927 1791 -2515
2395 -2515 11039 12279 4042 4003 -4775 -2146 -4348 -9204 -13786 -3911 -42 -6414 -10111 -11536 -3268
2380 -3268 3505 349 -154 -5874 1454 5326 -3475 4485 5366 -2110 8136 10548 471 -8875 1959
2365 1959 -8967 -8600 -4640 -7275 2655 -4924 1880 20181 4222 -1814 -1598 -604 4317 -4990 -5053
2350 -5053 6363 -1550 -845 -1247 3588 9035 7885 6019 12773 15053 651 4513 8093 2215 281
2335 281 4943 14266 16227 7319 7536 10466 4832 -8461 -14580 -4452 -2309 -12060 -3013 109 -1323
2320 -1323 -9081 5877 2391 -2011 164 -336 3185 4421 6983 6656 -6767 -1041 3234 5337 -1365
2305 -1365 7743 15965 8644 8972 4338 5220 2895 6209 506 -6893 -15998 -20212 -16080 -2544 4370
2290 4370 12488 7121 -8307 -10288 -7189 -2275 -6940 -3584 -13332 -7481 3261 11060 3307 9197
2276 9197 7670 -13349 -8637 -8926 -11312 -12362 -13382 -1305 -6728 -2086 -1194 2781 9363 4438 -3846
2261 -3846 5229 19781 7961 376 8580 11286 4706 7393 -1897 -1926 -337 3665 -4596 -21368 -21103
2246 -21103 -27499 -19836 -7006 -3967 -9655 -200 8899 6116 13981 10882 6033 -5673 -11117 -4292
2232 -4292 -3315 1015 -4074 2037 -4492 -3614 3314 1040 -2064 13 3600 -10218 -9237 -8049 -5736
2217 -5736 -8590 304 7772 8018 4497 -7721 -3296 10097 11477 15114 7861 -115 7654 -9542
2203 -9542 -6282 11675 14570 10869 -6083 -4019 4238 -2145 4385 16863 15027 13934 16584 15028
2189 15028 15662 34150 12195 -2744 14078 17237 12857 15405 -2454 9804 30691 27772 24378
2176 24378 20861 24526 18539 6156 5017 10359 21584 25595 24612 27108 27896 24612 28837 35444 37746
2161 37746 31201 40198 41996 36560 45845 45529 39956 37441 39734 46184 54009 51348 40920 46300 52926
2146 52926 52745 51044 62289 70614 60375 53343 64074 57415 64268 68850 68647 69549 57451 45599
2132 45599 63701 81016 79646 73295 73413 72296 81061 88329 87599 86049 89136 80339 73639 90576
2118 90576 100643 108619 124554 124358 124309 130599 117749 126783 145922 145069 149361 178935 165663 146062
2104 146062 170306 177124 195032 193755 195019 209140 237461 255069 249691 263623 273405 281981 289043
2091 289043 301875 311228 326679 352143 371498 390772 420829 437880 463035 509387 576823 619766
2079 619766 640470 655157 707463 766322 828333 910697 1037903 1181667 1393209 1643812 1996553
2068 1996553 2529027 3320985 4061824 4328978 3825196 2903208 2196574 1744101 1421441 1169867
2058 1169867 987256 852225 742250 660520 596335 555169 533905 517615 493598 452769 401613
2047 401613 358308 317002 294875 286531 286557 257150 234780 223626 221351 206018 199308 195800 188536
2034 188536 172610 159663 151611 150056 147483 130398 137101 134180 134013 129957 128984 100806 94524 94320
2020 94320 88897 97568 93233 95508 96111 87860 82629 68207 71257 76637 78470 69288 74245 57946
2006 57946 59437 58257 67521 65568 64180 57895 45647 43802 57153 48172 32268 33102 36682 30146
1992 30146 33680 45401 40354 29570 33644 27907 31748 27981 25100 30867 25327 26107 22160 20746
1978 20746 29014 22053 9121 6031 10794 6961 11949 19116 21843 10562 12487 11626 17447 20381
1964 20381 10150 -450 6871 11060 2262 9082 3470 -2417 5842 4698 -4916 -6665 3257 2977
1950 2977 -1958 575 -11186 -10498 2334 9993 9237 -3954 3146 7518 5259 -6255 4715 22566
1936 22566 17278 9004 -1032 4201 -403 4058 -1060 -1533 4325 6786 15711 13673 10066 9422 -511
1921 -511 7207 8262 1777 51 8452 -114 -4651 -10594 -10725 -3409 -7598 -11470 -10740 -3388 -6122 -1513
1905 -1513 -275 -12659 -19100 -14807 -4365 -9115 -5964 -13518 -17870 -19109 -22381 -11781 -16863 -22029
1891 -22029 -16037 -14930 -9298 6058 4919 -11002 1653 -3597 -934 11784 3822 -9938 -10342 -3544
1877 -3544 -4857 -21247 -21891 -19016 -11584 -961 -12940 -8490 -4330 -2851 -5794 -10336 -6055 -9656
1863 -9656 -6115 -14216 -1773 -82 -6828 1121 -15495 -29301 -25352 -13103 -3615 -7179 -19589 -18468
1849 -18468 -12384 2425 8439 -8433 -5229 -5247 -13146 -29630 -26542 -24939 -16166 10822 4871 475
1835 475 7398 -11624 -6932 -25996 -31952 -11749 4273 12998 -11467 -22860 -17520 -18744 -1957
1822 -1957 2309 4384 7197 -13906 -18483 -23420 -18022 -18417 -5650 -9811 -9952 -1432 -12961 -16863 -14779
1807 -14779 -6767 -9913 -10417 -3595 3190 2250 -8443 -6638 -5053 654 6176 7594 21882 18925 8388
1792 8388 -102 3235 4799 -3512 -1911 -13432 -16243 -21591 -7706 -10271 5474 4300 -9706 -6041
1778 -6041 -8186 -5141 271 11132 -557 -7934 -3821 -10637 304 -3584 817 -6447 -6777 715
1764 715 19798 23349 10835 1914 651 1635 -5368 -14365 -12174 -12233 -17086 -20146 -12795 -1151 -1634
1749 -1634 -10745 -6977 720 -8025 -12881 -17662 -14864 -11166 -13019 -8304 -19167 -24468 -13635 -16030
1735 -16030 -8006 -7417 -7811 -15730 -11334 -10648 -18662 -14520 -11888 -14970 -6544 2786 3577 -1105 -21365
1720 -21365 -22539 -27968 -20369 -22350 -14164 -7391 -8204 -17963 -20627 -6435 5302 2342 -16102 -38057
1706 -38057 -33598 -10967 -21465 -14509 -12620 -9473 -10780 -22304 -22018 -25125 -24442 -21618 -31041 -24788
1692 -24788 -14651 -5017 -18404 -17902 -19547 -6032 -14826 -17907 -21734 -15055 -14381 -15934 -10607 -8638
1678 -8638 -14616 -1864 141 -14122 -16456 -11202 -24053 -26378 -17698 -28453 -15665 -2381 -9837
1665 -9837 -8022 -12774 -24220 -31858 -34678 -23529 -13192 7302 -833 -7398 -25445 -18657 -14950 -13583
1651 -13583 -12605 -14627 -13505 -10778 -12506 -24131 -18876 -13735 -18381 -18122 -6818 -7408 -17550 -7770 -13507
1636 -13507 -19076 -4777 3489 -4817 -18940 -7275 -19799 -22371 -11127 -15777 -12440 -6635 -8
1623 -8 -4267 -5711 -8622 -991 -7603 -24097 -29406 -23239 -15178 -18937 -13194 -9711 -17206 -7217 -4263
1608 -4263 -18560 -24764 -27848 -25301 -23798 -17607 -14435 -14711 -9358 -12035 -9504 -6246 -21697 -14330 978
1593 978 997 8445 -6533 -14516 -12380 -12740 -10088 -21860 -10242 -8950 -13329 -4966 -3634 -25329 -28441
1578 -28441 -13772 -10131 -12566 -16479 -24755 -18164 -14899 -34305 -25774 -21359 -29182 -15431 -4929 -9261
1564 -9261 -23394 -16460 -14671 -12372 -12473 -38073 -40342 -17588 3801 -7421 -19025 -9134 -9786 -24119
1550 -24119 -5476 854 -8568 -13783 -11699 -4529 868 -5176 -3037 -4902 -5979 -4647 -1111 -5244
1536 -5244 -16482 -17525 -13324 -3532 -13122 -17481 -8125 2033 -9316 -19851 -21797 -16964 -8176 -8390
1522 -8390 -11311 -19038 -11185 -1200 -14707 -16064 -12596 -25515 -13493 -6350 -9057 -10062 -11393 -10843
1508 -10843 -12761 -16167 -31634 -18167 -11531 -24717 -15011 -12837 -16359 -10436 -2974 284 5023 -12525
1494 -12525 -18942 -14378 -23974 -5423 -2718 -9414 -14962 1160 -8550 -17177 -6820 -11213 -24721 -21744
1480 -21744 -6385 -1588 -14257 -17326 -13500 -23360 -14547 -16729 -16267 -27388 -26587 -20900 -14794 -18663
1466 -18663 -8280 -22778 -33233 -32497 -23503 -1547 3240 5090 11463 -256 -556 -8492 -12282 -6757
1452 -6757 -16256 -6257 -9329 -9334 -3768 -4879 -4421 1674 -5444 -17131 -11776 -2124 3101 3380 -1119 -5914
1436 -5914 -16956 -24342 -11920 1559 -4542 -8416 -15582 208 2904 -5387 -4436 -8330 -5045 -8434
1422 -8434 -6127 -5656 -9682 -10018 -19688 -19119 -9319 -6523 -18973 -22782 -16426 -9828 -17360 -14174 -1046
1407 -1046 -1775 -8559 -17163 -16919 -21002 -31398 -22943 -23631 -16964 -20052 -13907 -10548 -14664 -9641 -10646
1392 -10646 -16438 -17155 -10469 -7532 -2355 522 3927 -3454 -11113 -7058 -5643 -5377 -8224 -14827 -25964
1377 -25964 -5994 486 189 -105 -11759 -10460 -9072 18557 292 -9744 -9928 -8480 -12888 -8544
1363 -8544 -5171 -16995 -15618 -15716 -3021 -5282 -8173 -7755 -12365 -7946 -9601 -4379 -13583 -17957 -16091
1348 -16091 -10205 -16697 -19004 -2696 -955 1760 -3759 -5186 -9995 -11069 -21094 -13863 -17064 -17878
1334 -17878 -18390 -11169 -2592 -4725 -17901 -31169 -15270 -8040 -420 3553 2730 2764 -5771 -9734 -11899
1319 -11899 -8318 -6204 -3564 2400 2686 8413 13356 3023 11092 -658 -13018 -5899 -4622 -11607
1305 -11607 -16535 -12796 -824 187 -8904 -23689 -25094 -24048 -18786 -4905 -4450 468 -6930 -2881
1291 -2881 -9895 5547 14073 3328 2887 -5273 -8187 10765 1876 2056 -779 -9162 -15191 -5408 -4561
1276 -4561 -3333 -7313 -15846 -3173 -9320 -24419 -25099 -19740 -10335 -15538 -25702 -23122 -36778 -25596
1262 -25596 2051 8160 -835 -5968 -6953 841 4082 -426 267 -9315 -7563 -4417 -8016 -16912 -10822
1247 -10822 -10778 -7521 -5549 1853 -7654 -7299 -1091 -13805 382 -8478 -19024 -25787 -24634 -19970 -22620
1232 -22620 -25862 -17388 -15354 -19657 -10119 -26630 -20454 -5036 -10069 -12871 -4974 1819 -2635 -4820
1218 -4820 -9145 -18138 -11537 -1633 -8649 926 8526 1273 -1038 9073 12512 -4846 -3609 -17759
1204 -17759 -15884 -8944 -16780 -16729 -14832 -17524 -22149 -26211 -20305 -7892 -18587 -26543 -14885 -20668
1190 -20668 -16271 -12109 -18708 -21507 -21445 -8041 -3351 6142 -20370 -17713 -22751 -27705 -20126 2388
1176 2388 -6902 -23851 -21280 -14101 -15810 -16299 -22629 -6227 -4806 -8859 -7322 -8903 9308 12491
1162 12491 2420 2469 9731 21447 12630 6598 13113 -8953 -14312 -12798 -11528 -7811 -12973 -3708
1148 -3708 -4447 -4503 -13283 -23298 -16250 -2267 7470 7293 -1552 -12222 -10322 -3689 -413 -1488 284
1133 284 -1186 -2528 1774 -3875 2123 -1617 -10006 -7084 -326 -4351 2767 15447 -6956 -12482 -23524
1118 -23524 -18776 -12246 -8063 -7679 -17129 -1389 -3885 -7695 3256 230 835 6496 1070 3083 -3062
1103 -3062 -7652 -6688 1408 5456 -520 1517 -221 3720 -10904 -8734 -6824 -22653 -20721 -17642 -14949
1088 -14949 12418 13334 -4518 -14688 -8067 -7584 -5281 -2928 -1839 -13041 -2788 2838 4044 2931
1074 2931 9328 15502 22619 16062 9857 15587 1679 -11199 -2769 -7865 -8238 -7266 -13462 -20549 -16387
1059 -16387 -20227 -17571 -13505 -24630 -22135 -16214 -16176 -6033 -729 3344 -3015 -10143 -9466 -6591 -4953
1044 -4953 -7860 -7482 -6446 -5948 6639 5905 -4377 -5883 -5436 -3900 1428 -12041 -14834 -10 -7005
1029 -7005 -4199 174 -7926 -5037 5577 -6491 -1015 18171 11619 3802 -1743 -5600 4538 3974
1015 3974 -2098 -6074 -7701 -10808 -245 -6041 274 3195 -2273 -2188 -51 1055 5714 -6659 -1718
1000 -1718 -916 5744 4959 11666 9744 7704 -1036 1782 7745 1176 11896 12256 8213 8460 2469 -6929
984 -6929 -5098 4507 1431 378 4472 5704 1830 -6093 -11292 -13909 -14151 -16386 -5408 5862 3812
969 3812 10522 1293 7578 6434 1514 1325 -8676 -11785 -15505 -6627 -698 -3874 -787 13309 3608
954 3608 -1873 -387 -5620 731 -185 1316 -5793 1366 10282 2606 3063 -224 -6001 -11233 -4971 -2982
938 -2982 -7912 -3464 4947 1681 -810 -1308 -2561 166 -9045 -14234 -868 2031 -3777 -18097 -8936
923 -8936 2526 -3432 -4459 -59 -1409 -20897 -29853 -17725 -12998 116 -9752 -2233 -8616 -15287
909 -15287 -2389 -441 3589 4118 3237 -1192 9844 4833 -4532 -6681 -7459 -895 19211 17159 -1831
894 -1831 4983 7290 190 1941 -3878 2790 10525 7820 5948 -6430 -14173 -3509 598 -13175
880 -13175 -11852 9663 17155 15055 10224 -13761 -14084 4805 15150 2886 7318 6011 5380 -1145
866 -1145 -12277 -4032 -12508 -12898 -17090 -26497 -20210 -7110 -4195 -650 2429 6606 6786 7968 14604
851 14604 11942 13122 10511 6690 11364 -4066 47 4436 -6358 -2629 -6641 7188 501 -11554
837 -11554 -4265 -4523 3726 4013 5085 12744 3844 11220 10294 4199 -6644 3418 8844 2930 1149
822 1149 -1588 6189 16268 14111 13018 9051 9425 2991 4510 2728 4846 11544 6590 1151 15650
807 15650 16049 9671 877 5281 20708 14496 14012 4542 4459 2674 17372 9427 -1050 2191 -3015
792 -3015 -3886 -3080 -2743 8100 4483 12376 13490 11455 14982 21091 18169 7380 -1233 -4834 1981
777 1981 5002 6706 12581 10664 8743 20758 17963 15136 11306 526 -429 -5701 -11540 -5445 -833
762 -833 2621 13658 -363 1425 -1516 2050 5574 -8978 -15918 208 6268 -16158 -12330 -797
748 -797 5034 1914 419 -3205 2931 14229 12655 3081 -6141 -1178 -3217 5982 6446 7513 1152
733 1152 -1758 -2260 203 3167 -7817 -8283 -9298 -23688 -15682 -3876 8012 -3057 -2538 -1856 1376
718 1376 4037 5052 12768 1090 1025 11009 9396 8964 15264 16403 12623 13530 -3947 -8817 1504
703 1504 7531 12051 14176 15754 240 -2850 9365 17324 9142 10412 2623 -114 -10756 -9301
689 -9301 -6157 680 2621 11633 8048 -2106 12338 11140 2878 8481 7792 15650 11395 1055 -1692
674 -1692 -4894 -16178 -14737 -9458 -6784 -2283 12207 12441 6601 5199 9297 7101 5170 5747 10416
659 10416 10589 -3183 -9045 1267 5115 3039 4967 -6509 -3843 4369 -787 -4185 5477 23628
645 23628 13851 8519 9576 14407 3869 -6857 975 12805 25026 14879 1014 2970 2987 899
631 899 -2413 -265 -7637 -5480 11759 14118 8866 8661 8128 11307 -7508 -11275 -4970 3326 -2127
616 -2127 226 261 -16066 -11812 1305 11014 3559 5166 -9621 2331 4647 199 10208 17841
602 17841 4870 9138 1638 2389 13353 14964 16046 24999 11208 11928 13027 -715 4447 1006
588 1006 5186 14729 18962 15181 14279 8858 8703 12727 5467 14515 9388 1967 8580 -1265 -8996 -2761
572 -2761 3000 -9100 3210 4318 5095 7202 4326 9526 6644 10065 5295 12752 13707 8024 10491
557 10491 9678 3651 6036 3207 4952 268 8816 6171 5488 8660 3974 6386 5096 10852 14918
542 14918 14722 5015 11669 12870 14221 10813 4873 1837 -6044 -80 -4753 6482 -5140 -16781
528 -16781 -4711 7728 11491 19074 15510 8246 13599 -3603 -6733 -354 2128 -1001 2977 11885
514 11885 17512 28380 28947 17483 15986 20228 16480 18278 8692 4097 7232 20571 28689 21332
500 21332 16364 27783 20473 11028 2754 7428 15332 8506 3162 10852 11475 7448 9874 -2871 -211
485 -211 801 -6908 -3532 4801 2865 11968 9756 5057 5047 18592 23994 25520 17890 8595 8826 15456
469 15456 7740 1495 -4831 9806 7823 20750 16162 10629 -1371 -2171 -5107 2466 6673 12428
455 12428 10530 -728 -1108 2076 8002 4235 6240 8104 14497 14517 5381 -1987 11735 -1662 -2971
440 -2971 -138 -282 10691 12473 3824 9744 11259 9085 15732 17780 19517 20543 16661 12133 15062
425 15062 11189 15527 17079 17374 10762 15977 24322 12546 20325 18957 23883 27980 13068 11765 9953
410 9953 11774 24106 15152 17513 19990 11795 2504 11174 8328 12575 15895 8494 14403 23827 12178
395 12178 10442 -3655 -5358 18119 19599 12500 8970 13547 3138 -13106 -1624 12125 4788
382 4788 6216 8387 3105 11971 6640 -7629 -3055 -5515 -12076 1136 6264 12036 889 7935
368 7935 2147 4713 17498 9403 11077 15157 23337 26700 32671 26515 12621 13565 8792 4299 6455
353 6455 13537 25247 13189 17715 9753 2217 -1911 7842 20873 21789 17130 1970 7235 11927
339 11927 2681 5288 1448 12605 22321 24885 11422 -3632 12338 24229 21258 17889 6124
326 6124 2753 5485 -2791 1157 13030 13553 4491 16028 15907 16936 7796 7201 10755 11499 18417 27223
310 27223 19942 8915 23087 16677 9659 8813 19944 17010 8966 12126 14508 15636 4922 13097
296 13097 19728 17074 6868 4999 10414 7392 7195 5169 5890 20369 27920 12260 14887 20340 15411
281 15411 8310 13569 20775 32311 25063 10639 10532 9120 9102 13214 19608 15189 6579 1547 11502
266 11502 12726 4344 -6651 -3236 -494 6810 5625 5473 13522 16222 12389 14891 17797 13637 8536
251 8536 -6425 7097 8993 13005 26577 36687 28473 22052 21712 15142 20068 14122 5658 3829
237 3829 12293 10013 9849 21172 19841 16705 -6401 -5750 -6365 10524 8690 8365 17018 16719 17897 8415
221 8415 14826 24016 28448 19474 3350 8228 2428 606 4455 6029 12187 16776 16952 21459 26123
206 26123 24104 6469 4336 9121 7817 7330 -8067 97 -141 7507 6150 9202 4071 9409 6649
191 6649 19942 22709 15486 6877 9941 18093 13659 4987 9818 11125 10624 17598 14235 21683 25773
176 25773 12383 12341 17323 7184 7913 17208 17060 22221 25696 16595 25431 22830 20899 2663 2915
161 2915 20446 10208 16734 16996 12004 12879 8167 13601 16085 23024 25530 21063 19776 23767 21989
146 21989 16969 23105 16856 16614 10874 -3808 740 6681 18498 20022 26102 32920 15642 11621
132 11621 5461 9896 22248 12866 6457 7843 14393 7252 2179 11687 6833 13600 16946 14568 12984
117 12984 14372 23748 14436 12084 22434 19547 15036 13416 11734 15992 12667 19966 15017 4877
103 4877 6695 4879 10995 17520 29476 26472 18369 12163 7693 11236 20422 22652 20881 10582 19544
88 19544 15174 5792 10525 9132 15915 23584 17833 10423 10726 16037 12540 11791 11158 7648 17057 20410
72 20410 25046 23736 13589 15309 22653 18663 17311 24597 32767 21322 19052 18952 23203 9483 16053
57 16053 15042 12466 4461 9016 8338 2488 9649 7811 2914 5247 9809 8843 10787 13202 14266 8555
41 8555 22235 22165 13218 14151 17519 18280 18901 13805 7048 16853 20938 16640 16296 16175 20569 25872 22091
24 22091 17436 17119 9761 9596 5444 14392 19946 18041 27351 28423 26886 20693 24797 23690 19287 18066
8 18066 15938 12323 10851 3423 5392 17088 14855 15849
0 15849
$$ Imaginary data points
##PAGE= N=2
##DATA TABLE= (X++(I..I)), XYDATA
16383 -456481 -435886 -433257 -424040 -409389 -398036 -408606 -410213 -397695 -379993 -384993 -385808 -372851 -369131
16370 -369131 -361059 -349961 -333376 -327262 -324018 -325713 -322253 -319290 -309130 -295016 -288217 -286605 -277626
16357 -277626 -272466 -260673 -260756 -255244 -253878 -242650 -233956 -222312 -221400 -211380 -205201 -202167 -189835 -184906
16343 -184906 -179592 -173182 -163146 -165893 -151697 -139136 -138426 -134692 -131617 -131630 -120983 -115521 -109295 -100914
16329 -100914 -91603 -94902 -90212 -77766 -80504 -88484 -80455 -64765 -54135 -48669 -40783 -31137 -29172
16316 -29172 -25044 -12044 -7207 -4863 -3194 5698 11414 16662 28899 38003 45972 39834 42975 56549
16302 56549 60616 72688 76527 73720 73493 78191 89766 105788 103699 102954 105832 114558 114811 121722
16288 121722 125050 129480 136705 132861 145288 154875 169523 158774 173849 169465 170674 182143 192662
16275 192662 201359 209605 213080 210085 219729 218472 224118 233133 234609 237177 249059 244082 255769 267432
16261 267432 273544 266742 273819 272309 275403 279380 285013 285722 293184 295560 296875 294643 297078 303050
16247 303050 302749 302551 308138 320808 320795 333057 342524 348598 353801 342445 342603 350987 367689 362614
16233 362614 368363 370517 359814 364458 375463 372574 364951 374240 375565 380039 393710 399653 400764
16220 400764 400039 411666 421844 410731 405611 422537 423702 417515 432333 436296 436809 432201 434966
16207 434966 427949 430708 441971 445743 436381 438282 436920 443114 452971 459275 448143 454344 476620
16194 476620 483806 477641 469108 475001 487544 489130 478261 474122 466518 463845 470598 492217 504383
16181 504383 503002 502960 495199 504995 506050 505208 504568 509672 521916 526468 520225 510986 511394 510737 505610
16166 505610 514992 514225 517161 510413 523374 525688 524620 539856 538804 541720 545537 542889 548688 549122
16152 549122 532881 535828 539637 529316 546811 536727 530723 541525 543543 543758 537989 548187 551491
16139 551491 549262 548130 555650 568712 558014 552095 556473 560590 553885 553629 556960 556726 578147 575991
16125 575991 569650 559704 560710 557929 559681 570598 575566 561690 557125 570443 572455 556746 561191
16112 561191 571108 576427 568756 571427 568965 576923 570428 577898 584183 591142 588992 570714 579794 580032
16098 580032 580113 583922 588185 569190 579146 595332 584478 576816 585240 589105 590302 592388 587429 571822
16084 571822 578896 580193 592921 599260 588351 591670 581989 604331 608415 614382 594219 594810 600478
16071 600478 589175 582396 589649 595579 593309 589297 580661 586242 590464 586028 592857 610544 607654 603079
16057 603079 601364 599110 595069 605718 594286 587080 585283 597983 597564 598045 603539 597694 603015 592479
16043 592479 589966 594662 598102 603277 610097 600004 589833 586850 593351 603249 599482 600210 601131 610100
16029 610100 616798 602578 588044 590280 593562 602752 608237 605947 610428 610898 611993 609008 605037 613209
16015 613209 613600 609013 601299 600139 599666 605267 609470 603617 606498 621565 612193 609235 603309 609243
16001 609243 623132 626067 615884 605542 619057 622650 594608 594699 609427 607948 612341 618092 615269
15988 615269 612061 605540 595413 608185 608801 612735 617353 613777 616313 615322 601882 604910 614698 611255
15974 611255 614052 621955 621075 616072 611389 608382 599659 607242 614330 624962 619857 628836 641879 621533
15960 621533 625092 611219 605783 607761 615347 615580 608953 613229 606576 608238 606800 612429 611828 606717
15946 606717 616886 609149 605096 605518 601349 608686 616879 623877 627959 626397 621543 611745 615371 615294 611658
15931 611658 605137 614897 618901 608388 616274 630264 618563 604281 615748 616052 605678 606445 622702
15918 622702 624840 632930 627417 616418 613651 626187 631392 631891 616992 607745 609572 606455 600820 603407
15904 603407 612286 613579 604474 609899 620208 615924 610415 608724 609236 597766 595892 600776 607711 607608
15890 607608 612683 621832 626477 622024 609458 612234 617342 607750 605628 600816 604746 611667 626891 631032
15876 631032 621836 621844 606444 609182 611888 614427 607497 607984 618578 615499 608912 607297 611934 617076 617896
15861 617896 616315 620801 623575 626245 622447 637495 633797 610950 612570 615002 623920 624895 617210 618561
15847 618561 624211 626067 622473 627041 618439 607816 604741 616674 630577 629485 624629 633512 641075
15834 641075 628483 612579 617536 616542 603645 618308 623643 609528 615343 610856 616969 626909 634563
15821 634563 628720 625915 638752 632003 628967 636798 644011 633917 617042 619006 618989 627717 620837 609403
15807 609403 610684 608007 605305 609693 615316 617971 613514 616438 622786 619621 616830 616650 613456 610491
15793 610491 616238 616086 622258 614177 611046 605215 620068 636697 631110 628583 615341 616385 621238 617688
15779 617688 624109 635012 634439 619819 624493 622994 614529 617153 622927 622783 627351 637830 635983 619386
15765 619386 615125 613749 620271 616579 622857 631060 629577 631875 619550 633726 631798 629355 629846 610267
15751 610267 613666 619517 638338 633886 633738 626270 639000 641697 619858 619013 635071 632000 629079 632825
15737 632825 628902 637311 633561 630296 637463 631676 631448 631891 636422 644249 633240 631325 617324 618887
15723 618887 615352 618490 613125 616978 623286 626764 630268 636513 627699 624715 630835 634354 632174 638644
15709 638644 633380 629555 622738 615965 607963 607455 604799 601785 615426 613500 615483 619551 608708 611789
15695 611789 624600 625915 624586 631797 621025 623950 628940 623193 629578 619151 625289 619993 632593
15682 632593 629415 639372 634799 621347 620500 626182 624977 630164 628427 626641 631540 622106 622055 629200 632926
15667 632926 627307 621653 622383 632119 631097 634380 629168 627688 629590 640639 633678 639525 624945 613867
15653 613867 631743 630833 632989 628838 629366 622417 616361 631261 633577 625177 624705 633517 627611 630785
15639 630785 646141 633097 628352 636016 632720 645189 636516 636194 628713 642676 642150 631056 633510
15626 633510 640529 636740 633450 634100 634045 632197 631617 630895 627707 642542 648931 654309 636594 634826 636580
15611 636580 640958 642537 638985 637660 645398 638646 638090 646282 656532 648815 651245 639529 633721 646298
15597 646298 640504 629539 626068 625542 631836 636941 634599 626858 642064 646729 635548 623081 625444
15584 625444 640577 633790 640532 644964 652917 639059 630846 637128 629328 633116 629917 631610 642423
15571 642423 636912 623681 632661 650847 657947 646047 636000 647457 642512 628924 629225 633040 630839
15558 630839 626698 647381 642124 633129 643730 641689 637632 636030 634347 628666 628614 643062 637974 631322
15544 631322 631965 631983 627388 638818 647138 644539 644971 648898 647326 633744 629886 633134 632974 645382 637823
15529 637823 628297 644934 637899 637426 644233 652517 657931 660363 649910 653968 645015 661138 657804 645898
15515 645898 634429 637445 638140 640904 644391 645070 647374 650132 661345 655820 653124 642245 643845 645487
15501 645487 647565 645074 641915 636880 641858 636851 624470 630348 640942 648319 659641 645059 641060
15488 641060 648143 641753 643908 646943 651385 649019 637751 632090 641270 627804 625191 636290 638700
15475 638700 641492 653627 656878 652543 645981 646925 648684 649496 640948 637028 631738 634504 645490 647082
15461 647082 642069 641655 654749 660235 650409 653083 647226 653522 660363 648168 648854 636916 640842 635130
15447 635130 644427 639650 641657 639462 636240 642425 645993 642613 636317 639311 643996 639272 639803 655923
15433 655923 660102 647335 635735 647730 648651 655792 657256 649421 641557 634118 628069 633642 639494 642173
15419 642173 641817 658018 650037 643588 655746 645623 658017 644369 658683 667328 656740 650473 648101
15406 648101 655968 654549 653864 651865 645646 653923 654656 648015 650633 648766 645148 638592 648782 665517
15392 665517 641529 637557 647723 643971 643527 651433 655868 648980 648169 629253 636387 652097 652036 655466
15378 655466 657478 643721 642414 641416 647133 652818 646763 647986 656581 644716 642818 648158 647582 654913
15364 654913 666763 660964 655652 658502 660543 650521 643195 643862 641544 645337 644075 647950 662690 658621
15350 658621 658091 645215 649096 654360 659397 658899 660840 661050 659999 658648 661002 660724 650075 643241 654269
15335 654269 663160 653896 667749 650166 647969 641477 641286 640589 648786 654861 654403 648453 647716 645778 651408
15320 651408 653389 654628 655076 660077 654427 659177 650292 648247 653943 648608 645920 658841 655553 644447
15306 644447 643622 643434 649737 654939 662349 660914 661551 656101 671321 681391 669393 665008 656562 663316
15292 663316 663649 661334 664512 670283 663906 654119 659248 659092 650760 651076 665145 664083 666425 675879 666243
15277 666243 661786 660608 652242 655222 659934 657378 652091 650671 666786 674554 655962 652486 646535 651970
15263 651970 650983 662204 656547 653967 650093 640709 648198 653514 640879 649651 646968 651548 666753 681354
15249 681354 667479 651745 659043 664123 648918 644885 645190 648836 663200 660836 651631 657157 663669
15236 663669 649774 665103 675853 672414 663070 648731 646433 657946 669287 671151 662776 679524
15224 679524 687451 672244 660002 645233 654970 661925 661244 660150 652980 667900 675583 674342 673536 661003
15210 661003 660021 665690 672835 653106 647124 667623 654924 659741 666083 673792 677539 671263 660000
15197 660000 653211 666509 665051 665098 668624 659512 652613 654651 659635 663760 669298 678170 669904 666369
15183 666369 658783 671038 678921 679287 673032 664875 662413 673382 677064 660741 643356 641251 659912
15170 659912 665036 673373 661357 673422 672833 666672 670829 670204 675858 678195 674032 673559 675806 665870
15156 665870 659015 656754 671122 664274 656565 657467 657368 664589 674081 666551 673747 682512 672910 673144 673818
15141 673818 683083 677137 670088 666112 676306 663945 656664 657865 662163 657569 665152 658744 669893
15128 669893 676817 669721 666372 676236 673028 667449 673148 669078 666221 664416 667266 675969 678073 682752
15114 682752 685614 663781 664719 668440 673871 683134 675994 684042 679260 670376 678987 678279 674179 668155
15100 668155 667330 674179 681323 678988 676044 680053 685033 673697 674540 686290 684202 677818 678673 667800
15086 667800 670613 678332 666501 665442 667046 675769 680752 678997 674210 676302 681333 677331 677774 681338
15072 681338 686952 675280 677141 681244 682541 681520 680602 678066 673087 680143 682986 671559 669586 668644
15058 668644 671502 676970 665170 658040 679091 688560 682061 673001 671380 672631 687276 683626 683486 672327
15044 672327 676222 678885 671665 674200 693310 690895 675816 669812 669567 686228 678871 676051 682058 680763
15030 680763 678079 679542 682265 686280 683593 673462 675380 673487 671370 671821 671500 673734 684650 694403
15016 694403 680800 683786 689212 687202 684946 696808 682913 674761 671531 674448 677853 693452 684885
15003 684885 658272 659470 670148 676850 677278 680232 678880 687020 688960 693755 680995 682775 680948 680752
14989 680752 687675 691738 689097 683689 678437 680523 684280 683004 691792 678223 689604 688291 678401 681195
14975 681195 686001 678719 680086 679401 683643 685878 683560 672152 669417 686724 675098 683542 683654 681476
14961 681476 684398 685879 691035 689547 690528 681069 678273 678665 655938 677711 675219 677957 688053 699597
14947 699597 689545 684065 683285 678028 695881 693515 703298 695403 694903 691568 680836 675788 683790 683528
14933 683528 696917 687406 676292 674114 672722 677683 688023 675038 683111 675581 675552 689410 685236
14920 685236 673776 676188 690929 692518 697124 692670 682258 671248 682408 685407 691993 699914 691187
14907 691187 697501 713033 696230 693228 687476 685270 687838 683952 705387 709294 707111 697159 689755
14894 689755 698112 693413 696893 696233 685061 694722 702177 688790 695115 681389 683061 702988 702535 685774
14880 685774 682722 704173 697668 697655 702211 697384 686082 683201 689230 690983 688266 695149 705095 692907
14866 692907 688794 693725 691668 692954 702102 709879 703057 706468 701841 702558 704771 695077 689262 694935
14852 694935 692886 688697 697859 694170 693814 706781 704900 687407 686670 701748 707397 707739 699793 695305
14838 695305 691329 685768 688542 696507 700802 703288 717373 709164 709182 716118 718671 700404 695151 692633
14824 692633 699545 702111 698482 700908 702260 699556 695215 684128 685909 687083 692767 690925 691061 689995
14810 689995 693516 702634 690791 698518 699620 705312 705744 703028 710027 706276 702423 710949 698527 695219
14796 695219 695094 706810 708639 697697 696658 691464 692491 700225 704066 699397 702394 687477 681490 704980
14782 704980 713267 704102 713085 712047 709372 704953 702512 706566 695854 697579 691938 688065 701536 714147
14768 714147 706167 702048 702343 696808 698668 699978 707608 700119 708246 702018 697694 697974 695160 706135
14754 706135 711113 704627 703633 704469 698737 693553 687791 708531 707561 703669 703825 693172 680879 691277
14740 691277 688800 681063 683438 693949 708016 710813 690320 703241 712568 703869 704354 695893 696382 689899
14726 689899 700652 702427 706510 712315 706684 705145 716554 714842 711717 714939 708529 703036 698944 681253
14712 681253 683244 698408 700722 700603 701601 705894 706048 707768 702512 700844 706427 716354 715750 723710 717322
14697 717322 711040 705578 709887 714107 707028 705024 713059 712865 707251 706641 704583 698413 699993 710546
14683 710546 707165 703470 705701 705553 705491 716113 718115 721459 719872 715491 707484 709624 708303 724605
14669 724605 715499 708663 706845 702145 707754 718029 716918 703119 710009 705492 703254 713809 705150
14656 705150 696536 700976 698066 702782 709482 723334 717259 709375 699994 702440 703484 709031 716500 720097
14642 720097 715025 711447 714385 706699 707434 701877 714450 721014 709048 706629 702194 707778 701335 704565
14628 704565 704560 714407 714882 716552 725827 727682 739080 729822 717454 709980 718436 730846 736442 724963
14614 724963 725281 724272 718800 714148 729854 740880 737153 729036 723522 731099 731599 723236 724198 723532 715095
14599 715095 710908 711632 710175 713362 734904 737446 724380 716022 721389 717611 715191 713795 707539 709862
14585 709862 707163 714431 711723 719793 723204 711416 713921 709780 715243 720197 719555 715030 728687 725522
14571 725522 710884 718014 720949 724022 717616 703464 706213 724553 723544 714408 721679 738591 730555
14558 730555 718980 717568 724738 725913 712987 716980 720197 714112 718832 716730 720550 724048 724608 715926
14544 715926 713574 721082 718889 721325 722977 715923 714422 718849 719762 711468 700906 707118 721227 726373
14530 726373 719878 725702 733733 736553 734603 724593 728179 726227 737382 746067 731382 725502 722738
14517 722738 731659 732862 721948 719311 706076 707782 714695 729354 736174 725181 720983 717608 713408
14504 713408 718961 716712 711442 712256 726428 718600 715666 721021 733884 744616 743437 731926 725757
14491 725757 716044 706789 709545 712511 727734 728047 729799 730059 715240 712231 737589 722947 730083 746382
14477 746382 736973 729304 743199 726513 718727 725619 739052 736841 734390 730453 743406 723943 719091
14464 719091 730883 736335 739180 733294 735498 735392 738888 744051 753939 752123 752207 750498 746997 737570 732144
14449 732144 736318 740528 731462 728705 733043 742309 751077 744456 722264 715645 716619 720148 736727 741421
14435 741421 731306 728307 727479 724331 724536 727131 736504 740235 728296 739402 740851 734338 754929 751703
14421 751703 737436 745083 728609 719318 720899 724440 721378 734592 742274 744176 750005 754675 735160
14408 735160 728528 742564 746747 746761 741782 733182 721985 728555 741001 733063 720939 722518 724748 725815
14394 725815 723135 727653 738314 744096 745562 742334 752594 752428 739988 741178 739795 735420 739394 739047
14380 739047 738666 736741 731409 732314 737399 745763 753081 750054 745743 740115 739068 733614 745980 744555
14366 744555 735966 747251 748179 745170 750850 747316 742469 739234 736666 750807 745685 748670 740207 734478
14352 734478 736916 737499 742378 720042 721171 739322 731275 735919 734750 742254 736541 740107 736481 735666
14338 735666 745508 746853 742397 730619 749897 758345 750350 741238 733403 735476 737852 743501 748975 745703
14324 745703 754628 755922 751505 743721 739808 747410 750308 750742 762615 758760 755324 744582 734849 741493
14310 741493 735744 735155 741840 754499 752358 748729 742206 740994 741520 740673 731097 752245 744486 738221
14296 738221 733358 728762 735092 742290 754530 749250 749805 728304 730601 740880 747978 747683 749101 754217
14282 754217 754287 747964 749413 751461 759037 769781 761788 752874 756159 759084 753552 754993 753702 750223
14268 750223 758884 764775 756586 759414 747093 752838 751739 734894 747969 749087 746174 747299 747904 744275
14254 744275 748924 743139 755104 744253 751768 755943 746831 748234 747963 748066 748691 764152 752191 747589
14240 747589 755581 769768 774239 759644 744717 765205 756941 741692 765015 763939 762222 761712 758914
14227 758914 743942 741093 748406 749667 753027 757768 759233 758167 761783 753867 739281 739283 750140 742394
14213 742394 745448 759513 765326 763870 764567 758319 759157 762294 764720 768892 755715 756058 759996 770288
14199 770288 775816 764285 758388 760732 751147 760134 760950 747984 752269 762173 762990 752828 756282 766502
14185 766502 767950 756657 761326 761464 749856 741643 743767 754914 766026 772273 764646 762218 757581
14172 757581 763362 766097 766399 767647 771486 776448 754627 751645 755491 746601 750293 762076 759949 760475
14158 760475 761696 766665 764680 774277 773386 773374 759902 752385 755240 759311 754123 760968 752397 756145 770049
14143 770049 762349 763950 761195 757259 754549 758118 749019 771107 775162 759850 757994 763092 760954 762940
14129 762940 769909 766606 771592 770094 759730 764576 766148 750968 762323 776339 761120 750883 756563
14116 756563 755293 757133 750637 758671 769574 774809 769626 763210 767300 754069 761470 776633 780878
14103 780878 768393 770972 776729 765245 760050 773684 783946 783513 776013 766495 764186 762798 763214 759991
14089 759991 750476 756345 769605 777867 762749 769149 771862 772354 767918 757224 753520 750778 756175 767542
14075 767542 762823 767854 765171 757231 754296 762509 777816 775082 768508 765355 768539 769116 765801 760617
14061 760617 753617 762553 774810 767305 772242 783299 775535 774870 770542 770135 773830 767618 771675 771301
14047 771301 775478 757996 760054 779830 786557 790685 785002 777145 775529 772863 778338 781079 777005 772796
14033 772796 771608 781415 774977 775423 782853 768631 774597 777214 786660 783263 782639 776358 768885 773774
14019 773774 770054 772982 783945 783331 780248 792868 785851 792666 787165 780671 783781 777924 781986 778608
14005 778608 774077 783413 791934 787552 773901 769241 777908 765611 766385 781318 783063 798005 779729
13992 779729 775039 782083 777078 768405 756372 782496 788376 775735 773797 773332 776705 786072 804974
13979 804974 800567 796415 795680 796199 796797 780621 777066 778862 787547 784495 780026 778059 772836 764087 785726
13964 785726 795065 789394 793938 789694 784021 780053 773100 782286 782432 782544 782531 779035 781204 778947 776689
13949 776689 774054 782239 791559 786287 774954 774724 774615 780145 788824 777862 784358 786116 788292 789329
13935 789329 783037 788471 786732 790281 793667 798675 800064 799776 782196 792018 798732 795407 794370 791597
13921 791597 788761 787440 784913 781841 794350 787138 779415 788840 802137 807711 797353 793693 795900
13908 795900 797297 792225 789220 783439 787263 785434 790554 797500 803039 804185 795865 787050 793228 802418
13894 802418 805010 807353 793040 796357 798929 804768 791645 788395 795069 794323 778615 775814 786679
13881 786679 790149 793403 774163 780385 785147 772415 788185 797190 800143 802221 794996 787915 788020 796524
13867 796524 800486 791363 793592 790029 789559 805076 805731 801331 804449 801744 779618 789398 802529 805305
13853 805305 804556 800975 792604 803321 790848 798383 809799 794698 797819 792544 785274 784076 783421 790544
13839 790544 788794 799698 791949 798774 797166 787490 789687 785527 788655 786149 789438 784599 798179 790981
13825 790981 798106 796866 784263 797589 802487 800327 802689 807819 800803 800663 805562 797394 804492 798450
13811 798450 801423 804594 798257 805476 803318 808258 809589 812675 814309 805471 792129 794732 799771 792252
13797 792252 795328 805128 794161 789741 798368 808170 811727 805521 808126 802898 802623 803299 800645 797148
13783 797148 795418 794505 803150 807608 805339 800087 797892 795104 807413 807596 790386 799483 807549 806863
13769 806863 814764 822065 820912 816009 808768 803807 800627 801216 806223 804992 798026 806214 812605 808928
13755 808928 803437 799668 813559 814486 801005 788875 803104 813347 826730 816827 799112 799988 798244
13742 798244 808861 819757 825131 814213 814061 816196 800592 799710 804045 805494 805489 804804 810497 802719 805444
13727 805444 817879 820670 817987 819585 826108 808877 807381 815611 823484 811870 812612 819417 823147 823029
13713 823029 814610 825071 809668 800234 812167 814884 806799 809053 818569 818963 810208 804678 807372 815341
13699 815341 827623 807598 795738 796909 806622 823801 810850 813335 818352 811400 808477 810623 811736
13686 811736 821775 809511 815375 818747 817308 820346 825078 824203 830084 824876 817486 821800 825349 833208
13672 833208 825827 817731 824117 823891 816018 816707 805509 801761 813895 822145 810973 811195 811741 814388
13658 814388 828170 827592 823454 824395 826146 823717 820994 831227 825542 815714 815731 826248 834701 829236
13644 829236 833391 834300 837000 837763 827667 818218 825560 822888 817055 824740 818556 818386 823048 820640 821682
13629 821682 831467 845718 826494 817925 820824 832853 834051 833486 836708 835907 835618 827574 818756 826969
13615 826969 827326 832678 827160 828894 837798 835209 838934 835087 825766 811078 821306 827049 830069 821092
13601 821092 824156 828591 835628 837041 832091 832052 833493 837213 830620 836704 835148 826741 827062 828604 835544
13586 835544 820489 816080 818847 827697 820183 817783 810080 817941 817861 824008 837084 833165 834849 842589
13572 842589 832679 822525 828393 832576 838137 831519 828826 827811 832978 838520 842986 839614 840943 845700
13558 845700 854914 842041 836092 822435 828638 831241 828791 836775 824543 831264 832869 823524 830083
13545 830083 838638 824248 818871 830097 840720 842409 828225 830064 841166 847633 845970 838246 833915
13532 833915 839232 840589 846790 839009 854485 856525 836295 843326 847855 840063 838398 839519 832132 828234
13518 828234 824773 825809 827961 834724 838748 834913 834239 841808 833964 836829 843626 845708 849472 847080
13504 847080 844498 839225 827946 825096 825199 837039 845557 853541 848473 832637 824041 833575 841425 842659
13490 842659 840605 853825 856236 843401 835798 826343 832835 842219 840471 832523 842878 847292 838837
13477 838837 832512 848153 847016 844089 847054 850298 851205 846216 856791 853600 856765 855377 854404 846925
13463 846925 849788 839858 846344 848531 848896 851620 848149 858922 857186 863510 862283 858995 847027 849547
13449 849547 855853 864489 852843 856168 850578 845795 857291 848974 832221 840465 845324 842450 845720
13436 845720 844743 852206 841945 846164 850325 852920 843088 847002 852457 864780 848563 850264 856942 855020
13422 855020 866458 866760 855133 851324 852184 857627 865178 858838 867205 877776 865968 858094 870905
13409 870905 860937 861938 845363 842948 844304 857670 859982 879232 870283 871639 866062 864317 853424
13396 853424 869211 871411 862423 867780 861634 863428 857707 859561 854894 863314 858375 858140 853898 859992
13382 859992 864036 875697 863676 865257 861660 849961 862490 865803 859261 857335 853072 847533 848719
13369 848719 864017 862604 854956 855217 858379 855210 858187 860673 855297 862153 873049 867716 866958 865691
13355 865691 870392 870034 857694 857116 866690 863373 857064 860774 859325 864731 855028 866800 867649 867704 876167
13340 876167 867891 867496 869923 881333 871596 867272 875819 863241 863843 874473 874347 866348 874946 882874
13326 882874 885944 885474 875893 872316 874538 870133 872098 875095 876739 863649 862688 869287 876590 878268
13312 878268 884565 871452 864437 861375 863881 872689 873000 871792 861843 871938 876340 883994 876732 885758
13298 885758 879746 873054 880174 871537 865305 863078 857485 851496 857243 882670 879907 871970 863996 866993
13284 866993 880841 870752 862627 871015 866866 872373 865876 866309 855805 856860 869696 880747 873944
13271 873944 873451 870666 877012 885744 878210 875559 873834 866592 867455 882485 877958 877987 886961 884602 878979
13256 878979 867765 869514 879429 881153 881382 893942 891423 889369 876591 874880 881278 865949 873058
13243 873058 877529 883199 871627 883579 884849 876047 872817 870326 860945 867241 868998 878994 874282 888497
$$ [...]
##END NTUPLES=NMR SPECTRUM
##END=
