##TITLE=1H_EC-3296(IV-33)
 CDCl3
 8 sc, 
 8.6.2023
##JCAMPDX= 6.0         $$ Bruker NMR JCAMP-DX V2.0
##DATA TYPE= NMR SPECTRUM
##DATA CLASS= NTUPLES
##ORIGIN= UXNMR, Bruker Analytische Messtechnik GmbH
##OWNER= root
$$ XWIN-NMR		Version 3.5
$$ Thu Jun  8 14:09:07 2023 Russian Standard Time (UT+4h)  she@DPX200
##.OBSERVE FREQUENCY= 200.13135
##.OBSERVE NUCLEUS= ^1H
##.ACQUISITION MODE= SIMULTANEOUS
##.ACQUISITION SCHEME= undefined
##.AVERAGES= 8
##.DIGITISER RES= 18
##SPECTROMETER/DATA SYSTEM= spect
##.PULSE SEQUENCE= zg30
##.SOLVENT NAME= CDCl3
##.SHIFT REFERENCE= (INTERNAL, CDCl3, 0, 15.737)
##AUDIT TRAIL= $$ (NUMBER, WHEN, WHO, WHERE, WHAT)
$$ ##TITLE= Audit trail, XWIN-NMR		Version 3.5
$$ ##JCAMPDX= 5.01
$$ ##ORIGIN= Bruker BioSpin GmbH
$$ ##OWNER= she
$$ F:/spectra/data/she/nmr/H-F/1/pdata/1/auditp.txt
$$ ##AUDIT TRAIL=  $$ (NUMBER, WHEN, WHO, WHERE, WHAT)
(   1,<2023-06-08 14:07:35.56 +0400>,<she>,<DPX200>,
      <created by zg, POWCHK disabled, PULCHK disabled
       configuration hash MD5:
       00 E9 B6 7A A2 85 ED C7 34 08 36 98 17 FE 4E 26
       data hash MD5: 16K
       60 92 49 69 84 9C A5 DF AD FB 29 DC 78 C8 D3 3A>)
(   2,<2023-06-08 14:07:53.95 +0400>,<she>,<DPX200>,
      <Start of raw data processing
       efp BC_mod = 2 LB = 0.24 FT_mod = 6 PKNL = 1 PHC0 = -20265.89 PHC1 = 12.65272 SI = 16K 
       data hash MD5: 16K
       3C 25 EF AA 87 69 03 78 DD E4 78 38 EB 25 83 C7>)
(   3,<2023-06-08 14:08:13.93 +0400>,<she>,<DPX200>,
      <pk PHC0 = -1.886406 PHC1 = 1.8 
       data hash MD5: 16K
       72 27 FE C6 9E FA 01 80 1B F3 35 CD A5 83 4B 12>)
(   4,<2023-06-08 14:08:16.95 +0400>,<she>,<DPX200>,
      <abs ABSG = 5 
       data hash MD5: 16K
       24 08 EE 0B A0 70 AD D8 5C 0A 9B C4 67 5D CD FA>)
$$ ##END=
$$ 
$$ hash MD5
$$ 3C 13 53 D0 B7 A7 59 F9 21 FD 43 1A DC 6B 0D 74
##$RELAX= 
##$RELAX= 
##$RELAX= 
##$RELAX= 
##$RELAX= 
##$RELAX= 
$$ Bruker specific parameters
$$ --------------------------
##$DU= <F:/spectra>
##$EXPNO= 1
##$NAME= <H-F>
##$PROCNO= 1
##$TYPE= <nmr>
##$USER= <she>
##$AMP= (0..31)
100 100 100 100 100 100 100 100 100 100 100 100 100 100 100 100 100 100 
100 100 100 100 100 100 100 100 100 100 100 100 100 100 
##$AQSEQ= 0
##$AQ_mod= 1
##$AUNM= <au_zg>
##$AUTOPOS= <>
##$BF1= 200.13
##$BF2= 200.13
##$BF3= 200.13
##$BF4= 200.13
##$BF5= 200.13
##$BF6= 200.13
##$BF7= 200.13
##$BF8= 200.13
##$BYTORDA= 1
##$CFDGTYP= 0
##$CFRGTYP= 5
##$CHEMSTR= <none>
##$CNST= (0..31)
1 1 145 1 1 1 1 1 1 1 1 1 1 1 1 1 1 1 1 1 1 1 1 1 1 1 1 1 1 1 1 1 
##$CPDPRG= <>
##$CPDPRG1= <>
##$CPDPRG2= <>
##$CPDPRG3= <>
##$CPDPRG4= <mlev>
##$CPDPRG5= <mlev>
##$CPDPRG6= <mlev>
##$CPDPRG7= <mlev>
##$CPDPRG8= <mlev>
##$CPDPRGB= <>
##$CPDPRGT= <>
##$D= (0..31)
0 1.2 0 0 0 0 0 0 0 0.06 0 0.03 0 0 0 0 0.0002 0 0 0 0 0 0 0 0 0 0 0 0 
0 0 0 
##$DATE= 1686218855
##$DBL= (0..7)
120 120 120 120 120 120 120 120 
##$DBP= (0..7)
150 150 150 150 150 150 150 150 
##$DBP07= 0
##$DBPNAM0= <>
##$DBPNAM1= <>
##$DBPNAM2= <>
##$DBPNAM3= <>
##$DBPNAM4= <>
$$ [...]
##$SUBNAM3= <"">
##$SUBNAM4= <"">
##$SUBNAM5= <"">
##$SUBNAM6= <"">
##$SUBNAM7= <"">
##$SUBNAM8= <"">
##$SUBNAM9= <"">
##$SW= 18.05172834244
##$SWIBOX= (0..15)
0 0 2 0 0 0 0 0 0 0 0 0 0 0 0 0 
##$SW_h= 3612.71676300578
##$TD= 16384
##$TD0= 1
##$TE= 0
##$TE2= 300
##$TE3= 300
##$TEG= 300
##$TL= (0..7)
0 120 120 120 120 120 120 120 
##$TP= (0..7)
150 150 150 150 150 150 150 150 
##$TP07= 0
##$TPNAME0= <>
##$TPNAME1= <>
##$TPNAME2= <>
##$TPNAME3= <>
##$TPNAME4= <>
##$TPNAME5= <>
##$TPNAME6= <>
##$TPNAME7= <>
##$TPOAL= (0..7)
0.5 0.5 0.5 0.5 0.5 0.5 0.5 0.5 
##$TPOFFS= (0..7)
0 0 0 0 0 0 0 0 
##$TUNHIN= 0
##$TUNHOUT= 0
##$TUNXOUT= 0
##$USERA1= <user>
##$USERA2= <user>
##$USERA3= <user>
##$USERA4= <user>
##$USERA5= <user>
##$V9= 5
##$VALIST= <valist>
##$VCLIST= <CCCCCCCCCCCCCCC>
##$VD= 0
##$VDLIST= <DDDDDDDDDDDDDDD>
##$VPLIST= <PPPPPPPPPPPPPPP>
##$VTLIST= <TTTTTTTTTTTTTTT>
##$WBST= 1024
##$WBSW= 4
##$XGAIN= (0..3)
0 0 0 0 
##$XL= 0
##$YL= 0
##$YMAX_a= 194875
##$YMIN_a= -209125
##$ZGOPTNS= <>
##$ZL1= 120
##$ZL2= 120
##$ZL3= 120
##$ZL4= 120
##$ABSF1= 15.70612
##$ABSF2= -2.34573
##$ABSG= 5
##$ABSL= 3
##$ALPHA= 0
##$AQORDER= 0
##$ASSFAC= 0
##$ASSFACI= 0
##$ASSFACX= 0
##$ASSWID= 0
##$AUNMP= <proc_1d>
##$AZFE= 0.1
##$AZFW= 0.1
##$BCFW= 0
##$BC_mod= 2
##$BYTORDP= 0
##$COROFFS= 0
##$CY= -3
##$DATMOD= 1
##$DC= 0
##$DFILT= <>
##$DTYPP= 0
##$F1P= 0
##$F2P= 0
##$FCOR= 1
##$FTSIZE= 16384
##$FT_mod= 6
##$GAMMA= 0
##$GB= 0
##$INTBC= 1
##$INTSCL= 3.70164e-10
##$ISEN= 128
##$LB= 0.24
##$LEV0= 0
##$LPBIN= 0
##$MAXI= 10000
##$MC2= 0
##$MEAN= 0
##$ME_mod= 0
##$MI= 1.114404
##$NCOEF= 0
##$NC_proc= -6
##$NLEV= 6
##$NOISF1= 3.799351
##$NOISF2= 2.8
##$NSP= 0
##$NTH_PI= 0
##$NZP= 0
##$OFFSET= 15.73697
##$PC= 1
##$PHC0= -20267.78
##$PHC1= 14.45272
##$PH_mod= 1
##$PKNL= yes
##$PPARMOD= 0
##$PSCAL= 0
##$PSIGN= 0
##$REVERSE= no
##$SF= 200.130006917338
##$SI= 16384
##$SIGF1= 3
##$SIGF2= 2
##$SINO= 5.538805
##$SIOLD= 16384
##$SREGLST= <1H.CDCl3>
##$SSB= 0
##$STSI= 16384
##$STSR= 0
##$SW_p= 3612.71676300578
##$SYMM= 0
##$S_DEV= 0
##$TDeff= 16384
##$TDoff= 0
##$TI= <>
##$TILT= no
##$TM1= 0
##$TM2= 0
##$TOPLEV= 0
##$USERP1= <user>
##$USERP2= <user>
##$USERP3= <user>
##$USERP4= <user>
##$USERP5= <user>
##$WDW= 1
##$XDIM= 16384
##$YMAX_p= 526354973
##$YMIN_p= -570019
$$ End of Bruker specific parameters
$$ ---------------------------------
##NTUPLES= NMR SPECTRUM
##VAR_NAME=  FREQUENCY,     SPECTRUM/REAL,   SPECTRUM/IMAG
##SYMBOL=    X,             R,               I
##VAR_TYPE=  INDEPENDENT,   DEPENDENT,       DEPENDENT
##VAR_FORM=  AFFN,          ASDF,            ASDF
##VAR_DIM=   16384,         16384,           16384
##UNITS=     HZ,            ARBITRARY UNITS, ARBITRARY UNITS
##FACTOR=    0.220516191357247, 1,           1
##FIRST=     3149.43990451414, 0,            0
##LAST=      -463.276858491636, 0,           0
##MIN=       -463.276858491636, -570019,     0
##MAX=       3149.43990451414, 526354973,    0
$$ Real data points
##PAGE= N=1
##DATA TABLE= (X++(R..R)), XYDATA
$$ [...]
8729 16055394 15328098 14603677 14034239 13613697 13268114 12912719 12630053 12347147 12100873
8720 12100873 11822078 11673404 11667376 11677621 11550751 11593087 11613768 11789731 11859810 12133595
8710 12133595 12633300 13307764 14150773 15521651 17239860 20057723 23995615 29816973 38229657
8701 38229657 49596257 59756327 59819211 49062320 36203198 27343104 21373634 17737477
8693 17737477 15283428 13620948 12096961 11124078 10314324 9603334 8928251 8449523 8051819
8684 8051819 7850995 7557728 7337251 7212200 7030982 6987021 6796569 6662157 6445650 6354692
8674 6354692 6347562 6418987 6418154 6472938 6567092 6702851 6912358 7017446 7198017 7329862 7518552
8663 7518552 7738637 8213784 8536052 8968767 9572166 10005877 10306035 10748675 11359633 12125408
8653 12125408 12819814 13209058 13488208 14059044 14970109 16129010 17640873 19066598 20289074
8644 20289074 21211948 22010838 22845843 23860451 24939500 25542566 25052583 23779455 22585180
8635 22585180 21586967 20736901 19841489 18448355 17027568 15827095 15055033 14590711 14207258
8626 14207258 14009523 14048663 14223013 14670048 15423012 16226650 16748374 17371549 17875278 18204395
8616 18204395 18635775 19203744 19935074 20492596 21339286 22629709 24320002 26471457 28667555
8607 28667555 30296651 30994009 30438759 28624839 25833320 22745146 19982873 17925431
8599 17925431 16546861 15605753 14962910 14174690 13118661 12236895 11435672 10691301 10154837
8590 10154837 9578278 9194849 9134888 9140638 9127323 9002481 8754711 8768002 8906167 9266183
8580 9266183 9726122 10202662 10474717 10696765 10858441 11002734 11212557 11577205 11595525 11024763
8570 11024763 10272691 9678912 9008643 8312441 7672617 6905868 6051222 5233060 4619666
8561 4619666 4052229 3741685 3401986 3177032 2924797 2758966 2742563 2605138 2490886 2383237
8551 2383237 2238861 2165342 2141356 2022631 1993991 1796074 1600916 1546219 1397589 1316588
8541 1316588 1151668 1072102 971396 1046706 1042800 963467 853344 873932 833438 772320 811470
8530 811470 786641 697355 645963 607074 682896 706826 697786 611606 610828 678645 598858 689662
8518 689662 563154 451706 464592 521647 546377 438874 380800 371507 361505 314874 323397
8507 323397 319888 274821 319980 238328 276071 247545 185674 128824 132563 77209 78193 144774
8495 144774 151235 196535 281445 208798 157312 161316 265631 211411 131549 132541 136798 252634
8483 252634 260090 222727 227884 196369 194626 153746 196973 177677 155106 166144 93759 16110
8471 16110 38359 -30299 -111004 -115061 -99996 -19608 -21980 -26667 -45488 22427 -41236 45611
8459 45611 65717 42653 128198 81975 105645 131314 148482 199516 214589 121929 47097 105462
8447 105462 87966 122938 62922 122636 152013 57309 163077 215902 166603 68520 33359
8436 33359 117014 145402 268724 193764 121421 48797 -47282 -86246 -35713 37052 59271 38027
8424 38027 24226 91029 47927 36446 40641 -4800 89737 120286 142883 182103 127737 234956
8412 234956 159225 120243 7744 -8816 49963 7455 -48223 -9917 81742 108510 133846
8401 133846 66142 -19341 -38847 46943 -15860 -50701 -36673 -102824 -115245 13010 -1726
8390 -1726 31155 -19701 -95913 -48886 -127012 -126928 -76236 54561 20440 -120730 -109460 -56581
8378 -56581 67703 64528 -58291 -179859 -196778 -226935 -162246 -148270 -120644 -44569 -43138 -111632
8366 -111632 -45473 -93658 -83390 -40574 -58800 -156758 -155003 -41624 -21764 -14024 -62980 -44607
8354 -44607 -37477 126670 29342 -48762 -78867 -134238 -52799 9088 -79289 -143183 -194676 -191170
8342 -191170 -159307 -183937 -169306 -147900 -128147 -86237 -185236 -154917 -117000 -23925 -34006 -136365
8330 -136365 -196147 -144671 -79835 -118183 -119855 -172790 -208703 -178608 -257646 -217109 -148563 -124731
8318 -124731 -166328 -181210 -96888 -67726 -32813 -153503 -127554 -98776 -94161 -143292 -132953 -193489
8306 -193489 -172687 -158402 -161537 -157352 -102601 -59874 -73180 -158922 -178884 -208478 -189366 -111145
8294 -111145 -107183 -98695 -272722 -177698 -45162 -92270 -107287 -114766 -120921 -44391 -83050 -155521
8282 -155521 -100146 -103331 -165214 -59783 -88338 -128493 -80790 -51152 -91095 -106113 -56637 -80517
8270 -80517 -93879 -50422 -170036 -171932 -208792 -175518 -54025 -71874 -50530 -75654 -121913 -145524
8258 -145524 -115223 -33529 14708 77399 -25533 -69067 -16981 51749 22664 -54169 -979
8247 -979 -41220 45275 5738 36967 94148 80369 74080 104031 91711 89310 18979 -14540 -44538
8234 -44538 -109420 -182173 -220910 -33286 66480 62836 -3749 16637 124779 170822 174030 215934
8222 215934 195730 203035 209902 87449 40934 44967 120530 44024 -51540 25436 -2814 7169
8210 7169 95984 112763 67178 35982 -25874 -105539 -92861 -90985 -22931 25552 21812 -42705
8198 -42705 -22701 -37816 -107440 -55339 -43160 -570019 24696 508858 220662 222581 46103
8187 46103 95354 77330 17675 -19610 54213 42499 106446 123209 113163 105882 23694 -15734
8175 -15734 111278 223624 272851 234824 176504 161270 228690 245445 215190 209226 207818 118787
8163 118787 147402 231915 354205 402604 394881 460619 473906 396460 418661 541721 559003
8152 559003 592230 632204 687483 678990 780650 935293 922834 969984 935200 1025398 1170753
8141 1170753 1255961 1345215 1547743 1874516 2063100 2492720 3049253 3701155 4613539 5874305
8131 5874305 7085436 7844600 7604073 6439922 5015057 3832607 2970294 2426074 2137452
8122 2137452 1789416 1532942 1251893 1085944 965413 822718 838563 769046 676018 553936
8112 553936 533775 514978 366330 269832 195991 85530 69935 124917 177581 154459 111057
8101 111057 64569 11637 48589 106896 97883 58551 119455 51622 -86265 -78786 26644 91027
8089 91027 -55557 -7192 20071 -44401 -103798 -1751 -8017 -63547 19804 11283 -71691 -36159
8077 -36159 516 -42078 5808 48868 -37475 7422 121538 45961 -84778 25993 -2046
8066 -2046 -117474 -30333 -5883 -83299 -53447 84579 51681 -24716 -146590 -137744 -55108 -55184
8054 -55184 -163700 -146689 -24168 -33189 -101112 -38521 -153027 -214108 -162521 -59991 -51154
8043 -51154 -38346 -77962 -84884 -57013 -52174 -68793 -8488 -70210 -135660 -101087 -124076 -127063
8031 -127063 18395 -11034 -123719 -214743 -133195 -18668 -45548 -48807 -133430 -165814 -224108
8020 -224108 -211192 -153521 -182991 -252485 -126784 -57759 7343 -68580 -184663 -159124 -179922
8009 -179922 -172210 -173365 -173617 -243443 -232024 -279090 -286865 -198532 -149335 -147719 -120235 -98999 -77882
7996 -77882 -59876 -94403 -159840 -126034 -28334 -126783 -226679 -116212 -110991 -139736 -128529 -175708
7984 -175708 -129651 -115748 -61593 -139434 -215885 -215302 -146514 -150006 -131112 -107384 -146874 -119689
7972 -119689 -138363 -94588 -65343 -55920 -129041 -175774 -116262 -175792 -194481 -62016 -156224 -203375
7960 -203375 -159293 -146483 -143570 -189252 -147994 -159699 -134886 -190284 -246297 -228776 -167884 -222206
7948 -222206 -226221 -180369 -117084 -57162 -119927 -133067 -92546 -150659 -113269 -226799 -224073 -215361
7936 -215361 -217772 -94191 -153180 -71996 -44281 -72576 -41838 -100338 -176517 -170637 -178360 -188945
7924 -188945 -287735 -287344 -205445 -233238 -152411 -149792 -182411 -267857 -210009 -162098 -144577 -121123
7912 -121123 -150126 -117750 -142294 -198916 -162436 -217379 -182347 -228860 -319466 -256600 -204009 -108663
7900 -108663 -86780 -195271 -233728 -227362 -262187 -258394 -152840 -115740 -121561 -134317 -167783 -118874
7888 -118874 -64534 -123299 -39850 -83106 -136293 -36452 -79671 -185489 -130720 -91307 -117524
7877 -117524 -53899 21081 -83294 -147328 -137378 -86636 -204038 -255364 -199819 -125113 -127270 -181445
7865 -181445 -63247 -147745 -42540 -67271 -74880 -239558 -126227 -125851 -236129 -170317 -125815
7854 -125815 -131676 -187838 -180125 -212830 -191209 -72461 -97690 -72425 -19620 -114831 -114504 -53770
7842 -53770 -41004 -38949 -168483 -159130 -110574 -112563 -98889 -162290 -144097 -209545 -140815 -117030
7830 -117030 -167717 -70071 -119633 -124945 -113169 -16475 -12041 -55783 -112177 -43028 -33044 -21864
7818 -21864 -52286 -68747 -12606 166693 -97195 -327129 -218258 -163981 -87722 -136605 -185264
7807 -185264 -25825 18970 -19606 27448 51854 34299 30276 -127097 -168110 -70476 -53821
7796 -53821 -31949 -77575 -59336 -112411 -105075 -62706 -66120 -58974 -64003 -146740 -128222 -60706 -38610
7783 -38610 -26044 -29230 -105885 -63596 -16747 69960 50172 -18892 -148131 -194442 -189129 -110896
7771 -110896 -127647 -38077 21378 119708 23734 -71567 -106802 -107201 -47442 -119591 -45810 -2688
7759 -2688 -30267 5277 -128082 -1630 -71568 -110019 -56208 36968 3887 -13918 -29138 -147470
7747 -147470 47408 20391 -20861 58870 27531 -13716 -118122 -91716 -33425 -22982 20312
7736 20312 56034 36815 25758 -69127 -93614 -33207 -20686 89026 56163 18288 36016 -13369
7724 -13369 -44770 30738 48902 -115516 -61973 -24706 -26624 4693 21220 -11927 -68645 12999
7712 12999 -35733 14438 -7237 19573 -66715 -103022 -94402 -82556 -70972 -41874 -4687 -27086
7700 -27086 -103521 21931 -17996 -11046 -46964 -49193 7611 -45755 9634 7181 28208 19261
7688 19261 -26286 -76992 -156773 -181624 -6408 42202 42134 118833 205741 236112 97127 37600
7676 37600 59752 150357 145904 86893 140816 113571 47373 -34040 -42521 7247 71171 81341
7664 81341 129431 148235 140608 138434 237322 212302 81269 113663 147793 108043 -20777 17875
7652 17875 81034 87331 12377 -25986 -13396 29328 957 -22597 20075 5909 130160 284247
7640 284247 238555 180613 155740 99657 131001 124956 176964 198014 109860 242637 251831 115679
7628 115679 69635 201318 173182 130176 330728 318549 272382 301596 264574 306226 283866
7617 283866 263844 176828 255202 296159 269250 247146 363246 332123 270147 240829 285126
7606 285126 281915 348626 343425 291704 356386 319490 365490 367162 397806 324567 305320 356662
7594 356662 451141 381920 356941 331104 307708 358451 443489 429114 505560 502644 508577 427691
7582 427691 415186 453560 489838 552147 434539 342148 476825 545804 510203 471464 424001
7571 424001 390461 529897 510056 584102 602456 604051 704841 617448 563479 549437 568273
7560 568273 487144 574293 700041 659053 598712 578891 600947 621192 742472 700580 676911
7549 676911 710498 883909 855470 786675 794201 845161 914494 913176 965610 951474 1006900 907085
7537 907085 866701 976621 1017759 1041827 1095044 1195814 1230489 1158483 1185441 1104593 1109679
7526 1109679 1173011 1206072 1197760 1240259 1322708 1375349 1348372 1411001 1472720 1454187 1364882 1451517
7514 1451517 1612423 1568244 1591142 1511245 1610157 1735234 1669054 1722572 1746526 1793845 1796136
7503 1796136 1858271 1890889 1966629 2164828 2191111 2163891 2158360 2211629 2352215 2296637 2351265
7492 2351265 2443114 2507262 2458185 2584166 2712339 2757754 2790679 2870088 2920225 2903671 2997166
7481 2997166 3045217 3164778 3318422 3419821 3329322 3407117 3585273 3587004 3642408 3820124 3900593
7470 3900593 3981106 4194363 4323823 4402475 4545672 4640896 4830201 4997333 5138131 5152178
7460 5152178 5336257 5544764 5711884 5809227 6000464 6236086 6382407 6582455 6794354 6989724
7450 6989724 7337066 7564843 7715876 7921701 8116635 8473474 8821621 9223402 9477359 9751655
7440 9751655 10093086 10474253 10907081 11246363 11645077 11863484 12145432 12670675 13145603 13665551
7430 13665551 14007594 14453883 14798602 15240236 15746025 16061583 16318243 16646628 16973216
7421 16973216 17243241 17466882 17729691 17929810 18179780 18242058 18283309 18369242 18402060 18502278
7411 18502278 18453619 18309467 18182063 18030390 17790810 17576912 17470717 17391665 17141908 16951895
7401 16951895 16594208 16246002 15965092 15689293 15439131 15182057 14818245 14567465 14307215
7392 14307215 14079647 13788145 13502878 13137984 12761682 12345111 12037700 11858335 11531267
7383 11531267 11201981 10881474 10559430 10200471 9907519 9571547 9216981 8836710 8446072
7374 8446072 8164068 7894865 7647041 7385998 7120417 6853745 6507312 6263568 5991559 5837589
7364 5837589 5667381 5490405 5216166 5044770 4899009 4670498 4585268 4419474 4221230 4073937
7354 4073937 4040680 3916534 3636335 3563444 3481943 3371925 3289457 3284617 3155799 3047932 2928175
7343 2928175 2838973 2773834 2632342 2586536 2523431 2463112 2297368 2259691 2242547 2266350 2284801
7332 2284801 2203961 2046272 1990384 1964108 1886154 1742753 1775303 1814986 1758147 1779016 1665530
7321 1665530 1572621 1493674 1493870 1481381 1521313 1451791 1311921 1263869 1213256 1255225 1205638 1131028
7309 1131028 1142793 1231554 1239269 1145391 1048751 1105865 1008808 938776 879629 819933 862236 876139
7297 876139 934163 826141 843245 889966 819020 764467 842190 916258 791952 777692 791689
7286 791689 823386 667296 586889 594243 654446 699126 645698 587913 688920 763937 666674
7275 666674 609194 537891 429645 475458 511741 503416 450996 504347 507275 495883 536946 503200
7263 503200 543163 470080 525990 513724 476324 367744 483021 439498 303649 363628 438630
7252 438630 389966 420365 445543 485220 524479 461490 472832 447344 449154 434249 460318 330979
7240 330979 288021 349611 269000 297311 336322 391752 328933 237648 176281 245232 236672 198628
7228 198628 117937 119688 218826 222402 155985 127788 232530 230083 258797 250080 259190 284706
7216 284706 159305 160819 251302 234083 208260 259768 243389 229509 319214 271398 174134 79737
7204 79737 183108 243043 219563 246107 165513 106488 83368 179427 192454 173053 205688 190475
7192 190475 52874 187123 183082 130613 52931 94054 182358 96306 27903 135553 274068
7181 274068 201639 141548 50484 93426 67170 105190 66662 145915 102795 52808 123220 166645
7169 166645 66748 57881 14626 162618 237401 262740 305054 278567 349061 263491 207951 124330
7157 124330 166878 180525 172032 202077 148735 60340 111407 173314 152754 113727 145501 193696
7145 193696 176922 205826 109062 97906 140976 113562 4395 36393 -20355 -69171 31806
7134 31806 81611 178012 151192 21403 -41871 -51476 -85842 -69802 -19430 -7904 -34796 -35274
7122 -35274 21168 59075 62545 28508 -82632 -114479 17637 -1583 27405 41526 -17614 21339
7110 21339 124094 92950 14469 -21126 -101401 -152287 -21364 47885 15072 49535 35751
7099 35751 86265 22327 40965 67523 -9856 -40808 -84356 -43405 -31658 -81857 -36199 -36609
7087 -36609 -76013 -145512 -67908 -15659 20591 79882 132845 72812 -37045 -19532 -41960 3748
7075 3748 -81836 -60224 33129 -1294 10768 4876 38003 15012 -33236 -183965 -107793 -82604
7063 -82604 -5712 -36409 4662 59257 17349 100587 -22975 -64065 -33389 -50519 -25278 -14707
7051 -14707 -54714 25099 56210 42119 -90921 -59316 3923 -82058 -44469 -29179 33863 31436
7039 31436 95765 17874 -25175 -86466 -108361 -48559 -79706 -126235 -42713 -60311 -19918 49008
7027 49008 -50743 -32327 -5161 -130685 -62515 -25542 -142217 -159327 -185267 -93873 -5746
7016 -5746 -71674 -153712 12488 -22803 14061 17153 -100240 -36113 -58317 -41237 -9571 -104975
7004 -104975 -48367 604 -18619 -47773 -68668 -94582 -71051 -25378 -47120 -190192 -61232
6993 -61232 19390 17564 -31910 -114615 -33693 -48215 -50879 -58321 65037 34644 -25784 12480
6981 12480 -15215 -28346 42886 59912 -103388 2781 60745 4610 43470 35856 108541 111454
6969 111454 36687 171885 168835 138183 39478 -34936 35216 187354 217866 6615 -19129
6958 -19129 26218 71821 50380 57789 96742 90214 61901 137795 194367 166766 198447 93330
6946 93330 131341 159250 134411 69198 152888 230442 110501 55435 75400 78532 32972 42935
6934 42935 -6958 -12364 27719 18557 21760 82903 53858 81084 90025 93676 61756 20725 -65931
6921 -65931 -73848 32819 24591 -63934 -33713 8686 38523 20009 30259 11131 13772 20485
6909 20485 -26500 57449 91941 139049 9686 -60208 -56381 -76199 7902 106467 104906 56569
6897 56569 57095 -27910 35360 138354 48336 97766 183437 145956 168092 146679 136240 145687
6885 145687 125479 133426 254525 266209 162226 149388 109941 138182 130992 57936 86326 84814
6873 84814 31228 103570 141565 31041 25612 12294 30181 120329 61471 -77534 -156502 -114775
6861 -114775 -19793 -34313 16059 -67351 -133896 -101204 -145466 -96883 35826 3473 -26053
6850 -26053 -103114 -133822 -131048 -78627 63054 48534 17119 -81196 -143426 -115660 -204061 -279951
6838 -279951 -175458 -153571 27296 -2809 -145582 -72362 -58622 -179714 -175288 -34855 57280
6827 57280 101118 15107 -32336 -98510 -144465 -63216 -87989 -139050 -157236 -168566 -161872 -244046
6815 -244046 -238475 -99663 -112786 -9347 -166462 -264393 -130920 -171235 -214640 -201290 -137783
6804 -137783 -3044 -16635 -63382 -128871 -146981 -127627 -173551 -178107 -232778 -137835 -121585 -133920
6792 -133920 -96612 -166341 -197491 -98857 -200167 -211173 -199776 -151733 -104412 -186825 -274370
6781 -274370 -159120 -117678 -186764 -137018 -122437 -136538 -70324 -88821 -135523 -64299 -48000
6770 -48000 -30643 -111092 -57643 -16202 -28658 -53329 -65946 -87720 -149601 -114937 -116424 -26888
6758 -26888 -56842 -100141 -124198 -77479 -76261 -38950 -96392 -97530 -85980 -60075 -109165 -136916
6746 -136916 -152397 -150091 -132935 -145300 -40451 -66359 -165275 -123405 -74553 -24070 -21166 -51748
6734 -51748 -35571 1008 -72742 -131295 -106354 -209877 -126913 -142381 -92946 -180060 -154692 -145545
6722 -145545 -259540 -105428 -22162 -68014 -7881 -60545 -125705 -74471 -47321 -143087 -176268
6711 -176268 -187811 -201179 -246892 -176893 -166187 -149574 -156653 -29480 -85019 -177205 -221699 -150698
6699 -150698 -97965 -73913 -113480 -159224 -174548 -202569 -142338 -132787 -89694 -62043 -184316 -153402
6687 -153402 -142214 -169194 -115480 -156363 -98323 -155932 -114145 -80970 -101782 -178705 -109357 -152454
6675 -152454 -245136 -283159 -326186 -189723 -93995 -135489 -146071 -112249 -127019 -146028 -123372
6664 -123372 -103517 -63247 -95510 -82921 -135964 -160437 -132776 -49633 -144536 -54144 -41835 -136027
6652 -136027 -114988 -71025 -66926 -158336 -229537 -131381 -114438 -100322 -42955 -39306 -99939 -219115
6640 -219115 -145562 -194950 -187006 -193864 -113087 -161390 -102292 -28260 -45102 -150911 -153345 -53711
6628 -53711 -79452 -156721 -148320 -120628 -183930 -88025 -60601 -46119 -61638 -74139 -66781 -188210
6616 -188210 -149238 -110194 -165040 -119393 -89826 -200757 -182843 -54166 755 36715 -64182
6605 -64182 -11967 -72307 -116039 -191666 -209113 -166413 -154848 -143241 -128941 -86041 -106387 -58072
6593 -58072 -92830 -165111 -170596 -200362 -174906 -219931 -185575 -169770 -101498 -74753 -182872 -209792
6581 -209792 -105789 -168757 -201869 -164029 -44774 -57575 -190452 -83605 -46786 -87637 -79335
6570 -79335 -101437 -128967 -56646 -42431 -106702 -15257 -18378 -100125 -69256 -73616 -148066 -239004
6558 -239004 -300080 -239725 -196110 -177056 -132300 -124249 -151651 -107068 -49853 -97808 -196598 -254604
6546 -254604 -240891 -221220 -165831 -168249 -93779 -91467 -103990 -79019 -96263 -53803 -93447 -63787
6534 -63787 13591 -22545 62344 -6528 -117834 -140501 -66241 67322 -57770 -121701 -181918
6523 -181918 -271392 -136870 -188356 -258201 -233767 -127146 -194244 -160985 -161431 -118354 -147889 -138284
6511 -138284 -185830 -126764 -40576 -35046 -141377 -194791 -168836 -95298 -136218 -110209 -81443 -90641
6499 -90641 -54535 -42824 -56605 133 -15008 -85826 -60884 -27660 -12749 5063 -23647 -43466
6487 -43466 7701 -82316 -114988 -80009 -60336 -118712 -177851 -100209 -177985 -334268 -242390 -170230
6475 -170230 -199939 -89900 -161911 -174075 -115473 -113083 -85292 -166508 -134240 -172238 -168542 -89396
6463 -89396 -730 -74091 -135572 -160223 -155385 -148776 -129325 -204630 -232979 -194333 -182503 -176103
6451 -176103 -72474 -83230 -97883 -162603 -88967 -126748 -139830 -190973 -38899 -29827 6425
6440 6425 -24680 -56468 -7787 -7207 -85162 -166302 -84881 -128283 -146394 -106384 -87397 -89414 -115151
6427 -115151 -111487 -44130 -3549 -131383 -27684 -35929 -105796 4485 -26726 -86738 -144836
6416 -144836 -113161 -129551 -173395 -197194 -177121 -145423 -123962 -205649 -186324 -182353 -202185 -99499
6404 -99499 -71645 -129737 -47739 -26064 -192671 -123860 -25854 -28603 -95112 -257385 -286366 -251372
6392 -251372 -223735 -185612 -155836 -63077 3612 -56176 29102 -35285 -21897 -81165 -146958 -111669
6380 -111669 -123256 -107350 -166053 -180216 -222357 -103252 -100534 -125268 -29599 -58067 -46339 -156302
6368 -156302 -107737 -167931 -145414 -118066 -143857 -136934 -149402 -149681 -89598 -35482 -59442 -115091
6356 -115091 -20601 52726 -12970 26250 -30554 -81810 -71192 9095 -5516 18909 145902
6345 145902 60515 10571 14240 77564 -27123 -92105 -14569 -41849 -159998 -115855 -68352
6334 -68352 -71687 -110245 -78839 -96935 -155801 11118 -62139 -232948 -203960 -211212 -237260 -139847
6322 -139847 -87675 -113946 -85637 -78727 -90264 -57929 -105925 -118196 -5088 -26898 -120193 -37766
6310 -37766 -48670 43217 72310 53494 -31810 -114238 -115695 -93938 -124515 -100633 -64050 13232
6298 13232 -92764 -91235 -149399 -125962 -30197 -134510 -98683 -71393 -111785 -103483 -105330 -155265
6286 -155265 -88915 -72024 -150956 -118158 -39626 -30688 23205 -75708 -129422 -174115 -191708 -196043
6274 -196043 -155715 -94728 -12895 -118600 -140971 -94261 -143828 -133452 -201346 -155198 -122462
6263 -122462 -124951 -145902 -169514 -144735 -215347 -85884 -58658 -130930 -83896 -77008 -75094 -22282
6251 -22282 -98392 -52369 48910 -44723 -34449 64558 -6391 -175053 -155616 -85636 -105471
6240 -105471 -171161 -96190 -97689 -82314 -16855 -131337 -166096 -114209 -160653 -205503 -149319 -88454
6228 -88454 -147638 -114274 -100915 -69266 -53846 -103029 -168030 -120961 -137445 -151867 -224036 -273219
6216 -273219 -101394 -66226 -88817 -162410 -130459 -155113 -169550 -124843 -164143 -264224 -206115
6205 -206115 -19456 -38659 -79197 -44605 911 -82657 -210482 -187523 -139863 -106444 -116409
6194 -116409 -128418 -50439 -58427 -91139 -110769 -77719 -72931 -11850 -67309 -46358 -92458 -112550
6182 -112550 -182590 -79134 -157949 -247739 -86667 -185410 -152762 -106841 -52761 -111773 -73457
6171 -73457 -183222 -179224 -103268 -73319 -74968 -135001 -44124 -19161 -185157 -162019 -109520 -78586
6159 -78586 -18640 -69741 -84589 -38663 -3911 -63326 -103588 -66690 -81694 35700 126484 -32019
6147 -32019 -86330 -78577 -53122 -53621 -117753 -132407 -111685 -165274 -84839 -43148 -75138 -69062 -55996
6134 -55996 -44847 -172614 -296960 -118040 -83630 -224296 -79271 -106025 -137701 -136937 -163943
6123 -163943 -97675 -62910 -92472 -45362 -126476 -191948 33525 -82797 -110352 -1916 -46143
6112 -46143 -159737 -188084 -138172 -18284 -52245 -195778 -155433 -61511 -63167 -129807 -148106
6101 -148106 -130466 4075 -5811 -26557 -139518 -119550 -28244 -140625 -186921 -178063 -196980
6090 -196980 -162399 -57008 -77610 -181979 -153526 -92313 -80469 -197060 -51108 -60997 -117115
6079 -117115 -41079 -67286 -130902 -145194 -88012 -118444 -102773 -109281 -118862 -103135 -53992 -76231
6067 -76231 -3760 -6735 -82300 -7661 -79181 -117323 -140254 -153501 9724 -17404 -32436 -168873
6055 -168873 -109142 -34149 -65252 -21960 -64574 -18546 -85699 -129239 -130681 -154702 -173254 -92831
6043 -92831 -105785 -129360 -103460 -31046 -47577 -23635 -61242 -133451 -36717 -16507 81240 57743
6031 57743 94038 -47519 28812 -105943 -109796 -138558 -115549 46685 -51811 -25389 -77187
6020 -77187 -55819 -60326 17624 -56850 -61507 -74600 -106608 -108714 -122054 -219737 -208841 -166746
6008 -166746 -130243 -130776 -88326 -53374 -44110 -38386 5751 -90798 -133750 -53801 -5186 -74934
5996 -74934 1442 -78435 -72685 -83555 -80839 -84729 -24171 25144 -145979 -80378 -26613 -93165
5984 -93165 -158131 -140023 -206279 -37564 -8853 -89304 -76657 -70746 -134952 -57212 -61892 -14477
5972 -14477 -61682 -19678 43691 34622 25410 16514 70296 9255 -70878 -72795 7755 3424 -72652
5959 -72652 -15902 -31492 -43950 18022 118473 9216 -18178 15537 -45075 11979 -62435
5948 -62435 -55608 -118926 -127634 -125985 -127474 -108030 -102952 -111134 -56774 -29528 -142564 -133203 -132747
5935 -132747 -54131 -17240 -104410 -99296 386 -149183 -156784 -94777 -42092 400 -21082 -42588
5923 -42588 4675 27984 32201 -42285 -195411 -230835 -214007 -278621 -219187 -119599 -68361 -45225
5911 -45225 -81261 -24611 -58154 -33057 -74587 -120158 -179053 -94210 -105069 -189746 -193781 -137554
5899 -137554 -108618 -113484 -81704 -32273 -74296 -74186 -75246 -48970 -5267 -24462 -83408 -57550
5887 -57550 -28618 -50948 -10437 -50818 -57953 -65607 43785 84761 29309 -68724 -56041 52180
5875 52180 -127090 -177553 -80175 1487 -2963 -48492 -68207 -125343 -104568 -28298 3216 -27763
5863 -27763 -59154 -62822 -17893 -13956 -16764 -11958 -18652 -60082 -57781 -76335 -165421 -94154 -54757
5850 -54757 -68951 17858 58005 51458 110472 117928 38840 67071 73081 -23567 -46300 -50877 -57005
5837 -57005 -105548 -61093 -77341 -98432 -61087 -29031 -48282 -49546 -17280 1241 -65876 -69429
5825 -69429 -66543 -121175 -36115 -88564 -221309 -154964 -84417 -11862 -3083 55386 57547 -17703
5813 -17703 15597 6521 24903 -79683 -172159 -34704 -53724 -80438 -13151 -21497 69143 40326
5801 40326 -1110 -57571 -196826 -183815 -197239 -74319 61112 62163 89094 28835 -16019
5790 -16019 -78669 -134478 -105264 -62831 -71193 -30247 131953 116181 14000 -44894 -112001 -86731
5778 -86731 -39761 -5412 -24333 -7748 53949 56400 -55066 16088 1240 -16014 -48871 -37172
5766 -37172 -46608 -110144 -115560 -151292 -56494 33970 -16478 -43138 -13777 -50054 51771 58183
5754 58183 -142947 -25467 -98438 -161555 -200860 -161659 -21711 -77750 -53064 -42094 -28386
5743 -28386 -58789 -59448 8321 -106961 -232858 -154192 -51691 -91648 -67548 34492 87019
5732 87019 -27790 -86677 -44811 -75384 -95651 24673 -19313 -105839 -96708 -81015 -26247 2775
5720 2775 -85092 -95215 -27576 55659 117060 -55549 -25255 2953 -86452 42587 48431 -4753
5708 -4753 9904 -76935 -65529 -39883 -65677 -159387 -63061 -291 -2689 13993 50571 -35754
5696 -35754 -57321 -25348 24712 52655 39805 -33 34828 -85871 -106072 -121556 -111438 31637
5684 31637 -3091 -103659 -63471 -83805 -87343 -58306 -69255 -54159 -20049 2522 -6692 27954
5672 27954 -12444 -24524 36751 42580 32885 -23245 -4065 124730 120841 126705 17076 -16003
5660 -16003 -9606 -20710 1173 52395 29582 -58286 -64711 -51175 -103359 -35347 -6634 -53672
5648 -53672 -23869 18061 -986 -38588 -39053 -45891 -30565 8575 24215 3996 30477 -6256
5636 -6256 -43987 -56912 -70066 1993 799 3042 100097 154086 131342 132913 69438 120782 208196
5623 208196 163378 143023 206855 217096 187685 291986 241387 188793 203934 116087 61230
5612 61230 52660 55919 31381 16129 52493 14011 60517 42632 165248 273383 174445 129754
5600 129754 133506 245796 216773 182531 245470 368461 437513 463511 363745 335417 366961
5589 366961 323524 272139 214623 293717 228872 157069 218898 147322 160715 215797 219180 144701
5577 144701 218068 316547 276344 280900 177142 131975 125958 165934 336086 232753 278972
5566 278972 313617 231715 227416 276734 321772 331138 298995 363390 323247 290999 354868 292528
5554 292528 269763 180204 226705 207363 225515 221532 319771 297688 253744 284114 251980 258031
5542 258031 365529 338147 274221 243294 233489 256818 276779 377054 431080 363283 350420
5531 350420 324462 345764 259278 231194 158461 227850 326039 266132 245788 310582 240703 117937
5519 117937 193912 191938 236860 278326 204804 189599 172108 213038 200200 223054 292505 281426
5507 281426 259481 137303 178881 83119 75318 187430 229022 284838 238592 207622 228789
5496 228789 235261 305928 168634 90432 126967 184489 183922 266799 263191 364379 375489 310943
5484 310943 273236 246947 123960 194408 285987 317297 310227 312614 260996 235262 272115 175722
5472 175722 123382 102487 226352 253567 126877 98179 205313 225854 98038 124625 208851
5461 208851 298524 398275 367155 428118 481860 571387 610224 763014 893476 861715 691418
5450 691418 563694 461960 285022 279019 356992 342385 260564 295628 188022 173233 342395
5439 342395 260514 292141 331523 237558 183710 257248 265779 248529 310760 351745 453195 436931
5427 436931 420744 543553 647062 762939 866175 875076 990386 876282 698951 554404
5417 554404 479002 474785 397225 434558 316369 288878 302563 262240 206521 358824 245075
5406 245075 147555 221344 312246 278840 269243 234368 78520 78889 179075 167102 216403 234329
5394 234329 187793 251041 347879 390660 312095 422362 408697 327677 296104 178664 147093
5383 147093 136572 153853 185957 79058 -14626 53830 136338 46792 104948 142080 161867
5372 161867 193564 173453 125006 62261 176105 171569 119712 121619 144064 122086 34322 20123
5360 20123 42105 109986 77682 8207 91606 35463 73730 70327 88126 56162 -43895 -10450
5348 -10450 92253 131932 57439 78411 142174 179063 151947 76664 158452 132943 138039 124419
5336 124419 87562 53910 136466 221384 89693 137546 119762 102954 85802 128229 91097
5325 91097 19110 43116 37235 39517 77521 84831 -44597 -64043 32943 67677 40475 -11440
5313 -11440 79294 128779 101654 73395 -20593 -20935 56177 34158 132351 114766 131084 71601
5301 71601 138635 123448 163976 192983 256064 154170 138438 213731 198516 134483 152189 150377
5289 150377 86597 95057 164577 211009 230297 198437 194578 216589 189592 108330 61609 85180
5277 85180 63041 87168 95685 95041 133247 177305 138291 142306 158335 159485 170629 287842 289093
5264 289093 227041 223191 220118 256448 227011 90638 57890 185985 256650 45203 32635
5253 32635 -1615 19304 32741 81949 120357 149130 157805 195744 191036 171626 256492 304943
5241 304943 337018 308850 289835 242471 234458 245192 264759 328584 273968 208525 124195 304186
5229 304186 374566 298677 395132 358294 357218 374276 387738 412898 415917 395250 437441 446435
5217 446435 442944 499294 542997 549582 668856 757164 865902 1020837 1136996 1515820 1670114
5206 1670114 1949619 2313771 2543888 2682604 2480080 1932537 1647498 1449908 1206909 1034625
5196 1034625 834167 748568 710746 679031 571555 528212 454773 468808 463201 528266 601238
5185 601238 427169 377098 323729 400687 396693 253522 162470 204062 283909 213609 183107
5174 183107 118904 132239 212555 223174 306683 295177 220762 181283 141303 105938 183834 254416
5162 254416 215538 251234 242419 197940 113784 99103 226417 232812 139157 201211 218740 177151
5150 177151 203317 265503 315233 249778 170201 210221 220262 282156 273699 228967 271689 278952
5138 278952 272547 312866 317844 276276 235637 255735 229927 287192 372463 411738 436577 507143
5126 507143 515777 484426 406336 488780 472916 407552 444379 631368 650341 722308 831194
5115 831194 804159 800039 887389 920510 888464 1013346 1207598 1325395 1488829 1710192 1919347
5104 1919347 2117622 2321460 2518591 2630255 2661999 2647037 2492630 2384939 2293870 2121516
5094 2121516 1967198 1820585 1704819 1658294 1684162 1753136 1832619 1978559 2057219 2165390
5084 2165390 2297533 2522597 2734986 2799436 2932300 2969743 2975553 2938694 2784485 2444104
5074 2444104 2246074 2075167 2015590 1978792 1848410 1849938 1996743 2048840 2149124 2256010
5064 2256010 2527036 2673819 2821093 2816218 2877320 2894686 2799691 2635602 2484301 2352406
5054 2352406 2283036 2122726 2041609 2077136 1984497 2007304 2065112 2129885 2189115 2361157 2423438
5043 2423438 2562520 2602392 2575916 2599556 2589486 2491621 2404406 2147989 1850082 1727284 1656412
5032 1656412 1479622 1233178 1051699 941219 798951 725969 678591 620650 638544 532997
5022 532997 512864 536268 482220 442674 477304 461473 440801 436130 435282 389247 422503 363739
5010 363739 240593 185821 260216 362422 276052 277020 345619 276389 206645 238996 213103 204435
4998 204435 117180 134050 138291 189782 212687 203780 162742 171467 180630 97706 112220 177970
4986 177970 197352 192904 149864 149505 95663 63769 36204 -3639 34310 57911 130034 105715
4974 105715 94226 121836 93602 50201 32409 -72305 23179 89112 98172 79454 49819 4304
4962 4304 41841 21049 80107 66031 29757 93722 142545 138487 93448 96473 22594 5555
4950 5555 33641 36052 85900 48512 17862 89925 71835 35900 65302 80045 -34282 -30250
4938 -30250 9099 -4300 -98836 -52881 66261 15048 56025 177148 178946 40475 -36690
4927 -36690 65175 55540 -8174 -8819 2721 36942 80360 53644 50573 -613 29069 179172
4915 179172 230457 129923 16091 -16470 123617 141919 136447 75846 74898 67146 63749 52037
4903 52037 18975 82213 15038 8853 18019 55493 79383 151497 111435 -3745 55641 129361
4891 129361 55370 432 61615 30933 148003 98927 123527 187293 151056 160565 191945 54935
4879 54935 102620 48105 44522 26227 41852 98421 83171 48251 30105 166091 219902 155968
4867 155968 139586 70700 74681 179056 135646 188420 18698 12016 32739 42296 99653 149235
4855 149235 103435 46192 120437 145363 91466 139672 195595 71078 58805 144864 148542 212897
4843 212897 163492 195082 215829 173186 175750 188003 143794 189641 139596 57585 39829 184258
4831 184258 158861 111247 -29761 7830 76242 81037 77579 108813 152935 161150 202614 284007
4819 284007 194276 170606 205851 199103 120633 252483 279325 245120 243051 84208 100100 56990
4807 56990 120440 180054 274049 128072 70501 93436 85535 117506 175598 253411 257701 218985
4795 218985 177752 155759 130053 197786 130413 92570 47515 114332 51062 89164 -20368
4784 -20368 -63668 125333 208783 291835 263911 277756 190878 132609 141269 140799 122611 217137
4772 217137 128618 133437 159172 99149 26561 140403 126075 240831 223104 258612 163327
4761 163327 137909 158764 207625 204785 131942 124488 163574 229745 221423 167509 146730 149809
4749 149809 92392 131166 200352 255066 307440 290986 203587 185534 204269 258343 221671 280504
4737 280504 275855 214950 83068 70948 119293 102467 75482 78215 233984 334968 321367
4726 321367 262572 256685 219495 206566 194940 296189 289403 338276 282980 226167 209986 281801
4714 281801 322116 340217 373098 397054 353436 331699 292527 228686 324796 390499 355352 385057
4702 385057 341990 283482 369205 295310 318390 305471 379445 332745 295609 293196 362157 373485
4690 373485 340840 410218 533673 513535 491590 371617 306056 407658 372973 435481 492149
4679 492149 520087 473132 485705 519039 522723 514736 479684 509597 464079 503335 437969 388752
4667 388752 442933 579206 505954 426654 430633 504129 484160 495596 372293 402108 508007
4656 508007 530751 464841 328321 314670 289893 303387 346621 320615 297697 173287 223985
4645 223985 251188 334860 465407 308797 385732 287367 225505 276935 314356 206497 229962
4634 229962 247568 155703 166062 238532 359628 320993 317929 359763 254379 187764 315805
4623 315805 348932 399788 435285 380709 337279 343574 377279 314867 372414 377674 357190 363437
4611 363437 337956 365577 393695 413864 321660 321379 358255 346001 387729 467835 465930 476271
4599 476271 438837 475568 406666 442091 538108 429828 364634 429850 546837 627054 562952
4588 562952 615677 626100 620459 666639 591185 653110 522421 525499 564567 601773 582014 613492
4576 613492 620817 617328 625652 738809 592299 664200 787559 782589 857609 829177 818640 850868
4564 850868 947271 854184 837963 811237 815047 882913 826340 806860 911707 848190 810606 918129
4552 918129 842872 866126 931036 979226 1015543 989772 1010479 1100631 999878 1028580 973660
4541 973660 1036835 1076718 1070945 1077267 1146126 1159797 1176680 1275918 1267113 1335804 1276145 1384977
4529 1384977 1422729 1355855 1377683 1379280 1383086 1462932 1461812 1426070 1461383 1445583 1400194 1483071
4517 1483071 1526364 1419787 1599812 1640336 1570056 1572661 1585173 1735442 1817042 1737170 1717756
4506 1717756 1710716 1810680 1921802 1958186 1900063 1964377 2018714 1965041 2063763 2076183 2200636
4495 2200636 2170247 2105157 2195428 2285903 2321240 2358905 2402303 2530607 2665264 2725217 2719421
4484 2719421 2718790 2740628 2817701 2930832 3105440 3103261 3199450 3160611 3321249 3401777 3499010
4473 3499010 3671049 3809507 3892196 3902907 4079369 4201733 4188020 4292120 4600303 4678586
4463 4678586 4690089 4971533 5257477 5349853 5495466 5646851 5898669 6062561 6156338 6412632
4453 6412632 6749244 6991352 7218952 7633108 7949289 8376042 8758345 9195776 9597243 10090154
4443 10090154 10601185 11194675 11732754 12373259 13085804 14055884 15073772 16281246 17607825
4434 17607825 19079942 20711749 22627192 24511025 26501206 28599717 30296098 30919848
4426 30919848 30339323 29484122 28478940 27881848 27292171 27030888 26826377 26771051 26825395 27181737
4416 27181737 27668855 28491637 29353135 30305198 31432134 32346039 33360153 34197180 35090080
4407 35090080 35850929 36332691 36611396 36704172 36774996 36629678 36491862 36179437 35865748 35347500
4397 35347500 34764987 34088555 33604498 33232496 33143660 33338212 33756572 34338868 35123914 35911516
4387 35911516 36371854 36780586 36852503 36805901 36588686 36231201 36099659 36112385 36294651 36667773
4377 36667773 37156863 37451209 37595588 37696135 37422192 36914322 36220130 35454516 34518015
4368 34518015 33236327 31655802 30042314 28264148 26398443 24528286 22733466 21215394
4360 21215394 19774797 18501093 17342871 16374369 15501869 14755094 14050939 13543041 13216507
4351 13216507 12752241 12527261 12334716 12250248 12156909 11845796 11428652 10953621 10496921 10030094
4341 10030094 9701326 9523245 9365227 9215798 9136204 9044099 8880792 8809927 8827853 8771199
4331 8771199 8846647 8927782 9016739 9039873 9202533 9379385 9528895 9679961 9844267 10063454
4321 10063454 10256400 10461968 10464100 10691019 11002484 11244913 11577886 11870391 12293460 12828095
4311 12828095 13148160 13398083 13632082 13842253 14095183 14354701 14768775 15209596 15767242
4302 15767242 16361822 16991730 17727813 18586715 19450261 20522500 21874263 23106188 24597991
4293 24597991 26109025 27791293 29367069 30945886 32412166 33852021 35292460 36510735
4285 36510735 37559289 38429656 39152965 39624222 39883674 39930940 39758110 39623421 39246109
4276 39246109 38834771 38488106 38341778 38237934 38254972 38377579 38521451 38531914 38268683 37952586
4266 37952586 37569278 37052687 36445708 36068192 35644539 35295566 35205092 35350997 35491918 35769962
4256 35769962 36102629 36441777 36726991 36825582 36761704 36886173 36993099 36933383 36777866 36529151
4246 36529151 36091469 35389572 34630520 33655156 32740895 31741639 30776699 29759059 28764425
4237 28764425 27990447 27338758 26856156 26423192 25931467 25478619 25117165 24547257 23971025
4228 23971025 23520801 22880988 22160357 21337293 20425921 19582122 18717004 17789263 16992443
4219 16992443 16187071 15363890 14597730 13957385 13385499 12763650 12274076 11899510 11545790
4210 11545790 11117366 10571525 9925642 9516426 8965292 8533206 8120356 7755937 7420399
4201 7420399 7193166 6892517 6771818 6622699 6504411 6455214 6401705 6339998 6174919 6226252
4191 6226252 6121057 6126092 6258994 6306164 6304196 6242730 6223784 6048264 5816379 5672565 5643142
4180 5643142 5619936 5569753 5696060 5665060 5565022 5463365 5353065 5154059 4926284 4902782
4170 4902782 4823561 4755109 4686950 4624262 4642395 4767089 4806682 4731855 4968286 5130468 5237291
4159 5237291 5403321 5455687 5587786 5603008 5566409 5514276 5475565 5535297 5540453 5560319 5570894
4148 5570894 5590831 5520666 5448654 5342686 5269944 5259598 5304124 5411179 5508095 5569379 5685606
4137 5685606 5819741 6023410 6241613 6371850 6663202 6947348 7146010 7305879 7099522 6790496
4127 6790496 6463185 6163481 5826655 5708477 5637311 5514446 5506265 5367041 5420819 5394585
4117 5394585 5383854 5429264 5416884 5388187 5398595 5572284 5682073 5690354 5756107 5988182 6107572
4106 6107572 6244136 6468796 6582923 6715196 6959700 7175834 7319804 7530361 7690898 7772236
4096 7772236 7877139 7979436 8047021 8205858 8285451 8401851 8644151 8917726 9251291 9679551
4086 9679551 10236985 10741273 11303354 11956485 12484138 12757854 12887977 13074871 13195156 13331514
4076 13331514 13535057 13784995 13963083 14080158 14268914 14515697 14999622 15564955 16214911
4067 16214911 16831314 17562387 18576194 19744875 21190879 23001201 25341649 28210038
4059 28210038 31806780 36224457 41120098 46279285 50046696 51262861 50718556 48573103
4051 48573103 44596285 39988110 36088132 33454821 31848612 30783855 30261504 29973088
4043 29973088 30075766 30410101 30788895 31455242 32218114 33066872 34057423 35207490 36558165
4034 36558165 38072751 39770991 41705117 43871750 46345223 49247129 52564577 56205543
4026 56205543 60466344 65401037 70915897 77224992 84285622 92008735 100211603 108530996
4018 108530996 116583434 123786348 129399233 132850300 133445005 131057331 125779523 118340841
4010 118340841 109614505 100575892 91804714 83327996 75400217 68386912 62237311 56656685
4002 56656685 51812782 47423706 43557260 40231181 37220615 34444224 32008009 29806278
3994 29806278 27771527 25988858 24406601 22978843 21598935 20414181 19477543 18489405
3986 18489405 17618659 16875631 16127771 15559406 14974437 14448348 14007178 13385063 12875388
3977 12875388 12410499 11972188 11639274 11250325 10850712 10510217 10277195 10065498 9758461
3968 9758461 9443679 9354983 9193502 9004821 8768112 8610234 8589309 8460587 8235492 8018741
3958 8018741 7744481 7480823 7236504 7071501 6933005 6843296 6841056 6832982 6732466 6674037 6582200
3947 6582200 6619571 6666080 6547068 6643247 6787630 6916899 7232077 7526580 7930223 8400037
3937 8400037 8732899 9043876 9128149 8844194 8349836 7821850 7261749 6887008 6514931 6234673
3927 6234673 5965883 5788480 5598412 5412624 5251397 5112223 4965779 4819748 4597728 4541135
3917 4541135 4539101 4386884 4299765 4289309 4227077 4071707 4168493 4077122 4062732 4238764 4233310
3906 4233310 4270833 4203668 3990953 3805914 3641228 3571827 3454251 3427568 3514619 3459856 3577879
3895 3577879 3573823 3616940 3816963 4009625 4162808 4371098 4581225 4783303 4866499 4806282
3885 4806282 4684464 4497054 4455929 4383919 4147117 3862138 3588032 3438102 3255156 3107356
3875 3107356 3020859 2942801 2831245 2867135 2851334 2790258 2847498 2734555 2707568 2848863 2971676
3864 2971676 3102444 3259219 3195663 3161278 2918382 2664434 2599814 2487512 2394395 2460230
3854 2460230 2375678 2360863 2454456 2590889 2730733 2780209 2788780 2965542 2971732 2955426 2792005
3843 2792005 2643557 2547897 2404869 2273961 2260993 2322618 2343925 2335163 2369920 2482716 2504409
3832 2504409 2577794 2701324 2641537 2603915 2606516 2526451 2526560 2573790 2554532 2600081 2591997 2462812
3820 2462812 2257231 2167380 2088330 2074724 2087369 2007167 1995786 1900782 1844649 1835868 1816429
3809 1816429 1825236 1908528 1865747 1987971 1930963 1979362 1993649 2038955 2035480 2117259 2182635 2372940
3797 2372940 2407421 2660642 2890088 3078032 3384071 3587493 3748042 4026410 4331296 4523431
3787 4523431 4782084 4794410 4761784 4564724 4353603 4010666 3628947 3286324 3006224 2736732
3777 2736732 2470054 2214873 2166048 1967922 1785094 1794618 1705618 1701029 1673469 1576915 1437478
3766 1437478 1307297 1294498 1299610 1377077 1405330 1302579 1300299 1315104 1208989 1121877 1084385
3755 1084385 1087803 1106374 1141535 1170630 1062047 1062644 1164406 1207766 1191203 1146831 1073081 1068617
3743 1068617 960337 991401 1030317 969887 897258 896092 1055605 1087845 1039495 1063061 1164478
3732 1164478 1262959 1240791 1184994 1127862 1196060 1284588 1342231 1339065 1245282 1255558 1248842 1176962
3720 1176962 1076506 997479 924525 954555 920573 789695 761569 881170 856250 773763 752174
3709 752174 621551 605759 707798 691522 687608 639473 640319 707552 596473 566609 714286
3698 714286 641398 633899 597022 587450 461603 520865 543971 479215 433511 390850 458190 517827
3686 517827 558305 543839 458589 479423 578355 487967 576778 557811 497216 579631 571899 504419
3674 504419 527836 495373 441578 518870 495271 526210 620519 631121 753384 715467 589833
3663 589833 500851 433294 542810 515033 508507 543255 465146 435817 336356 306718 356458 411292
3651 411292 496586 461637 535857 557637 474035 505537 597477 542634 532617 655740 728446
3640 728446 650159 491136 533299 534155 610246 712332 681147 702462 679785 706378 726407 719856
3628 719856 635615 595939 595586 564729 606255 613214 620110 625420 587916 630189 676430 652659 607357
3615 607357 657091 777705 769002 636918 603339 568590 619469 770382 682404 744812 805039
3604 805039 786573 815743 776582 742355 832846 861749 825181 841626 839165 732490 834138
3593 834138 908991 1030285 1049136 1038777 1046275 1098105 1134351 1297749 1346877 1272751 1312804
3582 1312804 1290972 1240739 1352099 1289686 1264711 1296196 1378918 1253068 1250050 1317517 1255333
3571 1255333 1357877 1362289 1283345 1329791 1448495 1385205 1447086 1417884 1534699 1648975 1719251
3560 1719251 1797215 1983427 2060402 2244624 2561633 2732449 2833254 3016712 3083301 3061714
3550 3061714 3029601 2904049 2721179 2648298 2462706 2230751 2097987 1996035 1823302 1650601
3540 1650601 1561374 1487198 1358205 1241533 1186200 1240493 1231162 1084103 1087212 1101516 1110992
3529 1110992 1112242 1078466 1136558 1124012 995403 1018202 1041288 1114138 1105135 1055797 971819 968265
3517 968265 1103514 1021025 965946 1066217 1145590 1119577 1044289 1054352 1120459 1131253 1051774
3506 1051774 982862 1028134 1094999 1094811 1215653 1126234 1101684 1121772 1080832 1156388 1107701 1195802
3494 1195802 1230696 1301197 1347095 1359862 1238867 1259843 1211518 1260941 1346974 1180934 1259485
3483 1259485 1289020 1157006 1171878 1146428 1130006 1205481 1227213 1229161 1246488 1243379 1335089 1316691
3471 1316691 1293255 1376270 1449038 1505058 1574151 1542598 1574834 1595168 1663798 1747257 1679847
3460 1679847 1712130 1650301 1631318 1726124 1712093 1797267 1827604 1767984 1869321 2002861 1896222
3449 1896222 1949521 2035610 2004057 2155218 2061831 2146765 2219937 2218785 2268605 2391090 2481058
3438 2481058 2471328 2348779 2463756 2454716 2460692 2506260 2456643 2518288 2641399 2666191 2707530
3427 2707530 2745275 2740196 2804650 2858580 2873682 3029149 3044363 3021633 3041017 2998457 3049093
3416 3049093 2990296 3013149 3058529 3205471 3341009 3432489 3426478 3456429 3618955 3689354 3851031
3405 3851031 3868116 3918827 4021875 4122288 4231763 4216257 4310634 4375176 4476281 4533166 4555647
3394 4555647 4544472 4637286 4746379 4746410 4896787 4993053 5091546 5114305 5129694 5325323 5495243
3383 5495243 5552439 5630700 5768167 5853534 6145306 6258935 6431831 6599133 6710593 6761496
3373 6761496 6967932 7173867 7188154 7363448 7586333 7741392 7945383 8196564 8415302 8622082
3363 8622082 8865360 9016514 9149930 9295901 9491325 9759841 10015405 10329970 10527804 10772030
3353 10772030 11078582 11325496 11638688 12037409 12348900 12686352 13008435 13313282 13761082
3344 13761082 14134887 14335135 14646248 15160679 15683739 16252967 16918738 17541293 18218595
3335 18218595 18955219 19707601 20488379 21149030 21886066 22617410 23295042 24141033 24983795
3326 24983795 25941804 27007579 28088767 29181643 30298341 31410018 32643134 33894659
3318 33894659 35219478 36619105 38210728 39908435 41780303 43765981 45883243 48406669
3310 48406669 51308267 54406155 58160958 62508094 67631853 73622462 80907721 89864623
3302 89864623 100793491 114250714 131001481 149425850 164975007 170926515 162786934
3295 162786934 146663457 131356672 120293797 113153655 109001547 106859839 106025612 106148713
3287 106148713 107047641 108717289 111143875 114443468 118759250 124155078 130714835 138440968
3279 138440968 147789233 158802798 171872792 187560805 206273917 228769685 255709563
3272 255709563 287842971 325535411 368544592 414803930 460372411 499586204 524343954
3265 524343954 526354973 502986650 460212799 408773829 357853992 312369175 273832446
3258 273832446 241671346 215078656 192832982 173744057 157390520 143238064 131111915
3251 131111915 120653575 111629166 103775045 96926548 90897695 85307190 80382285 75718970
3243 75718970 71390078 67472259 63938853 60707640 58100466 55789941 53804016 51874053
3235 51874053 49750911 47391791 45093941 43015711 41427810 40126742 38974331 37956797
3227 37956797 36872080 35651839 34149019 32576546 30935317 29402184 28006169 26755946
3219 26755946 25591010 24508676 23543726 22668091 21882245 21229947 20526445 19891637 19334914
3210 19334914 18792527 18269701 17699625 17146924 16573813 15996990 15516222 14989270 14449604
3201 14449604 13998906 13692257 13439405 13299468 13144917 12901828 12931468 12963411 12580387 12095214
3191 12095214 11512956 11029810 10598297 10092716 9704955 9336673 9105904 8747627 8422125
3182 8422125 8279273 8145480 8041218 7808506 7563343 7369040 7283261 7098522 6936001 6696440
3172 6696440 6495337 6384341 6280294 6167110 6087858 6006297 5906243 5828272 5907400 5858670
3162 5858670 5897622 5814774 5602653 5236520 5003429 4828099 4741977 4688047 4568019 4463554
3152 4463554 4370373 4381183 4298944 4312845 4190291 4226534 4073051 3951509 3886344 3844409 3762670
3141 3762670 3665816 3554350 3485352 3467509 3413496 3416514 3388890 3163942 3178850 3224891 3004500
3130 3004500 2973328 2887109 2894616 2703101 2656336 2695281 2774914 2737576 2777354 2784652 2818757 2763960
3118 2763960 2762810 2686932 2571140 2448147 2401616 2441294 2460227 2396016 2311852 2263336 2201784
3107 2201784 2203369 2125392 2162738 2180502 2154475 2101097 2107952 2029969 2033579 2061413 2097213 1949339
3095 1949339 1859578 1871112 1883547 1813048 1910667 1948348 2013346 1922288 1809664 1783100 1709942
3084 1709942 1597599 1621988 1595154 1575917 1586150 1608648 1646581 1752943 1712837 1590021 1533511
3073 1533511 1551892 1637106 1630338 1621576 1535764 1483271 1590807 1576931 1552064 1542476 1569481 1546397
3061 1546397 1524667 1629071 1580461 1638225 1671456 1604977 1526302 1507279 1493458 1512006 1559258
3050 1559258 1535560 1558118 1554166 1466156 1450433 1352781 1320949 1355620 1349874 1229240 1109449
3039 1109449 1095573 1178266 1188214 1131810 1194163 1238279 1220139 1237132 1311606 1304901 1347085 1331050
3027 1331050 1259353 1252280 1361805 1295068 1225323 1282752 1265074 1230753 1141697 1149759 1254223
3016 1254223 1383651 1471570 1425298 1485402 1551360 1615346 1718423 1777720 1644708 1583780 1610953
3005 1610953 1573502 1573093 1547191 1489390 1452352 1492512 1499296 1411906 1377123 1476306 1428287 1449320
2993 1449320 1505790 1517668 1601259 1583219 1676917 1758039 1757808 1911065 2020288 2126490 2307199
2982 2307199 2628859 2822626 2956434 2955775 3099409 3201926 3234290 3195592 2983899 2814014
2972 2814014 2592506 2350628 2159431 2015361 1887482 1741460 1593728 1561386 1458717 1360670
2962 1360670 1360920 1399479 1340549 1270056 1185825 1131455 1093622 1047040 1104305 1021847 947219 941563
2950 941563 925820 922827 985058 963535 976153 996540 921381 830266 882394 982038 984053 887825
2938 887825 864808 855900 900249 952113 947127 974688 1052792 1018364 1014209 1033849 1031841 992187
2926 992187 1045772 953477 886611 968257 955623 848433 859275 958605 930670 988635 973509
2915 973509 937418 1054690 1086236 1161285 1100862 1020974 1093024 1135696 1166879 1131561 1203452
2904 1203452 1187413 1165864 1247652 1329354 1289393 1329911 1425930 1426818 1390859 1283833 1256629 1190709
2892 1190709 1044395 1111201 1148373 1206967 1146038 1034343 1096223 1102244 1055562 1089917 1226217
2881 1226217 1235525 1190614 1273721 1239984 1172863 1198522 1180348 1212701 1265328 1224959 1231472 1252241
2869 1252241 1241477 1184001 1168918 1058588 957843 916061 999400 1118684 995288 794103
2859 794103 926513 854319 881453 921751 1017269 979562 1055313 1085482 1022792 935100 949877
2848 949877 904068 812295 797263 759685 749055 726048 753670 715562 709313 673194 649945 638499
2836 638499 538104 511111 520592 516662 404073 442997 577416 607325 541910 501638 609983
2825 609983 501186 517198 559807 516605 496529 475684 451160 431543 308739 414281 297238
2814 297238 330145 321419 400517 412348 292487 248338 331111 365797 287127 308326 343777 327707
2802 327707 243614 263822 222015 174255 119729 132488 121338 135092 229382 300687 371826 274683
2790 274683 259902 189188 262331 303948 188625 138903 189766 152122 257723 283954 217393
2779 217393 270620 416655 366263 300935 334733 350282 316099 278179 237789 141556 286009
2768 286009 270987 292657 278258 332843 273492 193713 136540 129239 189028 223368 134120 168905
2756 168905 182700 166091 248273 165651 197496 192874 123561 149392 248609 227582 174980 269268
2744 269268 211205 143031 146555 175265 142489 213222 173411 123219 86723 57694 173340 121447
2732 121447 93879 159794 78379 161710 265765 266167 284392 239944 142810 136686 143169 120343
2720 120343 206491 248373 238183 197454 289339 280390 170357 157604 167766 154079 243080 155896
2708 155896 18364 90453 150167 247930 288331 280156 240271 87444 119608 80521 128482
2697 128482 85855 13233 86587 134160 182631 203827 63416 71339 98982 186181 171588 254259
2685 254259 204898 83683 177653 152788 180066 164245 135119 227464 143178 30510 100687
2674 100687 147613 89465 56525 82813 43515 93365 152499 156708 172313 134264 91085 111626
2662 111626 46106 43758 36274 172289 62877 51223 75867 82364 77354 50715 39250 143388
2650 143388 80770 69054 88098 -2897 41734 43114 109056 131899 140126 42920 21369 66251
2638 66251 76613 85989 44141 91936 54498 70022 113300 3660 63990 142136 83038 34899
2626 34899 9474 95465 92193 191368 196877 94401 164675 133260 89588 141085 98485 110940
2614 110940 52777 89863 -9243 -65811 -77143 -7080 -13535 50360 2445 -101498 1098
2603 1098 94675 88871 108556 65520 51669 66129 72243 18749 -162980 -106187 -61532 46408
2591 46408 19214 -53934 -133270 -83184 -142800 -60205 -26988 102324 79566 31245 -28575 51609
2579 51609 66673 42764 91286 91969 41473 33219 105024 162672 138244 60553 63492 58301 71870
2566 71870 97764 66856 142899 85392 26271 535 -17137 -39482 89350 94847 -4390 58189
2554 58189 46732 59034 105331 121277 91472 -6916 -39653 10051 22812 54434 20204 66933
2542 66933 86889 116896 97148 95376 17260 -12325 64219 54323 -19258 -28308 -18319 68558 127060
2529 127060 105516 80801 2838 2773 132754 50909 79705 -40756 69139 102093 81185 65241
2517 65241 -737 48066 59315 69376 82443 91319 157976 84091 57507 6391 -58827 -93946
2505 -93946 -97461 37962 -19044 -36107 -2614 -42308 -78990 98462 24198 -37204 -90468 -86648
2493 -86648 -102593 -88857 -85031 -32422 -3296 -9575 14128 11085 -3262 -13439 74688 26342
2481 26342 -17820 -48591 -130422 -83764 -92655 -2745 55367 38073 -27064 -50088 19835 15849
2469 15849 66763 145031 41723 34816 -57162 -37762 -34788 -4207 -22511 -99427 -56776 -157335
2457 -157335 -133422 -146056 -35980 -12772 -100292 -18175 -10434 3075 -8698 52732 35578 4701
2445 4701 94083 7569 4203 851 961 24780 -18209 -2155 -7615 -55720 -43771 -27372 27071
2432 27071 37628 142814 93814 16844 -61296 -57779 19669 29283 -3545 -23365 18540 85764
2420 85764 45024 -6222 -12900 -31147 61927 92696 97567 120780 36540 23336 11478 34205
2408 34205 -17986 -2063 -20677 -230 104589 15247 -46052 -2935 -20416 -60565 15332 96182
2396 96182 56798 25708 -36206 -527 4382 -49970 -87875 -53655 -48991 -74348 8591 21598
2384 21598 -4962 3121 -44756 -36367 20621 -23925 52574 520 -39262 -36745 27269 3788
2372 3788 -19035 38717 78413 92358 106293 119983 143066 141000 87633 94942 -13035 15848
2360 15848 -7023 47838 75595 12233 -8841 13608 105549 -75285 -76140 -86619 -31888 23977
2348 23977 58982 103186 5444 26178 2689 106476 102478 -55909 -40053 24854 48090 7214
2336 7214 12714 -25837 -16588 21476 -24572 -69070 25493 25229 -85597 16864 48171 52416 31698
2323 31698 41081 62427 -23898 -107939 -51615 18116 -15394 -15821 41073 2647 -40368 47179
2311 47179 37766 26959 45883 -61302 -62892 -81493 -136551 44231 44064 -16390 -11164 -24484
2299 -24484 -41540 -87 69603 -3622 979 14320 -19828 77548 49602 46613 15771 7888
2287 7888 10756 -1547 11683 -16638 46097 163757 147668 84789 85273 17514 27494 24967 93322
2274 93322 73926 83123 106285 -3556 -13186 73548 -9203 -62230 54209 35087 9239 -106628
2262 -106628 -21281 -64366 -20898 30539 53138 27764 39304 86691 167851 161601 -20714 11779
2250 11779 78866 14842 30396 112051 74679 50930 128580 97676 -18949 -52545 -45352 42900
2238 42900 111013 199650 85614 42171 45396 117055 -465 12196 -10083 -49062 -7277 36090
2226 36090 113202 81445 92692 -11885 -52307 -21932 43302 28223 66466 61930 50648 75714
2214 75714 59804 89029 120474 40549 14580 31162 129085 127537 -29026 -13535 73439 82428
2202 82428 42239 42094 -2982 36694 10357 60769 101910 136318 156653 51598 92309 100243
2190 100243 100207 42907 105670 167023 70903 36674 78192 154154 64354 184151 261147 307907
2178 307907 273530 232927 121354 75390 106434 149700 194942 223581 251144 179040 180477 199226
2166 199226 271506 339890 354871 328666 265698 267476 310296 322560 342085 358139 382279 490744
2154 490744 521660 518118 475206 544755 594268 562278 561875 571623 560115 610647 496052 460070
2142 460070 580207 694883 708966 689014 724955 735117 787842 829618 890784 879424 941813
2131 941813 1064617 1198271 1280556 1288504 1479037 1483135 1552390 1655050 1617540 1621171 1732810
2120 1732810 1855317 1954024 2133478 2298482 2607930 2761272 2778697 2869490 2943178 3148523
2110 3148523 3519551 3868135 4512211 5238804 6390879 8009391 10261540 13495877 18280804
2101 18280804 23023835 24759590 21076190 15267180 11223161 8500345 6709021 5580104
2093 5580104 4780990 4104445 3646324 3316029 3025940 2758710 2589007 2523370 2347954 2090828
2083 2090828 1803331 1596582 1489265 1386936 1314401 1165984 975525 896705 908791 833001
2073 833001 758374 815892 839583 829207 870521 787243 641273 654426 677668 639847 539391
2062 539391 556848 485527 483658 490027 475330 473401 488116 451881 423627 420182 374157 528423
2050 528423 427062 315674 363924 345503 351188 380750 412598 389669 343202 333501 263822 225517
2038 225517 202325 215848 264370 245148 205805 135825 137862 106998 132012 190204 100417 108337
2026 108337 60674 -3575 115842 170179 178847 162758 139987 138190 214250 170972 -11268 8020
2014 8020 144922 168933 45124 332 49949 134337 89424 67020 7033 -7193 -34085 -19404
2002 -19404 -25679 89170 120403 57294 29900 77113 88732 73980 61492 59233 100335 139776
1990 139776 40018 24300 76104 18506 -45917 26707 146689 234909 61092 70684 71091 92914
1978 92914 101100 47748 4332 27553 102806 10356 -17398 -20476 -97514 -53991 -40554 -67853
1966 -67853 -41063 -65593 -18706 -39779 -26360 4067 -45822 -33733 -86614 -71946 70225 82754
1954 82754 -27631 -98661 -43794 -28930 -61381 -47687 19932 19167 46250 -27145 -40400 -45176
1942 -45176 -82507 -13412 -47214 -110919 -115696 -4712 -22813 -17396 -35208 -8339 -85239 -87964
1930 -87964 22025 -4985 26086 52846 53270 21700 -40020 -159066 -55130 -26407 -64007 -126569
1918 -126569 -63620 -10938 1832 -87998 -98702 37965 115287 34164 67360 26544 3287
1907 3287 28465 -68690 -92059 94522 38153 -40376 -37872 -61098 -120174 -75624 -65111 -103566
1895 -103566 -100301 -51171 -22345 6351 29832 -34565 -41455 14791 -82605 -74064 -71956 -30593
1883 -30593 25815 63547 19957 -97874 -18410 39396 75409 101599 -2354 -8943 -3831 11739
1871 11739 -66200 4053 45746 90099 59845 -56796 -67820 -87769 -120021 -187306 -173207 -125430
1859 -125430 15788 -8146 -21373 -62771 23676 35708 51897 12057 59506 25649 7457
1848 7457 -72184 -24969 60511 27848 -39876 -53348 -14463 43496 57145 22143 -2852 -4318
1836 -4318 -647 -44766 -9676 3575 76835 80417 149942 153196 83932 11902 -47046 -62382 5508
1823 5508 -4562 -17259 25359 105205 101521 -33253 109162 133861 -6167 -62000 4173 12247
1811 12247 26528 2224 -42331 -94406 -139977 -158063 -106229 -180981 -153706 -109867 -65760 -1235
1799 -1235 24312 39792 21967 -24659 32682 -30441 -74301 12577 54715 -2517 253 15862
1787 15862 -2836 22735 102027 56065 -112227 -103907 -80083 -57964 -65594 -41984 26099 13652
1775 13652 -1037 -11262 -23857 59227 87474 30160 22242 60752 34628 -47317 -88082 -77133
1763 -77133 51165 47468 42810 -31797 -102782 -75287 4238 -52589 -128124 -16744 -53125 -87382
1751 -87382 -202487 -127824 -101062 -112675 -29595 -29684 -118616 -164391 -99085 -76473 -46816 -83266
1739 -83266 -93889 12583 3 27302 -34981 -10616 31879 -3050 31818 -14383 -27904 45692
1727 45692 -18262 10563 -119523 -121505 -82258 -86483 -120029 -99394 -87794 -56743 -71515 -33012
1715 -33012 -52385 -82176 -18400 -102959 -127171 -74680 -132060 -106475 -12991 97508 80270 -5351
1703 -5351 1403 21401 1117 -96778 -71736 -7561 54673 103877 3916 -133626 -103543 -15509
1691 -15509 -67635 -108201 -67962 -55292 5312 -110754 -105419 -172924 -204426 -166234 -139556 -65457
1679 -65457 -12069 -11593 2544 -59505 46366 77723 35413 29809 -19242 -91826 -123636 -92567
1667 -92567 -38057 -62851 -26502 -47307 -91336 -103840 -77814 -61885 -65543 -100500 -115299 -54592
1655 -54592 -44523 -65059 -106037 -21514 -50075 -467 30476 64511 32417 32631 -39107 -142975
1643 -142975 -91773 -41956 -52005 -102937 -104703 -85472 -92393 -98960 -25994 -35000 -28802 -48862 -27512
1630 -27512 17160 -47789 -37550 -49002 -37937 -64152 -58561 -72744 -104790 -86332 -97098 -110388
1618 -110388 -109879 -45132 -29654 12589 -58469 -168335 -75308 -126766 -62467 -121059 -129702 -111892
1606 -111892 -147784 -204449 -194265 -72187 -31290 -20945 24333 74811 -89962 -92270 -72095
1595 -72095 7376 -81947 -18550 83348 69609 60047 41720 -64713 -48524 -52687 -91822 -24272
1583 -24272 75013 -58543 -69928 -123990 -177260 -26047 30770 -19690 51723 -44185 -80590
1572 -80590 -34563 -102059 -12426 -65177 -52195 -114659 3897 -4412 3646 -8626 -21910 -33368
1560 -33368 1025 -67472 -113828 -117565 -136560 -80818 -105014 -79927 -82694 -72390 -103379 -199729
1548 -199729 -151133 -12399 8098 64753 67104 -29742 -17928 -2090 92631 10518 -38670 -11685
1536 -11685 -49798 -22763 9995 -155072 -155613 -173750 -209029 -93743 33164 12320 -75979 -110411
1524 -110411 -139861 -56948 -38626 -28136 -98924 -193634 -157195 -2224 14824 -65168 53061
1513 53061 27096 -89855 -108219 -86985 -46965 -31448 -89320 -20641 -57909 -81069 -60471 -93499
1501 -93499 -101040 -176072 -112585 -89822 -23513 -110444 -5585 -67506 -80433 11585 -15915 -56169
1489 -56169 -34117 -82374 -60917 -129155 -108785 -69631 -71202 -95630 -71325 -19688 -451 18476
1477 18476 -37636 -38775 99854 24886 17357 -1705 30629 30460 1426 -102367 -139588 -8940
1465 -8940 -8396 40266 -19573 43237 -16482 -102298 -282799 -140427 -32651 -71078 -132028 8253
1453 8253 5451 14336 31947 94582 19991 -46136 -9535 -109582 28275 26027 -47448 -92041
1441 -92041 -56195 -71057 -194003 -161716 -76833 -83470 -29710 -60372 -62824 -33115 -17639 58580
1429 58580 41436 5897 -12398 -94713 -125440 37416 -4063 2091 -111452 -134288 -56990 21281
1417 21281 18515 -37895 -36926 -60350 -101727 -125677 39038 -39788 -97012 -15009 -52889 -118909
1405 -118909 -42907 -72915 -18434 38041 -13334 -1965 -38455 -54053 -41540 -7572 -124543
1394 -124543 -93700 -65145 -106705 5401 26329 39192 45321 50137 39088 60099 14093 -6938
1382 -6938 -44249 -35092 -63960 -74432 -73962 -5349 -14864 -76020 -23865 56188 3321 10900 23429
1369 23429 98797 55269 -16000 62520 -40304 -23703 -21096 -64205 -1751 -18086 16719 66792
1357 66792 6980 -77634 -60035 -151617 -127334 -25920 -2761 8809 -88205 -43188 -106821 -21635
1345 -21635 33585 75263 -22160 14845 -2242 26659 -25993 -29631 21259 31028 10541 -35433
1333 -35433 -71894 -113130 -5016 -9855 -62662 -98485 16288 32597 38662 -25152 -36290 -105738
1321 -105738 -71033 -87155 -209732 -125922 -54939 4564 -90776 -124730 -23241 -80127 6593
1310 6593 16173 25503 -61796 -92232 -17534 27552 -77921 -104936 -40742 -45284 -14803 -106394
1298 -106394 -88967 -135219 -223257 -117931 -58087 -104974 -136126 -78672 -84635 -91337 25888 -6410
1286 -6410 25919 79417 13112 -34764 -29344 -99561 -64130 -43054 -70777 -80970 -9913 54572
1274 54572 -17544 -2521 -20298 -69812 -94608 -141788 -60159 -30872 -44035 -11434 -8614 -62980
1262 -62980 -67082 -110120 -79364 -2724 2372 -3723 57661 -47155 -43820 -26295 -138307 -125045
1250 -125045 -44121 -10639 -93317 -108912 -137043 -70736 -89104 -73590 -165099 -141252 -147693 -206849
1238 -206849 -192028 -119115 -34609 -10774 940 38810 -22527 8444 120709 188479 203638
1227 203638 57814 39458 -23416 -23218 -1664 132768 86546 -27469 -67944 -50428 32561
1216 32561 132431 52642 -126119 -125809 -17833 -10901 -39627 50064 -48131 -62031 -83377 -107472
1204 -107472 -102603 -38259 -90755 -27942 -60131 -80018 6976 40528 -38885 -48678 23799 3839
1192 3839 63362 26025 -76035 -73003 -56922 -34318 -41474 -78113 -13457 -32861 -95869 -174064
1180 -174064 -108135 6569 34866 79391 24569 -18370 -19575 54542 85277 41898 -7752 -84919
1168 -84919 67879 54415 14073 -29980 -71236 -53695 -65363 -34490 50598 46797 -4413 12768
1156 12768 23566 -75533 -90173 -11853 -11944 -125563 -129175 -37819 -47600 -41885 -1090 -76887 -20735
1143 -20735 92047 -632 -112922 -30205 -142476 -198639 -168711 -142469 -113445 -51391 20528
1132 20528 62536 99424 35474 15691 -82112 -66462 29904 56424 -8853 85599 32358 -132880
1120 -132880 -42946 57161 107193 23207 -70369 -85086 -94788 -37417 2390 -9232 -28021 -54066
1108 -54066 -60555 -38928 -110384 -175807 -148353 -73761 -26208 55128 -32120 -45743 53533 -27599
1096 -27599 -77439 6885 36514 -3910 -118368 -143660 -95262 -35946 70415 67540 13129 -55554
1084 -55554 -88805 23776 -36130 -70839 -65326 5806 -8309 -33384 134703 182 -18279
1073 -18279 -27890 -24834 121841 30353 -29536 -10973 -43332 93569 102311 -34245 -27466 45236
1061 45236 28951 -79498 -32932 -45002 22140 19840 52903 68441 44016 68706 -75181 -51532
1049 -51532 25231 -122194 -187596 -110413 -21501 -64253 -75834 -39348 -27547 -20924 -51240 3778
1037 3778 -47094 -46161 -52117 -44773 -41270 10351 13090 58046 -62906 27026 14805 -29664 62932
1024 62932 -114809 -229408 -21199 61484 1293 36852 -10515 19747 12237 74867 34861
1013 34861 50078 21397 -19135 -60158 -91162 -39181 -58289 -70037 -58106 -74771 17122 81784
1001 81784 84359 -56452 -56639 -47992 20248 52448 -36850 -46396 -2402 24177 30000 -9170 -63231
988 -63231 -53477 1126 -131082 -168822 -48102 -94426 -30239 -85902 -70189 27870 32509 923
976 923 -69527 -50895 -82912 -255072 -229445 -42375 -11516 -85398 -86096 -53505 -162730 -122950
964 -122950 -29927 -51156 -51869 -78564 -24024 4433 7406 24705 62184 101761 205316 102423
952 102423 47977 -41764 15105 30265 -28588 -61901 11374 -4882 -122765 -56874 -27596 -77340
940 -77340 -45644 -75599 8848 34577 12151 132397 143684 104668 66008 12227 -4299 44008
928 44008 -19601 40353 157765 73537 -28623 -462 133522 83566 -4147 -20113 90226
917 90226 93931 41085 29842 -4508 -47375 6721 89435 -33357 26125 -86651 -34492 -89625
905 -89625 -32743 -60716 35847 31077 -34702 -129664 -75348 -20782 -36818 2140 -26707 -26568 27450
892 27450 76387 5867 18671 -68156 -93715 3050 24016 -6950 34977 12931 34911 48437
880 48437 44925 80476 79444 23024 -34827 -46932 -25319 -8609 64879 101559 118469 84038
868 84038 42550 -115011 -124785 -128539 -32904 -15837 10522 -50569 -3980 -39413 36876 53364
856 53364 -37581 44997 73296 56667 20861 -48025 -123714 -180019 -133623 24411 21182 11450
844 11450 46894 78216 -35141 -138714 -14000 12317 -26013 2518 -69731 -71845 -44982 -465
832 -465 6393 -82566 -62640 -23391 -49431 -120250 -44253 -30788 -81564 -2259 43844 58209 -17945
819 -17945 -100073 -41676 -34257 5295 51531 -33644 -31874 -69146 38942 38017 28376 75099 27028
806 27028 36950 57258 123731 58596 66561 161653 -80524 -3372 -39074 11171 121245 145020
794 145020 126971 60141 69227 431 59376 95920 13807 -5587 46669 15964 -151858 -59816
782 -59816 -6446 -4906 -99821 -35515 -55443 7727 77534 57167 -75803 -34515 -19793 -124460
770 -124460 6356 134609 110692 -20728 6962 46100 13976 77831 -7764 35199 -13383
759 -13383 -81280 -13219 31523 101367 -27140 -26953 -115061 -53447 -8975 91840 95750 92552
747 92552 106466 115059 28707 102355 91335 107121 35938 58362 68253 -24082 -85530 -146054
735 -146054 -119177 -26275 -59128 -82205 -74673 31705 143414 30268 -31439 -18216 41915
724 41915 107272 -17509 18077 2414 597 -7254 24650 1009 18491 -27979 -115580 -94725
712 -94725 -115637 -111939 -17760 37845 -78851 -14126 -34754 -66561 -69033 -68375 18558 -48435 -25
699 -25 -53850 -57778 -74306 -71099 30211 12795 -1807 -79116 -98895 -75936 -107575 -105325 -17360
686 -17360 -92935 -16309 64991 658 53435 -18386 -88681 -51040 -16572 -59427 -4492 -23814
674 -23814 -12314 25459 56879 52985 66963 61261 -146725 -72377 -36401 -52671 -51995 -27829 7577
661 7577 54929 2560 95134 101145 1693 -30341 -35037 -79012 -51367 -1115 31362 -82571
649 -82571 15473 44731 36392 117996 151488 67912 72327 62907 -10835 33917 93623 49836 97100
636 97100 32192 -40853 1967 25847 -59011 -51179 -26351 -101231 -67207 31655 15768 827
624 827 40142 4975 214943 106355 -42853 -115612 -60964 -23277 -65583 6111 -52712 -104321
612 -104321 -115314 -53021 90777 42134 -78625 -48917 -83314 53688 55089 -56038 5134
601 5134 -15057 50378 20421 -20811 40581 60762 88979 10584 -87437 2373 -29220 -35959
589 -35959 38166 75463 80235 66082 27992 70657 109786 72342 117106 161702 84658 113021
577 113021 236429 132612 200808 118402 81472 -32398 -32173 70989 4931 56127 33251
566 33251 42600 -54756 -29057 -7003 125251 83826 30703 107526 12270 -41470 3661 74248
554 74248 53332 24197 126474 66239 -5670 78070 107240 103146 59800 56532 43715 64356
542 64356 1827 52790 9684 -110648 -193199 -124313 -43749 -105414 14981 -841 25688 -84217
530 -84217 -87925 -63169 12272 36647 100683 108196 54008 51115 87233 130396 21392 10707
518 10707 31370 3308 -66541 12334 87553 -50340 -17712 140444 84652 -19929 22307
507 22307 138477 120517 41667 77562 44972 3650 7553 66085 112835 13134 -35357 -29439
495 -29439 -37923 61053 -48776 -1099 64411 16506 15326 71960 190874 102240 50028 34252
483 34252 9509 68729 113357 -29172 18355 115897 38864 -40614 66267 54345 79547 59130
471 59130 -4315 -62467 -58495 54304 117472 92799 53026 27013 9236 -16305 34748 16232
459 16232 2219 -3305 -6298 84902 75211 16671 -2846 30645 84904 106172 64738 133475 128777
446 128777 61408 -18485 -59423 9843 188 47162 114597 101928 157622 159358 133781 89106
434 89106 -40710 -74892 -21389 -29580 76413 150737 41089 71684 82962 18155 4186 17783
422 17783 57524 36063 -71440 -63678 463 54630 101332 123333 66509 -11455 22277 -90964
410 -90964 -7474 46230 41919 6077 51944 98295 -28427 -17842 -12740 71175 30001 79149
398 79149 58164 3626 -31242 -130993 -98733 -69784 7218 89574 23356 -34611 52034 85274
386 85274 96224 131373 80036 27759 10579 68443 -51355 -2239 60531 64128 122839 38886
374 38886 -6765 21690 -7884 128745 50881 -45966 -31713 -14446 -20697 -46719 -47008 -104567
362 -104567 -96257 -8582 26895 -91214 -20712 38495 107027 91375 70495 113475 87915 40240
350 40240 79055 68094 -6342 29333 77755 55498 80949 5241 18232 69318 98206 -14847
338 -14847 -39367 -36105 27794 132671 115693 1972 110824 73503 7669 79989 9488 69277
326 69277 72650 122799 92076 124308 33536 -46974 60501 75927 41441 69742 77271 100995
314 100995 114205 61365 112690 71827 130945 113668 41287 -2953 39589 -36413 -36168 -1963
302 -1963 -68923 -59685 -15507 -56541 -10032 31823 18444 65354 123128 14727 -25845 40395
290 40395 -34293 -19798 45501 101370 -9168 -32321 -65820 -55128 -47827 1367 237 42739
278 42739 1343 50349 54280 106894 134701 -1539 77626 54475 -19052 -53735 -74383 24052
266 24052 121625 154640 46478 -69356 -50741 -5588 -26617 76824 118888 26583 -47359
255 -47359 -35231 1705 30958 137823 82626 1562 -5570 9307 22934 63463 118687 31098
243 31098 19448 -3712 77807 136676 121202 15481 -14209 30083 -2682 -540 92539 136691
231 136691 147091 143485 121963 19430 212 73541 63014 33812 26275 129512 114592 45140
219 45140 91208 161899 14891 37199 -1131 60418 -4613 -5433 30505 -21205 -20522 15805 -67294
206 -67294 3011 -8040 -101550 -6615 -16205 57770 143868 95626 136049 183836 136537 161215
194 161215 67661 -35096 -28833 91022 70481 53622 17159 -57078 39440 90591 97860 107108
182 107108 55056 44747 -29987 -23858 43974 97377 46760 66122 83649 -9115 -31648 -29791
170 -29791 109155 13543 -35003 43096 61773 18444 -118579 -84598 58888 61534 54274 70113
158 70113 121175 234120 116041 12201 35793 92431 9775 -19637 41207 103944 77524
147 77524 140323 162214 38401 43978 19331 -38567 868 120269 91860 19655 62756 93148
135 93148 30693 -137032 -42043 52811 110845 121016 206568 120331 9664 10644 98954 139138
123 139138 24897 34733 -1782 115062 47406 14780 -48101 -12137 106414 123598 135721
112 135721 87334 54064 2105 29910 -3937 25348 101769 167588 184114 169672 180232 233819
100 233819 173233 82435 119438 52810 45887 55923 161887 159068 62648 24685 -2066 -21589
88 -21589 36264 72226 83505 113680 59167 -18 -10145 16058 34049 -7448 57722 67954
76 67954 -6497 8915 52312 48838 63048 79550 45903 111626 98648 -27232 -31218 23374
64 23374 18168 -22459 55510 131881 39863 52107 52528 67847 28286 92925 72363 -21087 21351
51 21351 60412 10569 -85029 -24547 38555 98920 61551 27814 -10635 45027 86643 79785
39 79785 55117 64429 104574 90903 82373 83148 -23777 -51549 12228 54339 109925 78339 37427
26 37427 61195 114594 155716 119825 99044 143363 91036 62108 100704 111726 50590 99396
14 99396 105332 113859 39647 82665 161326 54816 11366 -2303 60851 53574 60638 86207 56390
1 56390 71777
0 71777
$$ Imaginary data points
##PAGE= N=2
##DATA TABLE= (X++(I..I)), XYDATA
16383 -811702 -800471 -751164 -745000 -762959 -824477 -877373 -813645 -753472 -730081 -778277 -755800 -717631
16371 -717631 -642530 -592203 -551671 -547589 -532646 -505731 -489378 -508908 -521565 -499266 -518718 -479255
16359 -479255 -472848 -487530 -453271 -420409 -347399 -371951 -351670 -363421 -456105 -380499 -343543 -310502
16347 -310502 -259803 -267811 -297195 -217085 -234976 -308532 -237985 -234094 -194876 -125493 -107804 -160651
16335 -160651 -145408 -145360 -140818 -142966 -91358 -83147 22238 87874 -27600 11997 -46325 -35648
16323 -35648 -54680 -55553 -35259 95283 188589 199645 140956 87650 126244 133082 135389 224652
16311 224652 121148 148446 145080 131450 184953 167839 174213 262549 258111 276164 308169 346475
16299 346475 343734 321717 365620 421187 404546 291684 420929 405391 473023 440384 363385
16288 363385 435933 517432 477192 458559 411793 387463 423119 489602 587717 601186 592737 576990
16276 576990 615521 641465 688782 676850 692716 650226 573937 658023 680355 711418 717209 724857
16264 724857 668681 721821 738031 769805 756913 782320 768506 741782 748870 704268 712157 738848
16252 738848 790528 772361 794078 904469 919432 944484 983598 857763 844416 923711 802615
16241 802615 762753 777225 860059 923099 984837 1062870 1021459 969575 906276 956636 884099
16230 884099 923966 1100006 1057832 1031292 1008234 1054779 1078043 1083883 1002136 944329 966244
16219 966244 954964 1061619 1010306 1068901 997678 1020697 1026222 966457 1023239 1068257 1041231
16208 1041231 1055411 1167337 1161696 1119349 1133320 1149657 1069474 1134623 1199316 1218562 1194262
16197 1194262 1158239 1147776 1126444 1229493 1239655 1179091 1240021 1246627 1170399 1130038 1102589
16186 1102589 1196027 1146991 1202002 1297944 1231787 1238049 1364462 1331730 1257593 1304595 1287072
16175 1287072 1199781 1228921 1307178 1358834 1337018 1311180 1306908 1378326 1245376 1076589 1189305
16164 1189305 1200951 1328339 1398407 1310623 1332216 1385015 1420263 1339784 1368057 1392539 1390424
16153 1390424 1428843 1369897 1303834 1244878 1348934 1360320 1395163 1388958 1320676 1377046 1468619
16142 1468619 1439220 1419390 1314969 1390724 1470047 1483236 1540462 1410287 1354002 1456490 1426889
16131 1426889 1465430 1321992 1224302 1304647 1288205 1338676 1288175 1410393 1399417 1407052 1486882
16120 1486882 1439195 1377374 1362177 1421778 1341252 1290942 1329209 1307607 1326019 1413538 1436785
16109 1436785 1386301 1416257 1383423 1416880 1435066 1378818 1332323 1362409 1377773 1433772 1536884
16098 1536884 1457127 1464615 1530233 1472140 1439266 1454055 1380973 1422647 1533593 1511730 1557948
16087 1557948 1555828 1496934 1509330 1501856 1444331 1379472 1471902 1487581 1491872 1402234 1408702 1382806
16075 1382806 1412564 1395391 1433973 1456326 1446854 1517498 1363609 1390823 1441098 1525360 1535453
16064 1535453 1462114 1489431 1465566 1439288 1436471 1365085 1438582 1422384 1406016 1491355 1506106
16053 1506106 1591997 1618691 1515990 1534154 1515124 1423641 1486154 1582144 1562649 1530010 1590170
16042 1590170 1563077 1570593 1497181 1544743 1600470 1502041 1484654 1434013 1384291 1427936 1531679
16031 1531679 1570383 1578287 1521903 1516982 1514117 1492763 1449269 1503521 1481012 1426979 1581765 1528058
16019 1528058 1505366 1490665 1412367 1434599 1474653 1484303 1488299 1513720 1470181 1478643 1441623 1506226
16007 1506226 1545298 1486032 1450102 1414162 1526026 1567203 1492321 1487606 1472795 1559475 1536707
15996 1536707 1608554 1595296 1522310 1517754 1563723 1602591 1581728 1516889 1511074 1476000 1476092 1452231
15984 1452231 1476131 1452087 1449036 1508613 1610271 1571345 1508414 1545581 1608946 1637744 1522282
15973 1522282 1481649 1494277 1588209 1514235 1538703 1525882 1505608 1532657 1472724 1501603 1564450
15962 1564450 1510944 1531992 1558419 1525659 1477699 1462223 1431432 1519842 1525504 1543012 1594857
15951 1594857 1617295 1630339 1634741 1502506 1584763 1621910 1503509 1462581 1508933 1513164 1574600
15940 1574600 1533073 1586072 1526986 1448454 1423228 1510975 1566741 1524358 1505639 1485026 1487615
15929 1487615 1487642 1414244 1541694 1625143 1507848 1414264 1431890 1442889 1339980 1400685 1372202
15918 1372202 1425592 1357440 1479970 1445121 1432729 1545866 1511242 1524586 1548558 1495175 1522540
15907 1522540 1480945 1472188 1501482 1562370 1572382 1517104 1603449 1592690 1470463 1402791 1440093
15896 1440093 1505115 1480893 1468572 1509719 1494947 1569256 1536838 1543926 1566827 1577154 1594994
15885 1594994 1522909 1539465 1580393 1533462 1539816 1579281 1520078 1568506 1560823 1572608 1533276 1559178
15873 1559178 1523466 1521058 1530012 1551497 1588374 1601426 1543061 1566076 1556271 1513969 1495124 1486684
15861 1486684 1464853 1457691 1520171 1552272 1473117 1539633 1657897 1630222 1624299 1632087 1631222 1603574
15849 1603574 1578140 1529222 1555514 1456135 1389140 1333253 1361865 1383244 1387670 1419285 1456460
15838 1456460 1483251 1483829 1445036 1535805 1685547 1521744 1531482 1493589 1504493 1543460 1527310
15827 1527310 1509331 1465889 1493412 1578783 1600276 1564157 1519748 1498836 1395159 1300443 1491999
15816 1491999 1629787 1609253 1533829 1489256 1510107 1559606 1532033 1523889 1590533 1606085 1572360
15805 1572360 1719430 1652137 1524806 1560266 1556728 1511400 1526312 1478358 1477423 1452939 1466596
15794 1466596 1450772 1521381 1482882 1481683 1509867 1565879 1707870 1590887 1473493 1411446 1511069
15783 1511069 1490269 1503354 1603722 1482016 1404070 1493722 1501706 1508448 1524213 1519534 1418650
15772 1418650 1385558 1545888 1517805 1448450 1578076 1576821 1544760 1445027 1536004 1598742 1510065
15761 1510065 1578622 1716332 1683735 1603447 1626039 1589312 1617666 1571499 1448173 1501138 1500872
15750 1500872 1492763 1530114 1472157 1531366 1496054 1568906 1558408 1494417 1571410 1562458 1573819 1704201
15738 1704201 1579797 1575251 1511047 1584734 1576056 1499376 1504533 1497539 1491292 1420030 1455917 1576856
15726 1576856 1645289 1661380 1546874 1455988 1675152 1635599 1520607 1535832 1614199 1607120 1611036
15715 1611036 1622371 1524661 1520941 1637255 1671275 1660495 1671831 1608454 1603182 1570821 1658822
15704 1658822 1717677 1558594 1467228 1475317 1538674 1591566 1651417 1636908 1536078 1507789 1438779
15693 1438779 1521483 1659909 1685180 1543073 1492928 1487683 1485076 1590173 1554537 1607705 1562695
15682 1562695 1463421 1507532 1584220 1660955 1612163 1474533 1474717 1544266 1487824 1589042 1654505
15671 1654505 1658902 1748844 1639677 1608344 1543686 1504860 1507465 1564885 1558023 1575220 1649434 1586766
15659 1586766 1528286 1632118 1586261 1540064 1581274 1532374 1467461 1471388 1462824 1514463 1571226
15648 1571226 1563117 1649300 1607362 1626363 1650233 1439456 1564251 1598790 1574709 1687441 1688756
15637 1688756 1584507 1555808 1459996 1487556 1566628 1571348 1584095 1500854 1501188 1534997 1508601 1677504
15625 1677504 1643377 1575256 1522520 1537776 1555419 1581056 1589727 1571081 1517826 1501331 1478781
15614 1478781 1552387 1517835 1459480 1527725 1526270 1576348 1568455 1564256 1557269 1612501 1526012 1439361
15602 1439361 1513364 1576309 1619752 1574018 1471129 1471789 1466933 1581180 1562303 1528662 1664589
15591 1664589 1567469 1446759 1524272 1568589 1569002 1475802 1624321 1652995 1639618 1630006 1607954
15580 1607954 1598159 1541868 1607374 1617612 1632355 1734252 1707984 1607894 1559363 1748341 1701047
15569 1701047 1616172 1568031 1507140 1455816 1610991 1643344 1614860 1627650 1615431 1545438 1545697
15558 1545697 1521435 1591434 1591676 1640189 1534553 1562522 1640350 1577713 1677990 1566945 1586144
15547 1586144 1674711 1610050 1602228 1568115 1636687 1637311 1583790 1515216 1613809 1665452 1524223 1567124
15535 1567124 1528924 1569088 1554806 1498464 1590250 1643041 1556431 1555601 1652059 1760244 1727050
15524 1727050 1662014 1619666 1651201 1611212 1591232 1581536 1586852 1566130 1593603 1686391 1651319 1511998
15512 1511998 1547298 1598410 1496564 1539354 1573628 1584553 1458186 1418439 1556301 1597111 1556731
15501 1556731 1575101 1609666 1638147 1586211 1622754 1623172 1494731 1621633 1652903 1525458 1575165
15490 1575165 1576728 1566387 1564504 1523571 1540728 1485760 1587693 1579939 1659694 1582552 1537999 1553721
15478 1553721 1662764 1709599 1638130 1663766 1587304 1582482 1621102 1560799 1532324 1580445 1605418
15467 1605418 1506442 1550985 1499211 1601681 1568781 1638393 1592907 1548704 1690666 1603738 1562109
15456 1562109 1583773 1629355 1637291 1609752 1601911 1583608 1616810 1591234 1663606 1721676 1663860 1600360
15444 1600360 1482475 1506170 1509581 1582832 1604437 1634590 1667495 1690522 1603342 1639031 1648110
15433 1648110 1646960 1673602 1652024 1619820 1572831 1571622 1557371 1598681 1682930 1698688 1633020 1522622
15421 1522622 1529522 1555617 1528965 1619071 1480819 1450706 1487818 1614582 1572392 1608979 1598034
15410 1598034 1589444 1689266 1659951 1658593 1683648 1724697 1647467 1636415 1668472 1694013 1712613 1732264
15398 1732264 1658977 1681773 1637546 1684871 1609635 1637747 1613834 1515773 1438105 1503134 1656402
15387 1656402 1759874 1770531 1669007 1617478 1645624 1701206 1712682 1577153 1579031 1622860 1555229
15376 1555229 1597330 1637966 1545560 1579992 1571466 1512706 1528908 1639673 1653632 1616138 1545634
15365 1545634 1553919 1648310 1695830 1706010 1670072 1655213 1565871 1531936 1588085 1630966 1593651
15354 1593651 1545710 1632357 1616068 1628507 1623183 1632185 1617508 1602787 1665151 1596636 1530647 1566217
15342 1566217 1639455 1630541 1583940 1533655 1650829 1679198 1588213 1531167 1599909 1624968 1610199
15331 1610199 1587035 1594105 1588380 1520456 1587536 1689710 1655573 1655476 1704043 1678961 1692105 1613410
15319 1613410 1665118 1638939 1681296 1800890 1693860 1717453 1689667 1709056 1690310 1616565 1587217
15308 1587217 1654407 1727609 1710903 1609430 1654280 1707615 1655090 1688953 1687857 1625277 1649331
15297 1649331 1729367 1625088 1616451 1618615 1622626 1642768 1602933 1602816 1584286 1596745 1581621 1622082
15285 1622082 1638959 1621135 1591027 1613389 1715100 1736008 1650566 1658912 1674553 1599755 1618497
15274 1618497 1740536 1763838 1718796 1694823 1660305 1711591 1662300 1669210 1651144 1510446 1505275
15263 1505275 1574671 1672027 1657354 1591578 1517478 1588231 1530565 1613089 1705776 1647566 1603385
15252 1603385 1683780 1722306 1732329 1759407 1704453 1610066 1522743 1498021 1556348 1720715 1654198
15241 1654198 1597684 1648236 1649808 1626613 1634172 1730118 1754326 1687597 1686300 1658288 1571766 1547810
15229 1547810 1588239 1641111 1708056 1695751 1688208 1672478 1611848 1692802 1674157 1666612 1682084 1700891
15217 1700891 1716006 1770882 1732071 1624408 1699654 1686939 1633993 1700598 1708968 1758049 1711763
15206 1711763 1692714 1708425 1692780 1692654 1623150 1655524 1688012 1681168 1719857 1646496 1618370 1558303
15194 1558303 1619268 1664133 1597951 1590336 1596048 1618155 1659800 1805954 1757032 1707825 1696629
15183 1696629 1633660 1586573 1691019 1704536 1710176 1622854 1664623 1539441 1606722 1649075 1745027
15172 1745027 1747785 1750551 1782358 1620390 1520106 1590500 1787345 1914148 1815327 1712572 1833613
15161 1833613 1835639 1793927 1728222 1667420 1655347 1700442 1710872 1604464 1620372 1625512 1586697
15150 1586697 1671591 1718795 1597098 1505207 1504164 1520421 1506595 1612351 1628585 1597046 1626762
15139 1626762 1523247 1609898 1719362 1729680 1552599 1498572 1574449 1674935 1582252 1585551 1599172
15128 1599172 1621914 1694353 1667995 1633738 1604731 1595197 1705539 1664073 1669016 1653717 1564121
15117 1564121 1676809 1707203 1599781 1612433 1723697 1733889 1722580 1676415 1682002 1643839 1667979
15106 1667979 1731656 1644554 1688967 1755059 1726113 1637242 1739623 1732762 1654372 1744456 1696847
15095 1696847 1771055 1683161 1634581 1624057 1665906 1728650 1707975 1696407 1733736 1698204 1711744
15084 1711744 1655256 1679973 1670976 1630938 1693793 1666883 1788107 1680726 1675928 1683387 1688833 1695296
15072 1695296 1690953 1645593 1661038 1631065 1633848 1652828 1612605 1600119 1575212 1584939 1704891 1731867
15060 1731867 1644789 1710721 1669792 1641569 1755106 1702131 1687616 1733567 1701846 1733365 1771495
15049 1771495 1656685 1675887 1616266 1578445 1641595 1625202 1647907 1643482 1652960 1636935 1690908
15038 1690908 1707818 1766077 1590881 1774520 1839193 1680195 1668352 1760736 1782690 1778344 1706101
15027 1706101 1642438 1707713 1667331 1698542 1659824 1671703 1735376 1811999 1814824 1807900 1759405 1751741
15015 1751741 1806109 1658668 1589206 1678350 1696792 1645402 1597730 1629338 1667019 1652820 1595220
15004 1595220 1589370 1651086 1671565 1672688 1688569 1625704 1657969 1710172 1757497 1659694 1669678 1692428
14992 1692428 1675327 1595628 1676541 1748359 1700057 1887644 1866248 1755281 1773923 1700529 1646100
14981 1646100 1801920 1734550 1756311 1776756 1761086 1716588 1711027 1781720 1813024 1692985 1685449
14970 1685449 1784767 1813449 1760450 1686556 1714090 1675623 1602571 1723209 1642513 1736091 1710806
14959 1710806 1693488 1755507 1641816 1733706 1602987 1564511 1736449 1752005 1687861 1725928 1702725
14948 1702725 1752404 1802276 1799617 1728503 1720726 1708832 1780408 1802787 1787119 1743994 1848421
14937 1848421 1776319 1775610 1765835 1815107 1744594 1708421 1637496 1668324 1727005 1789910 1789602 1714614
14925 1714614 1734985 1761260 1755389 1705370 1718582 1714558 1810564 1793902 1762374 1719145 1724162 1662642
14913 1662642 1699836 1643955 1687122 1691437 1643422 1681985 1644477 1632688 1607651 1745005 1739876
14902 1739876 1705438 1715349 1706265 1727883 1764138 1795099 1722873 1726001 1636697 1692320 1748989 1674254
14890 1674254 1717157 1688531 1608490 1629006 1603965 1672390 1575323 1626793 1701669 1713826 1697099
14879 1697099 1819120 1761299 1684394 1739479 1832652 1748219 1745673 1748930 1733406 1710872 1698087
14868 1698087 1749144 1692464 1762766 1736686 1675221 1733430 1795149 1770169 1687361 1680226 1793797
14857 1793797 1701117 1697746 1597971 1581844 1678870 1609042 1657080 1676069 1659700 1738760 1759394
14846 1759394 1755467 1735664 1729130 1739324 1729140 1775403 1788036 1686273 1699290 1712880 1568850
14835 1568850 1627616 1610286 1677470 1723963 1743597 1729287 1671432 1691312 1758187 1827648 1691572
14824 1691572 1663464 1651218 1690362 1722668 1724189 1699995 1736792 1730722 1822427 1881195 1781599 1755270
14812 1755270 1830142 1814432 1735152 1699568 1734481 1688862 1719131 1785677 1741769 1703431 1785066
14801 1785066 1751937 1752972 1735479 1740957 1833440 1844558 1830224 1810771 1782998 1843576 1834355 1729478
14789 1729478 1677248 1723031 1672160 1710293 1739232 1653534 1645377 1643808 1629826 1709866 1829421
14778 1829421 1919190 1841715 1744836 1718942 1721303 1708008 1728713 1681588 1678697 1745215 1780812 1767739
14766 1767739 1788073 1803459 1815905 1933252 1762226 1708472 1662770 1681604 1756074 1710453 1776092
14755 1776092 1839777 1817125 1740844 1764358 1784205 1694851 1718552 1733384 1724753 1732785 1730628 1759026
14743 1759026 1790953 1720067 1746939 1818086 1768188 1783338 1792927 1796909 1781665 1786261 1906040 1819463
14731 1819463 1700730 1695535 1822982 1857604 1806613 1776578 1868030 1784109 1802400 1850364 1834308
14720 1834308 1826451 1859897 1785378 1767960 1840571 1885701 1853288 1851651 1919015 1834491 1790496 1787771
14708 1787771 1731930 1825890 1813971 1800424 1773317 1688494 1681008 1549035 1632949 1696429 1763837
14697 1763837 1875284 1858878 1789831 1836573 1783780 1777010 1760916 1820081 1808485 1815544 1795131
14686 1795131 1737447 1789963 1822447 1836195 1768850 1758424 1776309 1752795 1719648 1777402 1752882
14675 1752882 1838917 1866005 1818469 1803082 1808492 1786448 1863032 1864747 1822328 1776025 1776958 1773118
14663 1773118 1699963 1727945 1720560 1752282 1728679 1776876 1835608 1826336 1707887 1727942 1848898
14652 1848898 1952610 1934763 1858772 1909676 1879008 1761963 1729429 1704251 1863195 1928376 1812759
14641 1812759 1773615 1859829 1832537 1809297 1870815 1782451 1734314 1832652 1837117 1803567 1769991
14630 1769991 1853986 1924969 1848119 1686613 1650390 1774896 1715449 1733001 1704607 1762714 1929654
14619 1929654 1953371 1872840 1784110 1703538 1775397 1761380 1741090 1838771 1816269 1858010 1810942
14608 1810942 1730342 1730968 1839377 1856031 1837463 1773896 1686065 1675801 1752203 1757605 1699883 1793074
14596 1793074 1806361 1726047 1742154 1834927 1854304 1772887 1825455 1966653 1897750 1853191 1841527
14585 1841527 1819568 1838201 1770346 1731267 1769214 1873917 1862045 1859411 1807504 1886588 1882740
14574 1882740 1789225 1721765 1681301 1575629 1626137 1722305 1680420 1741834 1772667 1852013 1799483
14563 1799483 1852987 1768582 1811244 1830504 1815213 1879194 1928983 1875999 1766248 1741722 1931047
14552 1931047 1855003 1713809 1751673 1839569 1839514 1838287 1868151 1764772 1753793 1798212 1939457
14541 1939457 1909970 1791378 1706139 1728557 1710592 1764561 1882253 1859156 1817324 1802983 1769698
14530 1769698 1798732 1768788 1750206 1732167 1699646 1758044 1794258 1906991 1856950 1911657 1895745
14519 1895745 1808460 1762831 1806161 1871186 1831229 1829611 1809190 1902527 1905582 1847534 1872695 1773567
14507 1773567 1776450 1825935 1805368 1773590 1715307 1806390 1774526 1784354 1711428 1711876 1708088 1875932
14495 1875932 1862578 1768985 1783157 1812385 1878088 1839571 1783276 1746810 1777470 1871105 1859121
14484 1859121 1790895 1686678 1779306 1817448 1781418 1872856 1819366 1775078 1721486 1833970 1828945
14473 1828945 1875098 1790327 1863046 1909464 1895147 1897036 1893736 1812223 1721060 1676997 1646673 1688269
14461 1688269 1764319 1877938 1823364 1818327 1796790 1792844 1821648 1772777 1832889 1875708 1878268 1836013
14449 1836013 1775006 1757864 1819571 1903151 1896335 1793408 1932313 1929403 1752762 1774808 1833451
14438 1833451 1673396 1633891 1734126 1786458 1887676 1843477 1851158 1807743 1919857 1976209 1863423
14427 1863423 1756170 1789455 1876940 1794669 1788107 1874308 1814595 1918236 1998148 1968750 1976215
14416 1976215 1885361 1851841 2006105 2029195 1930606 1905346 1895089 1811714 1864582 1913665 1892031
14405 1892031 1863343 1981038 1921910 1874544 1901109 1858811 1927002 1995418 1885667 1832540 1799591
14394 1799591 1702896 1751355 1933473 1880697 1746192 1804657 1842728 1942384 1950802 1872274 1948474
14383 1948474 1909586 1837841 1867467 1902903 1916817 1909786 1853446 1859236 1894469 1841623 1820604 1908862
14371 1908862 1928542 1870296 1845067 1798063 1828871 1769360 1876480 1965269 1984089 1874983 1869510
14360 1869510 1953280 1950024 1819083 1845634 1935531 2049964 1996451 1922799 1987426 1911471 2017684
14349 2017684 2016165 1920453 1916281 1851603 1810509 1843165 1789776 1795214 1807476 1797223 1887458 1826401
14337 1826401 1869935 1879656 1902160 1900920 1945894 1913958 1955299 2060754 2050946 1959243 1938692 1943815
14325 1943815 1923136 1943370 1917550 1753404 1722458 1866644 1852258 1892857 1888986 1907716 1922367
14314 1922367 1841409 1825499 1879017 1781326 1775087 1855636 1865114 1977552 1934489 1904141 1815293
14303 1815293 1866470 1887109 1870402 1874894 2005221 1969036 1864361 1854408 1757159 1820445 1802210
14292 1802210 1869783 1912214 1911622 1896186 1893230 1863958 1977063 1939680 1964764 1956473 1887089 1816431
14280 1816431 1756286 1727373 1748377 1826896 1812798 1823585 1830697 1838265 1935091 1892597 1946369 1884780
14268 1884780 1985347 2048076 1926262 1841380 1884121 1983702 2014378 1951538 1933046 1859043 1934713
14257 1934713 1984602 1912999 1852897 1897846 1987787 1957378 1939126 1893208 1887528 1897947 1876336
14246 1876336 1780992 1811578 1774385 1888615 1848741 1805447 1882089 1792058 1855987 1805621 1807370
14235 1807370 1981175 1949237 1912697 1861107 1846735 1824916 1672860 1746125 1893585 1904442 1949985
14224 1949985 1898769 1781184 1825706 1928816 1839973 1847093 1866477 1937659 1782725 1711224 1808346
14213 1808346 1846338 1882952 1988108 1977205 1982219 2091158 2033475 1993385 1962823 1893413 1910784
14202 1910784 1966084 1902735 1894691 1918504 1924564 1967342 1915401 1789287 1792062 1862438 1864289 1869171
14190 1869171 1897011 1891707 1930614 1840313 1910109 1891175 1828898 1913944 1875596 1858332 1940475
14179 1940475 2022591 1972531 1951790 1907699 1863971 1853393 1916875 1830218 1760443 1814135 1808835
14168 1808835 1808700 1916360 1907522 1904409 1916868 1989107 1938942 1929526 1838001 1904845 1971928 1959995
14156 1959995 1983990 1901083 1916392 1968959 1920192 1904760 1886544 1867861 1930555 1944730 1866861
14145 1866861 1898940 1984852 1834355 1836960 1900117 1928239 1738786 1706058 1844898 1834054 1908567
14134 1908567 1999727 2034701 1943453 1854301 1899465 1873767 1902712 1886377 1896559 1968531 1959575
14123 1959575 1935369 1963463 1834957 1951734 1932803 1984298 2064333 1972502 1935942 1926304 2017231
14112 2017231 2017534 1934816 1980849 1907084 1883817 1913763 1977505 2005951 1994172 1943307 1862242 1899024
14100 1899024 2000821 1986107 2034879 1973757 1901761 1944190 1955531 1978782 1910949 1878181 1932809
14089 1932809 1869588 1883568 1964715 1859427 1817987 1888031 2047568 1945946 1960662 2021468 1918810
14078 1918810 1941524 1870544 1927148 1924912 1964223 2025287 1943875 1976617 2026611 1971527 1919561
14067 1919561 1998368 1946948 1910173 1885985 1961060 1905088 1898432 2021342 1897638 1883236 1863706
14056 1863706 1910630 1999532 1891067 1957285 2038035 2103138 1999244 1973120 2052668 1984375 1946552
14045 1946552 2088831 2021937 2023086 2039198 1988082 1911749 1956159 1947556 2040061 2013836 2004363 1999356
14033 1999356 1858519 1958557 1946599 1920839 1983662 1979925 1914928 1936987 1970691 1978984 2000607
$$ [...]
##END NTUPLES=NMR SPECTRUM
##END=
