##TITLE=1H_EC-3296(IV-32)
 CDCl3
 8 sc, 
 8.6.2023
##JCAMPDX= 6.0         $$ Bruker NMR JCAMP-DX V2.0
##DATA TYPE= NMR SPECTRUM
##DATA CLASS= NTUPLES
##ORIGIN= UXNMR, Bruker Analytische Messtechnik GmbH
##OWNER= root
$$ XWIN-NMR		Version 3.5
$$ Thu Jun  8 14:14:54 2023 Russian Standard Time (UT+4h)  she@DPX200
##.OBSERVE FREQUENCY= 200.13135
##.OBSERVE NUCLEUS= ^1H
##.ACQUISITION MODE= SIMULTANEOUS
##.ACQUISITION SCHEME= undefined
##.AVERAGES= 8
##.DIGITISER RES= 18
##SPECTROMETER/DATA SYSTEM= spect
##.PULSE SEQUENCE= zg30
##.SOLVENT NAME= CDCl3
##.SHIFT REFERENCE= (INTERNAL, CDCl3, 0, 15.759)
##AUDIT TRAIL= $$ (NUMBER, WHEN, WHO, WHERE, WHAT)
$$ ##TITLE= Audit trail, XWIN-NMR		Version 3.5
$$ ##JCAMPDX= 5.01
$$ ##ORIGIN= Bruker BioSpin GmbH
$$ ##OWNER= she
$$ F:/spectra/data/she/nmr/H-F/1/pdata/1/auditp.txt
$$ ##AUDIT TRAIL=  $$ (NUMBER, WHEN, WHO, WHERE, WHAT)
(   1,<2023-06-08 14:13:44.00 +0400>,<she>,<DPX200>,
      <created by zg, POWCHK disabled, PULCHK disabled
       configuration hash MD5:
       00 E9 B6 7A A2 85 ED C7 34 08 36 98 17 FE 4E 26
       data hash MD5: 16K
       ED 3A 26 80 EB 71 6F EF 44 0F 55 E8 28 79 AD 84>)
(   2,<2023-06-08 14:13:46.29 +0400>,<she>,<DPX200>,
      <Start of raw data processing
       efp BC_mod = 2 LB = 0.24 FT_mod = 6 PKNL = 1 PHC0 = -20267.78 PHC1 = 14.45272 SI = 16K 
       data hash MD5: 16K
       C3 99 8A C6 B2 E7 F0 E3 B3 C3 C9 9E FF 40 4C B0>)
(   3,<2023-06-08 14:13:49.90 +0400>,<she>,<DPX200>,
      <abs ABSG = 5 
       data hash MD5: 16K
       6C 76 37 93 B8 CE E1 C6 6A FA A4 C3 05 D7 ED 45>)
(   4,<2023-06-08 14:14:04.45 +0400>,<she>,<DPX200>,
      <pk PHC0 = -0.6237367 PHC1 = -2.384186e-07 
       data hash MD5: 16K
       1A 63 54 76 51 43 84 97 BA 1A 44 B3 34 D7 68 9D>)
(   5,<2023-06-08 14:14:07.81 +0400>,<she>,<DPX200>,
      <abs ABSG = 5 
       data hash MD5: 16K
       6E 47 14 07 9A 35 46 74 0F 18 E3 74 B1 CF 94 D8>)
$$ ##END=
$$ 
$$ hash MD5
$$ 00 BF FE E2 4D AC 3C 97 4A 61 EF B6 5E 3D 91 27
##$RELAX= 
##$RELAX= 
##$RELAX= 
##$RELAX= 
##$RELAX= 
##$RELAX= 
$$ Bruker specific parameters
$$ --------------------------
##$DU= <F:/spectra>
##$EXPNO= 1
##$NAME= <H-F>
##$PROCNO= 1
##$TYPE= <nmr>
##$USER= <she>
##$AMP= (0..31)
100 100 100 100 100 100 100 100 100 100 100 100 100 100 100 100 100 100 
100 100 100 100 100 100 100 100 100 100 100 100 100 100 
##$AQSEQ= 0
##$AQ_mod= 1
##$AUNM= <au_zg>
##$AUTOPOS= <>
##$BF1= 200.13
##$BF2= 200.13
##$BF3= 200.13
##$BF4= 200.13
##$BF5= 200.13
##$BF6= 200.13
##$BF7= 200.13
##$BF8= 200.13
##$BYTORDA= 1
##$CFDGTYP= 0
##$CFRGTYP= 5
##$CHEMSTR= <none>
##$CNST= (0..31)
1 1 145 1 1 1 1 1 1 1 1 1 1 1 1 1 1 1 1 1 1 1 1 1 1 1 1 1 1 1 1 1 
##$CPDPRG= <>
##$CPDPRG1= <>
##$CPDPRG2= <>
##$CPDPRG3= <>
##$CPDPRG4= <mlev>
##$CPDPRG5= <mlev>
##$CPDPRG6= <mlev>
##$CPDPRG7= <mlev>
##$CPDPRG8= <mlev>
##$CPDPRGB= <>
##$CPDPRGT= <>
##$D= (0..31)
0 1.2 0 0 0 0 0 0 0 0.06 0 0.03 0 0 0 0 0.0002 0 0 0 0 0 0 0 0 0 0 0 0 
0 0 0 
##$DATE= 1686219223
##$DBL= (0..7)
$$ [...]
##$SUBNAM3= <"">
##$SUBNAM4= <"">
##$SUBNAM5= <"">
##$SUBNAM6= <"">
##$SUBNAM7= <"">
##$SUBNAM8= <"">
##$SUBNAM9= <"">
##$SW= 18.05172834244
##$SWIBOX= (0..15)
0 0 2 0 0 0 0 0 0 0 0 0 0 0 0 0 
##$SW_h= 3612.71676300578
##$TD= 16384
##$TD0= 1
##$TE= 0
##$TE2= 300
##$TE3= 300
##$TEG= 300
##$TL= (0..7)
0 120 120 120 120 120 120 120 
##$TP= (0..7)
150 150 150 150 150 150 150 150 
##$TP07= 0
##$TPNAME0= <>
##$TPNAME1= <>
##$TPNAME2= <>
##$TPNAME3= <>
##$TPNAME4= <>
##$TPNAME5= <>
##$TPNAME6= <>
##$TPNAME7= <>
##$TPOAL= (0..7)
0.5 0.5 0.5 0.5 0.5 0.5 0.5 0.5 
##$TPOFFS= (0..7)
0 0 0 0 0 0 0 0 
##$TUNHIN= 0
##$TUNHOUT= 0
##$TUNXOUT= 0
##$USERA1= <user>
##$USERA2= <user>
##$USERA3= <user>
##$USERA4= <user>
##$USERA5= <user>
##$V9= 5
##$VALIST= <valist>
##$VCLIST= <CCCCCCCCCCCCCCC>
##$VD= 0
##$VDLIST= <DDDDDDDDDDDDDDD>
##$VPLIST= <PPPPPPPPPPPPPPP>
##$VTLIST= <TTTTTTTTTTTTTTT>
##$WBST= 1024
##$WBSW= 4
##$XGAIN= (0..3)
0 0 0 0 
##$XL= 0
##$YL= 0
##$YMAX_a= 754481
##$YMIN_a= -819137
##$ZGOPTNS= <>
##$ZL1= 120
##$ZL2= 120
##$ZL3= 120
##$ZL4= 120
##$ABSF1= 15.73698
##$ABSF2= -2.314869
##$ABSG= 5
##$ABSL= 3
##$ALPHA= 0
##$AQORDER= 0
##$ASSFAC= 0
##$ASSFACI= 0
##$ASSFACX= 0
##$ASSWID= 0
##$AUNMP= <proc_1d>
##$AZFE= 0.1
##$AZFW= 0.1
##$BCFW= 0
##$BC_mod= 2
##$BYTORDP= 0
##$COROFFS= 0
##$CY= -3
##$DATMOD= 1
##$DC= 0
##$DFILT= <>
##$DTYPP= 0
##$F1P= 0
##$F2P= 0
##$FCOR= 1
##$FTSIZE= 16384
##$FT_mod= 6
##$GAMMA= 0
##$GB= 0
##$INTBC= 1
##$INTSCL= 3.70164e-10
##$ISEN= 128
##$LB= 0.24
##$LEV0= 0
##$LPBIN= 0
##$MAXI= 10000
##$MC2= 0
##$MEAN= 0
##$ME_mod= 0
##$MI= 1.114404
##$NCOEF= 0
##$NC_proc= -4
##$NLEV= 6
##$NOISF1= 3.799351
##$NOISF2= 2.8
##$NSP= 0
##$NTH_PI= 0
##$NZP= 0
##$OFFSET= 15.75901
##$PC= 1
##$PHC0= -20268.4
##$PHC1= 14.45272
##$PH_mod= 1
##$PKNL= yes
##$PPARMOD= 0
##$PSCAL= 0
##$PSIGN= 0
##$REVERSE= no
##$SF= 200.130002508764
##$SI= 16384
##$SIGF1= 3
##$SIGF2= 2
##$SINO= 5.538805
##$SIOLD= 16384
##$SREGLST= <1H.CDCl3>
##$SSB= 0
##$STSI= 16384
##$STSR= 0
##$SW_p= 3612.71676300578
##$SYMM= 0
##$S_DEV= 0
##$TDeff= 16384
##$TDoff= 0
##$TI= <>
##$TILT= no
##$TM1= 0
##$TM2= 0
##$TOPLEV= 0
##$USERP1= <user>
##$USERP2= <user>
##$USERP3= <user>
##$USERP4= <user>
##$USERP5= <user>
##$WDW= 1
##$XDIM= 16384
##$YMAX_p= 506840040
##$YMIN_p= -118120
$$ End of Bruker specific parameters
$$ ---------------------------------
##NTUPLES= NMR SPECTRUM
##VAR_NAME=  FREQUENCY,     SPECTRUM/REAL,   SPECTRUM/IMAG
##SYMBOL=    X,             R,               I
##VAR_TYPE=  INDEPENDENT,   DEPENDENT,       DEPENDENT
##VAR_FORM=  AFFN,          ASDF,            ASDF
##VAR_DIM=   16384,         16384,           16384
##UNITS=     HZ,            ARBITRARY UNITS, ARBITRARY UNITS
##FACTOR=    0.220516191357247, 1,           1
##FIRST=     3153.85077386486, 0,            0
##LAST=      -458.865989140919, 0,           0
##MIN=       -458.865989140919, -118120,     0
##MAX=       3153.85077386486, 506840040,    0
$$ Real data points
##PAGE= N=1
##DATA TABLE= (X++(R..R)), XYDATA
$$ [...]
8714 42098015 40271793 38798201 37830910 37359680 37344233 37710466 38589502 40187048 42798362
8705 42798362 46515521 51676383 59034372 69765832 81548545 89810631 87905999 75942732
8697 75942732 62548985 53416307 48160073 44950951 43066655 41922220 41335029 41030870
8689 41030870 40822441 40256035 39127672 37195750 34625441 31623178 28613179 25894642
8681 25894642 23569503 21608812 20035234 18749637 17656469 16695345 15782838 14889028 14106257
8672 14106257 13382253 12774467 12235801 11749588 11281324 10847807 10394338 9996187 9636602
8663 9636602 9353453 9130715 8929853 8746166 8574306 8412799 8289457 8167211 8041562 7928112
8653 7928112 7807048 7699180 7585054 7473578 7409848 7319870 7259982 7211360 7162537 7118448 7033132
8642 7033132 6973122 6936458 6919884 6956227 7018151 7080564 7163330 7287440 7428528 7624817 7799711
8631 7799711 7968890 8155313 8334981 8555556 8723976 8911008 9092726 9224039 9301345 9354351
8621 9354351 9439824 9565860 9758250 9958725 10147361 10358843 10657418 11049791 11482235 12030263
8611 12030263 12712847 13504992 14484834 15601381 16819523 18159637 19584414 20865249 21950354
8602 21950354 22877739 23758115 24619084 25285234 25320382 24684319 23706339 22775933 22017826 21232712
8592 21232712 20205127 18962958 17632367 16378528 15324361 14528303 13989955 13637957 13457138
8583 13457138 13383634 13494631 13689738 14018066 14518514 15150750 15924155 16859229 17818499 18705944
8573 18705944 19453803 20237453 21235804 22563582 24057930 25742166 27232836 28032766 27928302
8564 27928302 26791518 24827842 22396455 20070342 18187281 16743663 15626738 14749546
8556 14749546 13966685 13119709 12191671 11276813 10414936 9732435 9205971 8761876 8390651
8547 8390651 8138378 7971747 7915889 7908278 8000300 8212800 8520586 8913561 9327100 9782531
8537 9782531 10123514 10324126 10474493 10603868 10705420 10666024 10325224 9726667 9032986 8403822
8527 8403822 7833495 7264884 6582080 5887045 5223912 4667393 4229834 3910518 3607997 3338437
8517 3338437 3123206 2932678 2773671 2617926 2463680 2328592 2231432 2122295 2038860 1953548
8507 1953548 1908885 1862470 1814288 1759774 1694263 1667574 1600499 1552241 1517866 1511247 1471993 1417707
8495 1417707 1363616 1288722 1255522 1209770 1146693 1084313 1059038 1000639 973618 935145 912311
8484 912311 885185 847230 815293 781070 772263 764664 757928 754794 759643 723322 695200 659543 639737
8471 639737 637304 615829 606618 604914 609004 593508 576216 549505 535333 527035 511663 509294 477833
8458 477833 468036 459979 441451 416673 417508 394951 414242 419440 408339 388236 370830 376382 347521
8445 347521 325918 316182 310701 290623 292485 273860 275902 292341 267888 247397 253753 250444 228756
8432 228756 221271 219352 202189 201764 217861 214762 201731 210330 201329 198669 191771 194070 197772 169471
8418 169471 172992 200776 181093 170169 183796 179101 160171 158512 168805 171187 179305 165943 155737
8405 155737 172542 163316 185120 193128 212415 214904 196809 202147 214812 219039 235516 222467 227522
8392 227522 245757 269216 254420 216430 239001 212734 207989 185954 139783 134705 137001 120658
8380 120658 135138 162561 162943 139071 138411 150186 121054 134508 141367 136638 144155 150551 151422 160737
8366 160737 162568 172506 174091 188053 202754 214547 223768 221428 202174 182141 179456 195307 181515
8353 181515 169136 145925 143478 144790 150518 133317 132390 142151 142975 119305 96914 95701 68550
8340 68550 75581 38295 35636 35829 42139 48704 38536 36485 28020 29476 40250 29803 35874 54236
8326 54236 60615 71493 66416 65291 92812 76175 59926 33369 24466 30858 42850 8796 10034
8313 10034 28526 24589 25918 13057 -6725 1911 6545 9486 2277 11804 -4159 -13397 -5300 -8751
8299 -8751 -22169 -33690 -38832 -49253 -77758 -79121 -55657 -46346 -48931 -49401 -51052 -73149 -55654
8286 -55654 -35227 -43492 -61617 -32619 -14153 -24679 -61606 -75801 -61922 -36809 -60239 -70535
8274 -70535 -70982 -63194 -56539 -49397 -49398 -65022 -52125 -44546 -49990 -64926 -40992 -39138 -48306 -24634
8260 -24634 -10270 -20095 -35699 -52839 -32424 -35372 -38527 -42668 -15270 -19029 19746 14897 6019
8247 6019 3848 -12541 -11462 10383 45139 29444 27986 46057 73323 52466 53441 48853 48080 23805
8233 23805 48839 72679 81715 68290 58494 68886 115681 165683 208989 252232 319754 365890
8221 365890 349211 263210 184496 115654 82743 42433 47599 52567 47833 43492 28070 49593
8209 49593 46998 32159 45718 48762 57150 64360 51021 62165 51959 58660 49542 34881 10369
8196 10369 11859 -17541 -27177 -59054 99675 159810 70222 16536 7946 28996 -3136 -14464
8184 -14464 -10861 8207 -24384 -22533 -35046 -30397 -23418 -19529 657 -10924 -22941 -7929 -6410
8171 -6410 -3427 -10953 -5581 -22080 -9813 -43564 -71985 -69847 -52381 -31144 -38245 -56525 -61421
8158 -61421 -44170 -43938 -37593 -46793 -58026 -39292 -58292 -61596 -73730 -87197 -70067 -56041 -33290
8145 -33290 -55482 -57837 -78453 -52715 -36683 -36381 -47451 -77508 -80948 -87791 -57592 -38522 -27837
8132 -27837 -36222 -62829 -43309 -47877 -40981 -52920 -52092 -27886 -27341 -27240 -19129 -3777 2263 10047
8118 10047 -35577 -63656 -38177 -36652 -27043 -27174 -53443 -56900 -42004 -56804 -53670 -42843 -60719
8105 -60719 -62696 -63163 -66938 -64193 -40320 -41940 -55127 -65989 -60855 -38340 -53947 -66872 -54559
8092 -54559 -58511 -47373 -45646 -53948 -31640 -63450 -66799 -53694 -49947 -53208 -66206 -62479 -45882
8079 -45882 -57871 -94366 -72940 -59103 -70461 -52403 -34547 -23443 -28234 -39918 -25082 -32948
8067 -32948 -44430 -44337 -34788 -12781 -17345 -25648 -39323 -39510 -14831 -24204 -40440 -50200 -22178 -33429
8053 -33429 -32390 -48034 -67052 -60770 -40896 -16997 -20456 -26880 -29471 -20218 -30620 -33599 -41638
8040 -41638 -44511 -38566 -13511 -14965 -25937 -35663 -2877 -7538 -9930 -14528 -6023 -6256 -40859 -39167
8026 -39167 -26625 19687 32234 -23007 -32059 -11966 -28636 -39909 -49193 -15020 23014 19062
8014 19062 -2938 9304 5281 -4191 -17340 -11238 22792 43556 37609 19545 18700 20232 20867 36360
8000 36360 20963 31171 24034 2611 13734 12318 28216 29302 43857 47616 52952 45973 56599
7987 56599 85009 59596 38726 37762 70472 49283 47667 33965 22740 57145 39872 56432
7975 56432 55823 78402 60968 54194 58782 64440 64374 72912 81971 63724 44835 65608 78106 82649
7961 82649 97867 96644 87767 104797 109124 86125 110473 117738 120282 118701 117949 102139 115122
7948 115122 119832 117829 124843 123277 132012 144061 143884 148009 141502 154910 144595 148451 167861 162090
7934 162090 160588 168772 184490 183964 185344 186054 186037 204070 232334 223052 229530 219981 200354 205793
7920 205793 240253 242712 252986 259112 261417 261867 284650 314380 305775 332683 317262 323497 319103
7907 319103 313811 330665 333883 313666 301506 328846 308934 269965 300093 312906 334990 349695
7895 349695 375254 367813 347214 382880 374345 378481 374668 349431 372047 392572 399941 395073 383236
7882 383236 380595 382557 390192 397844 396036 439575 442276 437122 451228 448565 455832 437657 425636
7869 425636 457150 470298 484648 509977 516823 534876 500902 509674 534193 535510 573036 573337 545122
7856 545122 571444 573577 587461 600272 597528 612665 608237 619157 621225 646176 664660 680150
7844 680150 684777 676589 677353 684586 722762 746158 720588 737908 759709 772335 795948 820453 823988
7831 823988 808434 841697 874564 899071 905078 923212 941461 940061 960488 985457 1028896 1078210
7819 1078210 1101027 1103709 1141012 1177662 1151179 1202965 1233228 1262191 1313303 1360058 1377911 1411583
7807 1411583 1439024 1467522 1515006 1540571 1554559 1595676 1643619 1699710 1723223 1742741 1798992
7796 1798992 1848759 1902163 1929710 1939781 1995139 2025234 2068916 2130677 2180915 2201311 2232728
7785 2232728 2300219 2336712 2358643 2398945 2464203 2512001 2574500 2607260 2672027 2709736 2769469
7774 2769469 2872524 2905955 2978004 3059655 3119443 3190806 3293776 3385387 3455940 3572818 3662117
7763 3662117 3759300 3883557 4007605 4135406 4249962 4387341 4526889 4678709 4836248 4985473
7753 4985473 5149393 5312497 5515045 5699049 5890154 6124977 6345111 6575530 6830319 7068643
7743 7068643 7357031 7638486 7951365 8261108 8580747 8966531 9338020 9717991 10139183 10624463
7733 10624463 11127875 11651592 12220472 12829425 13468241 14175239 14915514 15715357 16580807
7724 16580807 17469146 18428213 19424542 20482883 21569483 22639443 23688794 24737934 25685727
7715 25685727 26521528 27252319 27805182 28126909 28205566 28059696 27705758 27125921 26335599 25394464
7705 25394464 24298696 23146702 21960550 20749733 19565365 18394385 17262409 16194048
7697 16194048 15189013 14254056 13390433 12551640 11782422 11107052 10485174 9873213 9324949
7688 9324949 8857116 8374613 7947507 7549430 7160102 6836038 6544026 6260818 5982999 5714177
7678 5714177 5469083 5253184 5057344 4846217 4664772 4492904 4323629 4183603 4014125 3892406
7668 3892406 3749577 3636221 3537498 3392037 3266828 3165815 3064643 2985324 2895021 2800696
7658 2800696 2722977 2681662 2608525 2515186 2439653 2342003 2295701 2239340 2177198 2131845 2082441
7647 2082441 2006883 1947846 1890085 1843021 1823930 1783806 1692830 1655201 1645487 1599493 1546100 1503239
7635 1503239 1493326 1471244 1406709 1374202 1356552 1358916 1343656 1268180 1251728 1237888 1206231 1207648
7623 1207648 1176450 1157044 1153147 1148713 1123368 1117732 1112379 1110208 1094065 1060249 1070742 1057263
7611 1057263 1051746 1048613 998841 986202 988106 981601 996179 986368 1016139 1034579 1039294 1069289 1069557
7598 1069557 1049302 1049655 1062977 1054842 1084331 1094499 1076577 1055135 1068692 1071804 1076928 1073959 1052238
7585 1052238 1036638 1003553 949595 936116 923059 897378 853045 816920 830645 806893 787508
7574 787508 749541 732825 734343 692416 684382 681581 655647 653900 664896 684714 670636 650402
7562 650402 660668 652125 661635 643894 646194 661497 647209 631032 620352 621306 646271 639717 650723
7549 650723 660947 667072 672326 704239 729944 737707 727487 732471 738794 755807 795796 794706 802443
7536 802443 833848 864007 901740 914581 892774 947310 974223 996105 1023168 1083086 1115455 1166856
7524 1166856 1208109 1266830 1302096 1378785 1417879 1489602 1545072 1649518 1730057 1805374 1903217
7513 1903217 2001092 2086877 2173856 2267893 2354995 2445943 2479327 2479687 2497104 2491770 2466922 2436472
7501 2436472 2387322 2304918 2164678 2097879 2025178 1949116 1852527 1735639 1617283 1519213 1458183
7490 1458183 1373067 1303973 1255232 1194943 1115114 1031704 994530 958740 924180 883861 864436
7479 864436 847388 825020 809605 782233 785570 790241 757293 732817 724776 738536 730455 750882
7467 750882 741065 740099 736352 744226 749675 774525 744914 727018 709153 724462 713217 675213 642477
7454 642477 613404 620142 601483 576689 567494 509282 468208 454883 415057 389219 378497 389423
7442 389423 373364 377587 367148 334418 318592 287614 269444 256123 259323 248567 218137 212317
7430 212317 208350 204496 207799 196870 190987 181868 162054 161756 161226 169461 157424 119713 119522 135636
7416 135636 155600 147654 150098 128200 91748 95234 125989 142667 122363 126639 120756 102943 103427
7403 103427 105825 104456 98399 74996 70816 61590 72405 79323 83504 84049 87718 78444 59250 38112
7389 38112 42052 76636 79777 39559 39712 48535 67077 49730 51781 62489 54053 45127 52768 40005
7375 40005 35816 40102 37348 24664 34262 16395 15037 25309 14891 21980 13037 23112 24228
7362 24228 19612 1597 4782 3020 2040 21985 20871 6688 1186 4940 13966 15562 10468 21680
7348 21680 -992 -13300 12750 11815 -4495 3938 37676 44770 23739 12374 23332 7279 -14984
7335 -14984 -20993 -48448 -35911 -22568 -10141 1481 511 10173 35982 24162 49511 43937 44935
7322 44935 29821 16591 24183 9849 4626 -23390 -10694 -6167 28669 7871 19708 18987 31133
7309 31133 33014 -11320 7396 36674 17880 14412 14425 28068 22516 13123 19196 25515 24724 55179
7295 55179 30631 26018 31588 47587 56274 65369 27241 -845 352 9906 26055 6206 6950
7282 6950 -4051 -1120 -2547 2793 19014 12026 12721 21135 5003 -9647 6222 22132 -7403
7269 -7403 -16042 -6009 -1228 28270 10833 -12305 -23684 -36737 -3332 -2564 10450 -670 -34122
7256 -34122 -22402 -957 -3330 -10512 -2288 -3484 -6329 -4031 -6606 12687 16700 17394 14942 29843
7242 29843 27814 -335 -6271 -12342 -9865 -11676 -45229 -9371 -19178 -41748 -43711 -18633 644
7229 644 12482 219 5123 -26981 -37983 -9667 2393 11670 -16279 -34463 -18767 -30360 -24148
7216 -24148 14480 12860 -177 -16709 -968 -3572 -25735 -15528 63 10583 -3844 -25323
7204 -25323 -24449 -18570 -24891 -8592 2723 -13802 -5642 6633 33117 4346 -2518 3552 10311
7191 10311 -3533 13517 27709 24504 38021 76279 54776 18930 29075 27705 20399 53751
7179 53751 45178 31377 31640 38854 31045 42039 54171 70023 94279 85573 100272 106543 94925
7166 94925 86501 108750 110607 124359 117041 91309 90442 99734 112569 148333 86103 82865 107788
7153 107788 116639 104281 60426 78699 115533 108883 101625 100507 100533 94635 133328 140786 149414 161921
7139 161921 178001 187820 188861 173056 176255 197657 210707 231505 230643 241762 240992 241951 264040
7126 264040 289291 306624 344204 358786 385808 404017 419327 436111 485513 542045 596998 598768
7114 598768 642139 692763 738033 770069 813119 831599 838952 838970 837153 811152 749623 680989 637772
7101 637772 593119 521572 491813 470990 438517 404530 357990 315781 308999 302744 256545 220103
7089 220103 196218 201153 176830 147114 162862 136257 112815 117917 91501 89514 82374 53737
7077 53737 57829 91616 97880 54152 42465 56801 87396 68294 62380 53781 29049 34295 36122
7064 36122 22114 10417 6620 10902 884 -8471 -1263 -11848 -3882 17592 21545 26188 6279
7051 6279 -21556 -13980 -12839 -34322 -9474 -2338 4773 15744 -162 -13089 -14393 -15012 -6752 -1254
7037 -1254 -9127 -40582 -61420 -41868 -28205 -15288 14956 -35008 -35771 -31670 -38836 -28028 -28138
7024 -28138 -24300 -43201 -61760 -47299 -26600 -43172 -74316 -55877 -41306 -58536 -71920 -50474
7012 -50474 -33195 -41512 -65361 -78766 -83997 -58919 -66143 -61043 -29719 -56869 -76162 -85978 -44604
6999 -44604 -15393 -50571 -78863 -42186 -54052 -51843 -37395 -79349 -55457 -58496 -65632 -33926
6987 -33926 -71633 -73549 -78274 -71207 -68693 -58179 -69302 -77802 -69430 -52022 -60147 -74299 -67645
6974 -67645 -85931 -69024 -57044 -71315 -68839 -67972 -65966 -65285 -69269 -55373 -56386 -60822 -56883 -74555
6960 -74555 -66024 -56823 -40621 -54961 -79150 -62243 -48958 -43261 -40906 -67795 -68506 -66213 -64745
6947 -64745 -63064 -40222 -60202 -106389 -93674 -69957 -58326 -61968 -61754 -56350 -23489 -56504 -86341
6934 -86341 -80631 -77771 -56345 -67395 -59009 -29094 -45632 -62998 -69875 -66548 -59133 -70268 -53200
6921 -53200 -61520 -65131 -79988 -77076 -57910 -73828 -62781 -55789 -82079 -87472 -70113 -77304 -93862
6908 -93862 -64680 -48209 -49519 -40687 -44659 -58450 -56656 -48462 -73223 -48602 -76430 -64160 -46587
6895 -46587 -53195 -57976 -61276 -74562 -43327 -24202 -5942 -25166 -58795 -44242 -36192 -36331 -40044
6882 -40044 -33764 -54926 -40405 -26309 -26724 -43599 -72371 -40331 -54758 -51304 -71984 -83200 -70629
6869 -70629 -68428 -56151 -63072 -53270 -52172 -37728 -40081 -46179 -37220 -36684 -67727 -30690 -25831 -28880
6855 -28880 -8413 -35538 -27330 -56666 -56970 -49596 -49519 -38391 -48279 -31397 -39304 -43946 -46125 -59662
6841 -59662 -54500 -47938 -55395 -64504 -41970 -33860 -34336 2767 5249 13087 16171 22314 7754 24561
6827 24561 13546 20490 30424 20798 41873 37417 47199 83548 116105 132483 148718 159258 161722
6814 161722 194649 217428 252694 267437 263658 244106 228882 240878 199074 144941 132539 109928
6802 109928 88215 78780 79849 65074 79064 59879 31716 1615 -22880 -42020 -45173 -27971
6790 -27971 -57610 -51775 -60851 -60990 -43498 -35324 -46878 -44272 -15628 -26701 -36554 -10787 -25840
6777 -25840 -34646 -26778 -1511 4474 -888 -17671 -10113 -23548 -38047 -49743 -26776 -17265 -30350
6764 -30350 -36542 -46453 -26775 -24421 -46552 -60208 -68839 -37949 -43481 -42409 -68081 -94840 -52319
6751 -52319 -39300 -49327 -33203 -34610 -50763 -3827 -17522 -29073 -29086 -20093 9063 17677 15493
6738 15493 -7891 -35956 -43556 -40065 -20754 -31849 -33213 -50747 -46550 -46854 -56224 -58438 -57381 -61666
6724 -61666 -60855 -50222 -43877 -45613 -28739 -32077 -34758 -31722 -60391 -49791 -49413 -57005 -60365 -67743
6710 -67743 -61503 -51968 -54656 -50070 -56258 -66065 -51334 -50488 -64744 -44772 -35368 -52879 -75076 -89604
6696 -89604 -81230 -56315 -53061 -50436 -48166 -55752 -60835 -65709 -76718 -71896 -72754 -74066 -85156 -90964
6682 -90964 -78118 -38335 -16125 -42225 -58870 -57516 -44103 -33311 -19020 -46460 -59640 -65072
6670 -65072 -65362 -71104 -90451 -86830 -92522 -61691 -60194 -75823 -75862 -61657 -59868 -46818 -45324 -53989
6656 -53989 -74175 -65008 -51485 -41374 -40124 -43171 -74698 -62279 -61242 -77996 -34888 -35830 -33181
6643 -33181 -49290 -60223 -58356 -64521 -64485 -58604 -75661 -71844 -74102 -49065 -23929 -32313 -40655 -57382
6629 -57382 -29218 -28828 -47789 -52077 -88168 -73216 -30736 -48200 -96992 -76230 -72385 -93602 -45796
6616 -45796 -62395 -64499 -28375 -48465 -61287 -32904 -31253 -61861 -60768 -48723 -47581 -73340 -75540
6603 -75540 -52054 -42481 -49351 -56357 -39013 -49735 -53196 -48959 -61361 -69666 -59334 -60346 -65230
6590 -65230 -72452 -84878 -64014 -46442 -37905 -55335 -75077 -80321 -75125 -60434 -47553 -73559 -66624
6577 -66624 -66788 -54733 -49150 -47580 -62346 -67948 -54190 -39155 -53612 -35299 -33962 -57993 -80655
6564 -80655 -87392 -55211 -33583 -54091 -67307 -57127 -69465 -66080 -43655 -43222 -50402 -64184 -79566
6551 -79566 -56555 -41199 -63604 -72386 -49581 -50176 -69961 -50099 -45800 -47894 -53201 -83274 -42421
6538 -42421 -32276 -50770 -33068 -36200 -35278 -41658 -53393 -60702 -58955 -46386 -29319 -24528 -27622
6525 -27622 -39044 -60033 -43113 -19115 2148 -13795 -30380 -62480 -50216 -50146 -50415 -38539 -37011
6512 -37011 -20076 -36527 -77627 -85028 -80919 -64453 -64707 -55856 -46988 -44180 -51165 -49760 -36661 -56128
6498 -56128 -80108 -36280 -18408 -41866 -59248 -48542 -47618 -42047 -66488 -52810 -32295 -4778
6486 -4778 -5731 -24166 -27543 -13097 -10194 -29271 -27327 -37356 -36202 -49986 -30116 -19980 -28118
6473 -28118 -25524 -48276 -70604 -38391 -20327 -47985 -75702 -64682 -60473 -44167 -73900 -53268
6461 -53268 -57769 -53038 -59457 -82141 -69608 -69213 -48008 -52072 -34168 -29581 -36364 -34141 -5665 -13877
6447 -13877 -41378 -48661 -49206 -77215 -68727 -37725 -62332 -56886 -78176 -70846 -67315 -57071 -55408
6434 -55408 -38956 -31036 -41520 -46785 -55203 -59697 -39084 -38303 -38087 -33945 -55693 -56272 -59232 -77658
6420 -77658 -70859 -59642 -71761 -68160 -50753 -35659 -47243 -17649 -28474 -50727 -43286 -25063
6408 -25063 -35555 -57832 -58671 -54284 -48231 -43447 -35962 -45234 -45858 -46680 -44701 -61314 -49516 -31034
6394 -31034 -31106 -26702 -37015 -26225 -34513 -54339 -55335 -46624 -28872 -26627 -27814 -41183 -38252 -51913
6380 -51913 -61839 -33396 -35147 -36278 -22530 -28567 -37816 -32562 -1269 949 -35622 -26725 -39416
6367 -39416 -29858 -11358 -15600 -29402 -63537 -40663 -37224 -48514 -59301 -50192 -45079 -34959 -29441
6354 -29441 -34993 -50250 -23199 -9738 -51989 -61304 -57000 -62545 -59078 -59765 -56953 -49908 -51534 -34142
6340 -34142 -55316 -63709 -63847 -45827 -28716 -51857 -64651 -67683 -53609 -25384 -11180 -2325 -39718
6327 -39718 -58389 -64906 -60854 -67740 -57465 -76805 -73432 -48629 -75209 -58121 -31736 -18697 -30902
6314 -30902 -32589 -12325 9096 -14245 -43597 -26514 -19093 -31583 -23930 -26542 -18907 -38298 -64467
6301 -64467 -49184 -55083 -42974 -32991 -29436 -31429 -41123 -39555 -66801 -55605 -55584 -27534 -31818 -30069
6287 -30069 -22384 -31223 -30663 -28624 -20149 -38464 -34799 -67754 -44267 -46621 -42536 -13519 -29979 -56000
6273 -56000 -61511 -19171 -16571 -22991 -55464 -70665 -31035 -50071 -57041 -28209 -41768 -71499 -36072
6260 -36072 -29966 -17400 -46734 -61547 -28193 -36314 -55392 -59360 -69061 -80445 -87519 -62930 -38014
6247 -38014 -58768 -37286 -13330 -31740 -43943 -31786 -16226 -42235 -61964 -36972 -33392 -43902
6235 -43902 -50368 -59033 -43659 -37423 -18153 -1327 -15427 -26387 -38966 -16140 -25395 -20697 -3946
6222 -3946 -24507 -22068 -32599 -21951 -10839 -49113 -31865 -41828 -49115 -27011 -16346 -20527 -30476
6209 -30476 -14865 -8530 -43907 -64605 -60665 -46537 -43249 -42207 -9601 -18802 -37848 -59885 -69755
6196 -69755 -64039 -42673 -36629 -46081 -3906 7593 660 -23756 -36221 -48157 -38191 -32064 -41198
6183 -41198 -40570 -21373 -33836 -33970 -25387 -27625 -35369 -17584 -30056 -22609 -36606 -58522 -69093
6170 -69093 -57588 -22697 -13032 11733 -11023 -31150 -21775 -14778 -9201 926 -32970 -14564 -39115
6157 -39115 -40558 -50458 -61063 -45080 -23823 332 -2588 -16917 -6995 -11277 -34636 -33414 -34621
6144 -34621 -24738 -25627 -19242 -21451 -40845 -41139 -55232 -54004 -24419 3849 25666 -13760 -26791
6131 -26791 -12621 -40076 -61029 -69778 -46868 -44690 -34160 -40553 -26625 -26553 -25254 -33423 -46479
6118 -46479 -36063 -31026 -37900 -36791 -31032 -28566 -32281 -43188 -48272 -66243 -31563 -39003 -60216
6105 -60216 -52904 -33259 -16668 -10128 -968 -18645 -29780 -35785 -25915 -32015 -36657 -34883 -44174 -22615
6091 -22615 -19675 -28826 -31064 -36732 -48258 -22183 -265 -911 -6398 -9061 -36489 -13552 -19892 -33834
6077 -33834 -33257 -22573 -28396 -42351 -34168 -45138 -35575 -16201 -14655 -10157 -20091 -4184 -11840 -36810
6063 -36810 -27376 -983 -2319 -9750 6033 -1745 -12841 -29700 -48836 -33300 -43196 -52937 7223
6050 7223 -1435 -13639 -31195 -12682 -2656 4237 2725 9364 -7947 -30304 -29134 -2299 -20513
6037 -20513 -45274 -26612 -46478 -38792 -26953 -30621 -18523 -5903 -18451 -11197 -54023 -51598 -23278
6024 -23278 -36293 -41853 -27522 -42847 -65739 -75740 -44686 -8867 4169 -13490 -37159 -50352
6012 -50352 -38717 -32037 -36220 -21844 -6963 9038 8858 10738 -17276 -573 -5946 -20760 -22638
5999 -22638 -33309 -39389 -15379 -35518 -37283 -38818 -61534 -44174 -43428 -38184 -24151 -30869 -50517
5986 -50517 -64990 -52123 -51180 -42622 -49566 -40588 -37918 -83261 -70383 -51534 -34863 -52826 -13931
5973 -13931 1939 -22246 -47238 -43340 -36668 -30667 1462 7492 -27207 -11980 -12721 -857 19028
5960 19028 20691 -1879 634 -21128 -26507 -39672 -65981 -36864 -44231 -11485 -20393 -8472 2284
5947 2284 8316 -21889 -22915 -26669 -1640 2714 9323 20083 24348 -4508 5220 2643 -14222 -14426
5933 -14426 -13915 -18145 -7505 12313 -14426 -23097 -20096 -18282 -17133 -27936 3629 9875 -4450
5920 -4450 1275 -15085 11401 -3627 -26970 -24710 -13265 -8666 -10175 -9626 -9472 12274 -8664 -29331
5906 -29331 -32781 -42166 -25592 -23502 -22079 2757 7510 4988 472 14512 20230 -5166 -16932
5893 -16932 -29642 -24165 -26647 13036 19811 14232 -5067 -21962 -38054 -11620 523 16597 5679
5880 5679 -32035 -33835 -25337 -20088 -17518 -35831 -42418 -45270 -20890 -30707 -26386 -14497 -3583 -3320
5866 -3320 -11026 8276 18402 19487 28775 15638 14537 21126 4083 -5346 -573 18308 -8625
5853 -8625 -10060 -8266 -11965 4033 -52 -29957 -31388 -16271 -8196 -14034 -28451 -22254 -36281 -39650
5839 -39650 -36445 -37709 -12622 13617 4693 -1786 -27752 -38576 -4615 -6546 10742 5982 -7996
5826 -7996 -17420 -33080 -21020 -16475 1711 2618 11132 7761 -5435 -11487 -48338 -20823 6053
5813 6053 33877 27700 17644 1153 -27767 -3674 21360 14565 -1441 -25991 -13044 -1567
5801 -1567 35020 17768 -10506 -20554 -27743 -28025 -3134 9517 2894 -37828 -39427 -25624 9657
5788 9657 8144 -5424 -14976 -8761 -12575 -19658 998 -3282 -7378 -26926 -35687 -12297 3644 -15501
5774 -15501 4007 37771 17481 5180 18267 10854 1269 -14349 4487 20311 3436 18578
5762 18578 18095 -24870 1664 10248 17642 39668 31008 18853 16255 -2427 -26545 -42402 -10814
5749 -10814 -11535 -3502 7281 1517 -29301 -13416 16767 16951 -10544 -6090 -4330 22353 28968 19844
5735 19844 45565 19479 -2389 13569 17034 6118 -1716 -11206 -11591 -2709 -5034 19821 18748
5722 18748 13852 10461 37592 47336 42878 33193 9937 54356 27129 -2877 5256 28912 17502
5709 17502 21362 -4579 1589 8448 -1299 15102 33333 26209 22313 30212 20158 -10477 9334
5696 9334 14973 7890 20897 11928 14998 -7601 5489 14102 -3864 -1324 8108 15825 22297 25317
5682 25317 19265 8167 -5193 -12039 -5334 8769 10882 26612 32252 37619 37095 33226 30286 34317
5668 34317 24828 45455 34093 21975 14297 11845 19839 16119 36456 42633 24973 34205 60172
5655 60172 54668 59890 55715 55354 44853 51835 56123 57268 61896 51598 40070 56326 46222 30816
5641 30816 16305 29982 21699 44505 64919 38246 20362 27514 55509 30540 16677 26886
5629 26886 17007 50507 54677 55154 49759 74750 74100 63344 64537 65256 51271 59879 57269 55524
5615 55524 52590 59399 66749 45515 74313 94087 77934 85195 87774 85538 73582 62722 57736
5602 57736 74257 91210 89885 73440 67559 89656 91748 83633 91516 105589 83224 70914 84699
5589 84699 95021 92227 77550 84705 105884 97705 104573 132921 152706 153331 139595 125844 158219
5576 158219 203894 215975 197995 195598 208784 214962 228887 235510 230160 221289 214395 204743 182327
5563 182327 144699 164489 183536 149941 185204 193906 212991 199661 231581 230321 229978 215756
5551 215756 256110 271557 253223 262183 327843 332065 343907 349845 351625 375708 400699 384392
5539 384392 390747 381825 343351 349831 339575 335937 337097 313262 294112 266266 272673 270550 270171
5526 270171 303143 279237 296866 289583 289311 290511 299458 300082 327369 339465 319653 320403 339347
5513 339347 379125 406267 401234 431216 443367 441442 421354 397179 391174 378067 371578 369429 344400
5500 344400 332709 349054 327165 341947 352280 345220 354407 349360 354211 369189 353552 369315
5488 369315 405050 391553 413567 409002 420746 428515 441262 454241 458488 450117 455527 455444 446244
5475 446244 420270 420943 403534 405701 383614 373139 376036 372114 384648 381297 363890 363736 361831
5462 361831 380079 373795 369842 360230 354262 367328 389088 409363 424238 439015 459451 454149 475444
5449 475444 475442 488703 482145 488442 510690 483909 470736 486576 472156 462936 478753 467709 484292
5436 484292 510485 525492 519521 521198 500972 500474 517149 533297 568080 600034 635714 658794
5424 658794 695984 760231 815864 887090 967409 1103995 1217238 1337326 1442974 1510263 1526666
5413 1526666 1439439 1286942 1121455 1010666 918813 854954 875903 857542 838037 842014 828247
5402 828247 842012 867123 900158 931765 978821 1008499 1023515 1069922 1138918 1250489 1351322
5391 1351322 1497733 1641886 1868615 2143408 2452300 2838569 3250637 3618187 3846447 3742847
5381 3742847 3260189 2715200 2261056 1906248 1668966 1490111 1364696 1282811 1234714 1177397
5371 1177397 1130604 1110806 1114945 1106519 1106689 1088425 1114800 1154023 1198935 1267141 1350025 1478394
5359 1478394 1605074 1764469 1967083 2243263 2563927 2898531 3284897 3659957 3868598 3675957
5349 3675957 3147921 2575311 2097513 1737580 1504753 1321736 1180378 1076357 1018614 942143
5339 942143 907162 894573 829133 777820 781318 766298 745307 743540 733825 736666 745033 779787 797683
5326 797683 838495 898547 995972 1100425 1209100 1324477 1450231 1510510 1393873 1221844
5316 1221844 1047687 886369 800325 703220 614343 535095 493813 449982 449739 409835 386547
5305 386547 388628 367748 370109 317902 311179 308345 299002 292482 277559 266640 243653 248019 274252
5292 274252 269322 246277 245855 248172 243987 239892 254651 223193 197459 192249 200440 194948 203681 200531
5278 200531 214746 203777 190647 190307 181554 165728 166471 166134 148531 173160 195201 183091 179191
5265 179191 146831 144333 167700 185012 154559 160620 167364 155616 150640 125641 159094 196228
5253 196228 173055 175325 176502 137716 161846 163442 140634 147267 149324 147872 177324 164412 151748
5240 151748 134770 154128 157609 146036 136540 140838 139838 136879 139511 123006 115041 137885 162371
5227 162371 159782 150101 129564 153981 167355 155496 139093 159107 182544 178450 177783 168393 160595
5214 160595 153444 159488 161564 162135 181684 169354 177625 193992 187351 211520 207057 217539 216791 234644
5200 234644 201890 194449 209105 230356 227010 193020 219459 216287 219291 247813 240865 218819 248737
5187 248737 256142 270005 269300 267609 279852 278578 288717 311487 286074 289184 315872 329190 338673
5174 338673 341052 343803 343929 350599 383045 380281 380464 395370 387438 401791 413537 435869 464271
5161 464271 486083 492788 526784 545644 545152 565782 602239 629394 655700 683555 691237 704193
5149 704193 720154 754970 769836 788147 815791 831111 870169 907517 964805 989841 1038865 1087987
5137 1087987 1160065 1216923 1276319 1361886 1471138 1603268 1796545 2016371 2251321 2556042
5127 2556042 2944214 3387299 3963123 4636607 5314955 6108338 6779276 6767174 5959560 4811216
5117 4811216 3804892 3046556 2492631 2113694 1862386 1648370 1475682 1344375 1232646
5108 1232646 1149239 1067639 984955 921812 880534 815141 774340 722688 710561 676795 650954
5097 650954 636567 613408 617106 613681 604396 570534 566968 584289 582365 579091 555154 551854 547113
5084 547113 534625 543835 556133 564791 556539 557500 575807 590469 589470 611705 613168 623650 655863
5071 655863 679138 706408 733064 764952 816140 847038 870035 939323 1001871 1098646 1159617 1226163
5059 1226163 1300182 1383343 1428196 1430130 1452843 1455474 1405331 1389242 1324911 1250241 1233173 1201210
5047 1201210 1200993 1200927 1215545 1250011 1268873 1318291 1387211 1436380 1465064 1501778 1540514 1587923
5035 1587923 1570894 1549695 1519409 1462562 1421979 1349846 1268392 1240266 1245469 1237997 1268678 1270323
5023 1270323 1290130 1351269 1382456 1458965 1504552 1488186 1469928 1463715 1472977 1419731 1372258 1343111
5011 1343111 1308018 1282015 1283277 1311435 1277559 1267861 1274458 1261349 1264703 1278454 1282196 1296353
4999 1296353 1299305 1286469 1294616 1243735 1201077 1156477 1085575 987114 915698 812259 731373 662323
4987 662323 589090 546071 530953 505704 450650 414963 386072 371268 379177 391345 357157 320072
4975 320072 311261 300721 308900 311206 319628 307811 289908 273702 283733 287742 252304 229981 238597
4962 238597 224131 220309 244542 217654 190599 194901 194614 173483 164654 178711 162260 141399 163375
4949 163375 170768 152008 150389 138417 138908 137376 132746 143627 127031 109353 118548 134425 97102
4936 97102 112164 108932 110743 94869 116748 114774 92256 73303 71935 114900 92888 98523 108773
4923 108773 100706 76585 59536 108378 120518 109285 90522 83482 98291 106462 117217 134810
4911 134810 125506 121803 103234 69802 71506 82460 77221 73019 77131 69714 88255 77176 63171
4898 63171 66604 79961 90692 85611 63999 97413 92877 93615 60555 59728 60965 75839 77191 75792
4884 75792 107444 79220 54513 75312 72806 64504 52698 52468 65905 85762 81894 73583 76703
4871 76703 64857 46012 66882 88313 59763 68269 63930 75646 77508 69391 59587 69871 61798
4858 61798 74544 70497 74889 68143 70116 80601 95941 103326 113733 111339 92200 82208 84903
4845 84903 66931 63407 81881 76061 66176 65392 96243 95061 84239 61128 47243 43703 52329
4832 52329 66989 63126 83947 84637 67102 98993 83968 95311 72786 59619 76557 95742
4820 95742 98673 107025 96095 71495 47912 45256 71752 55333 89609 71460 54552 75298
4808 75298 96604 100197 114691 106483 99723 120425 100684 120881 119900 110047 87304 96643 132397
4795 132397 140511 110709 97877 90425 102256 90772 67089 85308 99784 115822 94964 98042
4783 98042 99291 102469 106602 109336 106529 97815 88808 100988 96299 121015 105728 110508 87317 105201
4769 105201 92690 96475 99526 91569 109445 111284 113500 106097 93787 126977 108908 83472 68277
4756 68277 55452 77730 66284 89145 98061 104985 92430 84690 102584 107445 103461 131806 101929
4743 101929 74955 108740 118970 102918 108927 139425 140178 125651 105755 96683 91590 100812 105195
4730 105195 88505 120607 144379 135896 130653 136372 157562 127569 124748 120659 126228 143215 109869
4717 109869 121998 119330 144364 131810 130598 118279 107304 120112 124051 118191 136531 122424
4705 122424 156229 165843 168818 172082 137101 137504 149425 144794 160672 155645 161114 145110 122174
4692 122174 125797 161729 157345 143366 137315 151754 157653 149792 154211 164645 186859 178357 157797
4679 157797 142723 161383 176264 164753 167925 179045 198139 216262 217416 240409 225284 214647
4667 214647 225996 223422 230028 259046 264688 239010 235541 249334 272410 287352 228192 220099 235578
4654 235578 234171 227452 239345 283521 307707 290774 307309 308674 298747 311433 314645 309306 345094
4641 345094 369252 329853 320607 352955 349327 362374 360434 390445 369906 352026 354823 352464 363692
4628 363692 385932 388208 371685 408313 403220 389726 405185 412956 415883 457098 452877 464565 486020
4615 486020 471915 455346 453053 465010 483656 500372 489684 524149 528005 525140 511796 507816
4603 507816 514259 527986 521621 501120 508756 503279 491433 478330 490214 509695 534422 540326 546426
4590 546426 517175 496840 504157 519023 517641 524278 531617 553058 553067 532716 541016 551583 521825
4577 521825 533558 554558 534080 538184 513698 528309 538109 540984 533151 525844 530894 520473 533458
4564 533458 541385 551087 540040 519699 531567 557158 588359 603891 607430 586464 579709 596851
4552 596851 595916 609452 618348 610854 631232 627647 617617 617716 650510 671147 696822 682857 666168
4539 666168 678280 673360 669113 675309 669034 693218 718171 707960 700224 702363 718385 723509 741509
4526 741509 766524 777660 757852 783806 793160 791705 810479 824753 820213 852431 868550 867411
4514 867411 884428 911957 938018 931729 928715 952390 957776 961500 970432 966418 975773 1003113 989510
4501 989510 991460 1014006 1023514 1018693 1018622 1041131 1074212 1083522 1105539 1112848 1121314 1158598 1174532
4488 1174532 1183675 1210891 1213708 1236178 1239487 1250489 1280411 1290319 1314861 1334570 1357663 1362797
4476 1362797 1343511 1375914 1393369 1394364 1427241 1449156 1482567 1486239 1496118 1518875 1532922 1567643
4464 1567643 1578358 1596432 1620931 1632912 1627322 1632593 1638628 1666221 1690038 1705790 1736602 1719678
4452 1719678 1762634 1823748 1843365 1828661 1890563 1929106 1946494 1948550 1985968 2014683 2044699 2090535
4440 2090535 2120897 2133786 2177791 2204120 2227732 2280525 2306940 2335831 2374890 2399197 2427784
4429 2427784 2466716 2492230 2538023 2587420 2650028 2692591 2743812 2783831 2838445 2889766 2922983
4418 2922983 2961037 3040500 3100033 3184786 3264904 3309891 3386387 3471582 3558269 3641453 3710050
4407 3710050 3774373 3845115 3924611 4032352 4140589 4227482 4311971 4433646 4558584 4671916
4397 4671916 4780087 4870515 4976558 5109242 5237043 5356849 5544116 5676962 5811444 5977940
4387 5977940 6117095 6290698 6462466 6633094 6813479 7019760 7210561 7395483 7611932 7847638
4377 7847638 8087985 8340703 8616204 8927668 9226205 9541303 9868122 10252242 10660209 11115469
4367 11115469 11596858 12082889 12610814 13211607 13899236 14645972 15389734 16195462 17074000
4358 17074000 17869150 18533387 19158073 19776666 20392360 21023302 21594610 22098352 22517450
4349 22517450 22902900 23205866 23449297 23686188 23888063 24079631 24299589 24564602 24868406
4340 24868406 25274342 25758049 26312962 27007929 27806365 28716711 29671188 30741181 31867931
4331 31867931 32944316 33964756 34881666 35655256 36225238 36566398 36681518 36657924 36527581
4322 36527581 36265343 35963807 35652752 35405577 35177946 35043209 35025073 35056892 35137109 35217163
4312 35217163 35280489 35202884 35003903 34623831 34178175 33640988 33165782 32784277 32517792 32453165
4302 32453165 32532927 32714588 32975409 33323895 33645086 33928612 34099524 34128800 33951903 33605978
4292 33605978 33067615 32361806 31486560 30479660 29341834 28131174 26847453 25489841 24169710
4283 24169710 22848443 21637330 20464276 19396156 18434636 17602363 16869295 16190356 15561702
4274 15561702 14962420 14466701 14059095 13641558 13283757 13003760 12756616 12540290 12314718
4265 12314718 12173891 12060665 11950894 11867262 11805130 11715203 11661068 11576126 11548465 11545731 11560298
4254 11560298 11625227 11703161 11753717 11810485 11874392 11940660 11997170 12080510 12144076 12284081 12434930
4243 12434930 12611913 12837657 13031894 13286403 13530800 13823630 14147498 14465247 14777787
4234 14777787 15128337 15509623 15888206 16316326 16796259 17320774 17854757 18425542 19061507
4225 19061507 19748808 20466756 21209069 22018674 22919516 23877017 24887030 26015427 27153675
4216 27153675 28365965 29609538 30812777 31982860 33083334 34053371 34905890 35578484 36116663
4207 36116663 36501265 36673068 36672448 36539946 36283584 35950734 35592695 35263312 34961030 34717924
4197 34717924 34545804 34449595 34428301 34450119 34486056 34559983 34639974 34710441 34748690 34793345 34826287
4186 34826287 34860349 34906419 34968871 35081081 35234101 35405006 35606310 35814972 35946897 36037999
4176 36037999 35995590 35839169 35548551 34999591 34262228 33326825 32201116 31070906 29880600
4167 29880600 28716257 27639905 26653298 25788205 25010422 24313037 23753580 23250279 22823913
4158 22823913 22460240 22099255 21766797 21458180 21173473 20848435 20472942 20036132 19599937
4149 19599937 19153288 18613991 18024276 17450724 16819438 16192580 15551238 14913648 14312522
4140 14312522 13782435 13236175 12762522 12296563 11825115 11390569 10937115 10524287 10164358
4131 10164358 9802373 9494424 9239649 8987284 8765398 8545972 8381483 8192891 8001826
4122 8001826 7873868 7776303 7671167 7572580 7519867 7499575 7470328 7481974 7474995 7482028 7485570 7458123
4110 7458123 7403807 7386794 7358110 7364410 7361388 7358208 7281218 7165573 7055775 6974401 6847427
4099 6847427 6717045 6542372 6409190 6357900 6303140 6258093 6243161 6222531 6223221 6197666 6187603
4088 6187603 6176142 6135593 6097160 6070245 6084763 6070117 6094265 6122323 6128745 6110695 6079753 6034810
4076 6034810 5999218 5907326 5813779 5704413 5640521 5575271 5488354 5429046 5393084 5383873 5377916 5341730
4064 5341730 5350414 5372793 5420277 5421273 5438452 5476571 5527779 5571240 5626743 5663010 5698762 5731170
4052 5731170 5774946 5812755 5839164 5899359 5991249 6105750 6196727 6293286 6388415 6524446 6657986
4041 6657986 6810601 6975117 7133008 7338976 7552146 7822670 8076390 8313758 8593121 8890278
4031 8890278 9194888 9468740 9738833 9979522 10234340 10485627 10715941 10879735 10990615 11086424
4021 11086424 11257902 11451017 11755322 12169490 12645971 13243695 13951960 14851667 15924372
4012 15924372 17204547 18698953 20311188 21974774 23366216 24160516 24252315 23713562 22584217
4003 22584217 21016506 19399073 18025307 16966110 16160903 15585340 15159038 14866878 14702156
3994 14702156 14604397 14552905 14542901 14580622 14662424 14736806 14860451 15021782 15234905 15465024
3984 15465024 15709713 16008426 16355428 16739951 17141173 17568658 18039938 18535051 19062976
3975 19062976 19629145 20249493 20863477 21493447 22159669 22823682 23545057 24347163 25181449
3966 25181449 26066851 27007337 28024352 29135876 30335929 31650397 33051870 34577001
3958 34577001 36315153 38205284 40322509 42711361 45344868 48303130 51660161 55472318
3950 55472318 59775944 64654508 70134222 76230050 82866562 90083658 97978888 106514410
3942 106514410 115414002 124318068 132451207 138752256 141998972 141078283 135680074 126732198
3934 126732198 115890998 104705147 94150006 84716609 76421979 69139655 62730627 57090513
3926 57090513 52143767 47799525 44027957 40707942 37767341 35113020 32759520 30611038
3918 30611038 28669152 26936987 25375560 23983312 22702808 21545883 20524275 19540364
3910 19540364 18684809 17897094 17165575 16516992 15923916 15401483 14872680 14363188 13921533
3901 13921533 13493693 13069711 12702196 12327744 12012666 11650993 11345494 11042890 10776581
3892 10776581 10508818 10243844 10000095 9792831 9605963 9428393 9290651 9187446 9093776 9017446
3882 9017446 8951058 8819262 8668855 8495494 8271809 8033409 7812624 7593553 7426580 7238179
3872 7238179 7087645 6945640 6817851 6682559 6572539 6471445 6370913 6233271 6118736 6022009
3862 6022009 5910395 5808161 5706743 5604702 5496995 5423053 5321725 5225284 5181601 5176023
3852 5176023 5145956 5125100 5094983 5064473 5038247 4988173 4985718 4970024 4964482 4977064 4973468 4903876
3840 4903876 4789805 4701272 4610514 4538362 4444945 4369266 4327866 4280116 4266917 4266755 4260906 4257066
3828 4257066 4282277 4295497 4327704 4350950 4398687 4457179 4542882 4661536 4767757 4870066 5012000
3817 5012000 5187436 5347585 5519876 5702659 5795994 5828231 5794445 5632762 5424536 5199262
3807 5199262 4966355 4727656 4505145 4361168 4180447 3992642 3808420 3642081 3483872 3342318
3797 3342318 3241825 3150895 3082833 3017905 2954999 2929130 2909448 2880910 2880305 2861609 2856557 2842225
3785 2842225 2827538 2809624 2812567 2796939 2780693 2789858 2764277 2672950 2614354 2552377 2491133 2422250
3773 2422250 2359076 2276240 2244584 2185107 2136532 2102112 2059520 2037336 1993285 1962486 1950814
3762 1950814 1944260 1944536 1924633 1918154 1913698 1918108 1922542 1904399 1853559 1803302 1758106 1723792 1692308
3749 1692308 1652589 1620671 1587335 1566151 1554704 1540554 1519150 1528486 1531589 1553624 1556663 1550291
3737 1550291 1506007 1472244 1458516 1449347 1414733 1394975 1381083 1380856 1371276 1400448 1379818 1386486
3725 1386486 1371495 1374343 1410408 1405524 1451561 1409207 1367893 1350745 1348963 1339396 1313882 1318016
3713 1318016 1294709 1261225 1224273 1198233 1170050 1172577 1162509 1146476 1109535 1079143 1063870 1048303
3701 1048303 1047018 1018546 1008310 1048869 1041975 1050734 1082309 1057935 1040562 1030761 1037339 1013041
3689 1013041 993618 982697 993567 1016324 997034 985729 1012477 1002664 976851 957167 927109 913531
3677 913531 909144 910013 896569 871587 872849 869779 853480 844572 835674 832738 834278 855085 881682
3664 881682 877681 920938 925503 938029 988435 1014757 1050772 1075442 1104405 1152689 1169550 1231583
3652 1231583 1243751 1252712 1274401 1300633 1329608 1340880 1322806 1301604 1266206 1205565 1110112 1069539
3640 1069539 1032413 990149 962733 910040 888683 845313 796184 763087 752772 770268 772217 735109
3628 735109 729237 716479 704736 695443 693455 672712 663944 688555 656778 648213 671395 689829 691880
3615 691880 658474 648174 659952 681311 672099 671074 664110 658272 661453 674497 684968 696143 692054
3602 692054 697411 671596 648833 652272 643128 628719 624835 633163 631971 634858 642854 632691 636357
3589 636357 655601 673988 672968 649928 648989 679346 670069 696561 670808 648344 662626 660544 686050
3576 686050 703936 717744 738921 725328 722859 741424 731843 732106 724697 745299 754909 765018 774125
3563 774125 761127 756401 766354 779651 796645 828136 844817 885895 909650 934122 979331 1003345
3551 1003345 1014507 1010837 1024951 1074852 1091925 1055471 1043085 1010153 986552 998869 966473 971776
3539 971776 986748 1017673 1015214 1026472 1028302 1015455 1010979 1012100 1035648 1066490 1070769 1089656 1113481
3526 1113481 1107038 1135959 1109012 1129989 1158967 1161532 1167473 1220369 1213703 1215759 1276153 1308122
3514 1308122 1345014 1389960 1429084 1445369 1497769 1573432 1602818 1645451 1717571 1797029 1872708
3503 1872708 1959404 2060661 2215772 2327270 2498036 2722002 2888439 3068202 3219823 3308951
3493 3308951 3363828 3338245 3241521 3121672 2949116 2771114 2626102 2464824 2310013 2199337
3483 2199337 2134479 2044284 1958355 1899144 1837582 1745629 1688248 1665379 1606514 1553754 1506267
3472 1506267 1474343 1459777 1452817 1422409 1408058 1398833 1388491 1399878 1407485 1397220 1410703 1423002
3460 1423002 1442661 1447712 1439188 1461683 1494756 1523953 1536349 1548715 1560655 1563513 1549879 1545572
3448 1545572 1590815 1613335 1622396 1663595 1661702 1660905 1657738 1680547 1688265 1698720 1711523 1695312 1715240
3435 1715240 1736389 1722156 1744377 1758259 1797521 1839478 1854066 1911611 1967881 2023840 2074909
3424 2074909 2099338 2081226 2079147 2072853 2045714 2048106 2025427 2003705 2019051 2021160 2031936 2061971
3412 2061971 2099584 2132104 2188599 2236967 2291211 2356453 2403422 2427782 2467898 2534874 2592716
3401 2592716 2623828 2668129 2736867 2782038 2792655 2830582 2840337 2880242 2925558 2961735 2994181 3034830
3389 3034830 3081832 3106724 3161334 3203239 3247470 3283653 3301651 3340113 3420916 3494706 3521767
3378 3521767 3573846 3619322 3662594 3706769 3779342 3790542 3834794 3874023 3933827 3994585 4095586
3367 4095586 4175396 4205292 4290753 4373032 4428117 4485751 4552369 4627303 4693786 4775063 4878227
3356 4878227 4927085 5012265 5082350 5164723 5253476 5356483 5433418 5486279 5557569 5645409 5705996
3345 5705996 5807057 5913813 6003988 6093800 6205473 6304058 6405973 6527804 6648427 6767997
3335 6767997 6866636 7018146 7161338 7322922 7475186 7609198 7732371 7850134 7972992 8093774
3325 8093774 8224747 8385119 8561913 8732294 8909293 9060480 9255204 9431128 9618079 9807831
3315 9807831 10043725 10299179 10551846 10839785 11153127 11517526 11887720 12262323 12684790 13128090
3305 13128090 13601000 14086733 14541663 15015404 15487591 15921214 16351234 16802549 17220629
3296 17220629 17649963 18134705 18652593 19192118 19748157 20309827 20903700 21501880 22111208
3287 22111208 22733567 23300394 23835879 24399380 25025780 25702424 26476615 27341715 28319351
3278 28319351 29396734 30597456 31959914 33510592 35316401 37363019 39635314 42274601
3270 42274601 45304036 48851494 53034333 57943363 63425949 68946005 73727581 76314379
3262 76314379 75282613 71153140 65924988 61175978 57590448 55072096 53422912 52434859
3254 52434859 51938650 51854312 52146015 52773473 53680200 54812320 56038090 57257768 58350966
3245 58350966 59363151 60369727 61456980 62644078 64044827 65595210 67289754 69171611
3237 69171611 71232007 73485456 75900860 78524754 81334932 84396656 87736721 91401855
3229 91401855 95487718 100024312 105038558 110630637 116953268 124159903 132469660 141914325
3221 141914325 152713925 165204724 179604871 196250778 215466105 237736211 263373327
3214 263373327 292747782 326074810 362996629 402081466 440995439 476068786 501042919
3207 501042919 506840040 487551184 447125016 396577872 346292651 301897025 264888513
3200 264888513 234733271 210181286 189939254 172864462 157894942 144305918 131974017
3193 131974017 120777575 110659617 101538994 93441618 86333489 80055670 74573336 69748076
3185 69748076 65551298 61864112 58555362 55578641 52857437 50390222 48155151 46122394
3177 46122394 44286915 42606047 41057185 39611895 38302148 37130948 36141111 35341975
3169 35341975 34631141 34027545 33474475 32861180 31873872 30512553 29048492 27669810 26482830
3160 26482830 25424214 24478261 23619714 22847473 22128776 21501416 20937633 20401732 19852421
3151 19852421 19335510 18839679 18351372 17875315 17470193 17137349 16836285 16605691 16433574
3142 16433574 16308100 16286884 16321479 16461468 16762145 17184223 17623538 18198404 18536632 17891389
3132 17891389 16454109 14918875 13671838 12733363 12043527 11527694 11109798 10775022 10484290
3123 10484290 10278603 10066518 9802448 9598896 9369049 9182315 9005334 8803755 8643587
3114 8643587 8520122 8411546 8319521 8286309 8303316 8389418 8505268 8703492 8948604 9236427
3104 9236427 9558499 9899867 10022593 9743180 9158457 8466351 7884897 7460375 7068766 6785283
3094 6785283 6538928 6304916 6102050 5915379 5751402 5564787 5405585 5251619 5111727 4973742
3084 4973742 4880675 4777827 4639366 4518829 4470443 4392924 4322818 4256372 4186032 4111471 4022772
3073 4022772 3963610 3909389 3882142 3807924 3742261 3690224 3607019 3557711 3513626 3445400 3361747
3062 3361747 3305647 3266670 3200041 3159833 3114203 3056338 3035821 3012150 2939122 2840557 2764834
3051 2764834 2723990 2680126 2635062 2590006 2567025 2555110 2499659 2488553 2461864 2430476 2377085
3040 2377085 2335317 2290967 2237936 2215256 2190968 2183800 2183067 2190589 2156675 2141230 2133579 2056369
3028 2056369 2043961 2019772 1980111 1929244 1931253 1911044 1926378 1899703 1856205 1854485 1829889 1810510
3016 1810510 1774054 1781044 1801015 1815765 1796921 1807334 1800832 1799698 1800509 1801740 1816817 1835649 1831767
3003 1831767 1834763 1832968 1802884 1750161 1735919 1719836 1676329 1603136 1519285 1488661 1453464 1443446
2991 1443446 1438960 1422119 1426033 1431414 1447341 1480675 1508150 1530097 1548877 1536945 1560953 1566300
2979 1566300 1579074 1574634 1566828 1551312 1528100 1548310 1536807 1530387 1506666 1480907 1439481 1412529
2967 1412529 1391831 1358779 1365122 1374249 1387616 1356178 1358394 1351075 1312703 1320370 1361223 1374284
2955 1374284 1376206 1390510 1392308 1375452 1390159 1378368 1417499 1446210 1440174 1442564 1429161 1401867
2943 1401867 1403920 1434214 1429140 1431367 1460363 1455086 1459971 1524784 1556270 1592548 1639988 1686793
2931 1686793 1761003 1819740 1914802 2048910 2178169 2323449 2464531 2629232 2786347 2958143
2921 2958143 3084105 3171351 3204660 3205641 3100493 2968265 2801473 2613230 2416692 2242323
2911 2242323 2077796 1946199 1825314 1727575 1629272 1557480 1470929 1403771 1339965 1263321 1210986
2900 1210986 1169174 1134018 1083268 1069086 1045045 1022051 1003606 989537 979095 955397 922269
2889 922269 905959 877178 859555 864480 879416 879444 870059 876933 902766 886486 868645 893177 895142
2876 895142 860771 876154 843754 830289 832177 797699 728337 738462 719400 681030 712177 718374
2864 718374 700414 683010 654481 648221 672542 674822 683830 682464 674807 664877 680624 673512 637337
2851 637337 629896 651811 661168 638086 643489 600775 559167 548352 547090 549038 544561 541771 543546
2838 543546 524769 534452 543541 556937 559150 531647 519901 515315 521742 496503 507701 498738 491241
2825 491241 483309 491813 479340 478302 481819 484868 471993 477673 481966 474334 458836 451081 459623 436859
2811 436859 439541 429070 417731 400807 422350 453622 441938 430993 439303 444592 428857 423700
2799 423700 406573 385196 368842 366469 388948 400354 387842 387966 371230 374520 383682 362072 400121
2786 400121 385037 344942 335820 351334 333328 318565 328516 337313 296512 268223 297506 300754
2774 300754 301437 271106 277327 295864 281336 277321 284434 253328 263923 277027 280271 257505 255501
2761 255501 262511 259351 269136 251941 224333 239007 268068 270669 287482 279798 278020 275780 278519
2748 278519 289134 283284 271850 259654 263094 261038 267618 275837 242304 232570 208779 237885 246136
2735 246136 224527 222366 237037 227806 220333 212629 224842 237461 211663 211216 204913 185174 170351
2722 170351 189891 182348 168329 158902 155282 145748 155100 150201 155568 151749 160352 162358 161071 151492
2708 151492 147186 157076 138293 151191 149548 166661 157428 134996 172982 173077 176888 147723 158810
2695 158810 171705 168018 177233 177186 188639 178068 153302 145122 161657 148429 142916 128315 139496
2682 139496 156783 151040 148139 146573 150588 132091 122039 115656 148804 170608 160899 167889 151771
2669 151771 168525 143105 162872 154021 167317 158167 143402 164841 181230 185941 161722 156106
2657 156106 174413 158043 152136 151695 141763 169579 151246 120796 130243 142649 106117 115203 103270
2644 103270 115153 120830 89475 88604 111107 104175 99304 112202 109970 121302 118001 122526 108672
2631 108672 92234 118998 130964 118535 131729 110543 120251 114262 134366 143352 122868 118325
2619 118325 108154 132836 136395 109905 93417 97325 120452 115594 116101 159342 137600 101080 70888
2606 70888 83000 78090 103305 108589 116856 88119 115435 128447 107604 105732 76388 89461 109017
2593 109017 121930 100945 90078 120407 131976 140853 122793 104654 105130 110557 101144 104407 97582
2580 97582 86731 107939 112262 108448 90883 91747 80770 68874 78562 85542 86716 82226 75568 45408
2566 45408 61494 83382 79387 83840 90122 89574 59776 52336 65151 77206 75954 74092 50309
2553 50309 73147 52366 42533 49717 43388 78085 110593 74808 63457 55751 57894 55768 49650
2540 49650 60998 63566 69666 46642 27231 55986 54082 42633 53773 44133 30473 39509 24005
2527 24005 26403 36358 55089 63884 40286 34836 29615 52826 61460 59559 57569 46538 40069 54877
2513 54877 45372 10626 19143 17087 12151 1300 10857 35231 32095 32295 30282 47116 49540 43945
2499 43945 31927 26938 9739 8128 -14463 20081 32584 39005 26430 12743 36999 33987 44351
2486 44351 12969 -1164 14461 37102 45744 54379 41410 33128 25671 23516 28174 11824 20254
2473 20254 23444 47145 27273 17923 9220 28121 28112 22830 62065 38180 24732 16461 -2504 -14667
2459 -14667 12077 20372 4375 27268 42823 35095 26837 22471 47596 24338 -2667 -8585 1512
2446 1512 -24928 -23122 1085 22623 19299 19701 8883 18977 15428 14869 10095 15781 17769 8403
2432 8403 31340 4290 -21632 -21548 11532 -6329 984 16955 20397 9029 35693 52625 50650
2419 50650 39587 28834 22872 27643 35098 24164 2788 2360 22711 16310 13349 30959 12561
2406 12561 15107 37660 25924 18713 13619 5647 -9896 1133 26741 23091 16390 15839 10147 10896
2392 10896 11063 12060 12636 21279 9591 10872 19179 -7587 -2808 -6884 -5048 -2422 16382 7327 -10920
2377 -10920 10526 17950 16407 19581 24140 21940 9613 32447 16313 20690 13841 31258 53191
2364 53191 55760 17328 25975 46378 14776 3770 32788 32360 573 5678 -1706 18490 28520
2351 28520 51047 49138 39298 31044 45246 51553 51562 28081 32755 4900 -4663 -10022 5214 19221
2337 19221 21543 27210 37424 26938 23451 25285 7401 32362 33431 29409 38142 1460 -4067
2324 -4067 -1325 -4664 -23886 -18671 5104 7753 9650 2284 8022 -19495 -26261 5113 -10800 2950
2310 2950 6172 -7645 497 -3665 -11290 -22494 -7207 23001 16531 31086 27982 8553 12795
2297 12795 16441 25192 -1066 -8275 -32918 -3833 3783 -4699 -12843 -20781 10310 -24181 -12335
2284 -12335 -20266 -26516 -9183 2744 -3058 16775 7178 -11706 -1023 -17787 -15848 -10916 -19924
2271 -19924 -7299 5924 22265 23443 4163 15441 37558 41015 14213 -107 8848 -11723
2259 -11723 -9030 -5276 -11762 1677 7259 -1062 -5590 8575 9101 193 -5456 7770 -5378 -18787
2245 -18787 -15229 -3226 3011 -331 -13511 -2982 -16998 -11912 -27249 -887 -2815 13505 -19879
2232 -19879 -19336 -20623 -33381 -15145 -4103 -34923 -44887 -14539 18131 36277 8001 4061 -8484
2219 -8484 -12342 12084 26480 4787 -2813 -3847 -20347 -2584 -17478 -27624 -24892 4523 -4386
2206 -4386 -7116 -15130 -9567 10543 2939 25425 892 3331 17736 55212 45012 33502 14791
2193 14791 -12769 1557 9586 -13181 -21417 -9217 148 3668 8015 33266 33112 6949 35278
2180 35278 48561 66188 48065 64976 43606 44117 53055 51010 72726 49846 27970 27266 33331
2167 33331 35732 55526 70639 48576 58983 47082 47691 64878 58359 74938 75223 71074 80200
2154 80200 95550 108244 87585 95461 120225 98989 80346 93593 100507 112974 104066 116844
2142 116844 130287 117482 124943 145645 169039 138292 146228 170680 191783 181274 185957 184683
2130 184683 185750 212848 227104 215426 241102 247232 251757 277641 258268 294080 336392 363929
2118 363929 382394 366638 364080 361114 362670 393046 375243 417439 438881 456259 476150 498117
2106 498117 532288 524409 576601 629164 679058 692982 737835 786894 863518 933220 955139 1025687
2094 1025687 1097424 1184804 1280282 1459387 1647771 1905481 2206124 2607601 3163582 3978830
2084 3978830 4850128 5787815 6496570 5926914 4611230 3378969 2595069 2076755 1710385
2075 1710385 1458170 1250841 1115571 995367 895491 842630 788824 742790 710926 643829 579177
2064 579177 522378 488089 431217 400484 370034 341048 301540 268421 260428 271186 270614 257441
2052 257441 236944 206696 206058 188091 196755 179914 158274 167640 148350 150730 145712 141559 139048
2039 139048 145330 141712 135555 127389 95299 91059 98644 98429 101167 73357 77268 77040 80700 82676
2025 82676 96629 99729 92832 81665 66932 65776 49646 68378 65613 63114 52158 47614 40209
2012 40209 44517 48344 34029 17678 18666 28812 34367 21024 -9829 776 14240 5334 3795
1999 3795 18246 20525 14656 9480 21600 15669 25396 47321 19683 13922 2525 -8725 -25990
1986 -25990 -46071 -26882 -6844 -815 1543 9006 -3555 8210 8846 -12136 -17187 -25210 -40941
1973 -40941 -5888 -12459 -14613 -14831 -39875 -39885 -45333 -44501 -23279 11486 11028 2408 -11253 -266
1959 -266 -11551 -918 1743 6856 -21850 -38047 -34244 -25025 -4489 -175 -26505 -8964 15457
1946 15457 -1237 -27958 -28871 -36346 -35455 -25450 -30227 -52364 -66533 -45640 -35970 -28548 -31634 -45500
1932 -45500 -36231 -21499 -31301 -29014 -5751 -7484 -37823 -35739 -22355 -4089 -46460 -44671 -49192
1919 -49192 -30371 -7465 -4705 -21902 -27820 -43639 -52170 -41424 -19243 -16212 -28009 -34039 -37578
1906 -37578 -7858 7054 -11355 -19199 -20751 -2292 -13551 -14361 -12226 -29379 -58499 -43789 -19513
1893 -19513 -20762 -41332 -44351 -50059 -29932 -14351 -22506 -30703 -34360 -35449 -31350 -37611 -33687 -1515
1879 -1515 -14159 -13278 -41619 -35078 -30901 -40771 -62049 -47605 -37289 -48628 -72583 -51352 -44479
1866 -44479 -30173 -43654 -49249 -31642 -52316 -56185 -30708 -27104 -32352 -38434 -50431 -52405 -65251
1853 -65251 -77226 -65279 -50546 -52623 -40603 -24523 -11181 -14935 -45423 -50241 -39195 -41373 -23685
1840 -23685 -32480 -42676 -42158 -46702 -45009 -34376 -34609 -35559 -38187 -55516 -44308 -39686 -31201 -15312
1826 -15312 -27513 -35941 -10245 -26694 -22553 -23260 -24958 -32743 -51615 -24631 -27590 -18514 -12660 -26374
1812 -26374 -15867 -33425 -42042 -31735 -30488 -42235 -27963 -25841 -26801 -53624 -52545 -43522 -13546
1799 -13546 -21889 -51982 -20929 -27543 -34776 -59472 -69283 -83500 -81751 -70617 -45379 -46493 -62930
1786 -62930 -38394 -40517 -42072 -31503 -39078 -39744 -43699 -50838 -51152 -39334 -34190 -36571 -43423 -52610
1772 -52610 -82131 -97984 -79070 -90689 -55938 -45537 -36288 -21006 -24081 -33475 -27866 -36576 -42613
1759 -42613 -17145 -48060 -34051 -37575 -38442 -60059 -62314 -57357 -49029 -55814 -63186 -63796 -69566 -80720
1745 -80720 -63158 -66556 -36108 -62200 -64994 -31622 -47032 -61795 -61909 -52726 -48988 -39258 -45701
1732 -45701 -41916 -65220 -70273 -37066 -44586 -44895 -42152 -33870 -56079 -21127 -19562 -34074 -32571 -53638
1718 -53638 -57245 -40358 -62176 -66641 -60702 -60037 -38979 -34357 -36477 -50172 -62960 -58930 -34298
1705 -34298 -21987 -30176 -54914 -54289 -43576 -49419 -58245 -34887 -55549 -58291 -66137 -39775 -40120 -72619
1691 -72619 -58352 -59046 -84505 -79058 -90579 -46908 -26938 -14386 -57270 -42698 -43338 -44105 -65356
1678 -65356 -67995 -65182 -56560 -64926 -53406 -34492 -60000 -67268 -46700 -62124 -61618 -58365 -67309 -68840
1664 -68840 -57312 -62750 -40550 -29332 -75390 -62280 -74219 -70212 -63720 -29535 -27308 -54093 -34560
1651 -34560 -33215 -33351 -30347 -32727 -19735 -19953 -5523 -17440 -51526 -52901 -55680 -60222 -35907 -39685
1637 -39685 -48110 -44452 -44773 -64590 -54073 -43783 -46606 -59007 -55314 -63571 -60985 -63999 -70898 -87487
1623 -87487 -84765 -73005 -90018 -65111 -22050 -42396 -19402 -34146 -64951 -57595 -55141 -72753
1611 -72753 -78932 -73192 -41845 -38281 -46481 -68869 -77123 -62611 -47741 -76255 -66108 -75630 -74212
1598 -74212 -58542 -61333 -54281 -45851 -67027 -83737 -65763 -81613 -69423 -62969 -50819 -60018 -57418
1585 -57418 -68511 -66976 -60595 -48644 -54979 -70988 -63651 -59204 -55302 -21752 -31620 -48565 -62177
1572 -62177 -53051 -53479 -52699 -62149 -61213 -49079 -56848 -56321 -71727 -71501 -70751 -80053 -69847 -62294 -57549
1557 -57549 -75232 -53135 -46439 -65339 -70034 -71735 -59853 -58317 -52094 -40370 -72968 -45066 -53517
1544 -53517 -67624 -57882 -64075 -51448 -59249 -49696 -71345 -79148 -69143 -48822 -41247 -61666 -68996
1531 -68996 -60594 -49433 -50217 -71096 -60081 -49009 -50356 -41181 -48140 -49001 -46796 -70629 -60094 -58885
1517 -58885 -31777 -15412 -20291 -27098 -33817 -73598 -66962 -68853 -53699 -39455 -46694 -50721 -58405
1504 -58405 -63245 -36411 -49908 -61643 -42638 -45658 -58510 -69997 -61469 -6541 5745 -21526
1492 -21526 -35593 -61809 -58479 -74030 -67180 -71400 -55142 -62352 -63118 -32161 -32253 -35228 -30964 -39163
1478 -39163 -49511 -23312 10622 -37366 -33127 -27622 -42318 -21144 -50425 -49040 -43289 -56887 -53362
1465 -53362 -72963 -52370 -37935 -35427 -42225 -26386 -27649 -64321 -85078 -79730 -47129 -56468 -77261
1452 -77261 -90677 -79889 -66948 -73017 -44806 -47901 -53292 -57992 -93958 -67944 -57064 -55511 -41665
1439 -41665 -42866 -54385 -51749 -28851 -75757 -70412 -56945 -49631 -52741 -46773 -54597 -67054 -73891
1426 -73891 -51798 -40969 -46154 -44171 -63032 -58353 -49344 -48551 -26552 -37824 -46564 -30847 -25360
1413 -25360 -52079 -68857 -59338 -59803 -47567 -56004 -45942 -39653 -47636 -61535 -51450 -44168 -39933
1400 -39933 -23606 -46608 -66942 -61901 -34693 -54136 -51606 -60044 -67187 -55708 -41927 -28731 -52492
1387 -52492 -54713 -34566 -36699 -30623 -38464 -65769 -33257 -54024 -53954 -38944 -50610 -74817 -69017
1374 -69017 -85418 -66542 -76902 -70316 -52524 -58962 -44590 -71320 -70909 -55793 -62709 -62274 -48120
1361 -48120 -39280 -43837 -33328 -26011 -28372 -42646 -60972 -62981 -51755 -58724 -48780 -48201 -55700 -65159
1347 -65159 -77448 -52737 -56527 -56672 -50783 -53550 -54611 -65513 -65246 -48884 -36000 -45522 -58913 -63696
1333 -63696 -69029 -79483 -68518 -67263 -54516 -42286 -46874 -55321 -48204 -34694 -31060 -48546 -36163
1320 -36163 -58853 -76125 -57019 -38660 -50644 -49241 -50679 -53601 -37435 -29785 -36503 -39794 -19497
1307 -19497 -32475 -38198 -31808 -44321 -25102 -28930 -54956 -81699 -74604 -29664 -52451 -85511 -55068
1294 -55068 -54646 -40077 -61712 -55979 -36046 -53981 -40923 -31714 -40148 -70922 -69463 -61934 -52887
1281 -52887 -45437 -42037 -38142 -32912 -55299 -73584 -60344 -35584 -7582 -27511 -42780 -30895 -19928
1268 -19928 -20911 -31819 -50919 -62255 -57542 -55380 -44705 -75756 -58623 -63309 -47481 -46087 -54198
1255 -54198 -44938 -25958 -21774 -33542 -67881 -37733 -39029 -30765 -66805 -66025 -68489 -79095 -51177
1242 -51177 -42375 -30369 -24077 -25719 -50225 -86153 -78404 -61518 -53007 -56153 -21737 -16413 6640
1229 6640 -14049 -34762 -28660 -39207 -30486 -48699 -44418 -48884 -40954 -41366 -44243 -34192 -31692 -43644
1215 -43644 -47082 -41982 -29909 -10858 -24435 -19354 -38430 -60407 -62653 -40615 -44356 -35862 -18407
1202 -18407 -37311 -62246 -69154 -65891 -61847 -62492 -88706 -53759 -57588 -45223 -56369 -68142 -56557
1189 -56557 -37590 -55206 -42665 -47346 -47593 -34673 -27830 -34265 -37166 -62737 -55757 -59357 -58207 -68147
1175 -68147 -77614 -52450 -48738 -64380 -40036 -53192 -73749 -51835 -48576 -62273 -50267 -24450
1163 -24450 -54720 -47163 -18364 -34952 -51412 -44701 -35449 -23882 -21132 -60709 -65822 -49186 -31305
1150 -31305 -539 -9991 -44172 -52783 -56549 -27786 -31173 -61566 -49199 -44635 -56338 -44112 -52851
1137 -52851 -49010 -44508 -21234 -11596 -10149 -17895 -41400 -42130 -53243 -38154 -59692 -55110 -28119
1124 -28119 -33342 -52379 -42799 -53497 -67837 -40388 -46295 -34639 -36441 -31659 -51683 -38456 -43600
1111 -43600 -35893 -29989 -28211 -7438 12243 -6808 -26103 -36886 -14105 -31862 -38710 -19676 -9797
1098 -9797 -22162 -21338 4315 -24316 -11951 -4186 -13453 -52040 -48376 -51879 -32087 -38952 -28420
1085 -28420 -32375 -28089 -12177 -30754 -30021 -33473 -44657 -22690 -14813 2365 -7004 -63493 -84136
1072 -84136 -30824 -9772 414 -8237 -732 -1222 -50792 -55853 -17921 -29323 -25388 -19071 -23531
1059 -23531 -29688 -39424 -26314 -29016 -17929 -15449 -36690 -52406 -56940 -24657 -51540 -44444 -6025
1046 -6025 -19715 -23187 -19314 -42131 -20052 -57161 -28838 -18958 -35642 -17073 2711 -18954 -28259
1033 -28259 -43338 -36762 -32501 -30305 -13781 -28081 -32927 -42565 -28577 -21421 -23117 -29571 -36775 -41370
1019 -41370 -24823 -37308 -25237 -39817 -36505 -36218 -9000 16112 -24 -41141 -38698 -15481 -31861
1006 -31861 -25352 -5110 -12517 -46412 -19771 -30633 -30554 -24892 -42486 -28968 -19929 -23018 -17040 -14260
992 -14260 -36017 -20153 -21693 3930 -1388 -7562 -27569 -12073 -18182 -37694 -56213 -35937 -38777
979 -38777 -47569 -46060 -31831 -20380 -2548 4271 -2370 -6409 -28322 -31615 -44757 -53231 -16065
966 -16065 -6078 -26237 -30277 -26795 -41602 -38930 -46777 -49026 -50673 -62831 -39425 -23265 -10091
953 -10091 -51870 -48250 -13186 -15263 -9435 -19751 1574 6578 -6170 -10969 -24738 -23270 -36637
940 -36637 -2502 15731 -8303 -27421 -33657 -43929 -44206 -45241 -29594 -31711 -37523 -27694 -14958
927 -14958 -53676 -45254 -40576 -52259 -42357 -59405 -35484 -26015 -12234 -5442 -6639 -15827 -32202
914 -32202 -57441 -35087 -13179 -42903 -24306 5693 26236 19047 -8427 -6889 -20870 -21621 10601
901 10601 -3313 -51201 -33013 -12317 -26088 -35342 -7928 -2443 -6075 -11289 11718 1924 -17404
888 -17404 -7525 -10333 -24412 -29684 -802 -15002 -31710 -11851 -7885 -30806 -20205 -5707 -23276
875 -23276 -26816 -25162 -30129 -7672 -5827 -10565 -4893 -7898 -14746 -11221 -3316 -34859 -38549 -44790
861 -44790 -16135 -2605 2751 -30286 -52013 -9663 5741 -24699 -25430 -31152 -37297 -13732 -32143
848 -32143 -26256 -10124 -39729 -62662 -37387 -20225 -15872 -30278 -15439 -17220 -24796 -41801 -30573
835 -30573 -29459 -17364 -20207 -30684 -12376 -10480 1271 21472 61 8927 -14471 -34617 -47780
822 -47780 -2132 -13901 -32589 -36375 -12403 -22203 -14622 -11019 -15825 -8965 -23597 -18936 -22277 -9970
808 -9970 -17403 6433 -42205 -41918 -7183 -10766 -17679 -14457 -37636 -32242 -12912 -46680 -29469 -33135
794 -33135 -56813 -55216 -25654 1388 14016 -806 -35240 -40454 -34041 -17590 -16179 -11510 -24535
781 -24535 -18723 -24945 -17676 -3023 3311 -20979 -16324 -13766 -15841 -29039 -41478 -11196 2040
768 2040 -4944 -27433 -36581 3377 4141 -12175 -13784 -7268 2717 -19860 -23358 -4937 -6090 -6044 -27653
753 -27653 -25015 -28309 -19361 14936 -17563 -10163 -1524 27350 42313 31826 13836 12118 6663
740 6663 97 -8881 -9194 -34556 -29669 -24713 -19670 6322 -2582 -1771 6470 10471 14320 23307 15246
725 15246 7684 4974 2557 -10063 -13045 -4220 -6047 3297 -8360 -25434 -10526 5616 -6921
712 -6921 4490 -835 -19113 -13430 -3226 9206 -26569 6591 9757 -2041 -5790 16551 -5974
699 -5974 -37165 -8593 -17524 -14956 18486 11651 15223 -4155 20685 3441 -65 4550 -887 7252
685 7252 -164 -18781 -30250 -2883 4658 -10436 -22126 -15897 2743 8723 34048 8513 2644
672 2644 4587 -635 -12802 7334 29149 10394 8616 23453 39725 44182 30261 23993 36226
659 36226 7877 -276 23463 229 100 3698 6693 18954 17134 10405 -11621 4251 9166 23600
645 23600 16388 12423 -20209 -818 -3080 7415 10161 -193 18072 22595 8328 4491 -5181
632 -5181 6989 18941 27764 20867 29462 -923 903 4965 -4640 4952 23396 25002 16445 8141
618 8141 -59 13300 24595 14622 -6950 1671 3996 -1090 4578 4302 29174 28377 14708 26829
604 26829 28114 21332 11874 4921 14611 28041 29394 23892 10226 32105 728 10869 19698 23977
590 23977 37987 14912 19588 7488 22174 29091 12257 24285 23089 11762 24266 28166 34496
577 34496 29326 14769 -3937 6079 1998 -5110 16411 19271 26282 43751 19263 16418 36060
564 36060 26597 37064 36896 27708 27791 2213 -11436 24578 20121 24403 26179 46803 33253 5214
550 5214 27316 43914 39481 30242 28737 12939 23123 -6066 -1963 8795 35368 31694 28981
537 28981 16487 14565 28436 22551 16056 1373 -3061 -15422 -6353 14474 32990 18659 11191
524 11191 31863 26096 38591 44103 31461 35767 23505 10185 7125 23617 20449 29206 67253
511 67253 63165 44053 28022 32413 19925 15223 36119 43602 45726 32812 33319 17341 27581
498 27581 10930 34438 21605 28398 36566 21942 26074 37311 69706 62816 42702 49295 50004
485 50004 41624 50724 51117 43408 52181 23953 15700 -8163 38717 37935 7548 35893 36447 19033
471 19033 33897 33540 43064 40930 57736 46846 65747 48935 45569 66976 19772 20456 36077
458 36077 64719 59400 50149 59922 52121 35080 17519 14918 28376 56913 62227 37914 33961
445 33961 33771 41097 29411 45728 42590 52910 53717 44904 40159 22214 27166 37700 45812 71408
431 71408 71809 56338 45336 44317 31215 18246 44447 58764 32180 15883 19485 34671 32630
418 32630 34445 32544 49330 51875 40150 67088 56365 42766 67699 99844 91199 67659 74941
405 74941 53981 52061 37586 48528 50807 34231 41614 39266 36223 32461 31568 28976 13823 33255
391 33255 53173 49168 59626 56392 64242 62434 56430 70486 64765 63203 40318 44371 52311 46863
377 46863 62046 92731 83634 59945 70407 58945 60878 91449 64062 54087 54072 79955 67829
364 67829 54865 36392 48498 50780 46336 63397 55226 52987 71975 70094 42515 37388 54876
351 54876 52211 66387 74211 62186 42485 51094 61098 71203 64909 30722 36816 60426 58984
338 58984 62284 68483 36177 36959 49715 61919 61408 55403 73163 58446 46747 39845 33372 46234
324 46234 47863 61994 49130 52998 38539 32033 10814 38230 64895 82016 89991 81875 59285
311 59285 61191 78750 55408 53999 75573 84717 101507 106752 104349 95113 96913 78461 71793 57011
297 57011 69269 86480 65805 52739 61006 38941 59718 86725 92064 89261 63084 70104 78422
284 78422 83655 104048 91061 72475 58451 53842 60246 81364 75456 48082 44013 71485 73135
271 73135 67884 79305 64282 66928 75714 89393 92138 81356 74777 46674 53587 75578 76663
258 76663 62787 69450 76459 76520 85923 55575 61303 79756 72113 77624 82166 81449 84144 76441 70745
243 70745 61298 53700 50389 72114 77857 66316 65018 34425 52401 96242 92749 81078 65754
230 65754 81293 87489 66430 67973 42648 46222 49687 62719 54711 61429 69354 71601 82946 70891
216 70891 88469 66033 69588 66352 47351 11629 46042 86455 91144 73153 74073 95007 81672
203 81672 66459 75863 60728 57582 57685 59836 67406 56452 61304 60308 44427 29667 45996 62216
189 62216 84243 71719 52870 41974 48425 45817 54927 71919 49997 39680 46511 64903 60103
176 60103 60604 76014 63253 85821 65437 51846 65859 51256 39896 40458 65207 75422 55235
163 55235 26125 37664 28139 39490 4088 41629 63896 41316 26791 64457 81847 77488
151 77488 62743 42666 45071 60913 54171 37516 37902 50177 51112 46075 48965 24897 44048 34867
137 34867 37242 48091 29783 38397 34973 45750 41301 20172 16625 23058 24363 31382 37073 18986
123 18986 25802 21584 26840 542 9550 43449 15231 5472 30955 29481 32201 13881 27801
110 27801 18375 -5863 -4327 2358 22203 31625 21271 34322 2517 -1928 7153 3671 7984 5085
96 5085 15788 8719 18808 3069 9119 20810 14488 1318 -10717 -14801 -19637 -16662 -5191 4619
82 4619 -18292 -15551 -8782 -7609 -27759 -24739 -18275 -31393 -30539 -24670 -9852 -18907 -19659 -16635 -5245
67 -5245 -15897 -28731 -31749 -28527 -16653 -14747 -19343 -20500 -40965 -41710 -28438 -40317 -20126 -19740
53 -19740 -47403 -60680 -48687 -47781 -40966 -44574 -43180 -34820 -23491 -35240 -39541 -50926 -59046 -73091
39 -73091 -58322 -37423 -56537 -49255 -58821 -58999 -62011 -54972 -62238 -72040 -88588 -66979 -60601 -74780
25 -74780 -73269 -62239 -62387 -88433 -96999 -71666 -68797 -99826 -110282 -110563 -90368 -92056 -81275 -93843
11 -93843 -93518 -91331 -99660 -95458 -90673 -106253 -118120 -116833 -108138 -89872 -111813
0 -111813
$$ Imaginary data points
##PAGE= N=2
##DATA TABLE= (X++(I..I)), XYDATA
16383 -735207 -726206 -721611 -721480 -686315 -674934 -671739 -646945 -643836 -640026 -624401 -609787 -574241 -568848
16370 -568848 -566895 -545380 -533089 -509086 -500670 -485180 -486152 -470031 -433205 -431447 -440718 -425169 -406724
16357 -406724 -394850 -378975 -355678 -341347 -351515 -338299 -300945 -286575 -273257 -269193 -251282 -253532
16345 -253532 -233768 -225890 -201458 -192128 -179463 -171759 -159677 -145194 -136253 -113704 -88159 -82613
16333 -82613 -83607 -62375 -69047 -66986 -49972 -37765 -32277 -14360 26071 46357 48212 63826 57248
16320 57248 57052 80076 89347 112665 122975 132847 151865 167982 159562 171616 198906 211078 211949
16307 211949 206766 235817 249792 258968 265465 261730 276433 298045 309927 319749 353052 388184
16295 388184 374478 358474 361378 367377 393804 398993 412584 410379 432452 459937 447655 468753
16283 468753 467564 475894 485771 508910 516812 519869 526594 529519 577044 597861 582269 590780 596870
16270 596870 611852 608430 613819 625333 632465 633025 652131 661631 655220 674600 687032 678250 695896
16257 695896 718632 739962 715748 719847 758522 761176 740141 744510 770115 763843 775756 792637
16245 792637 803712 828299 864976 852509 853474 858625 856709 870924 868560 882753 906556 900560 896626
16232 896626 912355 907352 916586 902831 930582 945563 941160 937253 964905 952663 970160 989471
16220 989471 973100 997531 988704 974121 999079 1009444 1005735 993464 1008468 997095 1016714 1038627
16208 1038627 1060576 1079720 1051876 1061902 1061717 1071468 1074839 1079426 1058100 1075971 1099685 1094185
16196 1094185 1078702 1100670 1118658 1118333 1094047 1092635 1103027 1139355 1138327 1133351 1126594 1143483
16184 1143483 1144892 1145760 1176032 1161624 1158397 1178833 1191556 1170772 1188398 1192568 1204170 1216803
16172 1216803 1225424 1206930 1186162 1201410 1206463 1198468 1191067 1201210 1187690 1202730 1220483 1242525
16160 1242525 1257586 1234566 1273693 1270079 1265254 1246081 1236651 1235234 1232437 1238498 1235367 1266639 1295056
16147 1295056 1295742 1284594 1252887 1256861 1287741 1268823 1264784 1271752 1280586 1289319 1268605 1280624 1290404
16134 1290404 1283902 1311187 1316556 1316790 1312469 1333090 1313825 1302415 1342708 1336491 1312003 1328322
16122 1328322 1323434 1331014 1310576 1306735 1321800 1341878 1339328 1338764 1336496 1319329 1316643 1333184 1338742
16109 1338742 1353600 1337416 1319178 1309465 1326214 1367631 1373832 1368922 1360221 1358919 1356605 1341400
16097 1341400 1377043 1358580 1339241 1322428 1337302 1359200 1375175 1374906 1346372 1369952 1366350 1362117
16085 1362117 1350462 1369339 1392051 1363513 1381225 1393768 1373901 1380630 1374036 1379069 1386542 1399801
16073 1399801 1384813 1393116 1384327 1383028 1356524 1343654 1372539 1371140 1377438 1385126 1373687 1360522
16061 1360522 1361781 1339212 1335664 1338449 1336887 1362004 1351426 1372082 1348739 1365837 1377862 1362008
16049 1362008 1380155 1384955 1398834 1380605 1357430 1374529 1378477 1389463 1385196 1386986 1398726 1385548
16037 1385548 1380795 1406802 1412464 1406677 1387273 1382570 1395751 1378776 1376792 1408490 1416812 1392393
16025 1392393 1394048 1383970 1393213 1397786 1385452 1407319 1398797 1387113 1391574 1402373 1426882 1412421
16013 1412421 1411570 1432439 1418755 1406573 1396502 1383964 1377279 1369423 1399247 1413942 1394749 1417322
16001 1417322 1419211 1394944 1380400 1376382 1377640 1396315 1429008 1422109 1414749 1410507 1406438 1405380 1402527
15988 1402527 1420284 1413154 1410531 1434700 1426979 1400612 1425369 1426913 1391046 1405164 1409887 1424162
15976 1424162 1410760 1381265 1419506 1425114 1419668 1405641 1397974 1392752 1405206 1378436 1390952 1395288
15964 1395288 1387311 1400363 1424767 1418587 1405869 1421397 1413988 1411119 1406742 1407940 1398279 1423111 1434346
15951 1434346 1412408 1405632 1423187 1408718 1420737 1429624 1425054 1441265 1448308 1433602 1427447 1420680
15939 1420680 1405061 1398694 1422697 1411270 1409804 1408173 1378721 1402804 1394309 1393570 1418197 1400064
15927 1400064 1427470 1432460 1424331 1426982 1432844 1423384 1426890 1442380 1418965 1415331 1428537 1433495 1423919
15914 1423919 1427077 1439461 1432250 1424600 1422653 1416735 1412234 1426534 1432429 1431484 1418195 1413547 1411290
15901 1411290 1386632 1378814 1385154 1404039 1454977 1456476 1420228 1404983 1398944 1429153 1451020 1441183
15889 1441183 1447447 1427567 1425239 1436372 1429391 1411507 1422936 1401115 1417880 1426693 1411666 1414432
15877 1414432 1429707 1441481 1419468 1404116 1404093 1394366 1421599 1439779 1430846 1413222 1415178 1413746 1402842
15864 1402842 1427707 1452561 1448743 1441546 1435767 1428394 1426300 1424273 1443855 1446614 1456390 1442413 1434171
15851 1434171 1438153 1428442 1428925 1426081 1421563 1411802 1404783 1429335 1447879 1433183 1416165 1427008 1429384
15838 1429384 1430892 1436366 1381756 1390152 1413804 1437226 1417917 1414969 1403263 1423438 1471155 1447346
15826 1447346 1448770 1428565 1420588 1422224 1426093 1432263 1439879 1441291 1449412 1426442 1408565 1411956 1443455
15813 1443455 1444743 1443494 1437504 1451095 1435606 1464576 1471382 1457739 1448266 1457247 1453926 1446720 1422511
15800 1422511 1437200 1431812 1404082 1422800 1437164 1444152 1426597 1412427 1445064 1463024 1480583 1452226
15788 1452226 1418733 1431011 1442122 1418532 1424528 1432670 1444922 1445248 1429973 1429403 1439688 1447431 1437181
15775 1437181 1433867 1446236 1444796 1436674 1452772 1433543 1449134 1467856 1465725 1460925 1469937 1441588
15763 1441588 1407674 1430187 1443569 1447659 1440829 1431107 1450539 1458149 1454726 1441722 1438607 1434560 1417675
15750 1417675 1450838 1458328 1454580 1468117 1447393 1440990 1462270 1461212 1457815 1440542 1436750 1437057 1455071
15737 1455071 1443154 1439900 1451111 1429982 1424217 1438542 1434324 1449977 1458268 1438031 1456682 1449859
15725 1449859 1462246 1441555 1434156 1446249 1455590 1457396 1449849 1451089 1468871 1446491 1452069 1443767 1448547
15712 1448547 1454712 1453213 1426264 1461510 1483600 1463249 1435700 1436000 1438962 1449569 1443408 1450385 1450883
15699 1450883 1468256 1473772 1475843 1480419 1484736 1476759 1452007 1440259 1444105 1429980 1426287 1446176 1472653
15686 1472653 1496939 1494339 1469593 1485646 1489560 1458940 1452697 1447540 1461654 1475016 1473891 1468856
15674 1468856 1479260 1458767 1453558 1457901 1441250 1453008 1467745 1466132 1467193 1453833 1471633 1467058
15662 1467058 1469240 1473205 1479238 1491775 1497327 1484414 1450290 1437015 1449126 1459421 1448183 1451267
15650 1451267 1476695 1489323 1482216 1470602 1467387 1459469 1458398 1456354 1464785 1470376 1479859 1468565 1452552
15637 1452552 1462057 1463039 1444082 1464396 1503476 1485642 1451655 1464690 1448887 1474163 1490405 1479439
15625 1479439 1476004 1491276 1485754 1487193 1510809 1473299 1464541 1478934 1464370 1448121 1456516 1460039
15613 1460039 1468739 1472061 1440573 1466704 1481105 1468630 1473372 1480547 1467715 1454608 1453803 1459644 1506090
15600 1506090 1516499 1487153 1484417 1508977 1508954 1469642 1492886 1505743 1478175 1485011 1503761 1513332
15588 1513332 1493368 1451059 1446559 1453935 1453526 1460715 1488069 1486074 1475668 1472731 1471605 1484998 1499363
15575 1499363 1496971 1474234 1480628 1488011 1490031 1489481 1506606 1494230 1495716 1505234 1486916 1518296 1509877
15562 1509877 1497469 1498513 1481971 1484859 1471854 1469219 1476952 1456225 1466048 1465548 1483696 1469700 1477645
15549 1477645 1490030 1485546 1480156 1466247 1492947 1506354 1499928 1490648 1475325 1468333 1477768 1479250 1495431
15536 1495431 1509980 1500810 1510427 1521006 1509294 1508095 1496365 1510371 1492602 1491472 1514510 1510506
15524 1510506 1507671 1501447 1479422 1507169 1529230 1519932 1500682 1522951 1527397 1533848 1511806 1512467 1517115
15511 1517115 1514954 1515457 1527982 1528602 1530783 1528511 1499735 1494661 1504587 1524798 1501281 1500535 1498775 1500969
15497 1500969 1501223 1520296 1503893 1498374 1529488 1509178 1494690 1488788 1493240 1499139 1515509 1507829 1510873
15484 1510873 1521289 1500015 1493370 1486089 1484279 1499402 1500539 1494560 1521849 1491370 1480576 1502756
15472 1502756 1502473 1490005 1488379 1518331 1516458 1521498 1508204 1517068 1522250 1535162 1529771 1522526 1508571
15459 1508571 1509412 1499939 1499499 1499833 1485124 1498329 1483937 1483587 1501076 1534636 1513510 1491222 1498820
15446 1498820 1533324 1532991 1523387 1518634 1519454 1505048 1507398 1493311 1507064 1525219 1496243 1500185 1512591
15433 1512591 1520560 1531698 1513253 1491592 1490158 1470205 1482331 1501108 1511860 1515920 1521512 1500574
15421 1500574 1493443 1478019 1496292 1500591 1513511 1517708 1521976 1522709 1515900 1496404 1502986 1542945 1512483
15408 1512483 1495886 1468500 1481747 1503489 1512383 1527099 1537023 1546292 1548951 1560456 1560001 1544297
15396 1544297 1528495 1549746 1540831 1519859 1533991 1531949 1529687 1528196 1484704 1483804 1500573 1542364
15384 1542364 1557939 1549645 1554770 1531087 1523351 1526881 1527665 1518175 1514556 1483679 1509410 1513295 1518379
15371 1518379 1509823 1537079 1548514 1513051 1499507 1489228 1507413 1513507 1521431 1510924 1491899 1494217
15359 1494217 1512620 1531857 1549191 1534661 1523645 1531715 1518223 1534575 1532520 1538815 1514519 1534250
15347 1534250 1534512 1538376 1536027 1540026 1560920 1545693 1532042 1536672 1525771 1543000 1546189 1538344 1537284
15334 1537284 1540206 1563462 1554228 1548786 1543104 1534017 1532271 1522084 1531347 1530854 1527514 1527737 1514360 1529426
15320 1529426 1514567 1513684 1514689 1516828 1535625 1551238 1533379 1539254 1528857 1543245 1532687 1501753
15308 1501753 1512331 1522729 1536113 1522458 1529840 1560576 1547090 1551561 1557435 1539418 1531454 1543058
15296 1543058 1558841 1553284 1536367 1524326 1510960 1548713 1540709 1556412 1570815 1543114 1529408 1534390
15284 1534390 1547751 1556135 1540415 1537015 1552876 1551058 1539573 1542139 1561747 1572689 1588042 1564749
15272 1564749 1562648 1570722 1558272 1568466 1559084 1574480 1559968 1563762 1556030 1549255 1541693 1537844 1561103
15259 1561103 1562109 1567184 1537269 1519667 1531531 1520806 1518628 1542982 1585385 1575110 1543675 1553081
15247 1553081 1549585 1542565 1553513 1566622 1549232 1554790 1558957 1576024 1561742 1547798 1540930 1551017
15235 1551017 1524528 1547508 1568978 1591675 1587540 1575708 1572664 1590841 1576495 1542612 1565677 1605345
15223 1605345 1579614 1551556 1554591 1548224 1578945 1564831 1577866 1569379 1570774 1573872 1584747 1579988
15211 1579988 1562691 1572070 1567392 1544920 1557573 1576365 1583130 1564681 1574770 1566719 1583791 1568937
15199 1568937 1529920 1539563 1572630 1572760 1572892 1575542 1557645 1555017 1545985 1576850 1577854 1560652 1576602
15186 1576602 1560519 1569522 1587179 1545055 1550414 1550848 1542361 1542795 1569891 1589027 1581475 1567390 1562620
15173 1562620 1557661 1544859 1568737 1586669 1571179 1580726 1587424 1558542 1559034 1555976 1556403 1556856 1579943
15160 1579943 1575844 1543848 1566008 1553083 1566265 1579676 1591473 1583597 1582721 1578846 1578352 1568506 1594367
15147 1594367 1603766 1562639 1570074 1566877 1567967 1597277 1607095 1610298 1606728 1578786 1571325 1569857 1563633
15134 1563633 1577744 1591754 1572589 1586955 1595667 1612978 1607723 1612900 1588899 1567981 1586509 1575739
15122 1575739 1573501 1569129 1563154 1563019 1584964 1572498 1567548 1569165 1592457 1591723 1611838 1597631 1560398
15109 1560398 1568873 1586278 1590828 1576824 1597170 1626229 1615825 1607314 1573615 1557310 1573811 1575718
15097 1575718 1599515 1586427 1599255 1602848 1579054 1589097 1589545 1585886 1604835 1611917 1575210 1567861
15085 1567861 1596587 1593613 1593002 1586376 1586456 1579788 1575755 1569187 1586689 1594703 1597009 1604536 1600966 1598144
15071 1598144 1594889 1594442 1586392 1585926 1598373 1601625 1611851 1604327 1588264 1588472 1595000 1599269 1579527 1588883
15057 1588883 1582070 1560158 1582728 1601428 1608453 1618218 1621111 1586367 1576787 1594411 1614844 1599232
15045 1599232 1602506 1612534 1607742 1616398 1608019 1606629 1603055 1609260 1599995 1593818 1614281 1609537 1589195
15032 1589195 1586046 1632596 1627376 1625125 1639407 1619900 1612607 1588500 1580315 1608026 1609374 1613578 1623856
15019 1623856 1612483 1627952 1624899 1614342 1598571 1614099 1590702 1587433 1612955 1621278 1618682 1613788
15007 1613788 1593111 1584058 1584950 1601078 1618412 1615366 1611705 1606171 1590352 1596446 1617161 1604115 1609835
14994 1609835 1597401 1584858 1590432 1598776 1603026 1622077 1632787 1637990 1636918 1609547 1597308 1595859
14982 1595859 1609629 1630484 1618377 1639061 1621765 1619311 1616094 1588684 1595886 1610482 1621426 1615139
14970 1615139 1632529 1646196 1625677 1605381 1614656 1627508 1606310 1590181 1603421 1583687 1602861
14959 1602861 1599338 1620308 1611921 1618247 1644978 1659789 1630273 1629280 1648928 1648408 1640086 1627316 1611235
14946 1611235 1614140 1641603 1627757 1611718 1604984 1604305 1604267 1635002 1620231 1613609 1603838 1608461 1610542
14933 1610542 1598408 1610481 1610071 1611992 1632684 1623893 1647612 1644748 1636101 1646428 1668167 1650100
14921 1650100 1595932 1620296 1617139 1616848 1621243 1611818 1629700 1620835 1634070 1637681 1622269 1617492 1611228
14908 1611228 1613271 1599623 1620159 1633925 1637427 1648724 1607430 1617986 1634892 1669588 1644671 1628805
14896 1628805 1639311 1620802 1638118 1653721 1656279 1642180 1651343 1633845 1632160 1634140 1612343 1647888
14884 1647888 1653907 1618610 1642382 1675610 1658379 1638941 1632701 1633531 1656169 1651610 1644711 1685291
14872 1685291 1649616 1620273 1639420 1633454 1637125 1654667 1630670 1615533 1619759 1607952 1632568 1647067
14860 1647067 1650088 1658160 1663814 1660384 1636494 1630719 1636739 1621254 1636535 1651665 1659659 1657272 1674875
14847 1674875 1666907 1664452 1677706 1668399 1659642 1665996 1634998 1632594 1664822 1677201 1655347 1646493 1655319
14834 1655319 1667810 1658086 1667740 1691332 1656237 1627386 1652395 1666057 1644711 1631563 1641987 1664339
14822 1664339 1659500 1657374 1668766 1671011 1646423 1621041 1642366 1629913 1645354 1677510 1665389 1662219
14810 1662219 1679007 1674080 1683818 1650501 1681869 1701310 1694739 1713063 1673685 1656806 1652450 1657895
14798 1657895 1650588 1640928 1656063 1670389 1646492 1673082 1679719 1668050 1662623 1676950 1667882 1670424
14786 1670424 1687075 1683070 1661381 1659192 1637652 1649853 1675575 1652953 1664894 1633412 1651737 1683426
14774 1683426 1689132 1687855 1669595 1680412 1699052 1684136 1671390 1690571 1677314 1676396 1663035 1675284
14762 1675284 1680184 1671327 1656616 1663219 1678666 1674557 1686004 1683310 1670394 1680001 1651846 1652040 1655416
14749 1655416 1669495 1683424 1674883 1697904 1699739 1673234 1702303 1702792 1686026 1684746 1676578 1678027 1664265
14736 1664265 1682199 1688804 1697461 1690913 1704997 1686567 1677802 1665220 1663173 1669877 1676408 1679240 1664082
14723 1664082 1668437 1677926 1674727 1702634 1711271 1691862 1714572 1685748 1666961 1683364 1688346 1679302
14711 1679302 1678196 1689249 1702274 1696322 1720787 1721385 1711926 1709371 1689412 1685150 1699454 1703536 1714917
14698 1714917 1688977 1664112 1664075 1659656 1678880 1669584 1682396 1696251 1713309 1694094 1675705 1689895
14686 1689895 1686501 1697700 1700910 1698221 1725341 1721932 1687339 1682400 1708096 1718457 1700478 1700053 1712344
14673 1712344 1696012 1667647 1704660 1749909 1712125 1684988 1708794 1690308 1695527 1696967 1695474 1694319
14661 1694319 1705138 1742536 1737580 1720044 1694896 1684275 1701970 1724539 1717749 1705809 1709450 1692091
14649 1692091 1666136 1706056 1720810 1732548 1724425 1714313 1727183 1737933 1737070 1715332 1682599 1682874
14637 1682874 1688508 1712273 1722327 1722938 1710644 1711813 1720182 1708192 1711409 1701909 1725583 1705965 1692983
14624 1692983 1723677 1730774 1739930 1734127 1723847 1709820 1696012 1700783 1706298 1712364 1718338 1722771 1732375
14611 1732375 1725683 1717250 1712455 1700692 1733722 1728112 1728410 1741967 1739402 1748809 1720597 1716666 1722284
14598 1722284 1738705 1726852 1702883 1697679 1718181 1742685 1729268 1727299 1728681 1764909 1761625 1746806
14586 1746806 1725092 1711880 1708028 1709753 1742713 1763602 1760041 1758200 1752992 1748626 1734052 1738960 1741236
14573 1741236 1734988 1733567 1710711 1732800 1721217 1721277 1724234 1728030 1722941 1720535 1736555 1723274 1729243
14560 1729243 1727176 1706827 1719019 1726407 1721198 1707593 1734662 1746053 1770014 1750734 1719062 1727233
14548 1727233 1714941 1733219 1756046 1739159 1740448 1746893 1749502 1763119 1753885 1758291 1762326 1749661
14536 1749661 1731343 1729733 1724264 1704021 1722786 1725839 1713090 1703016 1710031 1738467 1758666 1749233
14524 1749233 1735586 1755784 1731240 1730202 1724184 1739025 1722762 1735608 1721667 1753596 1755087 1752221
14512 1752221 1743735 1734053 1737075 1716452 1716841 1714312 1734268 1762575 1760189 1755000 1724346 1735206 1757395
14499 1757395 1754626 1762773 1769476 1774236 1770974 1750545 1760656 1771065 1764669 1768887 1749130 1756446 1774082
14486 1774082 1754238 1746413 1758516 1766654 1755371 1730853 1728687 1747788 1751629 1739741 1756798 1742537
14474 1742537 1763911 1767847 1751434 1768167 1738656 1761195 1758536 1746324 1740245 1722200 1766583 1769742
14462 1769742 1771882 1781637 1778793 1723197 1757344 1746043 1717437 1727555 1718771 1725012 1762171 1749283
14450 1749283 1720305 1752700 1759540 1751789 1758846 1734001 1738685 1750723 1749713 1751918 1770593 1760428
14438 1760428 1754240 1752443 1772393 1773304 1762601 1791266 1818197 1810246 1774440 1766092 1786101 1769615
14426 1769615 1773079 1783169 1782886 1793220 1786482 1786573 1790914 1777851 1800514 1790746 1804646 1776215 1747854
14413 1747854 1762039 1768957 1768766 1762621 1777370 1789038 1749184 1759715 1757134 1721318 1763740 1779251
14401 1779251 1768245 1737084 1767083 1773512 1775827 1776323 1783206 1788564 1793168 1793875 1787237 1790169 1795307 1786059
14387 1786059 1819192 1815830 1799059 1779181 1763289 1757848 1787977 1789011 1773124 1762711 1774944 1770304
14375 1770304 1774606 1776401 1771539 1766530 1784261 1779525 1789974 1789727 1791129 1793581 1802259 1815017 1806930
14362 1806930 1811877 1803594 1782102 1799482 1814526 1797697 1803840 1789079 1788340 1803153 1792811 1773240
14350 1773240 1807537 1814851 1817796 1804574 1812570 1826617 1819206 1804234 1803527 1826372 1813073 1774485
14338 1774485 1799275 1809235 1809552 1810273 1830529 1819593 1804065 1795154 1804010 1814386 1808209 1791623 1800862
14325 1800862 1844218 1815094 1820923 1833931 1821043 1817468 1810833 1799818 1810978 1797831 1786365 1787507
14313 1787507 1786757 1802817 1822521 1818066 1833128 1819565 1809258 1825297 1816040 1795955 1798962 1809858
14301 1809858 1811619 1811391 1815724 1823923 1828524 1813953 1802682 1828086 1842311 1837496 1820660 1813084 1792805
14288 1792805 1794704 1807015 1829983 1807359 1799408 1803349 1807513 1820771 1836525 1853652 1807485 1819291
14276 1819291 1826354 1814139 1803580 1802586 1813660 1820162 1817967 1819196 1845554 1833950 1834552 1834647 1823215
14263 1823215 1832850 1846209 1821455 1827073 1826775 1826286 1820435 1828552 1825764 1792052 1803404 1817311 1808598
14250 1808598 1824678 1813613 1830666 1835641 1817133 1828793 1826882 1858408 1845774 1841656 1843314 1875553
14238 1875553 1855256 1831574 1823993 1816146 1831405 1843491 1847146 1846920 1866707 1859181 1843315 1823168
14226 1823168 1820154 1831016 1842694 1848031 1850007 1830894 1819157 1833301 1857608 1843591 1827710 1832468
14214 1832468 1844600 1825784 1812377 1849570 1856675 1843445 1850084 1826618 1855981 1885242 1855032 1839250
14202 1839250 1853180 1866863 1862176 1855980 1859919 1873056 1870590 1849726 1823522 1836529 1854193 1863894
14190 1863894 1879836 1882910 1865311 1859295 1864385 1864779 1867838 1836745 1837947 1837351 1814221 1834260 1844633
14177 1844633 1869360 1872212 1837692 1836928 1848714 1861547 1867982 1865975 1869003 1828187 1838421 1866602
14165 1866602 1865875 1845364 1836008 1816809 1873759 1878281 1884466 1887541 1858792 1868976 1859521 1851990 1853045
14152 1853045 1872047 1862674 1843107 1844004 1853214 1844209 1872338 1881696 1867174 1862612 1874462 1883692 1873664
14139 1873664 1863972 1889194 1865525 1852871 1837867 1841805 1880972 1896641 1891962 1866732 1859356 1849922
14127 1849922 1849968 1858996 1868893 1853641 1845034 1876265 1877982 1845284 1846011 1860405 1856559 1878844 1884832
14114 1884832 1883218 1887613 1865526 1867304 1864803 1872653 1882214 1865721 1878972 1873804 1871385 1883634 1892169
14101 1892169 1891318 1872547 1872073 1894514 1895838 1852071 1833054 1841036 1853852 1872780 1880906 1879324 1865676
14088 1865676 1865696 1874377 1894507 1878860 1891700 1885505 1880331 1881616 1891859 1932099 1913748 1887821 1874281
14075 1874281 1888399 1886117 1862606 1839115 1861896 1883438 1889886 1899456 1908748 1886210 1903000 1911193
14063 1911193 1894378 1890420 1881991 1893205 1900705 1916596 1917298 1899167 1883060 1880213 1879693 1874461 1883602
14050 1883602 1897424 1897721 1890106 1881502 1886374 1877983 1888842 1882750 1896710 1880328 1906066 1910957 1903112
14037 1903112 1884732 1872942 1913556 1899727 1915986 1896867 1891216 1884513 1901163 1905855 1895296 1903751
14025 1903751 1892129 1893561 1905343 1905210 1912132 1903207 1892474 1876832 1887887 1908919 1922183 1931500
14013 1931500 1912375 1920885 1915622 1903108 1888204 1885676 1909898 1901469 1888859 1917519 1929844 1921418
14001 1921418 1900073 1888701 1890310 1882581 1879346 1911390 1926416 1902262 1911029 1902814 1907071 1908413 1923105
13988 1923105 1912152 1905899 1916447 1902956 1878096 1899618 1931321 1918792 1905553 1919441 1936565
13977 1936565 1923998 1906880 1901832 1918880 1940178 1948349 1938169 1943835 1945558 1935662 1935275 1946706 1943325
13964 1943325 1951351 1946927 1936858 1928062 1915564 1915900 1935412 1955048 1939627 1897889 1900294 1911372
13952 1911372 1910992 1951451 1971875 1963702 1942141 1914604 1928779 1946363 1928357 1940221 1962198 1938849
13940 1938849 1917396 1940274 1948525 1934770 1936473 1950399 1944812 1903798 1928159 1958293 1955678 1945518
13928 1945518 1931366 1908339 1920385 1929751 1943583 1925006 1936554 1942164 1936382 1957048 1949561 1950093
13916 1950093 1958674 1951740 1965538 1975920 1968076 1934069 1926692 1919381 1914204 1949383 1957358 1950393 1956719
13903 1956719 1954885 1932415 1937402 1908912 1937679 1934810 1929369 1927993 1940360 1926111 1972617 1968081
13891 1968081 1945770 1953084 1957010 1970247 1964097 1966223 1965068 1963240 1941209 1940466 1946199 1942139 1944921
13878 1944921 1958430 1963355 1963561 1973290 1984595 1978421 1982079 1960488 1948833 1966655 1967490 1955753 1961545
13865 1961545 1959253 1977110 1953221 1959872 1973798 1962316 1952219 1946251 1952378 1984184 1972893 1946200
13853 1946200 1970546 1991773 1966911 1949983 1973507 1990384 1958798 1945324 1960492 1997003 2006487
13842 2006487 1984784 1993299 1970128 1967652 1965255 1974824 1960348 1966748 1983031 1980859 1955804 1939682
13830 1939682 1934681 1925520 1963879 1979619 1979614 1954073 1944986 1956403 1967620 1958396 1973017 1992152 2007302
13817 2007302 1997615 1980129 1990158 1986751 1990569 1980190 1981859 1987472 1978893 2000712 1995872 1989504 1978582
13804 1978582 1989567 1983508 1968118 1985236 1985539 1986429 1963341 1975071 1993181 1977210 1980357 2011519
13792 2011519 2004682 2007918 1991017 1953479 1967999 1987136 1964330 1979839 1991924 2008003 2004948 2028935
13780 2028935 2011680 2020492 1996809 2013968 2031766 2018466 2014808 1989899 2005444 1998973 1989326 1980220
13768 1980220 1984588 1977071 2003277 2013929 2021975 2035512 2011762 2003633 2008190 1999791 2029891 2016293
$$ [...]
##END NTUPLES=NMR SPECTRUM
##END=
