##TITLE=1H_EC-3296(IV-31)
 CDCl3
 8 sc, 
 8.6.2023
##JCAMPDX= 6.0         $$ Bruker NMR JCAMP-DX V2.0
##DATA TYPE= NMR SPECTRUM
##DATA CLASS= NTUPLES
##ORIGIN= UXNMR, Bruker Analytische Messtechnik GmbH
##OWNER= root
$$ XWIN-NMR		Version 3.5
$$ Thu Jun  8 14:20:48 2023 Russian Standard Time (UT+4h)  she@DPX200
##.OBSERVE FREQUENCY= 200.13135
##.OBSERVE NUCLEUS= ^1H
##.ACQUISITION MODE= SIMULTANEOUS
##.ACQUISITION SCHEME= undefined
##.AVERAGES= 8
##.DIGITISER RES= 18
##SPECTROMETER/DATA SYSTEM= spect
##.PULSE SEQUENCE= zg30
##.SOLVENT NAME= CDCl3
##.SHIFT REFERENCE= (INTERNAL, CDCl3, 0, 15.7822)
##AUDIT TRAIL= $$ (NUMBER, WHEN, WHO, WHERE, WHAT)
$$ ##TITLE= Audit trail, XWIN-NMR		Version 3.5
$$ ##JCAMPDX= 5.01
$$ ##ORIGIN= Bruker BioSpin GmbH
$$ ##OWNER= she
$$ F:/spectra/data/she/nmr/H-F/1/pdata/1/auditp.txt
$$ ##AUDIT TRAIL=  $$ (NUMBER, WHEN, WHO, WHERE, WHAT)
(   1,<2023-06-08 14:19:15.28 +0400>,<she>,<DPX200>,
      <created by zg, POWCHK disabled, PULCHK disabled
       configuration hash MD5:
       00 E9 B6 7A A2 85 ED C7 34 08 36 98 17 FE 4E 26
       data hash MD5: 16K
       34 83 44 17 C0 1D 33 17 C2 0C D8 D9 4B 47 20 EB>)
(   2,<2023-06-08 14:19:28.14 +0400>,<she>,<DPX200>,
      <Start of raw data processing
       efp BC_mod = 2 LB = 0.24 FT_mod = 6 PKNL = 1 PHC0 = -20268.4 PHC1 = 14.45272 SI = 16K 
       data hash MD5: 16K
       14 01 DB 72 B7 D5 08 C9 2E 70 EF 76 4F 78 73 B2>)
(   3,<2023-06-08 14:19:46.48 +0400>,<she>,<DPX200>,
      <pk PHC0 = 3.508402 PHC1 = -5 
       data hash MD5: 16K
       6F BE 2D 6F 5E 07 DE E4 9F 47 EA 9E 64 78 3C 86>)
(   4,<2023-06-08 14:19:49.56 +0400>,<she>,<DPX200>,
      <abs ABSG = 5 
       data hash MD5: 16K
       27 0D D5 CB 3D C7 53 15 36 48 73 4D 1A FE 26 C4>)
$$ ##END=
$$ 
$$ hash MD5
$$ 03 E4 32 4D EE C5 57 3A AC F5 21 9E FB B6 20 EB
##$RELAX= 
##$RELAX= 
##$RELAX= 
##$RELAX= 
##$RELAX= 
##$RELAX= 
$$ Bruker specific parameters
$$ --------------------------
##$DU= <F:/spectra>
##$EXPNO= 1
##$NAME= <H-F>
##$PROCNO= 1
##$TYPE= <nmr>
##$USER= <she>
##$AMP= (0..31)
100 100 100 100 100 100 100 100 100 100 100 100 100 100 100 100 100 100 
100 100 100 100 100 100 100 100 100 100 100 100 100 100 
##$AQSEQ= 0
##$AQ_mod= 1
##$AUNM= <au_zg>
##$AUTOPOS= <>
##$BF1= 200.13
##$BF2= 200.13
##$BF3= 200.13
##$BF4= 200.13
##$BF5= 200.13
##$BF6= 200.13
##$BF7= 200.13
##$BF8= 200.13
##$BYTORDA= 1
##$CFDGTYP= 0
##$CFRGTYP= 5
##$CHEMSTR= <none>
##$CNST= (0..31)
1 1 145 1 1 1 1 1 1 1 1 1 1 1 1 1 1 1 1 1 1 1 1 1 1 1 1 1 1 1 1 1 
##$CPDPRG= <>
##$CPDPRG1= <>
##$CPDPRG2= <>
##$CPDPRG3= <>
##$CPDPRG4= <mlev>
##$CPDPRG5= <mlev>
##$CPDPRG6= <mlev>
##$CPDPRG7= <mlev>
##$CPDPRG8= <mlev>
##$CPDPRGB= <>
##$CPDPRGT= <>
##$D= (0..31)
0 1.2 0 0 0 0 0 0 0 0.06 0 0.03 0 0 0 0 0.0002 0 0 0 0 0 0 0 0 0 0 0 0 
0 0 0 
##$DATE= 1686219554
##$DBL= (0..7)
120 120 120 120 120 120 120 120 
##$DBP= (0..7)
150 150 150 150 150 150 150 150 
##$DBP07= 0
##$DBPNAM0= <>
##$DBPNAM1= <>
##$DBPNAM2= <>
##$DBPNAM3= <>
##$DBPNAM4= <>
$$ [...]
##$SUBNAM3= <"">
##$SUBNAM4= <"">
##$SUBNAM5= <"">
##$SUBNAM6= <"">
##$SUBNAM7= <"">
##$SUBNAM8= <"">
##$SUBNAM9= <"">
##$SW= 18.05172834244
##$SWIBOX= (0..15)
0 0 2 0 0 0 0 0 0 0 0 0 0 0 0 0 
##$SW_h= 3612.71676300578
##$TD= 16384
##$TD0= 1
##$TE= 0
##$TE2= 300
##$TE3= 300
##$TEG= 300
##$TL= (0..7)
0 120 120 120 120 120 120 120 
##$TP= (0..7)
150 150 150 150 150 150 150 150 
##$TP07= 0
##$TPNAME0= <>
##$TPNAME1= <>
##$TPNAME2= <>
##$TPNAME3= <>
##$TPNAME4= <>
##$TPNAME5= <>
##$TPNAME6= <>
##$TPNAME7= <>
##$TPOAL= (0..7)
0.5 0.5 0.5 0.5 0.5 0.5 0.5 0.5 
##$TPOFFS= (0..7)
0 0 0 0 0 0 0 0 
##$TUNHIN= 0
##$TUNHOUT= 0
##$TUNXOUT= 0
##$USERA1= <user>
##$USERA2= <user>
##$USERA3= <user>
##$USERA4= <user>
##$USERA5= <user>
##$V9= 5
##$VALIST= <valist>
##$VCLIST= <CCCCCCCCCCCCCCC>
##$VD= 0
##$VDLIST= <DDDDDDDDDDDDDDD>
##$VPLIST= <PPPPPPPPPPPPPPP>
##$VTLIST= <TTTTTTTTTTTTTTT>
##$WBST= 1024
##$WBSW= 4
##$XGAIN= (0..3)
0 0 0 0 
##$XL= 0
##$YL= 0
##$YMAX_a= 787826
##$YMIN_a= -916108
##$ZGOPTNS= <>
##$ZL1= 120
##$ZL2= 120
##$ZL3= 120
##$ZL4= 120
##$ABSF1= 15.759
##$ABSF2= -2.29285
##$ABSG= 5
##$ABSL= 3
##$ALPHA= 0
##$AQORDER= 0
##$ASSFAC= 0
##$ASSFACI= 0
##$ASSFACX= 0
##$ASSWID= 0
##$AUNMP= <proc_1d>
##$AZFE= 0.1
##$AZFW= 0.1
##$BCFW= 0
##$BC_mod= 2
##$BYTORDP= 0
##$COROFFS= 0
##$CY= -3
##$DATMOD= 1
##$DC= 0
##$DFILT= <>
##$DTYPP= 0
##$F1P= 0
##$F2P= 0
##$FCOR= 1
##$FTSIZE= 16384
##$FT_mod= 6
##$GAMMA= 0
##$GB= 0
##$INTBC= 1
##$INTSCL= 3.70164e-10
##$ISEN= 128
##$LB= 0.24
##$LEV0= 0
##$LPBIN= 0
##$MAXI= 10000
##$MC2= 0
##$MEAN= 0
##$ME_mod= 0
##$MI= 1.114404
##$NCOEF= 0
##$NC_proc= -3
##$NLEV= 6
##$NOISF1= 3.799351
##$NOISF2= 2.8
##$NSP= 0
##$NTH_PI= 0
##$NZP= 0
##$OFFSET= 15.78215
##$PC= 1
##$PHC0= -20264.89
##$PHC1= 9.45272
##$PH_mod= 1
##$PKNL= yes
##$PPARMOD= 0
##$PSCAL= 0
##$PSIGN= 0
##$REVERSE= no
##$SF= 200.129997876304
##$SI= 16384
##$SIGF1= 3
##$SIGF2= 2
##$SINO= 5.538805
##$SIOLD= 16384
##$SREGLST= <1H.CDCl3>
##$SSB= 0
##$STSI= 16384
##$STSR= 0
##$SW_p= 3612.71676300578
##$SYMM= 0
##$S_DEV= 0
##$TDeff= 16384
##$TDoff= 0
##$TI= <>
##$TILT= no
##$TM1= 0
##$TM2= 0
##$TOPLEV= 0
##$USERP1= <user>
##$USERP2= <user>
##$USERP3= <user>
##$USERP4= <user>
##$USERP5= <user>
##$WDW= 1
##$XDIM= 16384
##$YMAX_p= 361744723
##$YMIN_p= -48343
$$ End of Bruker specific parameters
$$ ---------------------------------
##NTUPLES= NMR SPECTRUM
##VAR_NAME=  FREQUENCY,     SPECTRUM/REAL,   SPECTRUM/IMAG
##SYMBOL=    X,             R,               I
##VAR_TYPE=  INDEPENDENT,   DEPENDENT,       DEPENDENT
##VAR_FORM=  AFFN,          ASDF,            ASDF
##VAR_DIM=   16384,         16384,           16384
##UNITS=     HZ,            ARBITRARY UNITS, ARBITRARY UNITS
##FACTOR=    0.220516191357247, 1,           1
##FIRST=     3158.48169972936, 0,            0
##LAST=      -454.23506327642, 0,            0
##MIN=       -454.23506327642, -48343,       0
##MAX=       3158.48169972936, 361744723,    0
$$ Real data points
##PAGE= N=1
##DATA TABLE= (X++(R..R)), XYDATA
$$ [...]
6774G3456j0836p697l6k011M978R212q631q095r151J4278l351J117M953j0360
6760D7826j1513l789J378O282J1962K887j7372l01J920J5972j7318j010O27N195
6746D2746O66M356L96O115J020n747q784j1268J3943j2151J0111K400n573r359
6732B8871J33L102L449k384J1635k122k0710j237Q349k010Q958J1123K504j8842
6718C0819K497l667p405R625J806j931m419o228K340n881r519N965L848o577O971
6703A8244K833K992j622p27n348O082P372l857j6565J629R096r61m987J2578l418
6688B3341n076J0207n411j3929k908O738j520k212L169o35p396Q475K854j3113
6674B584o316N825k894K472p813Q38O370K356J0469k434j2695M602o204k679R855
$$ y = [73456, 62620, 54923, 54887, 52876, 57854, 67066, 58435, 50340, 41189, 55467, 52116, 53233, 58186, 47826, 36313, 32524, 33902, 40184, 52146, 55033, 37661, 37360, 39280, 55252, 37934, 36924, 37551, 42746, 43412, 47768, 48164, 54279, 55299, 49552, 40768, 29500, 43443, 31292, 41403, 43803, 38230, 28871, 29004, 32106, 35555, 33171, 44806, 42684, 21974, 20737, 29086, 27076, 36034, 47157, 49661, 30819, 33316, 29649, 22244, 31869, 33675, 31744, 27325, 21097, 23437, 17556, 8037, 14002, 17850, 11273, 18244, 21077, 24069, 22447, 21720, 16372, 22454, 29826, 25969, 9404, 11033, 20129, 19168, 14181, 26759, 23341, 18265, 28472, 23061, 9132, 6224, 12962, 11442, 9230, 12399, 11764, 4368, 12843, 15697, 2584, -3732, 2093, -801, 1671, -6142, -5304, 1066, 3422, 13891, 11457, -1238, 3364, -2840, -5519, 4336]
6659D336j008J063R64m964R835j1364J943R096K505j1196m52l176m850Q424J4909
6644A6065j2828j4176R068M762r199n46Q426K265q007j1712M915K511M428K470
6630a558j375J196L640j2514R122J1079r112j940Q8r82j4332j88K1671L962j029
6615G728j2268k246O140m141m476J513Q3L164Q96r373j61M276K959l002P966k364
6599c306L337M930j6074p31N923Q752m922K633k711j175k286r609l273J6j998
6584b0494L649O315l984O566m134N08n348r00m001j2692K575Q193l410P596O370
6569a3191q106o837J2615O372p375p756L215K142J0326o60k423l360q165J3777
6555i426j198J8754l449j5284l531j851l332n32o696N641J0514J220N436O492
$$ y = [4336, 3328, 4391, 5355, 391, 10226, -1138, 805, 9901, 12406, 1210, 758, -2418, -7268, 1156, 16065, 3237, -10939, -1871, 2891, -6308, -6854, 1572, 3837, -4170, -15882, -10967, -8456, -4028, -1558, -2933, -1737, 1903, -10611, -1489, 9590, 478, -1462, -1374, -2356, -16688, -16876, 4795, 8757, 7728, -4540, -6786, -646, -4787, -9263, -7750, -7667, -4503, -3607, -12980, -13141, -8865, -5906, -8908, -942, -3306, 31, 4961, -11113, -11844, -5921, 2831, -2091, 542, -2169, -3344, -5630, -15239, -18512, -18496, -20494, -16845, -10530, -14514, -7948, -12082, -11574, -16922, -17822, -21823, -34515, -31940, -23747, -27157, -19561, -13191, -21297, -28134, -15519, -9147, -16522, -24278, -21063, -18921, -8595, -9255, -11678, -15038, -23203, -9426, -10624, 8130, 4681, -10603, -14134, -15985, -19317, -19849, -26545, -20904, -10390, -9170, -3734, 2758]
6541B758q795l967n304K250M633k424j2993J507J2688l420o644p519J1545M92
6527a5193o46N65P373O909o436J218m816J4494j2088o440j680n963J0290n67k209
6512a5189R28q587J3751J2590q719m903p861J4420k216j2172j7794K446J7113
6499a6193j092r058J446M76M900R518j0588q116L361j057L41K998L615L332K658
6484a3459q215N85l148O476k432l557j977o74j1889L574j0066J0564K240M795
6470b7183N210J0985j346j0197J2005r06R483k0138n677J0952P025O77j0525m373
6456b4008n778k925N686M795O777p131J034q37M259K122m1k0461k034r801J9959
6441b8384R343l34K828n678k004P339R083r847j1780L053P708J0218m055ML678
$$ y = [2758, -6037, -10004, -15308, -13058, -8425, -10849, -23842, -22335, -9647, -13067, -19711, -27230, -15685, -15193, -15839, -15274, -7901, -992, -7428, -6210, -11026, 3468, -8620, -15060, -16740, -22703, -12413, -12980, -15189, -14261, -22848, -9097, 3493, -5226, -10129, -17990, -3570, -5786, -17958, -35752, -33306, -16193, -17285, -26343, -24897, -24421, -19521, -10003, -20591, -28707, -25346, -26403, -26062, -23064, -19449, -16117, -13459, -21674, -21089, -24237, -17761, -20193, -23750, -25727, -26401, -38290, -34716, -44782, -34218, -31978, -27183, -21973, -10988, -12334, -22531, -10526, -11432, -1949, -22087, -27764, -16812, -9787, -9110, -19635, -24008, -29786, -32711, -27025, -22230, -15453, -22584, -21550, -22387, -18128, -16006, -16047, -36508, -38542, -48343, -28384, -19041, -19375, -16547, -22225, -24229, -16890, -7807, -17654, -29434, -26381, -18673, -8455, -12510, -12506, -8828]
6426h828r171j4297J6189J4205p541j5006L132J4674j0135m012K324j99N463k513
6412a5715j914J828n179k394j9153J0759L130N221N66K969m465M364l541j7065
6398d0589K66K2277P315k372l960n608q391j1253K587Q925O461J2456o654M239
6384a4301j647n508j2997J124K1696L896m33j1312o318K942P156O820M113j2481
6370a7250l634n693L559k207P846m580n054J782K297K056m039k008M180j9084
6356d1829K377J1779j4939K1619q62N589l617R968L455j204l907j0042K297m10
6342a9726K458j0478j4698J0624J2226j5338M271L405O979M431K588k290P596
6329g952j802r955K40L79k026r94Q197J356p911P279K703o744j8735L489J3190
$$ y = [-8828, -17999, -32296, -16107, -1902, -9443, -24449, -21317, -6643, -16778, -20790, -18466, -18665, -13202, -15715, -17629, -15801, -20980, -23374, -42527, -31768, -28638, -23417, -22851, -19882, -24347, -19983, -23524, -40589, -40323, -18046, -10731, -13103, -17063, -22671, -31062, -42315, -39728, -30803, -24342, -11886, -18540, -14301, -15948, -21456, -34453, -33329, -11633, -7737, -8170, -19482, -25800, -22858, -15702, -8882, -4769, -17250, -20884, -26577, -23018, -25225, -17379, -21959, -27013, -25231, -22934, -20878, -24917, -26925, -22745, -41829, -39452, -27673, -42612, -20993, -21855, -16266, -19883, -9915, -6460, -7664, -11571, -21613, -19316, -19726, -17268, -27746, -42444, -31820, -19594, -34932, -30661, -27256, -20277, -15846, -13258, -15548, -7952, -9754, -19709, -19469, -19090, -21116, -22110, -13913, -12557, -20468, -13189, -10486, -17230, -35965, -32476, -19286]
6314a9286n124Q484O154O541j0751j3226J0652K805L99o255K975o279o543P866
6300b1588J5538Q744P964k387j0610M846j39k0461Q305O278j1936N260j341L203
6286h324r143j0238J1107r337n547P398j2471R271R275N798J04J349r457j537
6272b1752j0313L246O719M062j2648l638O522j1704N466K77O640J478K63k521
6258b7903l602J773J0136K832N049j4983j7993L259Q075L519q658K729k604O687
6244c1684n229J0530Q035M216m757j2987J4123m101q957P280L712J788m869O15
6230b2285p331J258j34m1M685m271j669J1009o197J937J1877k95J2038j3437k0239
6215c3095N050L844q786N66P880R196n307J1253r162r20R88M371l478k553j642
$$ y = [-19286, -24410, -15926, -9772, -3231, -13982, -27208, -16556, -13751, -13352, -19607, -16632, -22911, -29454, -21588, -6050, 2694, 10658, 8271, -2339, 2507, 2368, -18093, -9788, -3510, -15446, -10186, -11527, -8324, -17467, -27705, -16598, -25935, -31482, -24084, -36555, -27284, -18009, -12211, -12107, -10758, -20215, -21752, -32065, -28819, -22100, -18038, -30686, -34324, -27802, -39506, -34040, -33763, -27123, -25645, -25382, -27903, -31505, -29732, -19596, -16764, -11715, -26698, -44691, -41432, -33357, -29838, -38496, -35767, -38371, -31684, -36913, -26383, -18348, -14132, -18889, -31876, -17753, -21854, -30811, -23531, -19819, -18031, -22900, -22285, -29616, -28358, -28492, -28533, -23848, -28119, -29788, -18779, -24976, -23039, -11162, -11457, 581, -12856, -33095, -28045, -24201, -32987, -32421, -24541, -15345, -20652, -9399, -18561, -19481, -18493, -14122, -17600, -20153, -21795]
6200b1795Q466j0385O742K928N856o306j2364L005j0913J742J376M772J0962j529
6186a7443o508O190p625J0983m875j5237M651L316J5562j2842n863J5492k157
6173a6356k860r522k248r548J4266k154p28p9R833n738p616J5029L691o448l205
6158b3683P253o599j097p55m951J1928J201n79J4347J701p059q870k016J5382
6144c797j066o612l990r314M35K472k257L576l9L816q334j451J758l01p906Q288
6128b4722O650m213j737J968k41j5903l555n3Q743M125J1121M388n407j1443k702
6113c2981k493R35J2033L021j5286P033R079o703K83m9R045Q108l990m780Q34
6098a5911j952L800M478k770J710j2182o413R894J961J0370m278j0742j852l365
$$ y = [-21795, -13329, -23714, -16972, -14044, -8188, -14494, -26858, -23853, -34766, -33024, -31648, -26876, -15914, -17443, -23951, -17761, -25386, -14403, -19278, -34515, -29864, -26548, -10986, -23828, -29691, -14199, -16356, -19216, -28738, -30986, -40534, -26268, -28422, -29150, -29229, -19396, -25134, -32750, -17721, -14030, -20478, -23683, -16430, -23029, -24126, -24881, -29832, -17904, -16703, -17282, -2935, -1234, -8293, -17163, -19179, -3797, -4863, -11475, -15465, -24779, -24344, -21872, -24129, -20553, -20592, -16776, -25110, -26561, -24803, -25104, -33010, -24722, -18072, -22285, -24022, -22054, -22295, -38198, -41753, -41806, -33063, -28938, -17817, -13429, -18836, -30279, -32981, -35474, -34539, -22506, -19485, -34771, -27738, -18659, -25362, -25079, -25128, -16083, -7975, -11965, -16745, -15911, -17863, -14063, -9585, -12355, -10645, -22827, -29240, -19346, -17385, -7015, -11293, -22035, -23887, -27252]
6084b7252P803O042j787k813p641K635L037j0624O597J41p092R247l71M010L963
6069a4105l938L922p010M466m204r045O054P179j6335k582l690m45K904J0687
6055b6142J580L12o203o367K0346j4193J455Q471Q98r121j14R959K491j961l10
6040a8899K186J0327K25r126R283P937j8282p823J7896j3334R620k900j3536o650
6026c3076M396L400o954o508Q664j415p864K1635R74O3j0474l846J233O326q863
6011c2309J907K087p4j319J3572q532L442P871j435r248J2075N219j6005j0054
5997c2803N068Q545o502J6714n846r39n674Q567l911O775j3664o847P479J262
5983b1776m1R642l125j0416K257K68P889J4920o444q961K780J043m120r214R284
$$ y = [-27252, -19449, -13407, -15194, -18007, -25648, -23013, -19976, -30600, -24003, -23862, -30954, -21707, -22078, -18068, -14105, -18043, -14121, -21131, -16665, -20869, -29914, -23860, -16681, -33016, -35598, -39288, -39733, -36829, -26142, -24562, -24250, -30453, -36820, -16474, -30667, -29212, -20741, -19843, -28964, -29078, -19119, -16628, -18589, -18899, -16713, -6386, -6161, -15287, -6004, 1933, -16349, -24172, -6276, -19610, -9990, -12890, -26426, -33076, -28680, -25280, -32234, -38742, -30078, -31493, -39357, -17722, -16748, -16685, -27159, -31005, -29772, -23446, -32309, -30402, -28315, -28389, -29708, -16136, -24668, -21226, -13355, -14790, -24038, -11963, -6744, -22749, -32803, -27735, -19190, -25692, -8978, -14824, -15763, -21437, -12870, -16781, -10006, -23670, -30517, -23038, -21776, -21817, -12175, -15300, -25716, -23459, -23191, -15302, -382, -6826, -15787, -13007, -11964, -16084, -25298, -16014]
5968a6014l451J233k864k408L836k806P37Q696N624K002n437P116m557l120l201
5953a4614j1180O75J6028J0475j0858o612P683j734j0883r45J342j175q48m019
5939b6665J0122J4531K475L59k702j3387j2166K706J4650L942j608r650l290Q759
5925a1924M69Q526n336k331J4906j5912J116j56m345J098M263q038p18j835L915
5910a6302N477r824P555l82N161q399r398n10J2515M164j1819P219J1862p475
5896a0156J2549j3061o41J8571r513o648n784K850l30J1321N826p512J428r830
5882a0930q065R735l746R936J814q457m263m572J5082M869j820o36J0507J826
5868A1280m380n090L453m555J4608L768l085n092j2093j182m177l957J6358j0035
$$ y = [-16014, -19465, -18232, -21096, -23504, -19668, -22474, -21737, -13041, -7417, -5415, -10852, -3736, -8293, -11413, -14614, -25794, -25119, -9091, 1384, -9474, -16086, -8403, -10137, -21020, -21965, -20623, -21798, -22646, -26665, -16543, -2012, 463, 822, -1880, -15267, -27433, -24727, -10077, -6135, -7743, -17393, -20683, -11924, -11455, -2929, -8265, -10596, 4310, -11602, -10486, -10642, -14987, -13889, -9626, -17664, -18382, -20217, -16302, -10825, -20649, -13094, -13476, -8315, -16714, -26112, -26622, -14107, -9943, -21762, -14543, -2681, -10156, 2393, -10668, -11309, 7262, -2251, -8899, -14683, -11833, -12163, -842, 4984, -2528, -1100, -10930, -18995, -9260, -13006, -3070, -1256, -9713, -13976, -18548, -3466, 1403, -417, -1053, 9454, 11280, 6900, 1810, 5263, 708, 15316, 19084, 15999, 10907, -1186, -2368, -6545, -10502, 5856, -4179]
5854d179K990J2303r582j2256J5137n321K61l716o229N774R371Q220j1202j808
5840b37K224Q600L88K893L617o004m227O469J0762n923m234N830r353j48j3324
5825b667J1548J6305k433K1048K298j7765k607J303p234j3277J3235r394p120
5812C240J1441K49r78O853N695j8314m831J0335m666N186l171O898N302Q25L25
5797B4389J2115j1808l359J1688J6370J3858J3397p028k531p19o007j6945j0243
5784C3177O265q630r656K120l307k140J478q091o094p5J941P270Q23q733l984
5769B364p356K164J9597q893R75P369N797K0157Q160J2649R338J3746J0338q851
5755H7554k7119j1120o649K196p016j2112r403j116R184k681j336J353K024J0415
$$ y = [-4179, -1189, 11114, 1532, -10724, 4413, -908, -647, -4363, -10592, -4818, 4553, 12773, 1571, -237, 1987, 10587, 10975, 13868, 17485, 11481, 7254, 13723, 24485, 18562, 14328, 20158, 10805, 10657, -2667, 8881, 25186, 22753, 43801, 46099, 28334, 25727, 27030, 19796, 6519, 19754, 10360, 3240, 14681, 14930, 13952, 20805, 26500, 8186, 3355, 13690, 9024, 14210, 11039, 17937, 23239, 24064, 24389, 36504, 24696, 21337, 33025, 49395, 63253, 76650, 69622, 67091, 66372, 60365, 43420, 33177, 39442, 30812, 21156, 23276, 19969, 17829, 19307, 11216, 5122, 5047, 6988, 14258, 15081, 6348, 2364, -4992, -2828, 16769, 7876, 8851, 16220, 22017, 42174, 50334, 62983, 72321, 86067, 96405, 87554, 60435, 49315, 42666, 44862, 37846, 25734, 16331, 15215, 24399, 21718, 20382, 21735, 23759, 34174]
5741C4174r474p089p904n843N091m561O717j492j360O371n159p663N688J6365
5727B3861K275n915J4862M014p609j1398j1751j0068j2776J657l26J6359n954
5714b769m144j866O269q641N670j0410L504J3459o224O516k924p409K601R60J1532
5699F124J976p821l097o18p231p208Q717j609r803N190k17k717K955K492j114
5684a3981l547j0424O598R405N029o790l749L897m052l277m423n086P064P16o62
5669b3282R797k439N978p119R62o603K442J0971J852K765N83j402k370p630l621
5654a9116P027J3819J069j5927n154O029j854o26k286K160o131N929j914M768
5640a2207p320L7K887J588N022J522m341P823N530l710J964n750O286k621o833
$$ y = [34174, 24700, 17611, 9707, 3864, 8955, 4394, 11111, 9619, 8259, 14630, 9471, 1808, 7496, 23861, 26136, 20221, 35083, 39097, 31488, 20090, 8339, -1729, -14505, -12848, -13174, 3185, -2769, -6913, -8779, -2510, -11151, -5481, -15891, -12387, 1072, -5152, 1364, -1560, -8969, -6368, -5408, 6124, 8100, 279, -2818, -3436, -10667, -17875, -9158, -10767, -20570, -15380, -15597, -18314, -15359, -12867, -13981, -17528, -27952, -21354, -11949, -6920, -13710, -17459, -13562, -17614, -20891, -25314, -30400, -23336, -22620, -23282, -13485, -15924, -9946, -17065, -16103, -22706, -20264, -9293, -7441, -4676, -4093, -5495, -7865, -15495, -19116, -12089, 1730, 2799, -13128, -18282, -12253, -14107, -14733, -17019, -14859, -20990, -15061, -16975, -12207, -19527, -19490, -16603, -15015, -9993, -8471, -12812, -4989, 541, -3169, -1205, -6955, -669, -3290, -10123]
5625a0123m129j477O133M072N81K068k306M058R522j4267p519J57n851q256N433
5610b1904J892l510k36N736l494p029J6986L344N395R330j2191k08L349p002N197
5595d345N574j1120r700k372K617M474O754p082L32o403J532J05M73O404k002
5580a4759M716M894j216r321J1442j127o691n32P200J6996o686j3183O156n630
5566g741o365J2310K113k289k203o335j79J264n49n617P360R446j293q273N717
5551b634p32l119m464j472Q368J5350m327n184j537k891O844J472L582m090j5991
5536a0825K26N797K118l296R062N206p079j7483l139k328R02L528J7709L080n779
5521b301J6423j0261m121o818j1642J4924q625P916J2430o287N62j1016Q842r31
$$ y = [-10123, -14252, -15729, -9596, -5524, -4943, -2875, -5181, -1123, 8399, -5868, -13387, -13230, -19081, -27337, -21904, -20012, -23522, -23758, -18022, -21516, -28545, -11559, -8215, -2820, 6510, -5681, -5889, -2540, -9542, -4345, 1229, -9891, -19591, -21963, -19346, -14872, -8118, -15200, -14868, -21271, -19739, -19634, -19161, -12757, -14759, -10043, -5149, -6365, -15686, -4244, -5371, -12062, -12594, -5394, 11602, 4916, -8267, -2111, -7741, -14106, -1796, 317, -1972, -4175, -10510, -10689, -9425, -9974, -15591, -8231, 1215, -78, -8351, -2634, -3366, -6485, -10949, -12421, -4053, 11297, 6970, 1786, 249, -2642, 4202, 5674, 9256, 5166, -10825, -10599, -4802, -2684, -5980, 3082, 8288, 1209, -16274, -19413, -21741, -20839, -17311, 398, 3478, -2301, 14122, 3861, -260, -7078, -18720, -3796, -12421, -4505, 7925, 1638, 2200, -8816, 26, -905]
5507i05j117O240j4495k870M155k319J2549L648J29q198M143J0899j1928p429
5493g498l591J1319R834j2989j286J6588p144q945l21n555l639J2506K343K553
5479D175J0489o804l256J5127R340j6723N405o170L781m225P232J8048N259o113
5465C5565j3709L181L685m287j4893m111O632Q041n072j471O990j0769J1099M574
5451B5455m429Q898k790q47L341l146N414o958R494P134j5381n152Q263r38N026
5436C3384P507J37M719j391k134L550R533l073O636m882m37O494Q256j394j2397
5421E4508j1242n416J3933J6775k201l432r400Q515K01n979k575L226O312N726
5407F8951Q968m708m241L713k67J0713P046n004O403K196n789J656j080q272o688
$$ y = [-905, -2022, 4218, -10277, -13147, -8992, -11311, 1238, 4886, 5015, -3183, 960, 11859, -69, -7498, -11089, 230, 10064, -2925, -4211, 12377, 5233, -3712, -4033, -9588, -13227, -721, 1622, 4175, 14664, 7860, 4604, 19731, 29071, 12348, 17753, 11583, 15364, 11139, 18371, 36419, 41678, 35565, 21856, 25037, 28722, 24435, 9542, 5431, 12063, 20104, 15032, 13561, 20551, 9782, 20881, 25455, 21026, 29924, 27134, 26287, 29628, 26482, 31896, 24938, 34432, 41566, 26185, 21033, 29296, 28358, 33384, 40891, 41028, 45747, 44356, 42222, 45772, 55305, 52232, 58868, 53986, 53549, 60043, 68299, 66905, 54508, 43266, 37850, 51783, 68558, 66357, 62925, 53525, 62040, 62241, 56262, 53687, 56913, 63225, 68951, 77919, 73211, 68970, 72683, 72416, 83129, 90175, 85171, 91574, 93770, 87981, 89637, 88557, 80285, 73597]
5392G3597J341Q50k592K577j3828n163O728M20j0946J5791k938j168m467j1070
5378D9132J8322M131O646j453R793p714J967K1738o036k1985q90J0315j4951k24
5364F8791O392j748j2554J3306p265k436K822p884R61J6536K185j3949j308n770
5350E8079J3723J304j7266Q24r377m684l076m061Q396J678L720Q924P482j0497
5336E5169Q52M915j3963M975P08n699N124M700K503r393j1740R445k97j5459n501
5321B6339J0496m812k034j742O987J1261k625o96n947N437M556k734j1878j0148
5307B2460o40P063M472J6918m686Q03q468Q776j4056L726J054N802J0326r829
5293D3721l587p162m161P544R563o916K591P55J008O204j5946n655J1059n239
$$ y = [73597, 74938, 75788, 73196, 75773, 61945, 56782, 63510, 63930, 52984, 68775, 65837, 64669, 60202, 49132, 67454, 71585, 78231, 76778, 86571, 78857, 80824, 102562, 96526, 74541, 73651, 83966, 69015, 68791, 75183, 73435, 60881, 74187, 66922, 64486, 67308, 59424, 60385, 76921, 79106, 65157, 63849, 58079, 71802, 73106, 55840, 56664, 47287, 42603, 39527, 35466, 43862, 45540, 49260, 58184, 65666, 55169, 56021, 60936, 46973, 51948, 52656, 46957, 52081, 56781, 59284, 49891, 38151, 47596, 47299, 31840, 26339, 36835, 32023, 29989, 28247, 35234, 46495, 43870, 43174, 37227, 42664, 47220, 44486, 32608, 22460, 21820, 28883, 33355, 50273, 45587, 46390, 37922, 46698, 32642, 36368, 37422, 43224, 53550, 43721, 40134, 32972, 28811, 36355, 45918, 39002, 41593, 42348, 43356, 49560, 33614, 27959, 39018, 33779]
5279C3779P821O398O832L997j0169j1241Q050P197k3748J2642R520o699L559q092
5265C9846Q253K506Q345j2999N059j09j957j481R378K416J372L339J675M513M169
5250G4325J643p234r54M298O07R969J2964j1422k085N081N849l132o559N054K100
5235I0504j8438p82J5665R623O793R62p535q189q443P200l25M367J2066o003n829
5220I1636O216J0541J7150J868k653k882J0517l845j0633N467R993p16O152J028
5206A39839J3427K078n979J3232K354K298J856n403r595J107Q447J6008m02J1602
5192A90869Q345R142n371m722J0653M63J4390k254N706J0225j1482M384K2988
5179B53336J0414J1350O659n125J0591R362K9753Q649J1880J2514M852K3014L285
$$ y = [33779, 41600, 47998, 54830, 58827, 48658, 37417, 45467, 52664, 28916, 41558, 51078, 44379, 47938, 39846, 48099, 50605, 58950, 45951, 51010, 50901, 48944, 47463, 56841, 59257, 60629, 63968, 65643, 70156, 74325, 75968, 68734, 67780, 72078, 72685, 82654, 95618, 84196, 82111, 87192, 93041, 89909, 83350, 88404, 90504, 72066, 71284, 86949, 96572, 103365, 104327, 96792, 88603, 80160, 87360, 87035, 91402, 103468, 97465, 91636, 97852, 108393, 125543, 127411, 124758, 121876, 132393, 128548, 117915, 123382, 133375, 132659, 138811, 139839, 153266, 155344, 149365, 162597, 164951, 167249, 169105, 163702, 154107, 155214, 163661, 179669, 179267, 190869, 199214, 208356, 202985, 198263, 208916, 209379, 223769, 221515, 227221, 237446, 225964, 230348, 253336, 263750, 275100, 281759, 276634, 287225, 296587, 326340, 334989, 346869, 359383, 364235, 387249, 390534]
5166C90534o926K0260K2893J3650M543J7964J4347J9637M552J3842L0538J9743
5154E65577P548R452K6623K4012K4688K8296K5954L7194J6193M4549M1216M1927
5142H93229N3035N2166Q5257P5254Q5494J15361J24245J48608J69313K15343K61255
5131B278560L04215L85501M61415N31208N75993N76446N43081L95004J39938l5836
5121F155525j58208m07123n94895n97135n94233n71582m97610l93624l15259k54833
5111A771023j99939j38918j19200j05365r7190q1932q6488n6931m4170o1294o0264
5100G19332l4245l1311m9796l4126j3185k8730k8704m1830k8214k2078J670p552
5088D01231k4725k2380j5985m361l486r698N264j195k3551r078r214j3239r698
$$ y = [390534, 383608, 403868, 426761, 440411, 444954, 462918, 477265, 496902, 501454, 515296, 545834, 565577, 573125, 582577, 609200, 633212, 657900, 686196, 712150, 749344, 765537, 810086, 851302, 893229, 946264, 998430, 1083687, 1158941, 1244435, 1359796, 1484041, 1632649, 1801962, 2017305, 2278560, 2582775, 2968276, 3429691, 3960899, 4536892, 5113338, 5656419, 6051423, 6191361, 6155525, 5997317, 5590194, 4995299, 4398164, 3803931, 3232349, 2734739, 2341115, 2025856, 1771023, 1571084, 1432166, 1312966, 1207601, 1110411, 1028479, 941991, 885060, 840890, 779596, 719332, 685087, 653776, 603980, 569854, 556669, 527939, 499235, 457405, 429191, 407113, 408783, 401231, 376506, 354126, 338141, 333780, 330294, 320596, 325860, 324665, 301114, 292036, 282822, 269583, 259885]
5075B59885q296l204o548j5803j3835j1689k32j0291J971J5485m275n372p087
5062A90709j3408p050j2212Q218m101j9173K112K935J177K622j258j0552l506
5049A36513M077n351n846J0164m753k7281q915M972l189k59J238j0623K186P15
5035I3648p371j529m074O021J586O81J792j439O036j6230Q94q056q053Q259l05
5020G1860M4O609k652k156M597k3393o599J2195j1839M568k220O103J326n525
5006E2918Q768o806l800l634o351J4701j1253K093J5055l379J824R4p001k696
4992E0533o626m778R9M43k091j6419K746J3709M052M343J2207q741j7386Q432
4978D0523M575j3735o66K694P982l371q340Q656k048Q39j0469R69J931j2524J2254
$$ y = [259885, 251589, 248385, 241837, 226034, 212199, 200510, 200278, 189987, 191958, 207443, 203168, 197796, 190709, 177301, 170251, 158039, 166257, 162156, 142983, 145095, 148030, 149207, 151829, 150571, 140019, 136513, 140590, 135239, 129393, 139557, 134804, 107523, 98608, 103580, 100391, 100132, 101370, 90747, 92933, 93648, 86277, 84748, 80674, 86695, 88281, 88962, 90754, 89315, 95351, 79121, 80015, 71959, 63906, 72165, 71860, 71904, 78513, 75861, 73705, 78302, 54909, 48310, 60505, 48666, 53234, 51014, 57117, 58443, 52918, 61686, 54880, 51080, 47446, 41095, 55796, 44543, 46636, 61691, 58312, 60136, 60230, 53229, 50533, 43907, 39129, 39228, 39671, 37580, 21161, 23907, 37616, 41668, 46011, 58218, 49477, 32091, 40523, 45098, 31363, 30697, 33391, 41373, 38002, 29662, 38318, 36270, 37109, 26640, 27609, 29540, 17016, 29270]
4963B9270M840R27k763q710p527Q087N094K06O189r02J1244J202j0733l170J019
4948C4273j835p40L220R993N038J2643j1978j4332K238M002o7k118r1j198O27
4933C9675j814r239K47Q408n923k872K040J398k801M003q835J364J2799N345m827
4918C8968L878q263r293P221P833J0411K359j5449M273j1444K943o446k552N792
4904C0231j63j1776p852J7912k393O670K217L64N716j3894j276K397m530J0757
4890C4380J2322j3691k2123N496R108L316N472J489M61m590l884j353l149j339
4876B1915J3832k88r513Q45N248r637r466K9618J754R4m707q978J876n971p895
4861A8727M86O802J0467J860n382N95J057j4772K2251k718j0851k282l835R470
$$ y = [29270, 34110, 35037, 32274, 23564, 16037, 24124, 29218, 29424, 35613, 34711, 45955, 47157, 36424, 33254, 34273, 32438, 31698, 34918, 44911, 49949, 62592, 50614, 36282, 38520, 42522, 42455, 40337, 40246, 39048, 39675, 37861, 28622, 28869, 37277, 31354, 28482, 30522, 31920, 29119, 33122, 24287, 25651, 38450, 43795, 38968, 42846, 34583, 25290, 32511, 40344, 50755, 53114, 37665, 41938, 30494, 33437, 26991, 24439, 30231, 30068, 18292, 10440, 28352, 25959, 32629, 34846, 35210, 40926, 27032, 25756, 28153, 23623, 34380, 46702, 33011, 10888, 16384, 25492, 28808, 34280, 35769, 36230, 31640, 27756, 26403, 23254, 21915, 35747, 35459, 25946, 26791, 32039, 22402, 12936, 42554, 44308, 44402, 39695, 30717, 32593, 26622, 18727, 19213, 26015, 36482, 38342, 32960, 33555, 34612, 19840, 42091, 39373, 28522, 26240, 22405, 31875]
4847C1875J7546j2007q226J0970J0309Q75k1302q478L571M29m503j096O837j90
4833B6610P036O74L285J5860m244m270L695J2162q938P44R355J4481j6334O237
4819F6353J1148L71o209j0253L781m224o92J3998n872n229l556k265m239N578
4805E8690M96j2571l535J3932k594j1440R253m280J2318K249R407j5232j4884
4792D1809j213l111J2160k049O319P989o103j3301M570K1238O265n872J301q789
4778F1213m05L061K737j4643K856O60P211L181J572M859k59K024j397M350k851
4763G4169p923r450J4753l23N238N948J993Q726N684J0579j207K066J3195l245
4749A20203J5487P318M251L209J0115J7776J5401q383O175N317L372o277n331
$$ y = [31875, 49421, 37414, 29188, 40158, 50467, 51342, 30040, 21562, 25133, 25562, 21059, 19963, 26800, 26610, 33646, 34320, 37605, 53465, 49221, 44951, 48646, 60808, 51870, 52614, 61969, 76450, 60116, 66353, 77501, 77872, 71663, 61410, 65191, 60967, 60275, 74273, 68401, 63172, 59616, 57351, 53112, 58690, 59186, 46615, 43080, 57012, 54418, 42978, 52231, 47951, 60269, 62518, 71925, 56693, 41809, 40596, 37485, 49645, 47596, 53915, 61904, 55801, 42500, 47070, 68308, 74573, 68701, 70002, 61213, 60808, 63869, 66606, 51963, 54819, 55479, 62690, 65871, 67443, 72302, 72043, 74067, 72670, 77020, 74169, 66246, 56796, 71549, 71226, 76464, 82412, 84405, 93131, 98815, 109394, 108187, 110253, 123448, 120203, 135690, 143008, 147259, 150468, 160583, 178359, 193760, 185377, 191552, 196869, 200241, 193964, 188633]
4736A88633J1403j7727m686L400l566L764r404k24N759J110j7256k982O054M725
4722A69003J3134n729m765M864R662M014M738K480R794J4777m980J0766L8784
4709B66542J9497M827K5297J9647P039l215J9337J2048p190L505J023j825p140
4696C59392r740L733j627j5568j1749j5203n718j2615J234R31o255j1494r29o178
4682B68214M624r109n14J6172J2026J0279R208K8684K1440J6490j000N963J5453
4669C97930J840o528J736M999m404J8287k472n312j0346j3655n566P354m566j8169
4655C61128k1657j5815j2732Q234k362j3964n982m490j950J1257J0149r240J6721
4642C19297N831J7662J8383K742L104J10j1830r948O020k4277j0770j4569j1726
$$ y = [188633, 200036, 182309, 177623, 181023, 177457, 181221, 171817, 171593, 177352, 178462, 161206, 158224, 164278, 169003, 182137, 176408, 171643, 176507, 186169, 190183, 194921, 197401, 207195, 221972, 216992, 227758, 266542, 286039, 290866, 316163, 335810, 342849, 339634, 358971, 371019, 363829, 367334, 368357, 366532, 359392, 349652, 353385, 351758, 336190, 324441, 309238, 303520, 290905, 292139, 293070, 286815, 275321, 274392, 268214, 272838, 263729, 263215, 279387, 291413, 301692, 310900, 339584, 361024, 377514, 376514, 382477, 397930, 399770, 393242, 394978, 399977, 395573, 413860, 411388, 406076, 395730, 382075, 376509, 383863, 379297, 361128, 339471, 323656, 310924, 319158, 316796, 302832, 296850, 292360, 290410, 301667, 311816, 302576, 319297, 325128, 342790, 361173, 363915, 367019, 367129, 355299, 345351, 351371, 327094, 316324, 301755, 290029]
4629B90029j4588k3127K382N697K3601n321J6509M262p602J8048P328J925J2457
4616C31600K7134j330Q51o887n783R587n605k0320r261Q861j35j1499m888q747
4602C03578m564k474k4056k5160j5837m532K008l83k7477j0095q894O102o494
4589A81722j7300p658q70j279J480p925M937M158o69K647p637p981Q593l728j881
4574A46609m59r552j283l731m229o301k363l546r649o612Q458o142j98P898m355
4559A04545L215m924o346N424N150N545M497l042j5825p224l296R169K571J765
4545A01224k675n126L869J047o554K707k072R943N073n899P220p324k855N686
4531A04264k512k663O850j0156j3652J1386j2094P235K516J521P10l801P894l027
$$ y = [290029, 275441, 252314, 254696, 260393, 283994, 278673, 295182, 299444, 291842, 309890, 317218, 319143, 331600, 358734, 357404, 358255, 351368, 345585, 355172, 349567, 329247, 319986, 328847, 328712, 317213, 312325, 303578, 299014, 296540, 272484, 247324, 231487, 226955, 228963, 228580, 201103, 191008, 182114, 188216, 181722, 164422, 156764, 155894, 154615, 156095, 148170, 153107, 157265, 156596, 159243, 151606, 143625, 152218, 148490, 146609, 146150, 136598, 135315, 131584, 127355, 121054, 118691, 115145, 105496, 98884, 107342, 101200, 101002, 108900, 104545, 107760, 102836, 96490, 101914, 107064, 112609, 117106, 114064, 98239, 91015, 87719, 96888, 99459, 101224, 98549, 93423, 97292, 98339, 91785, 94492, 92420, 102363, 107436, 101537, 108757, 101433, 98578, 104264, 101752, 99089, 105939, 95783, 82131, 93517, 81423, 88658, 91174, 92695, 93405, 89604, 97498, 94471]
4517I4471k222J7876j616k208J46N227j0139j8187J0330K478P457j702p887P48
4503I4772Q920n281K274k20q371J4059J1612Q606M636M228N56J424k646n600m154
4488A24815m029o342O86K2517n9n307J585m791m70N868R796J150O31k218K725
4473A46557m293l050M427n744j294M195R46p487J5308L70M791p509P993N314J090
4458A61614M218M513J7229J445j932L367Q7J1109O760r826m572q664Q307K464
4444A96119J3860J8015l277o321R06K000N636j1414j6271J5399j0416o791J3057
4431B10502J3258L284J393J955M714n068L355J9501J0181j5457j1018J2366j904
4418B47062J3698J1881r71r931P93M133P862k701M704P410M906J040M001L285
$$ y = [94471, 92249, 110125, 108509, 106301, 106447, 111674, 101535, 83348, 93678, 96156, 103613, 101911, 94024, 94772, 103692, 98411, 100685, 100465, 92094, 106153, 117765, 126371, 131007, 135235, 135791, 137215, 134569, 128969, 124815, 120786, 114444, 115130, 137647, 137588, 132281, 133866, 129075, 128605, 134473, 144269, 145419, 146050, 143832, 146557, 142264, 139214, 143641, 137897, 136603, 140798, 141744, 134257, 149565, 149935, 154726, 147217, 155210, 160524, 161614, 165832, 170345, 187574, 189019, 187087, 190454, 190541, 201650, 208410, 198584, 194012, 185348, 193655, 196119, 209979, 227994, 224717, 218396, 219302, 221302, 226938, 215524, 199253, 214652, 204236, 197445, 210502, 223760, 227044, 228437, 230392, 235106, 230038, 233393, 252894, 263075, 247618, 236600, 248966, 247062, 260760, 272641, 271670, 261739, 262532, 266665, 274527, 271826, 276530, 283940, 288846, 289886, 293887, 297172]
4404B97172j062L004P544J1053J5464J3093n30J434n95N843o318O966k895J7814
4390C67987J5885k739j243J2250M288m831J6728J0788M671m081k508L841K5044
4377D46080J4121P113R324J0450L428J034J8338J9502K0665J2255N481K5507K0117
4364F13415J2335K5478M4406N1289M1043M4220J7393K518Q633l094j1386R526
4352H55776J6275M760K3841K7031L3141K7670K4213K3345L3114M9089M6067M2511
4340A206833M7489N7995P1397R0300Q5949Q7848J08585J11251J51667J45607J46558
4329B311479J66167J90886K10372J91385J90438J82494J64432J28403R0109O8520
4319C894685K2566J721l0722n4132o3883r1684j08288j41826j40374j51301j67153
$$ y = [297172, 296110, 299114, 306658, 317711, 333175, 346268, 345738, 347172, 346577, 352420, 346102, 353068, 350173, 367987, 383872, 381133, 379890, 392140, 396428, 391597, 408325, 419113, 423784, 419703, 417195, 421036, 446080, 460201, 467314, 476638, 487088, 490516, 491550, 509888, 529390, 550055, 562310, 567791, 593298, 613415, 625750, 651228, 695634, 746923, 787966, 832186, 849579, 852097, 860730, 857636, 846250, 855776, 872051, 876811, 900652, 927683, 960824, 988494, 1012707, 1036052, 1069166, 1118255, 1164322, 1206833, 1254322, 1312317, 1383714, 1474014, 1559963, 1647811, 1756396, 1867647, 2019314, 2164921, 2311479, 2477646, 2668532, 2878904, 3070289, 3260727, 3443221, 3607653, 3736056, 3826165, 3894685, 3917251, 3918972, 3888250, 3834118, 3770235, 3678551, 3570263, 3428437, 3288063, 3136762, 2969609]
4308B969609j62434j58530j61583j30656j42618j31891j28629j17146j03641q0709
4298A651772p9037q8840n7803n6681o5665n3464k2938m3125k9392l4219l6724
4287A083884l8095k9785j8046j4131k7454j5286p972j5693j692m569J611J2485
4275I25257r698J2341K2006K7958J8417J5157j8956l9374l1043m9239m5148m2174
4263G85504p661j774p724k2063j6110j6726n495q185j4703q362j3652j164J240
4250F63125j9678L330k2699r899J6242j1872j347p237j0906k674n204P317j1533
4237E86965P933J2780k160q260n978l435o597q901Q871J5625J168m715j0492n120
4223E77684J4617P512L580J3110p72J47J101P361M441K245K0474j3808j0564L714
$$ y = [2969609, 2807175, 2648645, 2487062, 2356406, 2213788, 2081897, 1953268, 1836122, 1732481, 1651772, 1572735, 1483895, 1426092, 1369411, 1303746, 1250282, 1227344, 1184219, 1154827, 1120608, 1083884, 1045789, 1016004, 997958, 983827, 956373, 941087, 933115, 917422, 915730, 911161, 912772, 925257, 915559, 927900, 949906, 977864, 996281, 1011438, 992482, 953108, 922065, 872826, 827678, 785504, 777843, 776069, 768345, 746282, 730172, 713446, 707951, 699766, 685063, 676701, 663049, 661885, 663125, 643447, 646777, 624078, 614179, 630421, 618549, 617202, 609965, 599059, 596385, 591181, 598498, 586965, 594898, 607678, 605518, 597258, 591280, 587845, 581248, 572347, 581218, 596843, 598011, 593296, 582804, 577684, 592301, 599813, 603393, 616503, 615731, 615878, 616979, 624340, 628781, 631026, 651500, 637692, 627128, 630842]
4209F30842k760P30k082J0674M223L939M175J4471J2485J0076K4606L2443M2308
4196G86130M2606M0549P0803N4087L2553K1305n67j8696k8207l4665m6071m0437
4184H79390l7567l0239l1680k0999p612J747k009J378J004O152n036J914R552
4171G65995j883J0093J280Q334N957K2426J7735J2047K502L052K5883K2603N178
4158I01202J4046J8698K9252K1715M461P982J3635K7818J9400J1678J5655J3400
4146A098942J5626k801O061J5137J0156Q757K4605K6747J6119J7500M0164L5294
4134A312307J6235L1381L9545M0968K8705L2048J7400J5174L523L973j0120O4
4122A531203J3305k753M421K2204J0967K3905M3035L4067L7558M1474N1543M4927
$$ y = [630842, 628082, 628812, 626730, 637404, 641627, 645566, 649741, 664212, 676697, 686773, 711379, 743822, 786130, 828736, 869285, 940088, 994175, 1026728, 1048033, 1047466, 1028770, 1000563, 965898, 919827, 879390, 841823, 811584, 779904, 758905, 751293, 753040, 751031, 752409, 753413, 759565, 754529, 756443, 765995, 764112, 774205, 775485, 783819, 789776, 812202, 829937, 841984, 844486, 847538, 873421, 896024, 901202, 915248, 933946, 963198, 984913, 989374, 997356, 1010991, 1038809, 1058209, 1069887, 1085542, 1098942, 1114568, 1111767, 1117828, 1132965, 1143121, 1151878, 1176483, 1203230, 1219349, 1236849, 1277013, 1312307, 1328542, 1359923, 1399468, 1440436, 1469141, 1501189, 1518589, 1533763, 1537286, 1541259, 1531139, 1531203, 1544508, 1541755, 1546176, 1568380, 1579347, 1603252, 1646287, 1680354, 1717912, 1759386, 1810929, 1855856]
4110A855856O6551O8166O1102L5071L1301J8480J7704K2514K7425M5842N4949
4099B304961M6803P1509P6368R5250J14739J10036Q8664O8104O7917L4511K2296
4088C101158L1005K0695J7413L660p835j4720k1659K275J3218L7132M7131P8056
4076C307529J01342J10464J20199J33501J24927J21495R9093P9808P6705O9115
4066D344178O0819P2420Q3330Q0661N7617P5259J09136J21345J38492J26987J27748
4055E397992J19530J07102J03391R9822R7560J36850J58336J82098K01694K50920
4045F855295K94775L50060M08155M55014N48441O82857Q50262J065812J199645
4036A2710316J242161J152425J019669Q16631J92154l77670m98819n26180n67964
$$ y = [1855856, 1922407, 1990573, 2051675, 2086746, 2118047, 2136527, 2154231, 2176745, 2204170, 2250012, 2304961, 2351764, 2423273, 2499641, 2594891, 2709630, 2819666, 2908330, 2976434, 3044351, 3078862, 3101158, 3132163, 3152858, 3170271, 3173931, 3166096, 3151376, 3129717, 3131992, 3145210, 3182342, 3229473, 3307529, 3408871, 3519335, 3639534, 3773035, 3897962, 4019457, 4118550, 4198358, 4275063, 4344178, 4404997, 4477417, 4560747, 4641408, 4699025, 4774284, 4883420, 5004765, 5143257, 5270244, 5397992, 5517522, 5624624, 5728015, 5827837, 5925397, 6062247, 6220583, 6402681, 6604375, 6855295, 7150070, 7500130, 7908285, 8363299, 8911740, 9594597, 10444859, 11510671, 12710316, 13952477, 15104902, 16124571, 16941202, 17133356, 16755686, 16256867, 15730687, 15162723]
4027A5162723l94090r5901J89912M41013N20015K99251k39583q09721r65758q22056
4017A3285805o08559m14668k72597j61337n7481Q656P7622P7519P8734J21565
4007A2135259J51815K01943K79651L30596L88703M63639N11252O08094P06904
3998A5777856P82305Q28222P83413P95769P98154Q36041Q98308J046199J218562
3989B3764829J449456J739001K146011K623772L291168M187207N368500O657852
3981E1227796P748641P422438M451209j344488o494850p939819p362848o053564
3973D1654515m751752l659354k805211k081356j489431r78304n87478l10386j69767
3964B4821476j59007k76426m29160o30628p29314p54332o96174n74372m29363
$$ y = [15162723, 14768633, 14672732, 14862644, 15303657, 15823672, 16122923, 15883340, 15073619, 14107861, 13285805, 12677246, 12262578, 11989981, 11828644, 11771163, 11779819, 11857441, 11934960, 12013694, 12135259, 12287074, 12489017, 12768668, 13099264, 13487967, 13951606, 14462858, 15070952, 15777856, 16560161, 17388383, 18171796, 18967565, 19765719, 20601760, 21500068, 22546267, 23764829, 25214285, 26953286, 29099297, 31723069, 35014237, 39201444, 44569944, 51227796, 58976437, 66398875, 70850084, 69505596, 63010746, 55070927, 47708079, 41654515, 36902763, 33243409, 30438198, 28356842, 26867411, 25889107, 25301629, 24991243, 24821476, 24662469, 24386043, 23956883, 23326255, 22596941, 21842609, 21146435, 20572063, 20142700]
3955B0142700k88193j54029o4858l4688o2127j42465k56902l47102m02372l91947
3945A7998017l29838k66907j60042o4280M0855J17567J16584M8061n4635j99442
3935A7245940l32261l81191l71106l32661k49417j46799l0743J00907K09117L28950
3925A6040736M72638N83315O82098P67082P88054O99148M91883J41681k79067
3916B0387568o73682r36324j044265j046440r65094q37544p11916n75631m36477
3907A3160195l32240k42141j24444m6528L7893J07174J65439K12086K62325K98956
3897A3498715K79735J81308J1588j58736l59909n48444p01293p56895p03441o27445
3887A0115183n66139m76856m15574l36824k99941k24080j73200j45980j13455
$$ y = [20142700, 19854507, 19700478, 19635620, 19600932, 19538805, 19396340, 19139438, 18792336, 18389964, 17998017, 17668179, 17401272, 17241230, 17176950, 17217805, 17335372, 17451956, 17500017, 17445382, 17245940, 16913679, 16532488, 16161382, 15828721, 15579304, 15432505, 15401762, 15502669, 15711786, 16040736, 16513374, 17096689, 17778787, 18545869, 19333923, 20033071, 20524954, 20666635, 20387568, 19713886, 18777562, 17733297, 16686857, 15721763, 14884219, 14172303, 13596672, 13160195, 12827955, 12585814, 12461370, 12414842, 12452735, 12559909, 12725348, 12937434, 13199759, 13498715, 13778450, 13959758, 13971346, 13812610, 13452701, 12904257, 12202964, 11446069, 10742628, 10115183, 9549044, 9072188, 8656614, 8319790, 8019849, 7795769, 7622569, 7476589, 7363134]
3878G363134p9010n8103m8070j9940q091M1705P0673J09271J69871K13259K56263
3867H010962K66268K70337K05980P5857m2606j68366j94977k11422k02670j59403
3857G849960j19722j18842j51664j86881j88033j89455j38538o2756j3623K6205
3847F706651J28859J88837K19080K37971J71934O9273m8515j11417j22733j03903
3837G336037o0674l6381l0623p6654j39078j89416k13130k20830k03367j70460
3827E995424j15520j01648n8702l0909m640J1984J8707L7063L0234L7013L6063
3816E855069M7877N0618P9116J20616J67176K10976K46791L14105L49241M09520
3806G851105M61779N36385N76225O03889N73924M86271L29615Q3030j36472l20505
$$ y = [7363134, 7284124, 7226021, 7177951, 7158011, 7149920, 7191625, 7262298, 7371569, 7541440, 7754699, 8010962, 8277230, 8547567, 8753547, 8829404, 8786798, 8618432, 8423455, 8212033, 8009363, 7849960, 7730238, 7611396, 7459732, 7272851, 7084818, 6895363, 6756825, 6694069, 6680446, 6706651, 6835510, 7024347, 7243427, 7481398, 7653332, 7722605, 7674090, 7562673, 7439940, 7336037, 7275363, 7238982, 7208359, 7131705, 6992627, 6803211, 6590081, 6369251, 6165884, 5995424, 5879904, 5778256, 5719554, 5688645, 5684005, 5695989, 5714696, 5751759, 5781993, 5819006, 5855069, 5902946, 5953564, 6032680, 6153296, 6320472, 6531448, 6778239, 7092344, 7441585, 7851105, 8312884, 8849269, 9425494, 10029383, 10603307, 11089578, 11419193, 11502223, 11365751, 11045246]
3796A1045246m34935m99039m86278m47134l67040k89032k31303j39682n2898k838
3786H095067N2837J12380J82464K32083K81346L27085M07235M77579N22586N09149
3776A1199811L81454J43629j58016l84594n13524m94972m13451l40801k41538
3767I177998j41377o2051L5256J30739J89241K63468L31374L84965L79565L47036
3757A1036214K61843J37508J9240r2468j43252j34085r8068j4934P9929J89194
3747A1241121K86444L66327M19154M16575L28542J98288R006j53890k97715l65088
3737A2448764l69964l13152k50872j85255j51513j28510j55905k09924k64833
3728A0418836l23137l56420l43762l20779k74565j97932j45226q0777j2944O0242
$$ y = [11045246, 10610311, 10111272, 9624994, 9177860, 8810820, 8521788, 8290485, 8150803, 8097905, 8095067, 8147904, 8260284, 8442748, 8674831, 8956177, 9283262, 9690497, 10168076, 10690662, 11199811, 11581265, 11724894, 11566878, 11182284, 10668760, 10173788, 9760337, 9419536, 9177998, 9036621, 8974570, 9009826, 9140565, 9329806, 9593274, 9924648, 10309613, 10689178, 11036214, 11298057, 11435565, 11454805, 11362337, 11219085, 11085000, 10986932, 10971998, 11051927, 11241121, 11527565, 11893892, 12313046, 12729621, 13058163, 13256451, 13265457, 13111567, 12813852, 12448764, 12078800, 11765648, 11514776, 11329521, 11178008, 11049498, 10893593, 10683669, 10418836, 10095699, 9739279, 9395517, 9074738, 8800173, 8602241, 8457015, 8376238, 8363294, 8423536]
3718H423536J09963J68198K19365K62094L26891L50516L36253K89159J77373N3851
3708A0717199m3413j15794j42472q7195m086P2792J41056J72399P1207j29046
3698A0652647l42513n07408n93301n69003n08604m37928l67028l08837k40137
3689F777888j72859j20194p9344k2473L8562L8362O4189R8950J22667J47426J47629
3678G040803R1131L7306k8786n3913n9357l8445J2337P2098R1607N8458n070r9440
3666G118729k02008k93937l69214l83167l52656l20663k80876k27790j62398j39093
3656D386927r0414o0447m6414p792K1693L3323L3627L6418K3590k3925o7381j14119
3644D125086j41698j36432j15592q7823q2156l2189R369M0869Q5888J27812J38485
$$ y = [8423536, 8533499, 8701697, 8921062, 9183156, 9510047, 9860563, 10196816, 10485975, 10663348, 10717199, 10673786, 10557992, 10415520, 10328325, 10324239, 10397031, 10538087, 10710486, 10781693, 10652647, 10310134, 9802726, 9209425, 8640422, 8131818, 7693890, 7326862, 7018025, 6777888, 6605029, 6484835, 6405491, 6383018, 6421580, 6459942, 6524131, 6623081, 6745748, 6893174, 7040803, 7131934, 7169240, 7140454, 7086541, 7027184, 6988739, 7001076, 7073174, 7164781, 7223239, 7218169, 7118729, 6916721, 6622784, 6253570, 5870403, 5517747, 5197084, 4916208, 4688418, 4526020, 4386927, 4296513, 4236066, 4189652, 4181860, 4203553, 4236876, 4270503, 4306921, 4330511, 4306586, 4239205, 4125086, 3983388, 3846956, 3731364, 3643541, 3561385, 3529196, 3538565, 3579434, 3665322, 3793134, 3931619]
3633C931619J14958J4226j00514k09073k66513k55067k45155j98679j71519j44738
3623B469545j04563r0982r4326p1124n9390m0838l7146j6951j5152j0972L684
3612A931785R863K4285L0266L9040K8687M6951O2058Q6293O5098L9720J6014l4572
3600B345488o4650r7740j14622j19862j15341r1666r0142p9830o4873k0864l7206
3589A448692l9086k8246l4793j6361l8532k7158k7442m1691m5893k9709l1466
3578A088315l7255k8984l615j7048k3908k1176j4554p092j0278L639j5553j2887
3566H99604M257j9093O740P396J419m23J16J2445r857O113K270p920q444j6134
3552H78489j2837j0647j0125j0619j0q564o844L872n124K182J5348q234k541R31
$$ y = [3931619, 4046577, 4060803, 3960289, 3751216, 3484703, 3229636, 2984481, 2785802, 2614283, 2469545, 2364982, 2274000, 2179674, 2108550, 2049160, 2008322, 1971176, 1954225, 1939073, 1928101, 1931785, 1941648, 1965933, 1996199, 2035239, 2063926, 2110877, 2172935, 2259228, 2324326, 2364046, 2380060, 2345488, 2280838, 2183098, 2068476, 1948614, 1833273, 1741607, 1651465, 1571635, 1506762, 1485898, 1448692, 1409606, 1381360, 1346567, 1330206, 1291674, 1264516, 1237074, 1195383, 1149490, 1119781, 1088315, 1051060, 1022076, 1018461, 1001413, 977505, 956329, 941775, 934683, 924405, 928044, 912491, 899604, 903861, 884768, 891508, 898904, 900323, 899900, 900016, 912461, 902604, 908717, 910987, 903067, 894623, 878489, 865652, 855005, 844880, 834261, 834251, 825687, 818843, 822715, 817591, 819773, 835121, 826887, 824346, 825277]
3538H25277K703N038N180j2262j2988Q30r181J0110J0649l580p359n69L065J3028
3524H29941J7798P033J2048J2518J221J4441J7919J0115J5807K388L030J3665
3512I57924Q908J9719J3488M014J2500J7898K0317L3050L7834M4873N4953M9493
3500A274971O4176P2270Q4387R5493J10121J14865J34174J44570J29693R1870
3490B316590K3865j5665q8665j21740j23484j40034j25677j13174j04547q4155
3480A423314p0881o1713m4427n7188l8366j6267r864j1808j7276k1770J632O2
3468A075448j7394j5997m297j2195r678Q984q108q156q091j636l211P61m1K145
3454I98534k61R330o108J533P418J2587j0042M552R835R091K3208J3494J2749
$$ y = [825277, 827980, 833018, 838198, 825936, 812948, 813778, 804597, 814707, 825356, 821776, 814417, 813848, 816913, 829941, 847739, 854772, 866820, 879338, 880559, 895000, 912919, 923034, 938841, 941229, 944259, 957924, 966832, 986551, 1000039, 1004053, 1016553, 1034451, 1054768, 1087818, 1125652, 1170525, 1225478, 1274971, 1339147, 1411417, 1495804, 1591297, 1701418, 1816283, 1950457, 2095027, 2224720, 2316590, 2340455, 2324790, 2236125, 2114385, 1990901, 1850867, 1725190, 1612016, 1507469, 1423314, 1352433, 1290720, 1246293, 1189105, 1150739, 1134472, 1124608, 1112800, 1095524, 1073754, 1075386, 1075448, 1058054, 1042057, 1037760, 1025565, 1015887, 1024871, 1016763, 1008607, 1000516, 998880, 995669, 996430, 996389, 998534, 998273, 1007603, 1001495, 1003028, 1010446, 1023033, 1012991, 1017543, 1027378, 1036469, 1059677, 1073171, 1085920]
3441A085920q948n031O107J841m826n053J8781l262r178j4106k0388j8916o050
3428A016891r13j646M972N937K649Q668O816J2865K6298J5938K3716J4680K5804
3415A162675J3554J8532J1276L0181L5105J7466K5355J3204R379L6921J3443J197
3403A388288J7696J2930J8818K0210K0634K9045K8190N0847O5027N4556O7613
3392A773854M4266K0472K2902K7342J3253K6258M8322L9108N0672K3012L1967
3381B121428K0165o824P496K4899L8072M6071M9924O0783N5232L8965K9955M0857
3369B527023N5267L6869K9075L6040L4743L3821K9285M2243M4394N3410K6869
3358B949039M2847O8683O8818R6230Q5102R4822Q7728Q1650P8459P7706P7388
$$ y = [1085920, 1076972, 1071941, 1078048, 1079889, 1075063, 1070010, 1088791, 1085529, 1076351, 1062245, 1041857, 1022941, 1016891, 1015978, 1014332, 1019304, 1025241, 1027890, 1036558, 1043374, 1056239, 1082537, 1098475, 1122191, 1136871, 1162675, 1176229, 1194761, 1206037, 1236218, 1271323, 1288789, 1314144, 1327348, 1336727, 1373648, 1387091, 1388288, 1405984, 1418914, 1437732, 1457942, 1478576, 1507621, 1535811, 1586658, 1651685, 1706241, 1773854, 1818120, 1838592, 1861494, 1888836, 1902089, 1928347, 1976669, 2015777, 2066449, 2089461, 2121428, 2141593, 2134769, 2142265, 2167164, 2205236, 2251307, 2301231, 2362014, 2417246, 2456211, 2486166, 2527023, 2582290, 2619159, 2648234, 2684274, 2719017, 2752838, 2782123, 2824366, 2868760, 2922170, 2949039, 2991886, 3060569, 3129387, 3225617, 3310719, 3405541, 3493269, 3574919, 3653378, 3731084, 3808472]
3347C808472P3575R1035J05944R2026J10521J24595J15508J27011J13110J15861
3337D877658J14707Q1304R1195R8748J22624J33345J42051J47769J54910J94119
3327F158430J97281K29972K16311K33530K35374K43820K79552L15276L45489L59762
3317H814797M18871M69256N55713O69329P90791R15889J015382J090885J199872
3308A5940785J395246J795946K402805L266883M385963N334676M977682K186801
3300D1686787k631349n281724m965766m007901k927534k100016j556608j148798
3292A7067091q26233n85007l97897k50305j13388j5686J00427J97062K92544L60521
3282A5829129M46929N29351O12667P35355R57277J263025J660391K087009K438778
$$ y = [3808472, 3882047, 3973082, 4079026, 4171052, 4281573, 4406168, 4521676, 4648687, 4761797, 4877658, 4992365, 5073669, 5164864, 5263612, 5386236, 5519581, 5661632, 5809401, 5964311, 6158430, 6355711, 6585683, 6801994, 7035524, 7270898, 7514718, 7794270, 8109546, 8455035, 8814797, 9233668, 9702924, 10258637, 10927966, 11718757, 12634646, 13650028, 14740913, 15940785, 17336031, 19131977, 21534782, 24801665, 29187628, 34522304, 39499986, 41686787, 39055438, 33773714, 28807948, 24800047, 21872513, 19772497, 18215889, 17067091, 16240858, 15655851, 15257954, 15007649, 14894261, 14878575, 14979002, 15176064, 15468608, 15829129, 16276058, 16805409, 17418076, 18153431, 19110708, 20373733, 22034124, 24121133, 26559911]
3273B6559911K290337J316395l91621j807856k208763k019001j622462j197065
3265B0919875q79622o38851m29645k54936j02957L8189J57184K48356K84727K95780
3255A9638100L26783L57048L69661L89086M10933M46147M49422M80734N19883
3246B3387797O07047O63846P18367P54329P84366P92973Q40779R02341J002334
3237C0454179J082387J141336J160428J198107J225799J267206J364979J471485
3229D0365906J546561J628265J775883K009432K304210K696039L136901L627890
3221E9091087M241864M949046N817326O873907Q025012R244426J0493147J1849699
3213A20585514J3614598J6136488J9917693K5189140L1869194L9022988M3023025
$$ y = [26559911, 28850248, 30166643, 29775022, 27967166, 25758403, 23739402, 22116940, 20919875, 20040253, 19401402, 18971757, 18716821, 18613864, 18652053, 18809237, 19057593, 19342320, 19638100, 19964883, 20321931, 20691592, 21080678, 21491611, 21937758, 22387180, 22867914, 23387797, 23994844, 24658690, 25377057, 26131386, 26915752, 27708725, 28549504, 29451845, 30454179, 31536566, 32677902, 33838330, 35036437, 36262236, 37529442, 38894421, 40365906, 41912467, 43540732, 45316615, 47326047, 49630257, 52326296, 55463197, 59091087, 63332951, 68281997, 74099323, 80973230, 88998242, 98242668, 108735815, 120585514, 134200112, 150336600, 170254293, 195443433, 227312627, 266335615, 309358640]
3206C09358640L6908262J5477821j5709988l8157573m4101154m0648088l3848322
3199A89279598k7166543k1712763j7430735j4034027j1407513r461972p945986
3192H0120059o741851n782283n011403m396996l858729l454485l118379k830099
3184D4925834k617366k434544k255847k020651j840895j700267j550264j479334
3176B9026666j409081j316729j258464j166192j048211r74335r27469q72655p84373
3167A9269157o86439n96818n21506m79304m85544m78140m90832n14297n04047
3158A4512230m71335m54094m31560l98442l42069l15899k75447k95673l28822
3149A1198889l39885l33082l32327l47943l19172k92802k97353k75775k59418
$$ y = [309358640, 346266902, 361744723, 346034735, 307877162, 263776008, 223127920, 189279598, 162113055, 140400292, 122969557, 108935530, 97528017, 88066045, 80120059, 73378208, 67595925, 62584522, 58187526, 54328797, 50874312, 47755933, 44925834, 42308468, 39873924, 37618077, 35597426, 33756531, 32056264, 30506000, 29026666, 27617585, 26300856, 25042392, 23876200, 22827989, 21853654, 20926185, 20053530, 19269157, 18582718, 17985900, 17464394, 16985090, 16499546, 16021406, 15530574, 15016277, 14512230, 14040895, 13586801, 13155241, 12756799, 12414730, 12098831, 11823384, 11527711, 11198889, 10859004, 10525922, 10193595, 9845652, 9526480, 9233678, 8936325, 8660550, 8401132]
3140H401132k58892k38038k17410j79215j58810j53676j82112j94011j93117k05901
3130F419950k09995k09653j91428j93483j73906j35161j00636p5032q8222r4962
3120D947472j09765j23980j34576j20280j27369j18674j14656j02711r4732r7367
3110C803362j00112q2107m5102j5062l7535l0718k2456o3164n7066o0730o6285
3099C223025q3444p8011o4697q2603p8648p8079o9785o3354m7098m3214l6708
3088B497384k7224j6278k3472k6768j9586j9270j4572j6063k7005j9959l2904
3077B254283n4679m3346m9682m0277m8913l4408j1281l2463k4856j9203k3501
3066A871674k0188j0644j8916k4570j9093j7861k4341k3636r207k0730j4111k0562
$$ y = [8401132, 8142240, 7904202, 7686792, 7507577, 7348767, 7195091, 7012979, 6818968, 6625851, 6419950, 6209955, 6000302, 5808874, 5615391, 5441485, 5306324, 5205688, 5130656, 5042434, 4947472, 4837707, 4713727, 4579151, 4458871, 4331502, 4212828, 4098172, 3995461, 3900729, 3803362, 3703250, 3621143, 3576041, 3560979, 3523444, 3492726, 3470270, 3407106, 3350040, 3289310, 3223025, 3139581, 3061570, 2996873, 2914270, 2835622, 2757543, 2687758, 2624404, 2577306, 2534092, 2497384, 2470160, 2453882, 2430410, 2403642, 2384056, 2364786, 2350214, 2334151, 2307146, 2287187, 2254283, 2199604, 2156258, 2106576, 2066299, 2017386, 1982978, 1971697, 1939234, 1914378, 1895175, 1871674, 1851486, 1840842, 1821926, 1797356, 1778263, 1760402, 1736061, 1712425, 1703218, 1682488, 1668377, 1647815]
3054A647815l7378k2847p271l2514k5651k8311k5529n5344m1019l8597l9982k9060
3042A264312k1448j7778o351j5560j6303j0786P798O554q227M370j4012k5488
3030A147081m3420n1781l3267k3264K802K070J0937M120k898k4527p160J726N954
3017I88373K4714K5293L4934L1985L3308r12j552k0120l1463l8220m8319k8224
3005I69797k6609j8954q698P792R922j7665p828J3757J3936J1666n613r924N00
2992I32079M224l288p642L119m686l421R593K658j9837j6958j8795k4211l7760
2979H15075j4280l5621m1896k9962k1657k2431q952n901m218j4736p402J328K560
2966F11907j5388K158l519j2709Q801J5523j1054J8482J8982p843l906N045j2353
$$ y = [1647815, 1610437, 1587590, 1580319, 1547805, 1522154, 1493843, 1468314, 1412970, 1371951, 1333354, 1293372, 1264312, 1242864, 1225086, 1218735, 1203175, 1186872, 1176086, 1183884, 1190438, 1182211, 1186581, 1172569, 1147081, 1103661, 1051880, 1018613, 995349, 998151, 1000221, 1011158, 1015278, 1012380, 987853, 980693, 982419, 988373, 1013087, 1038380, 1073314, 1105299, 1138607, 1137695, 1136143, 1116023, 1084560, 1046340, 998021, 969797, 943188, 924234, 915536, 923328, 933250, 915585, 907757, 921514, 935450, 947116, 941503, 931579, 932079, 936303, 933015, 925373, 928492, 923806, 920385, 929978, 932636, 912799, 895841, 877046, 852835, 815075, 800795, 765174, 723278, 693316, 671659, 649228, 640276, 634375, 630157, 615421, 608019, 609347, 611907, 596519, 598677, 595158, 582449, 591250, 606773, 595719, 614201, 633183, 625340, 621434, 626479, 614126]
2953F14126k283N363p701J888j0041m346J8213N856q508J062P738N73n065J0053
2939F26928M947k80P29J8160P971K4776K2332J2047L2923L8733K1592M1377M7673
2926H99908O7514P6406J01613J03338J24611J43084J60386J51367J25280N0415
2916B003922j0329o6869j30695j46176j60105j61682j47901j24404r0767n8826
2906I06168o0351m4516n2708l8967k6991k9381k2895k4775l4944j9636o599J174
2894E45579k2873j3034n214j9348n964l948m110N194J2416p486k716K454o113
2881D74837L660q178m352o147j7001j5169j3411j1396K10K2396m478M134n064
2868D20041p701J7243Q704O670j188M537J5483P319N69m435j846j2407j2689j6824
$$ y = [614126, 611843, 617206, 609505, 611393, 601352, 597006, 615219, 621075, 612567, 613629, 621367, 621940, 616875, 626928, 631875, 631595, 632324, 650484, 658455, 683231, 705563, 717610, 750533, 789266, 810858, 852235, 899908, 967422, 1043828, 1145441, 1248779, 1373390, 1516474, 1676860, 1828227, 1953507, 2003922, 1993593, 1926724, 1796029, 1649853, 1489748, 1328066, 1180165, 1055761, 964994, 906168, 845817, 801301, 748593, 709626, 682635, 653254, 630359, 605584, 570640, 551004, 544405, 545579, 522706, 509672, 504458, 485110, 479146, 475198, 471088, 476282, 488698, 481212, 478496, 480950, 474837, 478497, 470319, 465967, 459820, 442819, 427650, 414239, 402843, 403053, 425449, 420971, 425105, 420041, 412340, 429583, 438287, 444957, 443769, 448306, 463789, 471108, 471677, 467242, 465396, 452989, 440300, 423476]
2854D23476j4133O51j2268j0137K892N364j5876K968K282o565L739P88j1215J24
2840C72090M037l22J441l899Q763J0730O336j9052Q200k4353j1356J3332k0396
2827C45551k2273q539N413p716j3485N674O791q113j7564k221J004N44j539p596
2813B75931j1127n328q951k693n449J122j7550n872q183j4395M62k589p369j8402
2799A69607M945M986L310K538p291m700m29m925M833j2652l333K330K93r664O304
2784A56152o872J4509j7195k4615O567l418n226m351n133k267l704J5244K039
2771A21730P849j6005k3013K251o35k146n461q601J4217O265q270j3048j0180
2758F4953P483N323k000p169M647R156J7939J1533Q161k1475j1939m314k005j300
$$ y = [423476, 409343, 409994, 397726, 387589, 390481, 395845, 379969, 382937, 385219, 378654, 382393, 383181, 371966, 372090, 376127, 375805, 377246, 373347, 382110, 392840, 399176, 380124, 388324, 363971, 352615, 365947, 345551, 323278, 314739, 320152, 312436, 298951, 304625, 311416, 303303, 285739, 283518, 284522, 285066, 283527, 275931, 264804, 259476, 250525, 247832, 242383, 243505, 225955, 220083, 211900, 197505, 197967, 195378, 188009, 169607, 174552, 179538, 182848, 185386, 178095, 173395, 172966, 168041, 172874, 160222, 156889, 159219, 159512, 149848, 156152, 149280, 163789, 146594, 121979, 128546, 125128, 119902, 115551, 110418, 108151, 104447, 119691, 121730, 129579, 113574, 90561, 92812, 92177, 90031, 84570, 75969, 90186, 96451, 88181, 75133, 64953, 72436, 77759, 75759, 68590, 73237, 82393, 100332, 111865, 120026, 98551, 86612, 82298, 80293, 78993]
2744G8993J019L810O064r805J456Q544o760j402K425r609Q294J0298q987l863
2730H0477M831K894P772l080j476j0150j1673P76l275r685r225m50J0155J1167
2716F9058n228m377j714Q634j394J973l629m253N534m836k690P017n023J865n169
2701E5768j5813J941m178n175N22L354o659O948o295O34J6444J0269n606K57P964
2686F0375K027k350l821K982o322j6562N920O361P163J946n943M774j3220K613
2672D5943J950j631o955J1832L627l841j3204l798L823J1339k634j0741O937k892
2658C9755j0663M438o913l740M100J2443r450p392J0690k430q608o867J8276m671
2644B8968m883k645L111l638k086r0j366q68J13L959o301j309K43N31l924J2718
$$ y = [78993, 80012, 83822, 89886, 80081, 81537, 90081, 83321, 81919, 84344, 74735, 83029, 93327, 84340, 80477, 85308, 88202, 95974, 92894, 91418, 81268, 69595, 70371, 67096, 57411, 48186, 47736, 57891, 69058, 63830, 59453, 57739, 66373, 64979, 66952, 63323, 59070, 64604, 59768, 57078, 64095, 59072, 60937, 55768, 39955, 41896, 37718, 32543, 33065, 36419, 29760, 36708, 30413, 31047, 47491, 57760, 52154, 52411, 60375, 62402, 60052, 56231, 59213, 52891, 36329, 42249, 48610, 55773, 57719, 51776, 56550, 43330, 45943, 47893, 46262, 39307, 51139, 54766, 50925, 37721, 33923, 37746, 49085, 46451, 35710, 42647, 39755, 29092, 33530, 26617, 22877, 26977, 39420, 29970, 22578, 33268, 30838, 22230, 15363, 33639, 28968, 24085, 21440, 24551, 20913, 18827, 18737, 17371, 16503, 16616, 20575, 14274, 12965, 13208, 13739, 9815, 22533]
2628B2533J4549j3819p049n457J9604O508J203j1426k3049j2110L177L935J6227
2615A4826K104P920j3013K176J6011p935O754Q076k072j1792k57R261L792k3906
2601A1945O333N932j594k978L629j4007j0227m058P912J997j3389J3264j206Q99
2587D452k04Q104J1027q087l755n572J2814P546O042M690o119j2928O061R750
2573C3821j1402M958J636M162r728j6503N330m654j1891J331Q798p842K523L564
2559D103L292K109q225P771O253m380q517m292o14J1357K194j9121j15J2921L981
2544H717r063j0793P299o271k469O600N143j571K348J3263j0116j0072o044N545
2530g484k522q786L810o706r238K944J2972M984P674m6N099k566k000K150K920
$$ y = [22533, 37082, 23263, 16214, 10757, 30361, 36869, 38072, 26646, 3597, -8513, -5336, -1401, 14826, 16930, 24850, 11837, 14013, 30024, 22089, 28843, 36919, 34847, 23055, 22798, 32059, 35851, 11945, 18278, 24210, 22616, 19638, 23267, 9260, -967, -5025, 2887, 4884, -8505, 4759, 3553, 4452, 4248, 12352, 23379, 15292, 11537, 5965, 18779, 26325, 32367, 37057, 30938, 18010, 24071, 33821, 22419, 27377, 29013, 33175, 23447, 6944, 12274, 7620, -4271, -2940, 5858, -1984, 539, 4103, 7395, 9504, 1279, 9050, 15303, 10923, 2406, -1886, -2500, 8857, 11051, -8070, -8185, 4736, 8717, -346, -11139, -3840, -10111, -12580, -5980, -837, -2408, -60, 13203, 3087, -6985, -13029, -7484, -10006, -18792, -14982, -21688, -30926, -27982, -15010, -10026, -2352, -2398, 2701, 135, -1865, 285, 3205]
2515C205j047m095o72p369K603O539p302J1875O650L71o428j4483k737J3421N702
2500F233j4615o983L960J2040r187O234O21l196r699P554M945l736j533k041M393
2485e010K651J0277j0569k2491R310n418J880M529P627N77P301m669j1193P694
2471g504m100p664j1679P161j00q98o88l347J2258L126k161J404J3050m159m509
2456i810R320j331n745j3655m472L864J1279M284P06K365J0800j2357k149j727
2442h628l793m732J4685o87j1856K710l207l934J5427J1534o291J472N982j2505
2428c823j5454J3976J8248m240Q43r727K270j67j819P208q195m291J018O161P250
2413I258k919r685p523J4564O859j4178N79o535J9877J780o9N892K692J018j1964
$$ y = [3205, 2158, -1937, -2609, -9978, -7375, -836, -8138, 3737, 10387, 10758, 4330, -10153, -12890, 531, 6233, -8382, -15365, -11405, 635, -8552, -2318, -1697, -4893, -14592, -7038, -2093, -5829, -7362, -9403, -5010, -2359, 7918, -2651, -25142, -15832, -21250, -19370, -14841, -7214, -6637, 664, -4005, -15198, -7504, -11604, -19268, -30947, -23786, -23886, -24784, -25472, -28819, -16561, -13435, -15596, -14192, -1142, -5301, -9810, -490, -1821, -7566, -21221, -25693, -21829, -10550, -6266, -5560, -3195, 7605, -4752, -6901, -8628, -12421, -17153, -2468, -3155, -15011, -12301, -15508, -19442, -4015, 7519, 1228, 2700, 8682, -3823, -19277, -5301, 12947, 8707, 9550, -177, 2093, 1926, 107, 7315, -880, -5171, -4153, 2008, 9258, 6339, -3346, -10869, 3695, 10554, -3624, -3045, -9580, 10297, 12077, 12008, 17900, 20592, 21610, 9646]
2398I646k2159L88J1474j504k374l876l201J1582J753j3885l424P758O357j3086
2384a4551r911J1058Q839j2834p611K002J0165L474Q949L850j0943j605J5809
2371F691M265n991J873p050L477j462L658k420j7297J125J3601l330j1906N205
2357i561K961L526p938K742J2722L010n253j3499r318L116J8677Q186q607k607
2343a843M429Q321j853o342k821k828O659J486K404L622k91J0705j0107k065j747
2328G729J3063J6652o739j6159n447n895O138N208j7037K259M377P092j6513l9
2314e311Q438o446j502P420j296o46K701l589P420N685p182L319J858j139O280
2299A6010l324o270r125m014R417r466Q324l351J3764O885o648j5427j1870J7128
$$ y = [9646, -12513, -12125, -651, -2155, -4529, -8405, -11606, -24, 1729, -12156, -15580, -7822, -1465, -14551, -24462, -13404, -4565, -17399, -25010, -23008, -12843, -9369, -420, 3430, -7513, -9118, 6691, 10956, 4965, 6838, -212, 3265, 1803, 5461, 3041, -14256, -13131, 470, -2860, -14766, -9561, -6600, -3074, -11012, -8270, 4452, 7462, 2209, -11290, -20608, -17492, 1185, 9371, 764, -1843, 2586, 10907, 9054, 2712, -109, -2937, 3722, 5208, 7612, 11234, 10943, 21648, 11541, 9476, 7729, 20792, 37444, 30705, 14546, 9099, 3204, 9342, 14550, -2487, -228, 4149, 11241, -5272, -5311, 3127, -3319, -4821, 2599, 1303, 657, 3358, -231, 7189, 12874, 5692, 9011, 10869, 9730, 16010, 12686, 6416, -2709, -6723, 2694, -6772, 1552, -1799, 11965, 18850, 12202, -3225, -15095, 2033]
2285B033P316q878m489K028q806R951n776L734Q695j4914l320o1O473O128J0629
2270A0743j2872l502P435Q178q069L033R155j0203K519p755l832J700J4098o05
2256A0023n310M347n93o78N805p059K772r817K310M055j547q610J6482N45m147
2241H578l75j5781Q942J302r302j0986J7129J905k08P721p641O5m492J62J507
2226a474j3244J248j83J0867K286n447J107L631Q950o14r833R302n424n916J9716
2211A4972r950K544j448n073J621M847j1058m45K534K824M370J1450j3713q752
2197e277L786M499N540r545N465J4366r873j7463l007N354O541O667J217K585
2183A0855m714N249k129j6986O309J9895k723p481L714J0906q709q201j689k271
$$ y = [2033, 9349, 471, -4018, -1990, -10796, -845, -6621, -2887, 5808, -9106, -12426, -12487, -6014, 114, 10743, -2129, -5631, 1804, 9982, 1913, 4946, 14101, 3898, 6417, -1338, -5170, -3470, 10628, 10023, 4713, 9060, 8467, 7789, 13594, 6535, 9307, -510, 1800, 5855, 4308, -4302, 12180, 12725, 8578, 8203, -7578, 1364, 2666, -6636, -17622, -493, 1412, 1204, 8925, 1284, 1349, -3143, -2981, -1474, -14718, -13470, -13653, -2786, -500, -5947, -4840, -1209, 7741, 7127, -2706, 6596, 1172, -4744, 14972, 5022, 7566, 6118, 1045, 2666, 7513, -3545, -3990, -1456, 1368, 5738, 17188, 3475, -5277, -1491, 3008, 8548, -997, 4468, 18834, 8961, -8502, -11509, -6155, 386, 7053, 8270, 10855, 6141, 11390, 9261, -7725, -1416, 18479, 15756, 8275, 11989, 22895, 14186, 5985, 4296, 2025]
2169B025o168R689O321J995P666j5755m398n161L664J8038L065j1336Q043K852
2155B0540N661r237q095M233K182j194J0577N656p91n45K723l311L472j655J7033
2140D7249m744k775L237K680O76k352Q283J387K712j1141L100O031j5581R785
2126D8547P483M233M174r408r322J2298n855Q475O009Q584J4471K12Q333K682
2112A00916p912q26M750K893Q611J0222J3376j272L167M652l570L347J5728J7927
2098A72009j196m94q09J9875n798P147K6620P256m699J027K2466J4692J1019K9153
2084B98268O008m613K5662J4843J1139K1233M4501M2874M1925M5788J4830L3593
2072E96051N2440N0462Q8087Q0878Q8399J26962J80311K41887L29974M66420O82636
$$ y = [2025, -4143, 5546, 11867, 13862, 21528, 5773, 1375, -3786, -122, 17916, 20981, 9645, 17688, 20540, 26201, 16964, 8869, 13102, 15284, 14090, 24667, 30323, 29532, 28987, 31710, 28399, 31871, 30216, 47249, 42505, 39730, 42967, 45647, 46323, 43971, 52254, 53641, 56353, 45212, 48312, 54343, 38762, 48547, 56030, 60263, 64437, 55029, 45707, 58005, 52150, 60625, 66634, 75218, 89689, 89901, 98234, 100916, 93004, 92178, 96928, 99821, 108432, 118654, 132030, 130758, 133925, 138577, 135007, 138354, 154082, 172009, 170813, 170319, 169510, 189385, 183587, 190734, 217354, 224610, 219911, 220938, 243404, 258096, 269115, 298268, 304276, 299663, 325325, 340168, 351307, 372540, 417041, 459915, 501840, 547628, 562458, 596051, 648491, 698953, 787040, 867918, 956317, 1083279, 1263590, 1505477, 1835451, 2301871, 2984507]
2061B984507P31257L16656m97727p86394o28981m55592k93929k28851j70997j40532
2051H29417j21688q5174m6501k0941k9921j5162r487l6205n0712l5875k2822l5186
2039C19743k4963k377j8143l8635j3774n504r464q773j1901m620l325n784j2612
2026A59868j8114j9367J521Q36o216l812N948m458m002p599p229n064K950r06
2012I4356r379K641q98l929Q625r522j3540n421O358p723q988L6o335R186n516
1997D9951j0270j1430Q362O421m244j658J1681k679J1789j3646q631O710j556
1984D0800j3203j2580J1898J6676p481j685j7465r141J5559J3854j2347p109r459
1971H317J028k608J812L812R591M053q811l269j347J7323m764q527O6r681j088
$$ y = [2984507, 3715764, 4032420, 3534693, 2748299, 2119318, 1663726, 1369797, 1140946, 969949, 829417, 707729, 622555, 576054, 555113, 525192, 510030, 500543, 464338, 413626, 377751, 354929, 319743, 294780, 292403, 274260, 235625, 221851, 216347, 206883, 198110, 186209, 181589, 178264, 172480, 159868, 141754, 122387, 123908, 124744, 118528, 114716, 120664, 116206, 112204, 104605, 97376, 92312, 95262, 94356, 84977, 87618, 86720, 82791, 91416, 81894, 68354, 62933, 69291, 61568, 52580, 52616, 46281, 55467, 49951, 39681, 28251, 36613, 43034, 38790, 37132, 48813, 46134, 57923, 44277, 35646, 42356, 40800, 27597, 15017, 26915, 43591, 36110, 34425, 16960, 7819, 23378, 37232, 24885, 17776, 8317, 9345, 6737, 8549, 12361, 21952, 26005, 17194, 13925, 12578, 29901, 25137, 16610, 16676, 6995, 5907]
1956E907J1752N939m984j2827L936r873o17J599q661M804M871J4340j0235J262
1942G213n184q87m203P685J1030o721o212K020M364n282j4413P54J5939K803m860
1927D046m700Q745M433J88J229k483o144J0240j0225m706M778p437J546Q370p336
1912E44p984N850J0178n386k895Q912j0083J630J0918r57J731k76r760M375l076
1897C721o617o902k795K445O149j027r866M631m979J173k636Q505m376J4128J3479
1882A5033l641n563r686j2257M310J8003j3771j714J4489k734k670K147J5977
1869A7923j6756L783J536j3253J1988L161n372k179O20Q73J399n972O010Q49j438
1854C172Q433K471m367l198R42q810j644l409P785L530k881n605R35J0002k882
$$ y = [5907, 17659, 23598, 18614, 5787, 9723, -150, -767, 832, -7829, -3025, 1846, 16186, 5951, 7213, 2029, 1142, -3061, 4624, 15654, 8933, 2721, 4741, 9105, 3823, -10590, -9836, 6103, 8906, 4046, -654, 8091, 12524, 12712, 13941, 11458, 5314, 15554, 5329, 623, 5401, -2036, -490, 7880, 544, -7440, -1590, 8588, 3202, 307, 9219, -864, 766, 11684, 10727, 12458, 12182, 2422, 6797, 3721, -2896, -9798, -12593, -10148, -3999, -5026, -14892, -10261, -15240, -14067, -16703, -8198, -12574, 1554, 15033, 11392, 5829, -3857, -16114, -11804, 6199, -7572, -9286, 5203, 2469, -201, 1946, 17923, 1167, 4950, 6486, -6767, 5221, 8382, 3010, 831, 1451, 2324, 3723, -2249, 3761, 4610, 3172, 11605, 14076, 9709, 6511, 7453, -1357, -3001, -6410, 1375, 4905, 2024, -3581, -2646, 7356, 4474]
1839D474q871m345M574R103j5224l376jl991J3663j445n873j7197J1780P284M38
1824i007J301m793k289L767N086l442J3672O270n900k24p742q586N157Q875o001
1809c856j87J819l681M02o100r50P269M57J4405j200M142q485N876m331n570J2382
1793A2392P363n963k856J1323o235J454O629j1035j755q667j0643K202o068K3604
1779A1745r222r897k653R905p449M441O117k008j0425p278J0354J0211p297n589
1765i045L794l654K757N363j1856n00Q559J2358r258j0793j512l388J410n886
1751b1651L746m344K521J4371j4390m297J5975k946J3825j2951j864J4818M572
1738G385j0512j342l500J401q59J172p657M945K983j1859n56j81p341J3550O367
$$ y = [4474, -4397, -8742, -4168, 4935, -10289, -13665, -13666, -17657, -3994, -5439, -11312, -28509, -16729, -9445, -9007, -7706, -12499, -14788, -11021, -5935, -9377, 4295, 10565, 4665, 4441, -3301, -11887, -6730, 2145, -3856, -4043, -2224, -5905, -5503, -11603, -12553, -5284, -4827, 9578, 8378, 12520, 4035, 9911, 5580, 10, 12392, 19755, 13792, 10936, 22259, 16024, 17478, 24107, 13072, 11317, 2650, -7993, -5791, -11859, 11745, 2523, -7374, -10027, -122, -7571, -3130, 2987, 979, -9446, -16724, -6370, 3841, -3456, -9045, -5251, -8905, -6148, -785, -12641, -13141, -4582, 7776, -1482, -12275, -13787, -17175, -15765, -21651, -17905, -22249, -19728, -5357, -19747, -24044, -8069, -11015, 2810, -10141, -12005, 2813, 7385, -3127, -4469, -7969, -6568, -7427, -6255, -13912, -8967, -5984, -17843, -18399, -18580, -25921, -12371, -6004]
1723f004L865j250o764k824O297o331n550q054M799J4342J5617l734n924j2348
1709a3863j628R997m337O174P52j9217r157L609N864K535j417J0711k716L240
1695i453J0850l087r690j5742J4870J442k467Q285p739N64j300r717R674Q003
1681e507N260L726j8459j4R044L785j041K874q005O713q782M743J7214j3543r842
1666a1834M238J399m543q126K304Q223P699K253K975o836j355n020O824j4945
1652a6744J549R357m698l889O161q355Q799P556j0298n879K095J1942J747o163
1638f820K259Q213p038J872j3615Q455n549l18J8884j2480P041p02l984o458P957
1623b283o110J407j93J0025p996l883J5915n145M1j6938l868K2916K264o42N85
$$ y = [-6004, -2139, -3389, -10153, -12977, -6680, -13011, -18561, -26615, -21816, -7474, 8143, 4409, -1515, -13863, -15491, -5494, -9831, -3657, -2905, -22122, -31279, -27670, -21806, -19271, -20688, -9977, -12693, -9453, 1397, -1690, -11380, -27122, -12252, -10810, -13277, -4992, -12731, -12167, -13467, -23184, -13510, -5507, -247, 3479, -14980, -14994, -5950, -2165, -3206, -332, -8337, -1624, -10406, -5663, 11551, -1992, -11834, -7596, -6197, -10740, -18866, -16562, -8339, -640, 1613, 4588, -2248, -3603, -8623, -1799, -16744, -15195, -5838, -10536, -14425, -8264, -16619, -7820, -264, -10562, -16441, -14346, -2404, -657, -6820, -4561, 3652, -3386, -1514, -15129, -6674, -12223, -12541, 6343, -6137, 904, 202, -3782, -10240, -2283, -8393, -6986, -7179, 2846, -5150, -9033, 6882, 1737, 1778, -15160, -19028, 3888, 6152, 5510, 6095]
1608F095n049m993p516k058N972k88J1388j2867P10j9j0202Q529j32M69n095M419
1592a0637J1811j6228j20J0298n381O577M911p205q956J2098K46R140o587L234
1578C201N81j1081l68L392K328K461N003n269q991Q712o636j279o468j1170Q884
1563a6700J2976r779M234p535M078J4248N669p468j173m230J610M48p937l424
1549a4983o269M687P484Q023j023K490K36j0897p08q58J118L648J1561j1520J397
1534e614o486l341Q820N284J0839j1077r137m939J580n592J7824J1773j7065j795
1520h926N668l425J649N701k594Q0o154r260K32P37Q484m319J0746j690k523k091
1504g685j5365J0267J660k211M1J5234m846q265j4693P383J0942M699P820r794
$$ y = [6095, 1046, -3947, -11463, -13521, -7549, -7837, 3551, -9316, -8606, -8625, -18827, -10298, -10430, -9961, -15056, -10637, 1174, -15054, -15174, -4876, -10257, -3680, 1231, -5974, -14930, -2832, -2586, 6554, -33, 3201, 3782, -7299, -7667, -4275, -1947, 514, 5517, 248, -8743, -31, -6667, -7946, -14414, -25584, -16700, -3724, -13503, -9269, -16804, -12726, 1522, 7191, -277, -1450, -5680, -4070, -3622, -11559, -14983, -21252, -16565, -9081, -1058, -2081, 409, 645, -10252, -10960, -11818, -10700, -7052, 4509, -7011, -5614, -12100, -15441, -6621, -1337, 9502, -1575, -10712, -15651, -14071, -19663, -1839, 9934, -7131, -8926, -3258, -6683, -5034, 667, -1927, -1847, -8001, -17261, -17029, -16292, -7808, -12127, -1381, -3071, -5594, -7685, -23050, -12783, -11123, -13334, -13293, 1941, -2905, -11170, -25863, -18480, -7538, -2839, 4981, -4813]
1490d813q086k780J747L335q05L070J62r748n72M43N525K1314m91j2388j3566
1475a7653J381m969Q945J906l714Q350j330Q740J274n527r906Q269J417p063l640
1460a3520M347J3307L91k1013m365J2020P221r901L055j175J8521l222l659j3272
1446a1265q410P096O787J008P749N3l486J0171N784j0878j028k0489O210n02O241
1431d959J3905n01n37m992o682J610J1487q332j3698p766J0329N528M74M153Q056
1416H075p989n060O09k94R611M169q740P892P757j3360K800M18j1064l503O240
1401b439j0596j0566J4487R775p831P644q921p147k497o112J1825P501P521P699
1387A0343j0753N762p64n871l137R09J605N019J374M034r41j1453q514r144Q491
$$ y = [-4813, -12899, -15679, -13932, -10597, -11402, -8332, -8170, -17918, -18490, -18047, -12522, 8792, 8301, -4087, -17653, -16272, -21241, -12296, -10390, -14104, -5754, -7084, 1656, 2930, -2597, -12503, -4234, -2817, -9880, -13520, -9173, 4134, 4525, -16488, -20853, -8833, -1612, -11513, -8458, -9633, 8888, 5666, 2007, -11265, -19675, -12579, -5792, -4784, 2965, 3018, -468, 9703, 15487, 4609, 3581, -16908, -10698, -11200, -4959, 8946, 8445, 7908, 2916, -3766, -2156, 9331, 999, -12699, -20465, -10136, -4608, -4134, 19, 8075, 86, -4974, -4365, -4659, 4952, 9121, 381, 8273, 16030, 2670, 5470, 5888, -5176, -8679, -2439, -13035, -23601, -9114, 661, -7170, 474, -8447, -15594, -18091, -24203, -12378, -4877, 2644, 10343, -410, 5352, 4588, -1283, -4420, -3511, -1906, 3113, 4487, 8521, 7580, -3873, -12387, -21531, -13040]
1372a3040Q929J2012j0314n647m006p787r95J7046j1150j0297Q076R685K957J229
1358c302q14m287O61m936L213P211p243R040m736o502o780R510j2774J2447J0097
1343H05Q065r269M452l035j3058J1425M294K39l51j1582Q294q447q240J244Q194
1328f970n754J28J0932l259K629M761j2360l933j284J4985N09j995L778J769J1705
1313A5641j8510J465P79K888j2468J2339K845r712p636J059N435N804J0813j5360
1299d618p099L884K444o230j1511J600J0435J882N168l685j470J4628m759N275
1285E944j160k175J300J797o095j095o815K630M457L947q885K189R371R720j6436
1270a306j8740N428L320J1457J9740j1561q551n256O68j1728J1498J070j025m237
$$ y = [-13040, -4111, 7901, -2413, -8060, -12066, -19853, -20848, -3802, -14952, -25249, -17173, -7488, -4531, -3302, -4116, -8403, -7742, -12678, -9465, -2254, -9497, -457, -5193, -11695, -18475, -8965, -21739, -9292, 805, 8870, -399, 4053, 1018, -12040, -615, 3679, 3918, 3567, -8015, 279, -8168, -16408, -15164, -6970, -12724, -12596, -1664, -4923, -2294, 2467, -9893, -13826, -15110, -125, 384, -1611, 2167, 3936, 15641, -2869, -1404, -625, 2263, -10205, 2134, 4979, -4733, -12369, -11310, -5875, -71, 10742, -4618, -11717, -7833, -5389, -11619, -23130, -21530, -11095, -9213, -4045, -7730, -9200, 5428, 669, 5944, 4784, 2609, 3909, 5706, -389, -1484, -8299, -5669, -1212, 2735, -6150, -3961, 5410, 15130, -1306, -20046, -14618, -11298, 159, 19899, 8338, -213, -5469, -4801, -16529, -5031, -3961, -4986, -9223]
1256i223J9j382Q603O601q256M792n348r25J4073K033j8045J181n362J0482J1392
1241A0635N152j6913j3232R454L37L438K901J4338K762j3784N870q298O52j961
1227A351n643L563K288j3374O089N858m867M700n871j514m197K962k858j374L237
1212i650J0437k682o702P159j69L586j011J667K569p857m659K989n519m397P880
1197f359N62j3480J3994O286m678j347K968n189m758R286J666l316n792O687N462
1182A992q204q348O584M812k923O642Q522m768O847p934l544J5932q185n294O920
1167I051q72j0880m582L515j231J3009Q85q269K193P313m586Q407L930j9395N662
1152D150K715P59o005l031K48J816n754J997L959k326J860j211j160J5106J263
$$ y = [-9223, -9204, -10586, -1983, 4618, -3638, 1154, -4194, -5119, 8954, 10987, -7058, -5877, -11239, -757, 10635, 15787, -1126, -14358, -4904, -4567, -1129, 1772, 16110, 18872, 5088, 10958, 2660, 3312, 1351, -4292, -729, 1559, -11815, -5726, 132, -4735, -35, -5906, -7420, -11617, -8655, -11513, -12887, -9650, 787, -1895, -8597, -1438, -1607, 1979, 968, 2635, 5204, -2653, -7312, -4323, -9842, -14239, -6359, -5797, -19277, -5283, 1003, -3675, -5022, -2054, -7243, -12001, -2715, -1049, -4365, -10157, -3470, 1992, -6212, -14560, -7976, -3164, -6087, 555, 9077, 4309, 11156, 3222, -322, 15610, 7425, 2131, 9051, 8179, -2701, -7283, -3768, -4999, 8010, 8895, 626, 2819, 10132, 5546, 13953, 17883, -1512, 4150, 6865, 7624, 1619, -1412, -1164, 652, -5102, -3105, 854, -1472, 388, -823, -1983, 13123, 14386]
1137A4386j0234n75P907J1882p894k0740m954l132L537J249M924L182l015M141
1123F64j2069n065J859K561J0890n717P15P159L554o59o049k815o731K900Q017
1108g86o355K6765j6133j0275J488q785R48J0881J9030k0840Q65j667N018L710
1094C864J453P995J418j6291j174J1145k879j970J738p989N139L239j7283J7538
1080E943J1120J84J627m453m919Q272J0715r087n964m313Q791j3953j0203j914
1066h154J2244O162M747j255n896M129p676k474J68K33j1229M487N743J061O698
1051H988l406P5j7979q58O838N698O446q094l496k130O511o460m296J2926m877
1036d114Q917O54q426q160J5212J6993j3135q052K844N595q596K826j8439p48
$$ y = [14386, 4152, 3577, 11484, 23366, 15472, -5268, -10222, -13354, -9817, -8568, -3644, -462, -3477, 664, -11405, -16470, -14611, -12050, -1160, -6877, -6162, 997, 4551, 3892, -2157, -4972, -11703, -8803, -786, -7141, 19624, 3491, -6784, -5296, -14081, -13133, -2252, 16778, -4062, -3197, -4864, 154, 3864, 5317, 13312, 14730, -1561, -2735, 8410, 5531, 3561, 5299, -2690, 2449, 5688, -11595, 5943, 17063, 17247, 18874, 14421, 9502, 17774, 28489, 19402, 13438, 9125, 17916, 3963, -6240, -8154, 4090, 10252, 14999, 13744, 7848, 11977, 4301, 1827, 1995, 2228, -9001, -4514, 1229, 2290, 8988, 5582, 5657, -12322, -13180, -6342, -644, 5802, -2292, -5788, -7918, -1407, -7867, -12163, 763, -4114, 4803, 5457, -2969, -11129, 4083, 21076, 7941, -111, 2733, 8328, -268, 2558, -15881, -16629]
1022a6629J3596K712l53M169j2216M75k760P049q34k894M803k248J2916n45m790
1007B451j91m26M07l63L876R72o268M441o753j225o453L969M520J604l388J736
991a091J651l380r717k689J8482M269q826K55o834L829O040q308p637L456K989
976g511K3065j261L380k00j0087j029p408M046K078j0917q553J1881J605l802
962d713p125J0757L58J1785j003o039J074l844R83N716m957q971M400j636r08
947d123M691n426k893L10N735Q298k338J560l739P816J0224r001j1783J360N391
932F082K098M687L813m407l997k1035N944k780j696R021j7713K132J2481O606
918A236j7593P381M951m708L995j0502P839J960L829k392o843N092r145P991J1514
$$ y = [-16629, -3033, -321, -674, 3495, -8721, -8246, -11006, -3957, -4791, -7685, -2882, -5130, 7786, 7241, 2451, 2260, 1834, 2241, 1878, 5754, 6726, 458, 4899, -1854, -3079, -9532, -5563, -1043, 561, -2827, -1091, 560, -2820, -12537, -15226, 3256, 7525, -1301, -1046, -7880, -4051, 1989, -6319, -13956, -10500, -7511, 15554, 14293, 17673, 17473, 7386, 6357, -1051, 2995, 5073, -5844, -14397, -2516, -911, -4713, -11838, -1081, -723, 11062, 10059, 4020, 5094, 1250, 2233, 7949, 2992, -5979, -1579, -3215, -4123, 568, -4858, -7751, -7441, -1706, 6592, 4254, 5814, 2075, 9891, 20115, 11114, -669, 691, 6082, 8180, 12867, 16680, 12273, 8276, -12759, -6815, -9595, -11291, -2270, -19983, -17851, -5370, 1236, -16357, -8976, -4025, -8733, -4738, -15240, -7401, -5441, -1612, -4004, -10847, -5755, -14900, -6909, 4605]
903D605j509k324N659m517M960L977Q082r888j2816M499o79J332k5309p6P734
888a6270N294P545q373r27J4605L307m185N33M564o418n915O982O680p007q326
873g911J2962M873k3085l23J5660P564L816j3135N406j0731P998J0396Q863n115
859A7238k775k896p264P371m688j3239J3421M009j1311l474K679m14J2001r6o788
844C774j942L391j0548o717J4161r153J2050j2311K431J2581m750j5075K080l73
830a0401K35K030o026k110N325J4004Q08j331R619j3441l35J7946o48j791k49
815A3635p656o914m657K188OO129j766m917J1989k155k404j2140J3297Q52J747
800G234M988j1165p460K019k051n282L042R074p736N715j2592N684J0588m613
$$ y = [4605, 3096, 772, 6431, 1914, 6874, 10851, 18933, 9045, -3771, 728, 49, 1381, -23928, -24004, -16270, -10976, -3431, -11804, -12731, 1874, 5181, 996, 1529, 6093, -325, -6240, 742, 7422, 415, -7911, 5051, 9924, -13161, -13484, 2176, 9740, 13556, 421, 5827, -4904, 3094, 13490, 22353, 17238, 14463, 11567, 4303, 11674, 6986, -6253, 7168, 11177, -134, -3608, -929, -1343, 10658, 10562, 3774, 1832, 5223, -5325, -12042, 2119, -7034, 5016, -7295, -4864, 7717, 2967, -12108, -10028, -10401, -10166, -8136, -14162, -16272, -10947, 3057, 3865, 2534, 12153, -1288, -1623, 16323, 15675, 13884, 13635, 5979, -935, -5592, -3404, -3398, 2731, 965, -3952, 8037, 5882, 3478, -8662, 4635, 5487, 7234, 12222, 1057, -6403, -4384, -6435, -11717, -8675, 399, -7337, -1622, -14214, -8530, 2058, -2555]
786b555J0568r205K726m908m867o06q209l040J3888J1161L898j7093P380J3959
772A3097o93j1316l028j1605J1284O825j048J643Q14o467j034P723J058K512L551
757A3316j8397J0679j3066k230J6752K960L165n563j2788l347P298R62R02p597
743f954J3218m533m343j372L729O648M697k156p737m478J5863K90K80M935j0804
728G283m330M51J2112K405o674j4127j1437N235j272r60K1273j4Q121K922j0571
713A0417M735j4492n285k909J0202k517j448k12K157o992P273l869r836k356O994
698h138P269J1708K638j1181l981l387R807n753o190k995l0K1502o760J2939k832
683A4616n403N908j9573P10M366Q03p270J519R807J9911m575j0123k3851K945
$$ y = [-2555, 8013, -1192, 1534, -3374, -8241, -8847, -17056, -20096, -6208, 4953, 8851, -8242, -862, 13097, 12404, 1088, -1940, -13545, -2261, 4564, 3516, 5159, 5973, -494, -1528, 6195, 7253, 9765, 13316, -5081, 5598, -7468, -9698, 7054, 10014, 13179, 7616, -5172, -8519, -1221, -259, 643, -6954, 6264, 1731, -2612, -3984, -255, 6393, 11090, 8934, 1197, -3281, 12582, 12872, 13152, 18087, 7283, 2953, 3404, 15516, 17921, 11247, -2880, -14317, -9082, -10354, -11314, 9959, 9945, 18066, 20988, 10417, 15152, 660, -4625, -7534, 2668, 151, -1297, -1509, 648, -6344, 929, -2940, -12776, -15132, -8138, -869, 10839, 13477, 2296, -1685, -5072, 4735, -1018, -7208, -10203, -10233, 11269, 4509, 17448, 14616, 9213, 15121, -4452, -3742, 624, 1427, -5843, -4324, 5483, 25394, 20819, 10696, -13155, -10210]
669a0210P969P702r500M859J376k715M46n092J4237p313N882o296P065Q92l168
654F134J622p582j3069J0747O437L933J2607o396j6104M954M660j0736N144J3240
640A5591M345o631n591m617l702l489N245m299k234P610o975Q55J8746n591j0162
625h99j435J4456o190p782J0044m646m862j4610N849J1556R105n085l434r058
611f991L25O005R518n631n929l946l393J5252L767n413R130m613j4198Q206m319
596b230m536J6341J7250j0258k853j4623n974J305p868L903R378P024o38p089
582h68j94P800j4951n217M971J0536Q955o981n144R98J1160j0212N060o426j1861
567a2374J1655l094L842J6029m487k0117j53O844K26Q273J179K314r660O456J1304
$$ y = [-10210, -2241, 5461, -4039, 820, 2196, -519, -73, -5165, 9072, 1759, 7641, 1345, 8410, 9302, 6134, 7756, 174, -12895, -2148, 4289, 8222, 20829, 14433, -1671, 3283, 7943, -2793, 2351, 15591, 19936, 13305, 7714, 3097, -605, -4094, 1151, -3148, -5382, 2228, -4747, -3892, 14854, 9263, -899, -2334, 12122, 5932, -1850, 8194, 3548, -1314, -15924, -10075, 1481, 10586, 5501, 2067, -6991, -6666, -661, 8857, 3226, -2703, -6649, -10042, 5210, 8977, 3564, 12694, 8081, -6117, 2089, -2230, -6766, 9575, 26825, 16567, 13714, -909, -6883, -5578, -13446, -9543, -165, 6859, 6221, -868, -1062, 6738, -8213, -13430, -8459, 2077, 11032, 4051, -1093, -95, 11065, 853, 5913, -513, -12374, -719, -3813, 29, 16058, 11571, -8546, -8699, -1855, -1629, 6644, 7823, 10137, 477, 6933, 18237]
552A8237j3369M752L315j2344K488Q007l014j4431Q316L616q722J3257J597r843
538A862k982j6r51Q332J6172j2015j5598j1434J1179J489p232R664m058r928n506
523b1022Q850j5310K456R300N594J7320l728N128L354k346k2600L29k646J4432
509h89K779N941l58o035K538j7403J263J2871J439R337l125j1633J7043j1820
495A948q012R984K901L518K976L195r014r451O625O437J4649l156k0827k715K371
480A429M993m599m528J2540q800m1j2064J0378K757j4970Q108J207k115N834J480
465A609J1471J212q440j4648k17M791L558N364J3519r837n619o361l25J0013J513
450G603n633J6009Q073r4q597n256L851l038j5325K788J3723J1955n190m849R183
$$ y = [18237, 4868, 9620, 12935, 591, 3079, 11086, 8072, -6359, 1957, 5573, -3149, 10108, 11705, 1862, -1120, -1136, -2087, 6245, 22417, 10402, -5196, -16630, -5451, -3962, -11194, -1530, -5588, -15516, -21022, -12172, -27482, -25026, -15726, -10132, 7188, 3460, 8588, 11942, 9596, -13004, -12675, -15321, -889, 1890, 7831, 7473, 1438, 3976, -13427, -12164, 707, 2146, 11483, 8358, -3275, 13768, 1948, -6064, 3920, 6821, 10339, 13315, 16510, 7496, -1955, 4670, 11107, 25756, 22600, 1773, -942, 1429, 6422, 1823, -2705, 9835, 1035, 994, -11070, -692, 2065, -12905, -4797, -3590, -5705, 129, 1609, 13080, 14292, 5852, -8796, -9013, -4222, -664, 4700, 18219, 8382, 2763, -3598, -3923, 6090, 7603, 1970, 17979, 26052, 25958, 17361, 12105, 15956, 12918, -2407, 381, 14104, 26059, 20869, 16020, 25203]
435B5203r703j1888n313M362j985R597m880j2460l215r02N195J4154m152j4834
421a0821R618J2623L251r566L738K4194k2518j877r438L778J1333j0252r495O133
407G01M929L919j629k231M301j13K400P79r635j5323N148P736p587q104j253M412
391a1550Q001P251N748n798P803J3532j2751k506m27K467M488j635K481q175K64
376I193j1308q436J2953J1888l416l518O66m723j2872p164R034K0427L175m033
362A1866n564q234l34n367l63K818O918P460m562q102J2550l129r265O124L966
347F782l878K453O790l071j1244J027j028r14R622k903m266O875Q373r212o45
332D761J3J742o983J438n286K727J7439k913O502j599r375o878j7247O045R548
$$ y = [25203, 15500, 3612, -1701, 2661, 676, 10273, 5393, -7067, -10282, -11184, -5989, 8165, 4013, -10821, -1203, 11420, 14671, 5105, 8843, 33037, 10519, 8642, -796, 2982, 14315, 4063, -5432, 701, 5630, 9549, 7920, 5689, 9990, 9877, 12277, 13056, 3421, -11902, -6754, 982, -6605, -14709, -15962, -11550, -3549, 3702, 9450, 3652, 11455, 24987, 12236, 9730, 9303, 11770, 16258, 14623, 17104, 8929, 9193, -2115, -10551, 2402, 14290, 10874, 7356, 8022, 3299, -9573, -16737, -7703, 12724, 15899, 11866, 6302, -1932, -2266, -7633, -7996, -5178, 1740, 9200, 4638, -3464, 9086, 5957, -3308, 2816, 6782, 2904, 5357, 12147, 9076, -2168, -1141, -2169, -3083, 6539, 3636, -630, 6245, 14618, 5406, 4761, 4774, 6516, -467, 971, -4315, -1588, 15851, 12938, 19440, 17841, 8466, 1588, -15659, -9614, -66]
317f6j555K5717k67k1202p106J493K21Q631j18o67j0400P639n297J08N056M717
301F904m90q196L319Q286L462l660o276j233l751p048J9621O271n333p949r670
286e743J7J5160o187P04L675N990j873j3103o869r601N303n412R264K557m281
271a0399Q971M809K876M182J459N45N272J243o534n316k366R685r787p74R440
256A3306q747J2730o356o894L088J0463N636q417n50j8343M297P379m323J574
242D843k777o0k9m863K651O171j4598M999m700P26K403P624j2168m187J7745J0874
226A4654n574O808N988q03j4873m061J1450L867m819L24j079n359L013o988q91
211A657o726K539k24m939P560j938Q847J0753J382j1849L498J243r665L029P050
$$ y = [-66, -1621, 24096, 23829, 2627, -4479, -2986, -2765, 5866, 5748, 5081, -5319, 2320, -2977, -2869, 2187, 6904, 6414, -1782, 1537, 9823, 13285, 9625, 3349, 2116, -1635, -8683, 10938, 17209, 11876, 3927, -5743, -5726, 9434, 3247, 3951, 7626, 13616, 11743, -1360, -8229, -17830, -12527, -17939, -8675, -6118, -10399, -1428, 3381, 6257, 10439, 11898, 12443, 17715, 18958, 12424, 7108, 4742, 14427, 4640, 3866, 13306, 4559, 17289, 10933, 4039, 7127, 17590, 23226, 14809, 14259, -4084, 213, 7592, 3269, 4843, 2066, 2006, 1977, -2886, -235, 5936, -8662, -3663, -8363, -7637, -5234, 2390, -9778, -13965, 3780, 14654, 9080, 15888, 21876, 21073, 6200, 2139, 13589, 17456, 12637, 12961, 11882, 6523, 9536, 2548, 1657, -5069, -2530, -2754, -7693, -133, -2071, 6776, 17529, 18911, 7062, 10560, 11803, 2138, 5167, 12217]
196A2217j3290j24Q542Q832q808o868m109j3544Q842K298O807J3318j780m492
182G841m100q100l110J1563Q473j605M62j0198M148P579L937j2492r784l658J496
167g548N055J0460q070P357j056k539o824O844o364j872j780l630J2115N219K479
152I846r074P325k027o950M341J3339r119o680m659k742J2884j602L310R299P256
137B4747j6052l028N444p600O533r579M728p727l459N021n863Q77N007P207m042
122B214P403L564l930j766m633M625j330j3492R383J6556k114l414J955j0765
108D256M672q48K523n107j885l103j886O077o94K094L177n494K35l464r308J2458
92C703J0441O978n371l570J79q879k673J2526O63j0065M462j58k685r753L795
$$ y = [12217, -1073, -1197, 7345, 16177, 7369, 501, -3608, -17152, -8310, -6012, 795, 14113, 12333, 7841, 3741, -4359, -7469, 4094, 12567, 10962, 11424, 1226, 5374, 12953, 16890, 4398, -5386, -9044, -7548, -2493, 7967, -103, 7254, 6198, 3659, -3165, 3679, -2685, -4557, -6337, -9967, 2148, 7367, 9846, 772, 8097, 6070, -880, 3461, 16800, 7681, 1001, -3658, -6400, 6484, 4882, 8192, 17491, 24747, 8695, 5667, 11111, 3511, 10044, 465, 5193, -2534, -5993, -972, -6835, -5958, -951, 6256, 2214, 9617, 13181, 9251, 7485, 2852, 7477, 6147, -7345, 2038, 18594, 16480, 13066, 15021, 4256, 8928, 8080, 10603, 5496, 3611, 508, -1378, 4699, 4005, 6099, 9276, 3782, 4017, 553, -8755, 3703, 14144, 21122, 15751, 12181, 12360, 3481, 808, 13334, 13997, 3932, 8394, 8236, 5551, -4202, -407]
77d07Q75N771N045q109j0709J046Q778j821K891N59j822l878N63P490L039j088
61H223M095m188q962p725N887N221j0143P841J0943N37n360j1010p54O371O865
46G841J290K724q507k275K791M510n20L634q76K030k45j34j946J655l373j0515
30a916O565O983r092n662O923J251J1838l072r416m228L031l923l765R586J970
15G073j308n74n098j2N140L156L036p324L891l101Q31o909J0072n272k571
0A030
$$ y = [-407, 468, 6239, 11284, 3175, -7534, -6488, 2290, 469, 3360, 3919, 2097, -1781, -1218, 6272, 9311, 8223, 12318, 8130, -832, -8557, -2670, 2551, -7592, 249, 11192, 11729, 6369, -4641, -5395, 976, 7841, 9131, 11855, 3348, 1073, 3864, 8374, 7854, 11488, 10612, 12642, 12397, 12263, 10317, 11972, 8599, -1916, 4649, 11632, 2540, -3122, 3801, 5052, 16890, 13818, 4402, 174, 3205, -718, -4483, 5103, 7073, 5765, 5191, 93, 81, 5221, 8377, 11413, 4089, 7980, 4879, 5710, -1199, 8873, 3601, 1030]
$$ Imaginary data points
##PAGE= N=2
##DATA TABLE= (X++(I..I)), XYDATA
16383d68681K229N942J3960J380J2988J651L138O351M747L8Q930J077J4026Q118
16369c84106N757J5687O238m206Q333Q071N593L179J5505J974R903J0839J3690
16356b83543p024n786K1389R445m454K106P917J1023J1161J0485N922P440j533
16343b15452M210O914J4008R998j993J146M972J24J3531O369J0382J1934M973
16330a28884L506J1818M556k751R033O040J6632m40l282P565O731N530J3611L66
16316d9969N925P840Q743M495n963N852J0446R531O226J2552Q237q8O62j101O928
16301C0316M501K2625K820o154P33Q624R532L748P609J3454N101o334L074P127
16287A06776J0191J660M885K0346p074l097L748K3091P870N523J2582j671L867
$$ y = [-468681, -466452, -460510, -446550, -445170, -432182, -430531, -427393, -421042, -416295, -416257, -407327, -406250, -392224, -384106, -378349, -362662, -356424, -360630, -352297, -344226, -338633, -335454, -319949, -317975, -308072, -297233, -283543, -290567, -296353, -274964, -265519, -269973, -267867, -259950, -248927, -237766, -227281, -221359, -213919, -215452, -211242, -204328, -190320, -180322, -182315, -181169, -176197, -176073, -162542, -156173, -145791, -133857, -128884, -125378, -113560, -109004, -111755, -102722, -96682, -80050, -80490, -83772, -76207, -69476, -63946, -50335, -49969, -44044, -36204, -27461, -22966, -28929, -23077, -12631, -3100, 3126, 15678, 23915, 23827, 24489, 23388, 30316, 34817, 57442, 60262, 54108, 54841, 63465, 72997, 76745, 84354, 97808, 102909, 96575, 99649, 106776, 116967, 118627, 123512, 143858, 136784, 133687, 137435, 160526, 168396, 173919, 186501, 184830, 188697]
16274A88697J1068l440p0M830K114N223J983R40m443L728N705N509Q964K285l548
16259B29545J3854R449J2319j862L56m179R436O906J0109k509j256P979L940Q355
16245C02442K989r84M761P335O918q471l432J1098J6447N524J1327J156j6488
16232C40622N014Q779J0307l675k006q90O482j867M155m537P770J7347J582n551
16218C83532P845P86j022J234P211m96N675O299L814N101K267N188n542N887N101
16203D32880L012o45l512O379m424j56J7445k36J0651J670K077J901k790P585
16189D71837J301N530j3927N310Q997K46j2015k601K477J5936j317l064Q090K835
16175D89635j085L226K511J322k292M275M808O263L285j4618K466J188O201m808
$$ y = [188697, 199765, 196325, 196255, 201085, 203199, 208422, 210405, 211345, 206902, 210630, 216335, 221844, 230808, 233093, 229545, 243399, 252848, 265167, 263305, 263661, 259482, 268918, 275824, 285933, 283424, 282168, 290147, 294087, 302442, 305431, 304447, 309208, 316543, 323461, 314990, 311558, 322656, 339103, 344627, 355954, 357110, 340622, 345636, 354415, 364722, 361047, 359041, 358151, 364633, 362766, 366921, 362384, 370154, 387501, 389083, 383532, 391377, 392163, 391141, 392375, 399586, 399090, 404765, 411064, 414878, 419979, 422246, 427434, 421892, 427779, 432880, 435892, 435247, 431735, 438114, 433690, 433534, 450979, 450743, 461394, 463064, 465141, 467042, 464252, 471837, 473138, 478668, 464741, 470051, 479048, 479294, 467279, 464678, 467155, 483091, 481774, 478710, 486800, 489635, 488550, 491776, 494287, 495609, 493317, 497592, 502400, 508663, 511948, 497330, 499796, 500984, 507185, 502377]
16161E02377J116J1718P350J863j2583J2299o29j643M349j164Q75j794J2190L123
16147E39447M367k110M600j536K1577j499j0906q55j1089n710R269N282q374q010
16133E34453O519r12R979K613k658P68j994L869k701N665r977M06P663K987J695
16118E58375l116J061K171j1105N17J1429o396J2225J1071P063n918p869o23J957
16104E70842n414P194O533o225j0825J1821N338j703j0433R755K985m214P887
16091E83541j3753k325R799R963l847Q609O387k804j0966m572O707r619L627j4897
16077E65850P960M907J5768K082o324N619j1445k748k010m715m310M427Q940Q62
16063E84863m929J6953j1418J0206Q001q048l538L622l03o198L149R274k244p19
$$ y = [502377, 503493, 515211, 522561, 524424, 511841, 524140, 523511, 521868, 526217, 525053, 525928, 524134, 536324, 539447, 543814, 541704, 546304, 544768, 566345, 564846, 553940, 553085, 541996, 536286, 545555, 550837, 542463, 534453, 540972, 540060, 550039, 552652, 549994, 550762, 548768, 552637, 549936, 555601, 545624, 546030, 553693, 556680, 558375, 555259, 556320, 558491, 547386, 547903, 559332, 552936, 565161, 576232, 583295, 577377, 569508, 568885, 570842, 565428, 572622, 579155, 572930, 562105, 573926, 579264, 577561, 567128, 576883, 579868, 575654, 583541, 569788, 567463, 577262, 587225, 583378, 591987, 598374, 595570, 584604, 580032, 586739, 577120, 580747, 565850, 573810, 578717, 594485, 596567, 590243, 595862, 584417, 581669, 579659, 574944, 570634, 575061, 584001, 584863, 579934, 596887, 585469, 595675, 603676, 595628, 592090, 595712, 595409, 589211, 592360, 601634, 599390, 598671]
16049E98671j1244J976M95k141p533r95K181J2848J125J381p389o425p808l76
16035E74766J9313l26k393R345n259l591R801n626q281Q784P721j4132r696L224
16021E83650M812q643O258n658K440Q351j3184O994R663L790L919p660r243J4958
16007F00447k517Q54o158l404N06j563L724o079J0521M035q065r712l120J0714
15993E90183M818n614p27J879m284m899q56M279K611N80L46j113J0837m39K959
15978F00560k57j771N334J0833j0114j3352R880j2604j0439J5170L487R58L515
15965F01200pN294j3893J0055m962m060J066K177K1010K928m310j6177M886N108
15951F10315p973J522k371K780K89r909l71l428J3525J178o461j230p199j773
$$ y = [598671, 587427, 589403, 589898, 587757, 580224, 579229, 581410, 594258, 595383, 596764, 589375, 582950, 575142, 574766, 594079, 593753, 591360, 600705, 595446, 591855, 601656, 596030, 587749, 596533, 604254, 590122, 580426, 583650, 588462, 579819, 586077, 580419, 582859, 591210, 578026, 585020, 594683, 598473, 602392, 594732, 585489, 600447, 597930, 598784, 592626, 589222, 589728, 588165, 591889, 585810, 596331, 600366, 592301, 582589, 579469, 590183, 595001, 589387, 588660, 590539, 586255, 581356, 580500, 584779, 587390, 587970, 588316, 587203, 598040, 597601, 600560, 600303, 598532, 603866, 614699, 604585, 591233, 601113, 588509, 578070, 593240, 596727, 597685, 601200, 601193, 606487, 592594, 602649, 597687, 593627, 594693, 596870, 617880, 620808, 616498, 600321, 605207, 610315, 602342, 603864, 601493, 604273, 604562, 594653, 594282, 590854, 604379, 605557, 599096, 597866, 590667, 588894]
15937E88894O913P685p56m551J035n773j651O630P370l314j75k623P359o834p213
15922E92996j1382P412O159j964J1652j1170M633k246O020l437m723N438p47L811
15908F02452k066J3292m257M687l074p194O00j500L192j1635O305M037p621O004
15894F03222j0060J1713j228q50l130o838J8607r972r329l200Q061j637L481o630
15880E92210N858K762j01j5719j025O461p228J0510J4404n063m722Q734N296j2516
15866E99861p069O003J0657p723l672J2695p563R58j92J1746j5417l255J4065
15853F11094O417j803r942q781J699N343j816q560J904P84l505K989lk128O985
15838F00677J338O020k480N780L097J860n19j0547j3415O835M624n283J291k597
$$ y = [588894, 595807, 603492, 602736, 598185, 599220, 593447, 591796, 598426, 605796, 602482, 602307, 599684, 607043, 600209, 592996, 581614, 589026, 595185, 593221, 604873, 593703, 598336, 596090, 602110, 598673, 593950, 599388, 598641, 602452, 600386, 613678, 609421, 614108, 611034, 603840, 604440, 602940, 606132, 594497, 600802, 604839, 597218, 603222, 593162, 604875, 603647, 602797, 599667, 592829, 611436, 601464, 592135, 588935, 596996, 595359, 598840, 592210, 598068, 600830, 600729, 585010, 583985, 590446, 583218, 593728, 608132, 603069, 598347, 607081, 612377, 599861, 592792, 598795, 609452, 601729, 598057, 610752, 603189, 604147, 603955, 615701, 600284, 597029, 611094, 617511, 615708, 605766, 596985, 598684, 604027, 602211, 593651, 595555, 596339, 592834, 595823, 595820, 593692, 600677, 602015, 608035, 605555, 611335, 614432, 616292, 615773, 605226, 591811, 598646, 603270, 597987, 599278, 596681]
15824E96681L015N81l640K239J718o294M069l782Q905N28O030o942J2408l774
15810F11742J937p750K961J2975q928M519p69o172M177K959q576J890L095N660
15796F19720o904j001j826k760q359J0613J3241o685R74j3541J3479k859k114
15783F11978M730k690k841j0409j1189N543M285L129M408P320N785r237M319m260
15769F10871q51O603l122N453j0695j5617J0729J3124k134n781m889J2292m626
15756F11357r124P95l865K587k334J8341J0321r905j4006N074k741j826J0510
15743F15184m94J020j3167p039J2306m379k57L128Q806J801m28K931J2064O87
15729F32163M945q22j2102j3977r170O667j36P121j1655O288J3166k2135m229
$$ y = [596681, 599696, 600277, 596637, 598876, 600594, 594300, 598369, 594587, 603492, 604020, 610050, 603108, 615516, 611742, 613679, 605929, 608890, 621865, 612937, 617456, 616687, 610515, 614692, 617651, 609075, 610965, 614060, 619720, 612816, 611815, 609989, 607229, 598870, 609483, 622724, 616039, 617013, 603472, 616951, 614092, 611978, 616708, 614018, 611177, 600768, 589579, 595122, 599407, 602536, 606944, 614264, 620049, 610812, 615131, 610871, 610020, 616623, 613501, 618954, 608259, 592642, 603371, 616495, 614361, 608580, 603691, 615983, 611357, 602233, 603028, 599163, 601750, 599416, 617757, 628078, 618173, 604167, 609241, 606500, 604674, 615184, 614690, 615710, 602543, 595504, 607810, 603431, 603174, 606302, 615108, 616909, 616481, 619412, 631476, 632163, 637108, 636286, 624184, 610207, 601037, 607704, 607568, 614689, 603034, 609322, 622488, 600353, 596124]
15716E96124k34N564J4838q034N446J1913j51m908o969N365k763L297o492n26
$$ y = [596124, 595890, 601454, 616292, 608258, 613704, 625617, 625466, 620558, 613589, 618954, 616191, 619488, 612996, 612470]
$$ [...]
##END NTUPLES=NMR SPECTRUM
##END=
