##TITLE=1H_EC-3296(IV-3)
 CDCl3
 8 sc, 
 7.6.2023
##JCAMPDX= 6.0         $$ Bruker NMR JCAMP-DX V2.0
##DATA TYPE= NMR SPECTRUM
##DATA CLASS= NTUPLES
##ORIGIN= UXNMR, Bruker Analytische Messtechnik GmbH
##OWNER= root
$$ XWIN-NMR		Version 3.5
$$ Wed Jun  7 15:52:14 2023 Russian Standard Time (UT+4h)  she@DPX200
##.OBSERVE FREQUENCY= 200.13135
##.OBSERVE NUCLEUS= ^1H
##.ACQUISITION MODE= SIMULTANEOUS
##.ACQUISITION SCHEME= undefined
##.AVERAGES= 8
##.DIGITISER RES= 18
##SPECTROMETER/DATA SYSTEM= spect
##.PULSE SEQUENCE= zg30
##.SOLVENT NAME= CDCl3
##.SHIFT REFERENCE= (INTERNAL, CDCl3, 0, 15.7601)
##AUDIT TRAIL= $$ (NUMBER, WHEN, WHO, WHERE, WHAT)
$$ ##TITLE= Audit trail, XWIN-NMR		Version 3.5
$$ ##JCAMPDX= 5.01
$$ ##ORIGIN= Bruker BioSpin GmbH
$$ ##OWNER= she
$$ F:/spectra/data/she/nmr/H-F/1/pdata/1/auditp.txt
$$ ##AUDIT TRAIL=  $$ (NUMBER, WHEN, WHO, WHERE, WHAT)
(   1,<2023-06-07 15:46:13.48 +0400>,<she>,<DPX200>,
      <created by zg, POWCHK disabled, PULCHK disabled
       configuration hash MD5:
       00 E9 B6 7A A2 85 ED C7 34 08 36 98 17 FE 4E 26
       data hash MD5: 16K
       A3 88 B8 EE 5D 21 D4 42 B4 B3 9B D1 10 A5 F9 64>)
(   2,<2023-06-07 15:50:15.32 +0400>,<she>,<DPX200>,
      <Start of raw data processing
       efp BC_mod = 2 LB = 0.24 FT_mod = 6 PKNL = 1 PHC0 = -19905.86 PHC1 = 12.65272 SI = 16K 
       data hash MD5: 16K
       5D 97 1C C8 8D B8 8D EF F3 BB D0 68 EC 72 E2 B1>)
(   3,<2023-06-07 15:50:35.64 +0400>,<she>,<DPX200>,
      <pk PHC0 = -156.2644 PHC1 = -2.8 
       data hash MD5: 16K
       1A 3C AE F2 DE 61 95 07 CB 12 6B 63 11 8B A6 52>)
(   4,<2023-06-07 15:50:38.98 +0400>,<she>,<DPX200>,
      <abs ABSG = 5 
       data hash MD5: 16K
       A2 90 A8 D1 5C F4 2F 0E 28 9D 2F EE 2D 92 BC 85>)
$$ ##END=
$$ 
$$ hash MD5
$$ F5 A2 1E B2 2F CE DA 95 91 9C 60 17 2E 78 2A 77
##$RELAX= 
##$RELAX= 
##$RELAX= 
##$RELAX= 
##$RELAX= 
##$RELAX= 
$$ Bruker specific parameters
$$ --------------------------
##$DU= <F:/spectra>
##$EXPNO= 1
##$NAME= <H-F>
##$PROCNO= 1
##$TYPE= <nmr>
##$USER= <she>
##$AMP= (0..31)
100 100 100 100 100 100 100 100 100 100 100 100 100 100 100 100 100 100 
100 100 100 100 100 100 100 100 100 100 100 100 100 100 
##$AQSEQ= 0
##$AQ_mod= 1
##$AUNM= <au_zg>
##$AUTOPOS= <>
##$BF1= 200.13
##$BF2= 200.13
##$BF3= 200.13
##$BF4= 200.13
##$BF5= 200.13
##$BF6= 200.13
##$BF7= 200.13
##$BF8= 200.13
##$BYTORDA= 1
##$CFDGTYP= 0
##$CFRGTYP= 5
##$CHEMSTR= <none>
##$CNST= (0..31)
1 1 145 1 1 1 1 1 1 1 1 1 1 1 1 1 1 1 1 1 1 1 1 1 1 1 1 1 1 1 1 1 
##$CPDPRG= <>
##$CPDPRG1= <>
##$CPDPRG2= <>
##$CPDPRG3= <>
##$CPDPRG4= <mlev>
##$CPDPRG5= <mlev>
##$CPDPRG6= <mlev>
##$CPDPRG7= <mlev>
##$CPDPRG8= <mlev>
##$CPDPRGB= <>
##$CPDPRGT= <>
##$D= (0..31)
0 1.2 0 0 0 0 0 0 0 0.06 0 0.03 0 0 0 0 0.0002 0 0 0 0 0 0 0 0 0 0 0 0 
0 0 0 
##$DATE= 1686138372
##$DBL= (0..7)
120 120 120 120 120 120 120 120 
##$DBP= (0..7)
150 150 150 150 150 150 150 150 
##$DBP07= 0
##$DBPNAM0= <>
##$DBPNAM1= <>
##$DBPNAM2= <>
##$DBPNAM3= <>
##$DBPNAM4= <>
$$ [...]
##$SUBNAM3= <"">
##$SUBNAM4= <"">
##$SUBNAM5= <"">
##$SUBNAM6= <"">
##$SUBNAM7= <"">
##$SUBNAM8= <"">
##$SUBNAM9= <"">
##$SW= 18.05172834244
##$SWIBOX= (0..15)
0 0 2 0 0 0 0 0 0 0 0 0 0 0 0 0 
##$SW_h= 3612.71676300578
##$TD= 16384
##$TD0= 1
##$TE= 0
##$TE2= 300
##$TE3= 300
##$TEG= 300
##$TL= (0..7)
0 120 120 120 120 120 120 120 
##$TP= (0..7)
150 150 150 150 150 150 150 150 
##$TP07= 0
##$TPNAME0= <>
##$TPNAME1= <>
##$TPNAME2= <>
##$TPNAME3= <>
##$TPNAME4= <>
##$TPNAME5= <>
##$TPNAME6= <>
##$TPNAME7= <>
##$TPOAL= (0..7)
0.5 0.5 0.5 0.5 0.5 0.5 0.5 0.5 
##$TPOFFS= (0..7)
0 0 0 0 0 0 0 0 
##$TUNHIN= 0
##$TUNHOUT= 0
##$TUNXOUT= 0
##$USERA1= <user>
##$USERA2= <user>
##$USERA3= <user>
##$USERA4= <user>
##$USERA5= <user>
##$V9= 5
##$VALIST= <valist>
##$VCLIST= <CCCCCCCCCCCCCCC>
##$VD= 0
##$VDLIST= <DDDDDDDDDDDDDDD>
##$VPLIST= <PPPPPPPPPPPPPPP>
##$VTLIST= <TTTTTTTTTTTTTTT>
##$WBST= 1024
##$WBSW= 4
##$XGAIN= (0..3)
0 0 0 0 
##$XL= 0
##$YL= 0
##$YMAX_a= 181602
##$YMIN_a= -249633
##$ZGOPTNS= <>
##$ZL1= 120
##$ZL2= 120
##$ZL3= 120
##$ZL4= 120
##$ABSF1= 15.73367
##$ABSF2= -2.318179
##$ABSG= 5
##$ABSL= 3
##$ALPHA= 0
##$AQORDER= 0
##$ASSFAC= 0
##$ASSFACI= 0
##$ASSFACX= 0
##$ASSWID= 0
##$AUNMP= <proc_1d>
##$AZFE= 0.1
##$AZFW= 0.1
##$BCFW= 0
##$BC_mod= 2
##$BYTORDP= 0
##$COROFFS= 0
##$CY= -3
##$DATMOD= 1
##$DC= 0
##$DFILT= <>
##$DTYPP= 0
##$F1P= 0
##$F2P= 0
##$FCOR= 1
##$FTSIZE= 16384
##$FT_mod= 6
##$GAMMA= 0
##$GB= 0
##$INTBC= 1
##$INTSCL= 3.70164e-10
##$ISEN= 128
##$LB= 0.24
##$LEV0= 0
##$LPBIN= 0
##$MAXI= 10000
##$MC2= 0
##$MEAN= 0
##$ME_mod= 0
##$MI= 1.114404
##$NCOEF= 0
##$NC_proc= -6
##$NLEV= 6
##$NOISF1= 3.799351
##$NOISF2= 2.8
##$NSP= 0
##$NTH_PI= 0
##$NZP= 0
##$OFFSET= 15.76011
##$PC= 1
##$PHC0= -20062.12
##$PHC1= 9.85272
##$PH_mod= 1
##$PKNL= yes
##$PPARMOD= 0
##$PSCAL= 0
##$PSIGN= 0
##$REVERSE= no
##$SF= 200.130002288054
##$SI= 16384
##$SIGF1= 3
##$SIGF2= 2
##$SINO= 5.538805
##$SIOLD= 16384
##$SREGLST= <1H.CDCl3>
##$SSB= 0
##$STSI= 16384
##$STSR= 0
##$SW_p= 3612.71676300578
##$SYMM= 0
##$S_DEV= 0
##$TDeff= 16384
##$TDoff= 0
##$TI= <>
##$TILT= no
##$TM1= 0
##$TM2= 0
##$TOPLEV= 0
##$USERP1= <user>
##$USERP2= <user>
##$USERP3= <user>
##$USERP4= <user>
##$USERP5= <user>
##$WDW= 1
##$XDIM= 16384
##$YMAX_p= 373297573
##$YMIN_p= -111992
$$ End of Bruker specific parameters
$$ ---------------------------------
##NTUPLES= NMR SPECTRUM
##VAR_NAME=  FREQUENCY,     SPECTRUM/REAL,   SPECTRUM/IMAG
##SYMBOL=    X,             R,               I
##VAR_TYPE=  INDEPENDENT,   DEPENDENT,       DEPENDENT
##VAR_FORM=  AFFN,          ASDF,            ASDF
##VAR_DIM=   16384,         16384,           16384
##UNITS=     HZ,            ARBITRARY UNITS, ARBITRARY UNITS
##FACTOR=    0.220516191357247, 1,           1
##FIRST=     3154.07083063281, 0,            0
##LAST=      -458.645932372968, 0,           0
##MIN=       -458.645932372968, -111992,     0
##MAX=       3154.07083063281, 373297573,    0
$$ Real data points
##PAGE= N=1
##DATA TABLE= (X++(R..R)), XYDATA
$$ [...]
6463a9747r684j6970k0446J4412j6354L6340k302l3156Q657k1344J9993R482J1055
6450d0064J57m9385L4901J6947q713n0717L2686Q34K0081n0217J9868K8946J3701
6437c0975p921l9142K34P547k6211M9065J0946k1872j1296J5094j903J1368q045
6424e3111l9865K8920K7696l0790p011j0175l412K0888o765J1413p843J8092J9433
6411c2530j3264n088M334k1726K8729L7123J2134j6325n477k1755J7596K545K4932
6398A1228l0413j1400j2567P500J4758m4320j9124k419o897K8137K4915r516k5649
6385g5767m019J1438O214L920J5499p059L400Q782l3356m706M288k5228K0774
6372g5820L5292R45L82K1109l8511k7148J5446J4582j0689K9320k7707q398K394
$$ y = [-19747, -29431, -46401, -66847, -52435, -68789, -32449, -34751, -67907, -59250, -80594, -60601, -51119, -40064, -39907, -89292, -54391, -37444, -46157, -96874, -64188, -63354, -43273, -93490, -73622, -44676, -30975, -38896, -78038, -77804, -70257, -96468, -47403, -36457, -58329, -69625, -54531, -56434, -45066, -53111, -92976, -64056, -36360, -67150, -74161, -84336, -87748, -66860, -73625, -62212, -70055, -51963, -32530, -45794, -50882, -46548, -68274, -39545, -2422, 9712, -6613, -12090, -33845, -16249, -13704, 11228, -19185, -30585, -43152, -35652, -20894, -65214, -84338, -86757, -93654, -65517, -40602, -50118, -75767, -79786, -68348, -62134, -58214, -42715, -49774, -46374, -37592, -70948, -75654, -71366, -96594, -75820, -40528, -39583, -39201, -18092, -56603, -83751, -68305, -53723, -64412, -35092, -62799, -71197, -68803]
6359f8803L8100J478o397o632J7618p932k1112J8021k377k7120J7275j5637P311
6346e6207k170j8693L3077j3539J4775o652K4289J5706k7981N940j6184L967Q990
6333c4682J43p59K1791M359m2165K0731r646P730n683M441j1290j6785O010P000
6319d8805M169o770J1835J6829K833k4720o642M5008m5943l4048K5138P167J2551
6306d1398o236l2187M4871j914j8622K3731j7227J5923m592j3792J5357j3177
6294d9263k4160j2868L576L9807J1549j2774n9112m672K1334n925R981R709o475
6281g9293K507L9201m241j5207j9582O1751k1892j2557n65J6314O968J3157k1677
6268c5116l968L8641j4289j2241J1220j2344j0728L6949J4185j4122l4987k7348
$$ y = [-68803, -30703, -29225, -35622, -42254, -24636, -32568, -53680, -35659, -38036, -65156, -47881, -63518, -56207, -58377, -77070, -43993, -57532, -42757, -49409, -25120, -9414, -37395, -31455, -47639, -43672, -34682, -34539, -35298, -13507, -9148, -51313, -30582, -40228, -32498, -38181, -33740, -45030, -61815, -55805, -48805, -44636, -51406, -39571, -22742, -19909, -44629, -51271, -6263, -52206, -86254, -61116, -53949, -41398, -47634, -79821, -34950, -36864, -55486, -31755, -48982, -33059, -37651, -51443, -36086, -49263, -73423, -86291, -82715, -42908, -31359, -44133, -103245, -107917, -86583, -92508, -82527, -72818, -79293, -76786, -37585, -41826, -57033, -76615, -14864, -36756, -49313, -49878, -33564, -26596, -13439, -35116, -39084, -443, -14732, -26973, -15753, -28097, -38825, -1876, 12309, -1813, -36800, -64148]
6256f4148K4209j3261k1011K6074r256O280j4793j1798R01M4331n092j3252Q272
6243d2544L218k0421k5123O552R413L511j0908J0420j0912K21M793J3246j9754
6230g8288N099M7956k429N172j1985k6585K2560k09j99J999K451o346K1064m90
6216b0230J1186J2774k8841J928J0983p636m1916J6351K3966j6868j9184K7367
6204c0120K2027j5495J3618J4436J09l1069l1650Q363q282J1483k98J6737P919
6191b2222k644j2226o621j5038R7L225J0937J7150m5097o885j7133K2331J2298
6178f1828m986J9605L53o766N518q156j0181J3929J9580l2j6701K0m359K594n709
6163e7119R624j4046M807N138J2446J364q975m213J956j4932K2828J7249m572
$$ y = [-64148, -39939, -53200, -74211, -48137, -57393, -51113, -65906, -77704, -76803, -32472, -37564, -50816, -42544, -39326, -59747, -84870, -78318, -68905, -65394, -76302, -65882, -76794, -76573, -71780, -58534, -78288, -73189, -25233, -27662, -22490, -34475, -61060, -38500, -38709, -38908, -36909, -34458, -40804, -19740, -20230, -9044, 3730, -25111, -23183, -12200, -19836, -61752, -45401, -21435, -38303, -57487, -30120, -8093, -23588, -9970, 4466, 4575, -26494, -58144, -49781, -58063, -46580, -46878, -30141, -22222, -24866, -37092, -43713, -58751, -58654, -55429, -44492, -27342, -72439, -79324, -96457, -74126, -61828, -66814, -47209, -46856, -53622, -48104, -56260, -66441, -52512, -32932, -32964, -49665, -49645, -54004, -51410, -57119, -47495, -61541, -56734, -51596, -39150, -37786, -46761, -50974, -49018, -63950, -41122, -23873, -28445]
6150b8445j8128J0138Q818n501m1269K9395L875j643n259P83K2441m827l967k5795
6136e9384q095K3966J7601j7167P397j3955k8718Q979K8224K5715k3527j2113
6124e1077K1427K548M261o755J2102j0003j9050J3453K264n993j1018J0736k903
6111d0008m3137K1007N369K69M8637m07m5313J459q439J1555K2520J553o4758
6098h9693J4475K6207K6842M210m6058k0746K1699M4964l977J3423j8317l0432
6086e7403j118K2313K3481k183k5464l6174M5409K5878m439k0829N1708M8944
6074G0123m7054o3549K5286j0558J508J4626k6813k012o373J0366r95K7157K6122
6061A7834j0549l5148o815n759k1347r749K8666K1330L2680n733k0309J1888N208
$$ y = [-28445, -46573, -36435, -27617, -33118, -74387, -44992, -41117, -42760, -48019, -47236, -24795, -29622, -33589, -59384, -67479, -43513, -25912, -43079, -35682, -49637, -78355, -69376, -41152, -15437, -38964, -51077, -29650, -27102, -22841, -29596, -17494, -27497, -46547, -33094, -30830, -36823, -47841, -37105, -40008, -83145, -62138, -56769, -56500, -7863, -8270, -53583, -52124, -60563, -49008, -26488, -24935, -89693, -75218, -49011, -22169, -17959, -64017, -84763, -63064, -18100, -22077, -8654, -26971, -57403, -58521, -36208, -12727, -14910, -40374, -76548, -31139, -5261, -9700, -30529, 21179, 70123, 23069, -40480, -15194, -25752, -24244, -9618, -36431, -38443, -44816, -34450, -35445, -8288, 17834, 7285, -27863, -34678, -40437, -61784, -71533, -42867, -21537, 11143, 5410, -14899, -3011, 2197]
6048B197p152l7369J1655M176j1145R951O887j3822O388L3647L2940Q969k2536
6035B4786k7883l6081j2780J1994J1425K6038J8909R6j5360k6763k3088j9681
6023f8388R564O751L0813J3765Q770P325j0238M181k381n3867j5645L6154J6711
6010a6485j0079Q084J0681j5963K24K1580k318j4640K504l1258J2072J7107k8979
5997d7470o959M3141j2148l8088K9528p592K5433K779J5300N596l2481K4107p912
5984f766q300L4707k9761l7847N264O881J7763j526k2261J3863K6813j0807k7131
5971c9108L281K8006L7081j2678K492L70j3852k0005p237j8133k7091K9144J793
5958c5937K3792J6786l0996j2053q004l9949J2677n756O670L7909K0936R744j074
$$ y = [2197, -4955, -42324, -30669, -26493, -37638, -27687, -20800, -34622, -28234, 5413, 38353, 47322, 24786, -3097, -39178, -51958, -39964, -28539, -2501, 16408, 16504, 1144, -25619, -48707, -68388, -58824, -52073, -21260, -7495, 1275, 8600, -1638, 2543, 162, -53705, -69350, -33196, -16485, -26564, -18480, -7799, -23762, -23538, -1958, -4276, -18916, -16412, -47670, -35598, -18491, -47470, -54429, -11288, -23436, -61524, -31996, -39588, -14155, -11376, 3924, 9520, -22961, 1146, -6766, -15066, 19641, -10120, -47967, -42703, -35822, -18059, -19585, -41846, -27983, -1170, -11977, -39108, -35827, -7821, 29260, 16582, 19074, 19444, 5592, -14413, -21650, -39783, -66874, -37730, -35937, -12145, 4641, -26355, -38408, -46412, -86361, -73684, -79440, -72770, -34861, -13925, -4181, -5255]
5945e255K7617P486l9260K3366K2900m3913J433j1253L186K510j1173m365j8531
5932d5252J9802j2528N278J155o424J2168m773J3287j9177K892k3267K8269L3351
5919D781j1252l744j5271m181m189J2204K7919j6959N440K4092k6412l6677K0662
5906b3587K9902j8228N972O579J9281K634M86J16j1425J6875j1777L135l9008
5893a9045j6540L0200R933Q585k047R565l8540J8595J8153K4227j8124m2607Q718
5880h927K4326k3491l3092K9359M353J5188J5630p594j2814l5984J4917j203P81
5867a8551p453K1234J1366k863Q776J6712l4701K5586k2260M884j0870J3434k2953
5854a7659k0032J377j3085N0432K504J516n2518L7525P936j143j2582P122N969
$$ y = [-5255, 22362, 29848, -9412, 13954, 36854, -7059, -5626, -16879, -13693, -11183, -22356, -26721, -45252, -25450, -37978, -32700, -31545, -37969, -25801, -30574, -17287, -36464, -33572, -56839, -28570, 4781, -6471, -10215, -25486, -29667, -33856, -21652, 6267, -10692, -5252, 18840, -7572, -44249, -23587, 6315, -11913, -5941, 638, 19919, 22553, 23039, 23155, 11730, 28605, 16828, 19963, -19045, -35585, -5385, 4548, 13133, 11086, 20651, -17889, 706, 18859, 43086, 24962, -17645, -8927, 15399, -8092, -41184, -11825, -7472, 7716, 23346, 15752, 2938, -33046, -18129, -19332, -18551, -26004, -4770, 6596, 3733, 12509, 29221, -5480, 20106, -2154, 2730, -8140, 5294, -17659, -37691, -36314, -49399, 1033, 3537, 5053, -47465, -9940, -2004, -3147, -15729, -8607, -2638]
5841b638L2486q16q29l6817k5970J121j4373k152J5707J6249J3978j2742n800
5828b2596L1903j9080j6714J2281K7084k0609j4387J6036R63K020p540J0483J2579
5815A2423l3571j0484M7595O070j4652N214L6146J704l6523n986Q057J7046k0984
5802A2055l2822N55j566L4039j6762J8407j8734K4K4321K6559M684j2909j918
5789C5933j2997q432k4849L491j8957J9995J9004N988J0683l8458J6908P440O608
5776B2357J7590l4674J9897P830j9253J2165j0403M883K3420K0432K902j7668
5764D9478k829L999l2738Q171J5090j4912J8555r582m490O910J3374l114j4180
5751C3732j3977J5772R596J8823j6123j6345k7926j890J155K7220Q418R438k1065
$$ y = [-2638, 29848, 29032, 28203, -8614, -34584, -33463, -47836, -49988, -34281, -18032, -4054, -16796, -22596, 9307, -9773, -26487, -14206, 12878, -7731, -22118, -6082, -5119, -3099, -10639, -156, 12423, -21148, -31632, 15963, 22033, 7381, 12595, 48741, 50445, 13922, 7936, 15993, 33039, 12055, -20767, -20212, -21778, 12261, -4501, 13906, -4828, -4804, 19517, 46076, 50760, 37851, 35933, 22936, 14504, -10345, -6854, -25811, -5816, 13188, 19176, 29859, -8599, 8309, 15749, 22357, 39947, 5273, 25170, 33000, 13747, 25912, 15509, 20392, 43812, 64244, 67146, 49478, 46649, 50648, 17910, 26081, 41171, 26259, 44814, 35232, 30742, 37652, 51026, 47912, 33732, 19755, 35527, 45123, 63946, 47823, 31478, 3552, 1662, 2817, 30037, 38455, 47893, 26828]
5738B6828J1856N598k7723J2566j1936K3984J3899J085j753j0466J1979q360L3886
5725H1443l0126J7496l4694M63L662m205L7930j9984K713l2727n765P79K2559
5712C9544K6750J8624Q635q233k2206J1938j9557k8522K743Q295J5370R232j1353
5699E1260K9621M2191k171l7077n3499p047K1397L6746J638N195j2307l6952N105
5686D4100L2404k4328j5952Q087j9522o390n827M8188j3763O052o046o371n459
5673C5173l1317L8310K8921K0959k736k0042k2879n9241K1914M0493J5985R167
5661G4707r664m6059J1016K191Q838j5786j6394m891N4147L5719k4561j934l6820
5648C0509p089Q343K8917J9105j4877Q875K7262k884n0011L6854J2807j8120J1722
$$ y = [26828, 38684, 44282, 16559, 29125, 17189, 41173, 55072, 56157, 54404, 43938, 55917, 47557, 81443, 51317, 68813, 34119, 34582, 38244, 34039, 71969, 51985, 54698, 21971, 16206, 16985, 39544, 66294, 84918, 93553, 85320, 63114, 75052, 55495, 26973, 29716, 38011, 53381, 62613, 51260, 80881, 123072, 120901, 83824, 30325, 23278, 44675, 81421, 83059, 88254, 75947, 38995, 44100, 76504, 52176, 36224, 44311, 24789, 18399, 12572, 60760, 46997, 53049, 47003, 40632, 35173, 3856, 42166, 71087, 92046, 89310, 69268, 46389, -12852, 9062, 49555, 65540, 74707, 65043, 18984, 30000, 32191, 41029, 25243, 8849, 3958, 58105, 93824, 69263, 67329, 30509, 23420, 31763, 60680, 79785, 64908, 73783, 101045, 98161, 48150, 85004, 97811, 79691, 91413]
5635I1413k3721j6177J6761K1072R194j1962j9609J0150J2516N539K9061k9697
5623I4540m1432L6243j8270Q783K8408j6809L981k0008J1620K6585P431j5474
5611A05598P519J9172j9677k6301k9870L7284J4563L1211l537l18l0100J0607
5599A16151k762R819L6403N979Q758j4719P57K9390N929k771l3552K19K9385m631
5585A84355K0937l1745l0352K7930L8325k4479j620O554J1870j4049J9201K9958
5573B36885j1231K9293k9648q76Q627r43K776j1035L4268K3187j0485j7034J9153
5560B72937K2480N198K9980L780k3890L7L071J1650k6256L540K793n725r193j7621
5546B72781P764K805J6367N275J4251l4448l1892K2315M4624j720j3422q757K8949
$$ y = [91413, 67692, 51515, 68276, 89348, 98542, 86580, 66971, 77121, 89637, 95176, 124237, 94540, 53108, 89351, 71081, 79864, 108272, 91463, 95444, 75436, 87056, 113641, 121072, 105598, 113117, 132289, 112612, 86311, 56441, 93725, 108288, 139499, 135962, 135644, 105544, 116151, 113389, 123208, 159611, 165590, 174348, 159629, 160386, 189776, 195705, 192934, 159382, 159601, 188986, 184355, 205292, 173547, 143195, 171125, 209450, 184971, 183351, 189905, 201775, 187726, 206927, 236885, 225654, 254947, 225299, 224423, 233050, 232107, 234883, 223848, 258116, 281303, 270818, 253784, 272937, 295417, 300615, 330595, 334375, 310485, 310522, 313593, 325243, 298987, 302527, 305320, 299595, 290402, 272781, 280545, 283350, 299717, 304992, 319243, 284795, 252903, 275218, 319842, 318122, 304700, 295943, 324892]
5533C24892P066m710K6905j2252P381K4979k4892k90L2344k499p330r263j9994
5520C42337K4289J6681M5929J034r690J7266M112O125J5113J0793k8866j7036
5508D28087R26L1908L3792k8961J354J8531l5227J3329j0705k786j8159q016Q130
5495D32203L9385P700K978J2741J7369K4480m770O213O600K6186k9478J8677o367
5482E53917K2984M5115l1819K8093M1200L0212m3829j0381Q292J2918R114j5614
5470F50202q52Q591K0894q697r271L4801J8000l0116K3942K6391K8154N2448k1749
5457G92738K8407L5650K857M9114P7528J06569P3682Q4610R6798N9627J24417
5446A531997J77421J99530J89301O4809p5428k09704j59345j27635j14133l2625
$$ y = [324892, 331958, 327248, 354153, 341901, 349282, 374261, 349369, 349079, 381423, 378924, 371594, 362331, 342337, 366626, 383307, 429236, 430270, 420580, 437846, 441958, 448083, 463196, 473989, 445123, 428087, 429013, 460921, 494713, 465752, 467106, 485637, 450410, 463739, 453034, 450248, 432089, 424073, 432203, 471588, 479288, 482266, 495007, 512376, 536856, 532086, 538299, 544899, 571085, 541607, 560284, 553917, 576901, 622016, 590197, 618290, 659490, 689702, 645873, 635492, 643784, 656702, 665816, 650202, 649350, 657941, 678835, 670138, 660867, 695668, 713668, 683552, 707494, 733885, 762039, 814487, 792738, 821145, 856795, 859652, 908766, 986294, 1092863, 1166545, 1251155, 1347953, 1407580, 1531997, 1709418, 1908948, 2098249, 2163058, 2087630, 1877926, 1718581, 1590946, 1476813, 1444188]
5436A444188m1713m5920m0647j2543n1454J0414L0043r266L3238O4652P9510M8597
5424A509099L8865P0979O8475J26352J45801J35769J92081K79464L43400L45297
5414C255582N10564O65318N35969Q2972l84396n61817n53466m41960l06326k40721
5404B561719j91756j39841j45253j20392o5695q2317r2990p1461k6129m304p117
5393A614464K7602M6723O5076P0629J10902J28870J95953K14355K49100K60601
5383B984275L57290N26970O61126M82519o299m84317n84374n44628m36469l12045
5373B644048k52774j92948j98062r8655j55594j59383j39856o2465p5677k3827
5363A284807m3344n3572l2514j5088K5874m35J3397J5424J0498P8591P3938R5474
$$ y = [1444188, 1402475, 1356555, 1315908, 1303365, 1251911, 1262325, 1292368, 1283102, 1316340, 1380992, 1460502, 1509099, 1547964, 1618943, 1687418, 1813770, 1959571, 2095340, 2287421, 2566885, 2910285, 3255582, 3766146, 4431464, 4967433, 5050405, 4666009, 4104192, 3550726, 3108766, 2802440, 2561719, 2369963, 2230122, 2084869, 1964477, 1898782, 1816465, 1723475, 1652014, 1625885, 1621581, 1614464, 1642066, 1688789, 1753865, 1824494, 1935396, 2064266, 2260219, 2474574, 2723674, 2984275, 3341565, 3868535, 4529661, 5012180, 5005881, 4521564, 3937190, 3392562, 2956093, 2644048, 2391274, 2198326, 2000264, 1901609, 1746015, 1586632, 1446776, 1384311, 1308634, 1284807, 1241463, 1187891, 1155377, 1140289, 1166163, 1165728, 1179125, 1194549, 1205047, 1283638, 1357576, 1453050]
5351A453050P8448J94226K20140J13792m3581j70479j92754j89416j37586j00228
5341A225612r5573p5265k5045r8839q1597n1170l1185k4351k5507m7290m1629
5330F28161m111l2962p956N7594j4074m8501m115l3493m987j4768p994j1250l9622
5317D61922j1491M556J0174k6495K1232j7537m2777N9010K1991l232j687k7433
5305D48233r650L3138P659l0526l244p539j1275L58j7413K5483K0679k1268J106
5292D35741O456n847j9267q718J2170M8379j8246k0506j0067J4299L0553k2909
5280D42038O617J0074L0041j210l9137K7365J0069j42P7J1279k3415k4357K747
5267D52046K5772K9562L1833k0378N298K0614N587R81M6905K638j8137J7129O992
$$ y = [1453050, 1531498, 1725724, 1945864, 2059656, 2016075, 1845596, 1652842, 1463426, 1325840, 1225612, 1130039, 1054774, 1029729, 930890, 849293, 798123, 766938, 742587, 717080, 669790, 628161, 624050, 591088, 583132, 640726, 626652, 578151, 574036, 540543, 535556, 520788, 512794, 501544, 461922, 450431, 454987, 465161, 438666, 459898, 442361, 399584, 458594, 480585, 477353, 475666, 448233, 438583, 471721, 479380, 448854, 445610, 438071, 426796, 427154, 409741, 435224, 455903, 434635, 435741, 442197, 436350, 417083, 408365, 420535, 468914, 450668, 430162, 420095, 434394, 464947, 442038, 448655, 458729, 488770, 487560, 448423, 475788, 485857, 485715, 485792, 497071, 473656, 449299, 452046, 477818, 507380, 539213, 518835, 524133, 544747, 550334, 551315, 598220, 600858, 582721, 599850, 606842]
5254F06842K4159K7143R612J363M0051j9309K5473J3138K3208O463l6121L4556
5242G56578M4193r660k1129L879N5313J1404p507P233M8572J2166J0607M240L5221
5229I51110L8790K4113K0335k3045L9427m798O459K8725j7888n737L5148J6283
5217A108922o80R594O1372n3349L0766K8795k3107J4035M7720M4365J475K2789
5205A292697K9017L3804K1901K9819J1162N8334J0934r489N6966J6821P0974J2184
5193A635124K913L5687K8789N3962O2705O0280N9223O1900O1051O4681N4546N1286
5181B232147P9305J42941J15385J31889J52475J51691J59721J96742J68665K46322
5171C777283K87156M19857M59249N65508P32359P48735P46527R97322J459671
$$ y = [606842, 631001, 658144, 667756, 669119, 709170, 689861, 715334, 728472, 751680, 758143, 722022, 756578, 800771, 791111, 769982, 773861, 829174, 840578, 833071, 840304, 888876, 901042, 911649, 915889, 951110, 989900, 1014013, 1034348, 1011303, 1050730, 1045932, 1052391, 1081116, 1063228, 1057491, 1092639, 1108922, 1108242, 1117836, 1179208, 1125859, 1156625, 1185420, 1162313, 1176348, 1224068, 1268433, 1269908, 1292697, 1321714, 1355518, 1377419, 1407238, 1418400, 1476734, 1487668, 1478179, 1535145, 1551966, 1622940, 1635124, 1638037, 1673724, 1702513, 1756475, 1819180, 1879460, 1938683, 2000583, 2061634, 2126315, 2180861, 2232147, 2311452, 2454393, 2569778, 2701667, 2854142, 3005833, 3165554, 3362296, 3530961, 3777283, 4064439, 4484296, 4943545, 5509053, 6241412, 6990147, 7736674, 8733996, 10193667]
5162A0193667K008858K073641R94845o57853j440863j308214r73607o61900l94328
5153I834246j74186k03219k72168l55384m88889o51382p13568o86986o54723n55509
5143E078232m76278m17986l88755l32906k50861j88933k52696k27429j24070j59101
5133B259217j59815j61524q2486r8604n4495j14284n9230p3634l4780J0376m5352
5122A385389n6548L945l3468m1705m873m8794m2842k3455j8925n4861L006R45
5110A067814J8613p801m288l5404k2408K2675l626m3609k7880J0660k9554l0941
5098I14251O841n510K7604j7638l6326n234k498j2389K4536M6415P208k494o105
5085I38661Q992m744j6395K5635L1077J6275J0692L7999L4313P8483M3566M3441
$$ y = [10193667, 12202525, 14276166, 15271011, 14613158, 13172295, 11864081, 10890474, 10228574, 9834246, 9660060, 9456841, 9184673, 8829289, 8340400, 7689018, 6975450, 6288464, 5633741, 5078232, 4601954, 4183968, 3795213, 3462307, 3211446, 3022513, 2769817, 2542388, 2418318, 2259217, 2099402, 1937878, 1855392, 1756788, 1702293, 1588009, 1528779, 1455145, 1420365, 1430741, 1385389, 1328841, 1332786, 1299318, 1257613, 1252740, 1203946, 1161104, 1137649, 1118724, 1063863, 1066869, 1067814, 1086427, 1078626, 1074338, 1038934, 1016526, 1039201, 1035575, 991966, 964086, 974746, 945192, 914251, 921092, 915582, 943186, 925548, 889222, 883988, 881490, 869101, 893637, 940052, 947260, 944766, 938661, 947653, 942909, 926514, 952149, 983226, 999501, 1010193, 1048192, 1082505, 1160988, 1204554, 1247995]
5073A247995N7150J6029K1114O3352N1421M7254j2383k0127l3878o3902j5284
5062A358741p2882q7889N211K8953j0421j1789N746M7166N4462L8106O22J1320
5050A367346M8707K7908J4855J7971k5442j2839n4422m9437m3727l2753m0636
5039A217531j8980p322r462K1253M4967M1998N3720L888K0560K2325J3336L1609
5027A435423k2327m8778o3497k5941j518j0335k3334l3080r189m1618J0189k476
5015A163519l9892L5218L4755L8305N9630k236j462j2674n9696m9067l0604l9837
5003A095959p9006o6264n9940p3143l6111l3485m7502j6166m8993j0859q338j0674
4991F05478n6793L663K440k6535j6384m8005q338j1519o056J6666K338r726j6414
$$ y = [1247995, 1305145, 1321174, 1342288, 1405640, 1457061, 1504315, 1491932, 1471805, 1437927, 1374025, 1358741, 1285859, 1197970, 1203181, 1232134, 1221713, 1209924, 1215670, 1262836, 1317298, 1355404, 1356026, 1367346, 1416053, 1443961, 1458816, 1476787, 1451345, 1438506, 1384084, 1334647, 1290920, 1258167, 1217531, 1198551, 1191229, 1181767, 1203020, 1247987, 1289985, 1343705, 1347593, 1368153, 1390478, 1403814, 1435423, 1413096, 1364318, 1300821, 1274880, 1273362, 1263027, 1239693, 1206613, 1197424, 1155806, 1165995, 1163519, 1123627, 1158845, 1193600, 1231905, 1291535, 1289299, 1287837, 1275163, 1215467, 1166400, 1135796, 1095959, 1016953, 950689, 890749, 817606, 781495, 748010, 700508, 684342, 635349, 624490, 616152, 605478, 548685, 552348, 554788, 528253, 511869, 463864, 455526, 444007, 437951, 454617, 456955, 447229, 430815]
4978D30815j2366M2280j4237j8422Q591J8626k8451o802n677J2463J1343L037
4966D41200l0475j1849J297m6817K625k832J1604j3389k5121P095M1016K762J6549
4953C93665J8107k6024k7679J3227p192o093Q378K6396Q57n2519n067k753J8998
4940C52301K6553k8171m464L0159l4110J1890l3096O905j4460P247J1132p037
4928C24849n821P038J4991k168j7879l0972K7845M664l2177k433L3432j134J968
4915C22203R333j9281n248K2624j8511k589k6055j3702J226L0734K112L1879k2281
4902C12444n109K5318j3644j8630J1545k6986K5658l8384L2270N0244r664k1631
4890C23431k4537m584K5257j2958L028M481K7526k873J0205K2080n2996j1771
$$ y = [430815, 418449, 460729, 446492, 428070, 436661, 455287, 426836, 420034, 414357, 426820, 438163, 441200, 410725, 398876, 400173, 353356, 355981, 353149, 364753, 351364, 326243, 333338, 374354, 377116, 393665, 411772, 385748, 358069, 371296, 364104, 358011, 366389, 392785, 393642, 341123, 336056, 333303, 352301, 378854, 350683, 346219, 376378, 342268, 354158, 321062, 327967, 313507, 320754, 331886, 324849, 319028, 326066, 341057, 338889, 321010, 290038, 317883, 322547, 290370, 287937, 321369, 320235, 322203, 331536, 312255, 307007, 329631, 311120, 308531, 282476, 268774, 270000, 300734, 302846, 334725, 312444, 307335, 332653, 319009, 300379, 311924, 284938, 310596, 272212, 304482, 354726, 345062, 323431, 298894, 294310, 319567, 306609, 309637, 314118, 341644, 338771, 348976, 371056, 318060, 306289]
4878C06289K6903j1408P476j9747Q248L6669j3859r962n94J5276O961l130o124
4865C42998K6190l5932k3740L2373K29k1481J5647J1086O749k7103L0556J2307
4853C69879m0605L858M0486p240L1813J4482j3625m863k0958m622L1328j2529
4841C87404N0455R396m951N782q275k0395n19n298J8373n4170j5738j914K461
4828C62611l134R315J6092L4615k4601j18Q325k4271k1310J0687r63j1015K6607
4815C82840k9998P9K5129J7816j4910K6852J76m4725o518P719R487L0894K2892
4802D27733l7606m0197L429K1261K1695q904k1925J0177K4943k6147m919J0018
4790C79558J4797j9397L6022o276m830K3391J2357k5511q599K5257j8016K2012
$$ y = [306289, 333192, 321784, 329260, 309513, 317761, 354430, 340571, 330609, 330015, 345291, 352252, 349122, 342998, 369188, 333256, 309516, 341889, 342118, 320637, 336284, 347370, 354119, 327016, 357572, 369879, 329274, 333132, 373618, 366378, 398191, 412673, 399048, 394185, 373227, 368605, 399933, 387404, 437859, 447255, 442304, 448086, 439811, 419416, 418897, 413599, 431972, 377802, 362064, 360150, 362611, 359477, 368792, 384884, 419499, 394898, 394780, 403105, 378834, 357524, 368211, 367248, 356233, 382840, 352842, 352921, 378050, 395866, 380956, 407808, 407984, 363259, 356741, 364460, 373947, 404841, 427733, 390127, 349930, 353359, 374620, 396315, 387411, 365486, 375663, 400606, 374459, 369540, 379558, 394355, 374958, 410980, 404704, 399874, 423265, 435622, 410111, 401512, 426769, 408753, 430765]
4778D30765l0997R521K4777Q323j6878m7616K3238O6413k9510j7974L0994j3328
4766D37728Q517r414J5328j4768l024J7952j5153j1573M27K2036r391j7505K4098
4753D45258m74K7239j5339K5109L091j6713m552K0946K0107j2085L6317R28p328
4740E22504l3662k7272M4298L8588L8152K083k1708m0948K8077J9678m896j6484
4728E48410k9219L2438J6052j9788l6971J7525L4276m1344K8057K6288j1059M2075
4716F06740K0768r328k8021j9432j551q055K9325m951j1899K3145J9051J74j1777
4703F04189K7546M535J0197Q601j0857M2914j1049N979J2848k1882J6077M1865
4691G30963K8502k9442k0191J4075l5371K1999R635m152K5226j1710j2250j3915
$$ y = [430765, 399768, 409289, 434066, 442389, 425511, 377895, 401133, 467546, 438036, 420062, 451056, 437728, 446245, 436831, 452159, 437391, 434367, 452319, 437166, 425593, 426020, 448056, 438665, 421160, 445258, 444784, 472023, 456684, 481793, 484884, 468171, 463619, 484565, 504672, 492587, 528904, 529832, 522504, 488842, 461570, 505868, 544456, 582608, 584691, 562983, 522035, 550112, 569790, 564894, 548410, 519191, 551629, 567681, 547893, 510922, 528447, 562723, 521379, 549436, 575724, 564665, 606740, 627508, 618180, 590159, 570727, 569176, 561121, 590446, 585495, 573596, 596741, 615792, 615966, 604189, 631735, 636270, 646467, 655068, 644211, 687125, 676076, 682055, 694903, 673021, 689098, 730963, 759465, 730023, 709832, 723907, 688536, 710535, 720170, 716018, 741244, 729534, 717284, 703369]
4679G03369J8884n481Q75O955Q615K942J0357j8778K2566r101K0041K7520m0150
4666G48614K8281L5577j7961J027P184J3277J0727K9204k262k5588J2139L9710
4654H79929j7180m2533j7203k7905J097l1120L6372J4786j9609P412Q713K1229
4642H13988J1465p22l330j0765p689k60J2131K7472M556O879R100l8699j9982
4629H04144R182j4500L408q71M242J490m007m2855N44k1337k73N288M5426p784
4615G82097J156J5930L3797j4505K3088j1730k9542L773k0065j7573R485J585
4603G77496L503n8K6977R948k8483J5465Q844N244k0791m597k0476k9935r106
4590G34031J8481J1810j403J7025O410l0047j6426K6529M030k7911K5446N397
$$ y = [703369, 722253, 716772, 717647, 724602, 733217, 736159, 746516, 727738, 750304, 741203, 761244, 788764, 748614, 776895, 812472, 794511, 795538, 802722, 815999, 826726, 855930, 853668, 828080, 840219, 879929, 862749, 820216, 803013, 775108, 776205, 745085, 781457, 796243, 776634, 784046, 792759, 813988, 825453, 824731, 821401, 810636, 802947, 802687, 814818, 842290, 846846, 853725, 862825, 824126, 804144, 813326, 798826, 802234, 801363, 805605, 807095, 803088, 760233, 760777, 739440, 739167, 744455, 789881, 782097, 783253, 799183, 832980, 818475, 841563, 829833, 800291, 804064, 783999, 766426, 775911, 777496, 780999, 780941, 807918, 817866, 789383, 804848, 813692, 818936, 798145, 793548, 773072, 743137, 734031, 752512, 764322, 762919, 779944, 786354, 756307, 739881, 766410, 770440, 742529, 767975, 773372]
4578G73372j2075j2353l375J2988L4667L369j6306J5828J7530p892j5722n2743
4566G37288J2446J7856Q2666l0432j7432q038K5276P918j7087j5322O070K3899
4554H25108M9601L163p482K2905p321n3087J9761L7158j4385N619o210K4039j065
4541H97804K5466J0959j5549K63q085k4165L9311K5232j0849J0076R386R899K381
4528I72129J2611M164J4454Q2301K7456k4434P454M0246k0348J0621j0140J5267
4516A131781k3335R141L1698O7802N599j6573M2884q015J6356M1490L1199k2315
4504A307712L3418J727q231r449M5842L4414j2688M6460J1521L6220J6494K7073
4492A530513K0542k828M3961K6888O1681J8342J3783L4767p878M4522L9574J1867
$$ y = [773372, 761297, 748944, 745569, 758557, 793224, 796593, 780287, 796115, 813645, 805753, 790031, 737288, 749734, 767590, 850256, 819824, 802392, 794354, 819630, 827548, 810461, 795139, 801209, 825108, 874709, 877872, 870390, 893295, 885974, 832887, 852648, 889806, 875421, 881040, 874830, 898869, 897804, 923270, 934229, 918680, 918943, 910858, 886693, 926004, 951236, 940387, 950463, 959849, 969748, 972129, 984740, 988904, 1003358, 1085659, 1113115, 1088681, 1096135, 1136381, 1116033, 1126654, 1116514, 1131781, 1108446, 1117587, 1149285, 1217087, 1222686, 1206113, 1248997, 1240982, 1257338, 1298828, 1330027, 1307712, 1341130, 1342857, 1334626, 1325177, 1371019, 1405433, 1392745, 1439205, 1450726, 1486946, 1503440, 1530513, 1551055, 1548227, 1592188, 1619076, 1680757, 1699099, 1712882, 1747649, 1739771, 1784293, 1823867, 1835734]
4480A835734N3985J7812K4729K4210J963L7676P2991K4477K1777P5563L5689J6575
4468B243181K2612N8624L8265j337M1639M9060N4208O5257L3338M3343O0875K558
4456B711623N1975N6331J2397L1747J07575N8714K5839P7519Q3030K5190M9034
4445C290974P4349L8479N7669Q6189N8629P5031J43617M3024P3190N3177Q5224
4434D079552N4586P8375J16624P6730O1056J05475M7061J16761J13883Q4315J35120
4423E069538J09658J08885J38740J58041J62074J76557J80040J92779J90862K29274
4413F716448K39610K69794K82460L27280L43595L38960M20117M23935M45680M83607
4403A0291486M37034M50824M39539L86429L00794K59132K14736J86567J55089
$$ y = [1835734, 1889719, 1907531, 1932260, 1956470, 1958433, 1996109, 2069100, 2093577, 2115354, 2190917, 2226606, 2243181, 2265793, 2324417, 2362682, 2361345, 2402984, 2452044, 2506252, 2571509, 2604847, 2648190, 2709065, 2711623, 2763598, 2819929, 2832326, 2864073, 2971648, 3030362, 3056201, 3133720, 3216750, 3241940, 3290974, 3365323, 3403802, 3461471, 3547660, 3606289, 3681320, 3824937, 3867961, 3941151, 3994328, 4079552, 4134138, 4212513, 4329137, 4405867, 4466923, 4572398, 4619459, 4736220, 4850103, 4934418, 5069538, 5179196, 5288081, 5426821, 5584862, 5746936, 5923493, 6103533, 6296312, 6487174, 6716448, 6956058, 7225852, 7508312, 7835592, 8179187, 8518147, 8938264, 9362199, 9807879, 10291486, 10728520, 11179344, 11618883, 12005312, 12306106, 12565238, 12779974, 12966541, 13121630]
4394A3121630P1382R6455J22601R3818J48820J63598K29623K90433L28641M02868
4384A5069869M49268M97480N21689N55967N62907M23999L38684J93953J04000
4375A8717816O3058M2942l0056l4234k3142j07384j52532j97069j30465j15391
4365A8033543n4107M2686J36816K19283K10920K45861J81072J35348N2855r3216
4355A9111061j49096j43224j38468l2990J9733P4040J66453J76801J55266J33424
4345A9373000O0904r1484j52095k07680l32139m03542m70196n84394o66040p28625
4335A5797709o78726o88344o66462o00391n77286n39822n19361m39545m32634
4326A0655138l83217l38609l48132l18691k77410k28562j96540j96663j97628
$$ y = [13121630, 13193012, 13289467, 13412068, 13505886, 13654706, 13818304, 14047927, 14338360, 14667001, 15069869, 15519137, 16016617, 16538306, 17094273, 17657180, 18081179, 18419863, 18613816, 18717816, 18780874, 18823816, 18793760, 18759526, 18736384, 18629000, 18476468, 18279399, 18148934, 18033543, 17979436, 18022122, 18158938, 18378221, 18589141, 18835002, 19016074, 19151422, 19204277, 19111061, 18961965, 18818741, 18680273, 18647283, 18667016, 18741056, 18907509, 19084310, 19239576, 19373000, 19433904, 19342420, 19190325, 18982645, 18650506, 18246964, 17776768, 17192374, 16526334, 15797709, 15118983, 14430639, 13764177, 13163786, 12586500, 12046678, 11527317, 11087772, 10655138, 10271921, 9933312, 9585180, 9266489, 8989079, 8760517, 8563977, 8367314, 8169686]
4317H169686j24026j05990j37833j11953p3451j11728j9442k9333l2980j0505
4307G412445J8129q75J9980L9652M4171N2608P4427J01575P5077L2743L2411M1230
4295G943573L1183J2798N2845P0916Q7090O6304P4670J56949J39328J64663J84564
4284H984883K11825K14753K21166K63978K40843K91998L03074K77942L35895L96930
4274A1743287L85030L84558M20314M92557N12324N30012N65617N31637N52462
4265A6117798N18306N17433M61897M09449L12883K78928K08468J18708M9906K9847
4255A9023623J0977n0079n4837j14773r8850p8165p5417l3926r3705n7333m3367
4244A8334148o8816r1271r4882o2166o0323n075l2581k0938M2102L7859Q6692
$$ y = [8169686, 8045660, 7939670, 7801837, 7689884, 7616433, 7504705, 7485263, 7455930, 7422950, 7412445, 7430574, 7429699, 7449679, 7489331, 7533502, 7586110, 7660537, 7762112, 7837189, 7869932, 7902343, 7943573, 7974756, 7987554, 8040399, 8111315, 8198405, 8264709, 8339379, 8496328, 8635656, 8800319, 8984883, 9196708, 9411461, 9632627, 9896605, 10137448, 10429446, 10732520, 11010462, 11346357, 11743287, 12128317, 12512875, 12933189, 13425746, 13938070, 14468082, 15033699, 15565336, 16117798, 16636104, 17153537, 17615434, 18024883, 18337766, 18616694, 18825162, 18943870, 18993776, 19023623, 19034600, 18984521, 18929684, 18814911, 18716061, 18637896, 18562479, 18528553, 18434848, 18377515, 18334148, 18265332, 18174061, 18079179, 18017013, 17956690, 17951615, 17919034, 17898096, 17940198, 17978057, 18064749]
4233A8064749M7848R5055R6341J23216J07662J04080O6144L9698l7872o7974j80327
4222A8458620k73703l17569m00949m07088m17259m44221m55536l71958l62760
4213A5007577l70160l46613k84989k89033k73685l05100j93555k40058k71908
4204A2432476k36843k68229k84611l37803k96187k89434l19790l20653k87280
4195I791646k98247l24430k96972l00124k72834k94339k55403k14062k67103k64084
4185G004048j98280j61080k08397j52940j05300j16690j00827j13356r5944k8982
4175E722252q2426p2479k7671p1831n6220p3652J4104J7969k5593q9593j06350
4164E148510r2625j10528r4466o9169n2940n0793n3266n1456k5032l5734l8559
$$ y = [18064749, 18112597, 18207652, 18303993, 18427209, 18534871, 18638951, 18705095, 18744793, 18706921, 18638947, 18458620, 18184917, 17867348, 17466399, 17059311, 16642052, 16197831, 15742295, 15370337, 15007577, 14637417, 14290804, 14005815, 13716782, 13443097, 13137997, 12944442, 12704384, 12432476, 12195633, 11927404, 11642793, 11304990, 11008803, 10719369, 10399579, 10078926, 9791646, 9493399, 9168969, 8871997, 8571873, 8299039, 8004700, 7749297, 7535235, 7268132, 7004048, 6805768, 6644688, 6436291, 6283351, 6178051, 6061361, 5960534, 5847178, 5751234, 5722252, 5639826, 5567347, 5539676, 5467845, 5411625, 5337973, 5352077, 5370046, 5344453, 5254860, 5148510, 5055885, 4945357, 4850891, 4781722, 4728782, 4677989, 4624723, 4573267, 4548235, 4512501, 4473942]
4153D473942m379k1465J8102K853J3262K1109J8831K619M9292L1655N3807K8993
4141D688621K4552J7320m527K4458K3095J1758K9162N5138n073j1244L4508m0396
4129D847372M251P8655j4726M3801P2865Q2424J11705J06129J17522J12887J28265
4118E691150R9176O6535R9980M5648P2330m0299k0712K9824K1336l0073J5155
4107F050050L5393K0037O9542P0579O3109Q9847J02636J47970J11886J72667J73825
4096G107541J21582K12708K15952K46968K23965J50938J06172N9429M3324L3300
4086H521879J6564K234N805L1968J09335O9130M4807J43049P3922J00995J42981
4075I262669J72341J23384J89058K03415K30653K12924K46177L04860K39925L09219
$$ y = [4473942, 4469563, 4448098, 4466200, 4469053, 4482315, 4503424, 4522255, 4524874, 4574166, 4605821, 4659628, 4688621, 4713173, 4730493, 4725966, 4750424, 4773519, 4785277, 4814439, 4869577, 4864504, 4853260, 4887768, 4847372, 4851623, 4930278, 4915552, 4959353, 5032218, 5114642, 5226347, 5332476, 5449998, 5562885, 5691150, 5790326, 5856861, 5956841, 6002489, 6074819, 6034520, 6013808, 6043632, 6064968, 6034895, 6050050, 6085443, 6105480, 6175022, 6245601, 6308710, 6398557, 6501193, 6649163, 6761049, 6933716, 7107541, 7229123, 7441831, 7657783, 7904751, 8128716, 8279654, 8385826, 8445255, 8488579, 8521879, 8538443, 8540677, 8546482, 8578450, 8687785, 8756915, 8801722, 8944771, 9018693, 9119688, 9262669, 9435010, 9558394, 9747452, 9950867, 10181520, 10394444, 10640621, 10945481, 11185406, 11494625]
4065A1494625L17050L37042L80388M07167M57881M86309M89377N24486N37711
4056A5432036N67783O64758P20912Q54184R27686Q76777Q41824Q47289O16846
4047B2350095J94988p7844k29047l52481m71418m16794l12343j77832m5940R9190
4037B0560574J44231K49494M28717N92018P13116Q69259J150448J401709J561627
4028B7671193J322482Q54878N25998P4383m20787p28909o94771n06152l40477
4019B7757838r9104O2790J63006K85177M01818N18953O83004Q09688R40491J097016
4009C2620677J165564J276429J425030J623844J847324K091827K403980K735231
4001D7189906L139406L572768M016732M451338M875300N219141N330378N004162
$$ y = [11494625, 11811675, 12148717, 12529105, 12936272, 13394153, 13880462, 14369839, 14894325, 15432036, 15999819, 16664577, 17385489, 18239673, 19167359, 20044136, 20885960, 21733249, 22350095, 22545083, 22467239, 22238192, 21885711, 21414293, 20997499, 20685156, 20507324, 20461384, 20560574, 20704805, 20954299, 21383016, 21975034, 22688150, 23557409, 24707857, 26109566, 27671193, 28993675, 29848553, 30374551, 30448934, 30028147, 29299238, 28604467, 28098315, 27757838, 27658734, 27721524, 27884530, 28169707, 28571525, 29090478, 29773482, 30583170, 31523661, 32620677, 33786241, 35062670, 36487700, 38111544, 39958868, 42050695, 44454675, 47189906, 50329312, 53902080, 57918812, 62370150, 67245450, 72464591, 77794969, 82799131]
3993H2799131M015028K409578N77978j231271k700155l512961l580010l047478
3985G5729840k318846j347193l78554N23446J394293K491638L730003M054308
3977H3878935J538899k991975o112464p008511o464118n339367m270396l493787
3969D9737216l021919k705956k528728k232035j856703j568206j295210j050655
3961C3477804q55175p74632p35266p00395p16978o64383o14606m89043l53363
3952B7573963k34838r0998n1078r5470j55014j92016k65390k81694l64652m32080
3942B5410733m90264n30993o43364p08756o15122o13048n63608m47506l33536
3933B0464536k17854j54269k7558N6732J52892K07759J87595J21338O8772r1936
$$ y = [82799131, 86814159, 89223737, 89801715, 88570444, 85870289, 82357328, 78777318, 75729840, 73410994, 72063801, 71685247, 72208693, 73602986, 76094624, 79824627, 83878935, 85417834, 82425859, 76313395, 69304884, 62840766, 57501399, 53231003, 49737216, 46715297, 44009341, 41480613, 39248578, 37391875, 35823669, 34528459, 33477804, 32622629, 31847997, 31112731, 30412336, 29695358, 29030975, 28416369, 27927326, 27573963, 27339125, 27248127, 27197049, 27101579, 26946565, 26754549, 26489159, 26207465, 25842813, 25410733, 24920469, 24389476, 23746112, 23037356, 22422234, 21809186, 21245578, 20798072, 20464536, 20246682, 20092413, 20064855, 20121587, 20274479, 20482238, 20669833, 20791171, 20859943, 20768007]
3923B0768007j43477q5084r311K0531R2642J94807K53932K32033J61344L1382
3913B1516806j16741k35948k90851l05035k74120k15451j20046p3312q0645j68397
3903A9636260k53803m33223o00932p13127p33125p54193p00404o79253n96788
3894A4171412n08125m60904l81402l55091k46836k23276j00710o8241O053M4108
3884A1876988P0575Q8694J04249Q796p8819k51387l45824l78704m29360l43361
3874A0321847l21136k80017k14778k21580j47231m1655n7176Q592R4522J32731
3864I274119J53524J46841J15340J46374J03403j8109j66474k55119k68905k43067
3854H987927k37349k35268j54932q0199m1676J9395O2549J3222R0310J64792J18675
$$ y = [20768007, 20624530, 20539446, 20530135, 20550666, 20643308, 20838115, 21092047, 21324080, 21485424, 21516806, 21400065, 21164117, 20873266, 20568231, 20294111, 20078660, 19958614, 19885302, 19804657, 19636260, 19382457, 18949234, 18348302, 17635175, 16902050, 16147857, 15447453, 14768200, 14171412, 13663287, 13202383, 12820981, 12465890, 12219054, 11995778, 11895068, 11826827, 11832880, 11876988, 11947563, 12036257, 12140506, 12149302, 12070483, 11819096, 11473272, 11094568, 10665208, 10321847, 10000711, 9720694, 9505916, 9284336, 9137105, 9095450, 9038274, 9046866, 9141388, 9274119, 9427643, 9574484, 9689824, 9836198, 9939601, 9921492, 9755018, 9499899, 9230994, 8987927, 8750578, 8515310, 8360378, 8280179, 8238503, 8257898, 8320447, 8333669, 8423979, 8588771, 8707446]
3843H707446O9717Q2957J7136l1212l2418l0653n1121n1054l5586k1770k7205
3832H596237L1472Q9729J36338J42473J97255K84373L25152L93695M51672N02244
3822A1150640N54375N57017N16652M28862L70435J73065o1535k17386l87819m81007
3812A2603299m99293n16624m16676l78469l67578k60940k35472k01360j40580
3803I586307q1636k414P09J36532J73686K98388L53582M08234M48562M68347M76535
3792A2266832L34468J29484o4657k77794l81866m03110l36552j97711j39477r4371
3782A0835246j2878P7932J21682J92426K20756K33943K08340J27835L9492j0620
3772A2034154n9136l7417k5968M4810J84646K24901K63977L03968K09925J41736
$$ y = [8707446, 8777163, 8860120, 8877256, 8846044, 8813626, 8782973, 8731852, 8680798, 8645212, 8623442, 8596237, 8627709, 8717438, 8853776, 8996249, 9193504, 9477877, 9803029, 10196724, 10648396, 11150640, 11705015, 12262032, 12778684, 13207546, 13577981, 13751046, 13689511, 13472125, 13084306, 12603299, 12104006, 11587382, 11170706, 10792237, 10424659, 10163719, 9928247, 9726887, 9586307, 9504671, 9502257, 9502966, 9639498, 9813184, 10111572, 10465154, 10873388, 11321950, 11790297, 12266832, 12601300, 12730784, 12666127, 12388333, 12006467, 11603357, 11266805, 11069094, 10929617, 10835246, 10822368, 10900300, 11021982, 11214408, 11435164, 11669107, 11877447, 12005282, 12044774, 12034154, 11975018, 11937601, 11911633, 11956443, 12141089, 12365990, 12629967, 12933935, 13143860, 13285596]
3762A3285596O886j23791k99963l88886l99781l95545l81295k92446j97081j69785
3752A0643909j01110n9394o3449n9743j01131j37532k33115k28858k73515k33314
3742I152748k11290j52870q9911k4331J6651K2875J32037K08794K24044L11896
3732I590643L47494L77615M35324L94435L52743L42954K49246J69861N754j35996
3722A2130073l47783n43016o42868o69215o51329n44709m80288l97840l75554
3713G477471k96542j96969j88045j54525r2352p4629r081o390N8201J26552R9395
3702F743086J81345J43232J28159M1015j6852p7831p6248m6137R744K5268N7459
3691G112240N1230P1706P710m8905j39615k48163k78217k59584k68804k93541
$$ y = [13285596, 13292482, 13168691, 12868728, 12479842, 12080061, 11684516, 11303221, 11010775, 10813694, 10643909, 10542799, 10483405, 10419956, 10360213, 10259082, 10121550, 9888435, 9659577, 9386062, 9152748, 8941458, 8788588, 8698677, 8674346, 8690997, 8713872, 8845909, 9054703, 9278747, 9590643, 9938137, 10315752, 10751076, 11145511, 11498254, 11841208, 12090454, 12260315, 12266069, 12130073, 11782290, 11239274, 10596406, 9927191, 9275862, 8731153, 8250865, 7853025, 7477471, 7180929, 6983960, 6795915, 6641390, 6549038, 6474409, 6465328, 6458938, 6517139, 6643691, 6743086, 6924431, 7067663, 7195822, 7236837, 7219985, 7142154, 7065906, 7019769, 7029513, 7054781, 7112240, 7163470, 7235176, 7242886, 7193981, 7054366, 6806203, 6527986, 6268402, 5999598, 5706057]
3681E706057k60888k49549k22144j85683j20086j31311r2551q1654k4577j5512
3671D322102P580L8198K6169L2115j7194l3893j19329p5280j04921o0929k359
3660D012259Q5O3500N2085O8799N9938J536n4080j97367k11181k39674k23458
3649C332442j60898j54038j49891j23922q6285p6222j28541n2122k2895o8818
3639B308810q158l983l7921j3902m3997j0103J3575r151K7555O6472J8390K3830
3627B331417R0346O8295M2492M3885j672l1873m0551p9581j03553j14162p1636
3616B133407q0335o9744p1299j0648m4831p0680l1942p4799k6290k6047j2931
3605A613861o2507J8684L1738j3687k4763l3750J6575n793j1451M3504k7832l3275
$$ y = [5706057, 5445169, 5195620, 4973476, 4787793, 4667707, 4536396, 4443845, 4362191, 4337614, 4322102, 4329682, 4367880, 4394049, 4426164, 4408970, 4375077, 4255748, 4180468, 4075547, 4014618, 4012259, 4012344, 4075844, 4127929, 4196728, 4256666, 4258202, 4204122, 4006755, 3795574, 3555900, 3332442, 3171544, 3017506, 2867615, 2743693, 2657408, 2581186, 2452645, 2400523, 2377628, 2308810, 2300652, 2296669, 2258748, 2244846, 2200849, 2190746, 2204321, 2195170, 2222725, 2289197, 2307587, 2331417, 2421763, 2490058, 2532550, 2576435, 2574763, 2542890, 2502339, 2422758, 2319205, 2205043, 2133407, 2053072, 1983328, 1912029, 1901381, 1856550, 1785870, 1753928, 1679129, 1652839, 1626792, 1613861, 1551354, 1570038, 1601776, 1588089, 1563326, 1529576, 1546151, 1540358, 1528907, 1572411, 1544579, 1511304]
3593A511304l1778r421K5912l718j5789l8009o33o013L885n182j2400l2491L350
3580A389017L7495K5844j2029m2407K4685L4410l284l6802M59R804J0523L4210
3568A471925k3780J5469Q536K3393j9382R649M5296j288K2323L0480n360M2193
3556A619454j5405k1907J9231j2841k4886J1150Q153k028l7105j0792J5115K5267
3544A573406P519M14J8024J9471J0121K9873N5046R257O2832L6794R214M8623
3532A880594N0505N9438R4870K3165K5869O6333R2571O2620L1910P9717L2097
3521B499689K2460m971k6626N273O294J8728O4632N8123K2183L4408N0090R5416
3509B845699J10130Q3726L0549q734j3341r6334p7594j00472r1598j01343j39266
$$ y = [1511304, 1479526, 1470105, 1496017, 1492299, 1476510, 1438501, 1437868, 1431855, 1435740, 1430558, 1418158, 1385667, 1389017, 1426512, 1452356, 1440327, 1397920, 1422605, 1457015, 1453731, 1416929, 1417388, 1427192, 1437715, 1471925, 1448145, 1463614, 1472150, 1495543, 1476161, 1485810, 1531106, 1529818, 1552141, 1582621, 1577261, 1619454, 1604049, 1582142, 1601373, 1588532, 1563646, 1574796, 1582949, 1580921, 1543816, 1533024, 1548139, 1573406, 1580925, 1581339, 1599363, 1618834, 1628955, 1658828, 1713874, 1723131, 1785963, 1822757, 1831971, 1880594, 1931099, 1990537, 2085407, 2108572, 2134441, 2200774, 2293345, 2355965, 2387875, 2467592, 2499689, 2522149, 2517178, 2490552, 2495825, 2502119, 2520847, 2585479, 2643602, 2665785, 2700193, 2750283, 2845699, 2955829, 3039555, 3070104, 3061370, 3048029, 2951695, 2874101, 2773629, 2682031, 2580688, 2441422]
3498B441422r6637o4604j01058j9488j2749l4464m7366k4702l0750j0370j84j0263
3486A988787j5115k4998j9651J7227K0972j6941J3527K8548J3447q654l4751k8809
3474A933589M4254L1531k2215l6231j548K2597L999J2622P009K9288o015m675
3462B014205N3591M726K654J7957L4486k4628j8749q935L6244J2121K5661O1518
3450B210851K8204P488Q5088N6138M9834L8917L2866q40K6218K2443Q057K8211
3438B593475q247L4947j2692L7232L2160L2608j6466J3286O1056K7010K5247M7934
3426B867550R4305M9446P9363J5256L4800M2038M7665J4427P8327L2441P4339
3415C429957O8261R1745Q9168N0653Q5024P1023P795K3070J09716P2992P2322
$$ y = [2441422, 2344785, 2280181, 2179123, 2159635, 2146886, 2112422, 2065056, 2040354, 2009604, 1999234, 1999050, 1988787, 1973672, 1948674, 1929023, 1946250, 1967222, 1950281, 1963808, 1992356, 2005803, 1997149, 1962398, 1933589, 1977843, 2009374, 1987159, 1950928, 1949380, 1971977, 1975976, 1988598, 1995607, 2024895, 2018880, 2014205, 2067796, 2072522, 2075176, 2093133, 2127619, 2102991, 2084242, 2075307, 2111551, 2123672, 2149333, 2210851, 2239055, 2246543, 2331631, 2387769, 2437603, 2476520, 2509386, 2508546, 2534764, 2557207, 2565264, 2593475, 2585228, 2620175, 2607483, 2644715, 2676875, 2709483, 2693017, 2706303, 2767359, 2794369, 2819616, 2867550, 2961855, 3011301, 3090664, 3105920, 3140720, 3182758, 3230423, 3244850, 3323177, 3355618, 3429957, 3498218, 3589963, 3679131, 3729784, 3814808, 3885831, 3893626, 3916696, 4026412, 4099404, 4171726]
3404D171726K8393Q2345R3136Q7974Q1701J41220J61706J16131Q5412J03301J25348
3393E278393Q4241Q0243M8232J6533R2918M0679M8244R2343O0512P1640J44483
3382F058461R6653Q2755J41183J45624J63250J87590J27857J52222J80331J51846
3372G487772J34901J56324J53559J53412J74060J51951J66002J48959J80887J82517
3362I090344K12382J96990K06078K28970K11621K08370K25993K36836K47990K36264
3352A1301838K71458K81802K91502L25598L32531L82271L57434L72220L98535
3343A4315189M02630M05650M01750L78871L90026M10095M40811M34354M19785
3334A7999161M50647M54033M79257M89514N05003N48139N75659O04634O51615
$$ y = [4171726, 4200119, 4282464, 4375600, 4463574, 4545275, 4686495, 4848201, 4964332, 5049744, 5153045, 5278393, 5362634, 5442877, 5491109, 5507642, 5600560, 5641239, 5689483, 5781826, 5842338, 5913978, 6058461, 6155114, 6237869, 6379052, 6524676, 6687926, 6875516, 7003373, 7155595, 7335926, 7487772, 7622673, 7778997, 7932556, 8085968, 8260028, 8411979, 8577981, 8726940, 8907827, 9090344, 9302726, 9499716, 9705794, 9934764, 10146385, 10354755, 10580748, 10817584, 11065574, 11301838, 11573296, 11855098, 12146600, 12472198, 12804729, 13187000, 13544434, 13916654, 14315189, 14717819, 15123469, 15525219, 15904090, 16294116, 16704211, 17145022, 17579376, 17999161, 18449808, 18903841, 19383098, 19872612, 20377615, 20925754, 21501413, 22106047, 22757662]
3325B2757662P02114P74574Q07985Q28345Q96179J032384J143410J304430J504941
3316C1752024J714056K040477K405168K755105L263908M175485M841333L232466
3308E6180022j52122k621392l256719k748599j932253j199369p78241n68559m74696
3299D2448072l90718k85483q5751O7102K69225M28710M90476N00163N92484P38274
3289D4772554R14307J054809J142172J264935J428292J530932J670982J810960
3281E5589943K029908K359053K698369L151818L775410M609017N516147O172930
3273H5902595O095175M625032J752674j366298l453108l889314l295616k362474
3265H4008666j378410p40395k78767J06717N10209R82394J436059J929195K423071
$$ y = [22757662, 23459776, 24234350, 25042335, 25870680, 26766859, 27799243, 28942653, 30247083, 31752024, 33466080, 35506557, 37911725, 40666830, 43930738, 48106223, 52947556, 56180022, 56027900, 53406508, 50149789, 47401190, 45468937, 44269568, 43491327, 42922768, 42448072, 42057354, 41771871, 41686120, 41753222, 42022447, 42451157, 42941633, 43441796, 44034280, 44772554, 45686861, 46741670, 47883842, 49148777, 50577069, 52108001, 53778983, 55589943, 57619851, 59978904, 62677273, 65829091, 69604501, 74213518, 79729665, 85902595, 91997770, 96622802, 98375476, 97009178, 93556070, 89666756, 86371140, 84008666, 82630256, 81889861, 81611094, 81717811, 82228020, 83210414, 84646473, 86575668, 88998739]
3256H8998739K912972L381661L785396M270978M717270N259292N889354O687674
3248A25903336P615261Q671143R818095J1061040J2272278J3497816J4555582
3241B03394551J5124755J4796764J2924323R230229M234108q13858m633108o624897
3233B47632867o887943n815009l802948j395575J461032N007043R485133J5222087
3225B60906687K1293740K6490471K9903791K5581287R121597j2790876l0359667
3218C30147030l7189466l5402779k9924661k4295611k0325458j7756211j5923549
3211A49329295j4132308j2288544j0738846r360237q138474o949116n958169n178808
3203G6584793m626601m194687l907316l503930l139847k811169k455237k144068
$$ y = [88998739, 91911711, 95293372, 99078768, 103349746, 108067016, 113326308, 119215662, 125903336, 133518597, 142189740, 152007835, 163068875, 175341153, 188838969, 203394551, 218519306, 233316070, 246240393, 255470622, 259704730, 258890872, 254257764, 247632867, 240744924, 234929915, 231126967, 229731392, 231192424, 236199467, 245684600, 260906687, 282200427, 308690898, 338594689, 364175976, 373297573, 360506697, 330147030, 292957564, 257554785, 227630124, 203334513, 183009055, 165252844, 149329295, 135196987, 122908443, 112169597, 102809360, 94670886, 87721770, 81763601, 76584793, 71958192, 67763505, 63856189, 60352259, 57212412, 54401243, 51946006, 49801938]
3195D9801938j785280j527565j092381j002641j479545j896199j955279j779026
3187C7284022j574156j351537j115525r87765r02635r10447r29075q82287q35527
3178B7795068p40438o73364o19453o02013n84257n11193m52800l74125l29223
3169B2908202l08420k81064j43967n9579K2645Q4310K02966N77998J028715Q16082
3159B4847888l69258j372548j614947j522846j229934r35908p46621o71700n87733
3150A5796393n57962n63956m76757m55814m39173l96665l69283l24031k74813
3141A1937939k75292k26255k34939k38253k13461j61678j47198p2145j9762M4344
3131A0393300J28743K54481M47505K54379l20061o90065p70590p71527n86896
$$ y = [49801938, 48016658, 46489093, 45396712, 44394071, 42914526, 41018327, 39063048, 37284022, 35709866, 34358329, 33242804, 32255039, 31352404, 30441957, 29512882, 28630595, 27795068, 27054630, 26381266, 25761813, 25159800, 24575543, 24064350, 23611550, 23237425, 22908202, 22599782, 22318718, 22174751, 22115172, 22137817, 22222127, 22425093, 23003091, 24031806, 24847888, 24478630, 23106082, 21491135, 19968289, 18738355, 17802447, 17055826, 16384126, 15796393, 15238431, 14674475, 14197718, 13741904, 13302731, 12906066, 12536783, 12212752, 11937939, 11662647, 11436392, 11201453, 10963200, 10749739, 10588061, 10440863, 10368718, 10348956, 10393300, 10522043, 10776524, 11224029, 11478408, 11158347, 10468282, 9697692, 8926165, 8339269]
3122H339269m63426l93711l40543k63114k64527k42369k15460k31693k23956j69509
3112E530961j90044j76648j37449r7890j18433j42135j63348j24025j40523j27367
3102D113099j10986o8115p9511j01944p6250p3988p3595o4946j07338l0695l3284
3091C292447m1687k7797k0816q3204n0367o9270r6754n4523n9959k0365p1625
3080B696080m6187Q5n1014l4912m0693n0281p8266m3354m0156n8875j00572q8472
3068B063383l6230k7534o6203l2948j9081l0489J2070j40K3656J910K4857n735
3056A907516l4671l7540m2497p2610m0845r5356o0296m4157l4625j7835K161j896
3044A427349L2220K2105O5541J290p475k3890j7598J731J9256M437l4542K0568
$$ y = [8339269, 7875843, 7482132, 7141589, 6878475, 6613948, 6371579, 6156119, 5924426, 5700470, 5530961, 5340917, 5164269, 5026820, 4928930, 4810497, 4668362, 4505014, 4380989, 4240466, 4113099, 4002113, 3933998, 3854487, 3752543, 3676293, 3602305, 3528710, 3463764, 3356426, 3325731, 3292447, 3250760, 3222963, 3202147, 3118943, 3068576, 2999306, 2902552, 2848029, 2788070, 2767705, 2696080, 2649893, 2649978, 2598964, 2564052, 2523359, 2473078, 2394812, 2351458, 2311302, 2252427, 2151855, 2063383, 2027153, 1999619, 1933416, 1900468, 1881387, 1850898, 1862968, 1862828, 1886484, 1888394, 1913251, 1907516, 1872845, 1835305, 1792808, 1720198, 1679353, 1583997, 1523701, 1479544, 1444919, 1427084, 1429245, 1427349, 1459569, 1481674, 1547215, 1548505, 1541030, 1517140, 1499542, 1501273, 1520529, 1524966, 1490424, 1510992]
3032A510992K3485m6560l2219L0842K103q348Q708j8191l2757j9291l9489k8476
3020A350799j9460k4521J8445l8630r330l381m1208l6276K2420k8469k5577R465
3008A174277j2913J98R481M315j6148l6029O898o128n3540K492k0101n044J8439
2995A066197j9318K1765L7207o510K6911O074P651K4078k9097K0965m66J5181
2983A170638K8053j3613l708o807m0808k4038l9338o1685M446N956q994K0562
2971A030664K8840l6502O291L9850J7871l719N1259K3893K9397J3914j9607M4309
2959A226460O6581N8758N7687N2418P9461P6608M0020O0762Q7239L2707K4835
2948A863536M5453n007k1372j3822l5853J8022r576p241N0931N0642P4630Q4670
$$ y = [1510992, 1534477, 1487917, 1455698, 1486540, 1488643, 1480295, 1489003, 1470812, 1438055, 1418764, 1379275, 1350799, 1331339, 1306818, 1325263, 1286633, 1277303, 1273922, 1232714, 1196438, 1218858, 1190389, 1164812, 1174277, 1161364, 1161562, 1171043, 1175358, 1159210, 1123181, 1130079, 1123951, 1070411, 1072903, 1052802, 1047758, 1066197, 1046879, 1068644, 1105851, 1099341, 1126252, 1132326, 1139977, 1164055, 1134958, 1155923, 1155457, 1170638, 1198691, 1185078, 1181370, 1174563, 1133755, 1109717, 1070379, 1008694, 1013140, 1019096, 1010102, 1030664, 1059504, 1023002, 1029293, 1069143, 1087014, 1083295, 1134554, 1158447, 1187844, 1201758, 1182151, 1226460, 1293041, 1351799, 1409486, 1461904, 1541365, 1617973, 1657993, 1718755, 1805994, 1838701, 1863536, 1908989, 1903982, 1882610, 1868788, 1832935, 1850957, 1841381, 1834140, 1885071, 1935713, 2010343, 2095013]
2936B095013P6602L3953N9764P4318l2428o4326j34448j24280j68323j42025j07176
2925A566644q5254q5231o6563r8276o7799j2669o5928k0129k5656n1652k9419
2914I58068l4217n1715k5101l4417m8295j1565j4012j4128l2490j9655k700K828
2902F72601j9965k6330l2363N498K7821j5851l0811q592l0150j95L678l558J0539
2889E52322l3729P36o396R397k4025l644m953l8416L46K8184J7026p142j7327
2876D72379K4776l5864l091J6190j0172m1491j7730k71j6973J0201L0178m2054
2864C86078K540J5759k6935K1398k2459j2716L5800L1622l7112j3044j0602l094
2852C67235N6095j0871j9787j4226j2954n7110L4122L4045J821k2133k4596k1218
$$ y = [2095013, 2171615, 2205568, 2265332, 2339650, 2307222, 2242896, 2108448, 1984168, 1815845, 1673820, 1566644, 1481390, 1396159, 1329596, 1231320, 1163521, 1150852, 1084924, 1064795, 1039139, 987487, 958068, 923851, 872136, 847035, 812618, 764323, 752758, 738746, 724618, 692128, 672473, 669773, 672601, 652636, 626306, 593943, 599441, 627262, 611411, 580600, 572008, 541858, 541663, 545341, 541783, 552322, 518593, 519329, 512933, 522330, 498305, 494661, 489708, 451292, 451638, 479822, 496848, 489706, 472379, 497155, 461291, 458200, 474390, 464218, 422727, 404997, 404726, 387753, 397954, 428132, 386078, 388618, 404377, 377442, 398840, 376381, 363665, 399465, 431087, 393975, 380931, 370329, 367235, 423330, 412459, 392672, 378446, 365492, 308382, 342504, 376549, 378370, 356237, 331641, 310423]
2840C10423J6576J5459j0544Q468j3766j3609J5237k4245j7179o111R417M7385
2828C37511k8928Q575L971R513l8697l441j2712q375j444o148J5170N451j4249
2815B66197K4696k451l3624J3448R886o582J0013j2030J0166n878k9219n859J2436
2802B51199J4853P495K922J3943j2264l0040j9030J1660M438K0299l001n4272
2790B08202k8642k2929J299J6870n072Q790j1946N863L1404j4980l1946m2307
2778A14606L4315J0919J8967j7965j0075J259J4492j1913M7j5460o435j916J3023
2765A43864N781L0722L138n124k6313k7257J4433j1704K6243K2538K1757l3009
2753A65069Q337N59M293j3368p574p838K981M7235k8799l9601L7685P859k0148
$$ y = [310423, 326999, 342458, 331914, 340382, 326616, 313007, 328244, 303999, 286820, 280709, 290126, 337511, 308583, 317158, 321129, 330642, 291945, 288504, 275792, 267417, 265973, 259825, 274995, 280446, 266197, 290893, 288442, 254818, 268266, 278152, 271570, 281583, 269553, 279719, 273841, 244622, 238763, 251199, 266052, 273547, 276469, 290412, 278148, 248108, 229078, 240738, 245176, 265475, 262474, 208202, 179560, 156631, 157930, 174800, 169728, 178518, 166572, 172435, 203839, 188859, 156913, 114606, 148921, 159840, 178807, 160842, 150767, 152026, 166518, 154605, 154652, 139192, 132757, 130841, 143864, 149645, 180367, 183505, 178381, 152068, 124811, 139244, 127540, 153783, 176321, 198078, 165069, 173406, 173965, 178258, 164890, 157316, 149478, 152459, 199694, 170895, 131294, 168979, 176838, 156690]
2740A56690J3991J8152k7291l5429K5559K5706J2895j0535k523R343j677J1311
2728A96192j6465j8348q300K1522k3121k2686L9843J4638J0200l3900j8666L3162
2716A74071n674Q38O72q56r07J531J794K5651l2453j5226J7436K0206n244Q494
2702A90333j6314M386j8381k72J286k5641m724k3369M5509J7896m2971j2351N251
2689A20638k047P630j1357n706k1023J7647k1403K0316K5922k6255k2103k315
2677G9944R329L3340J9828q733R200l261m488l520j4576k6235J7301k1689J0513
2664I6953N561j7187o425l8045K8600j0147K6177K798Q005L3004j8380k2579k4227
2651F4108L0602j2592J0507N125J0483j3049K7494J212k8683J2428k8921M863
$$ y = [156690, 170681, 188833, 161542, 126113, 151672, 177378, 190273, 179738, 177215, 186558, 184881, 196192, 179727, 161379, 153079, 174601, 151480, 128794, 168637, 183275, 193475, 159575, 140909, 174071, 168397, 169235, 169907, 169051, 168144, 169675, 171469, 197120, 164667, 149441, 166877, 187083, 181839, 190333, 174019, 178405, 160024, 159752, 161038, 135397, 130673, 107304, 152813, 170709, 127738, 115387, 120638, 118591, 126221, 114864, 109158, 88135, 105782, 84379, 104695, 130617, 104362, 82259, 79944, 89273, 122613, 142441, 133708, 142908, 139647, 135159, 131639, 117063, 90828, 108129, 86440, 96953, 102514, 85327, 78902, 40857, 69457, 59310, 85487, 88285, 96290, 129294, 110914, 88335, 64108, 94710, 82118, 92625, 97750, 108233, 95184, 122678, 123890, 95207, 107635, 78714, 83577]
2639H3577J240r838k669K7994k3227p899q748J038j8432P316K3105j5243n090
2626E3124J9131l86j0701N814j4871k871k4889k7579Q249J4632N6295J3428k5931
2613F3445j8145J2757j1138l0439J9909n453m4304K6612J3681J3074R047j0281
2601C8765P756q982J7643K1400K018j0028p03O604j6923k0722J3493q112J5077
2588E7286J4453j1601J2854P5827l9245k088J7821n7440k4429O418k7374J6209
2576C8691K5277k5148K157Q493o942r623k3999o519J7829j8693K8286m703q947
2563A6159j3096L6058l3475q410j118j081K2504K190k285K301k9687J2229L6277
2550C8566R580m726j5803K8204M138J3675n977j9296j0918J1748O907P873j870
$$ y = [83577, 84817, 74979, 72310, 100304, 77077, 69178, 60430, 61468, 43036, 50352, 73457, 58214, 53124, 72255, 71869, 61168, 66982, 52111, 49240, 24351, -3228, 5021, 19653, 75948, 89376, 63445, 45300, 58057, 46919, 16480, 36389, 30936, -13368, 13244, 26925, 39999, 49046, 38765, 46521, 37539, 55182, 76582, 78600, 68572, 67869, 74473, 57550, 36828, 50321, 42209, 57286, 71739, 60138, 72992, 148819, 109574, 107486, 125307, 67867, 43438, 49856, 22482, 38691, 63968, 38820, 40977, 49470, 42528, 32905, 8906, 2387, 20216, 1523, 29809, 25106, 16159, 3063, 39121, 5646, -2764, -3882, -4963, 17541, 19731, 17446, 19747, -9940, 2289, 38566, 48146, 43420, 27617, 55821, 59959, 73634, 67657, 48361, 37443, 49191, 56098, 63971, 62101]
2537F2101J094k6538r557k0140J9932j8821k4622M054K3104k4330L3083K3713
2525D3073k228j943J497m394k453O591r439k6872M119J798L451J9602K699j3514
2511B1987n581j0753M454K3553j1520L5281j7031r150R05p743p199K1471m884
2498C3790j6115J9305l1530j8835N0461P226N269K2452j087j3871o652P35j149
2485D9999j1406j7832k2947K1136J719j5226J2270l3062N68N7370M5634L6942
2473A25165j2347j1114j8191J021n036j9874K3690j8973k9763J1597j4424M601
2461C6352J5316O355k4148J8319j7622k9088j2587l0306Q163l0236L6426L9678
2449A6622Q690J2331J2182n705m4413k0492q557M5363j06m4091R351M240k0387
$$ y = [62101, 63195, 36657, 27100, 6960, 26892, 8071, -16551, -12497, 10607, -13723, 19360, 43073, 40845, 38902, 40399, 36005, 33552, 40143, 30704, 3832, 7951, 9749, 13200, 32802, 35501, 21987, 16406, 5653, 10107, 33660, 22140, 57421, 40390, 31240, 32145, 24402, 17203, 38674, 33790, 17675, 36980, 5450, -13385, 37076, 44302, 49571, 72023, 70936, 57065, 50413, 51148, 49999, 38593, 20761, -2186, 18950, 20669, 5443, 17713, -15349, -14781, 42589, 88223, 125165, 112818, 101704, 83513, 84534, 79498, 59624, 83314, 64341, 34578, 46175, 31751, 36352, 51668, 58023, 33875, 52194, 34572, 5484, -7103, -37409, -29246, -59482, -23056, 16622, 25312, 37643, 49825, 44120, -293, -20785, -29342, 16021, 15915, -28176, -18825, -14585, -34972]
2436c4972Q731K4033j395k94l560J3851k2428l769j5012K1510J169l4351J2602
2423c3885K1414k050Q104Q868j107K2220O875l7319R805K443Q957m049j3440J0137
2409F973j0536k0911N921j7891J6601L5465l817q264j3576L1519J0923k1033R317
2396B0691J8247k2122R16P506j3003j0992K5421k539J1545m0122J2329J7197m008
2383B1066m5900K9924J1629k1409Q090L9834l276k2546R721K3334l6268K7434
2371D1633L0406l0866j7780j1432J9236k001j6425p50j1161k3348J2661o180J7835
2358A828N421J1079l1560K6149J3564K4594l5583j1360k190m986K5676J6852k2964
2345A6520L391j7241J4125M72j4873J0275j4470r978j6620L4775j398q573k4569
$$ y = [-34972, -26241, -2208, -3603, -3897, -7457, 6394, -16034, -19803, -34815, -13305, -12136, -46487, -33885, -12471, -14521, -6417, 2451, 1344, 23564, 30439, -6880, 2925, 5368, 14325, 10276, -3164, 6973, -3563, -24474, -18553, -36444, -19843, 15622, 11805, 3541, -10035, 21484, 32407, 11374, 20691, 38938, 16816, 17732, 25238, 12235, 1243, 26664, 24125, 35670, -4452, 7877, 25074, 21066, -24834, 5090, 16719, -4690, 3400, 43234, 39958, 17412, 27133, 50467, 14199, 41633, 72039, 41173, 23393, 11961, 31197, 29196, 12771, 12021, 860, -22488, -9827, -16007, 1828, 7249, 18328, -13232, 12917, 26481, 51075, 15492, 4132, 1942, -3044, 22632, 39484, 16520, 19911, 2670, 16795, 17267, 2394, 12669, -1801, -11779, -28399, 6376, 4978, -3595, -28164]
2332b8164L0729k0299jJ8855j5483Q070K0325l0307k3528j4417L9241J680j3076
2319b6375J4814n589K7811Q021M1877j5068n017j6665M583j6796J3749R013K0939
2306E5297l2726j2903k838M177J0427j3977Q867m37L009L2367k1047J944j0372
2293B1788j7343J3129l2018l33K2179k106r028J3005k5460J7228K4815o946l974
2280A4936o584k3573M174L0649K4446J725J3226m3969R298k0157j7646J8058k3715
2267a9132K8172k4073J0910J3815j1436K8812j2540j7458J4118l6768J3994M0174
2255B8588m423J2901k503k3038K8389l6209j5490K3700J1692J8978k8962p970
2243E653J7663L2661J4493k4493p360K0335j4447O473o498J5462j3850k1273n204
$$ y = [-28164, 2565, -17734, -17735, 1120, -14363, -6293, 14032, -16275, -39803, -54220, -14979, -13299, -26375, -11561, -17150, 10661, 18682, 60559, 45491, 40474, 23809, 28392, 11596, 25345, 34358, 55297, 22571, 9668, 6830, 11007, 21434, 7457, 16324, 15887, 18896, 51263, 30216, 32160, 21788, 4445, 17574, -14444, -14777, 7402, 5296, -3732, 9273, -16187, 1041, 25856, 18910, 14936, 8352, -15221, -11047, 19602, 44048, 45773, 58999, 15030, 24328, 4171, -13475, 4583, -19132, 9040, -15033, -4123, 9692, -1744, 27068, 14528, -2930, 11188, -25580, -11586, 28588, 24165, 37066, 34563, 11525, 39914, 3705, -11785, 11915, 23607, 42585, 13623, 5653, 23316, 55977, 70470, 45977, 38617, 58952, 44505, 50978, 44480, 59942, 46092, 24819, 19615]
2230A9615L4256j842k631k2378Q539L6057n432k2115L2059p253j5047p265j642
2217D4921J3064R381l9443n821K0001K4501l137P203M7605k9421q069R325J3400
2204A03510j9199n510L7195k967O16j9052j3341J855N161K2079k8790o919N695
2191H0333J2827o986J9308L972K7083k4920l3022j5923N2241J0838R172n872L5702
2178A64753J9662j4424J009o671L2728J71R461J0954k5728k7477K702K9045L1219
2165B27404L7434P291O326M4720k8576J7286k5341j4059Q126K4270K3977j8944
2153C09914J657K4995K1657J7282j924l0764o993K3480K4884M0325m1575L404
2141C86342L0869K5416J8996n6003Q323L6545j9904j0914o619n891j7104o632
$$ y = [19615, 53871, 52029, 49398, 27020, 35559, 71616, 66184, 44069, 76128, 68875, 53828, 46563, 44921, 57985, 67366, 27923, 22102, 42103, 66604, 63467, 70670, 118275, 88854, 80785, 90110, 103510, 84311, 78801, 115996, 113029, 113645, 94593, 81252, 83107, 88268, 110347, 81557, 74638, 80333, 93160, 86174, 105482, 109454, 136537, 111617, 78595, 62672, 114913, 125751, 134923, 129051, 164753, 184415, 169991, 171000, 164329, 197057, 197228, 206689, 217643, 191915, 164438, 167140, 196185, 227404, 264838, 272129, 278455, 323175, 294599, 311885, 286544, 272485, 280611, 304881, 328858, 309914, 311571, 336566, 358223, 375505, 373581, 342817, 335824, 359304, 384188, 424513, 382938, 386342, 417211, 442627, 461623, 405620, 413943, 450488, 430584, 419670, 413051, 407160, 390056, 383424]
2129C83424J8673M1595J951J1142M6618k1219L0124K9431J4431k4241j540O0032
2117E90421P129L7325K0482N8969P337l225L6095j5107M6553K4973J1987L7867
2105H60806O4925L8584k4330L8436M8456N4525O9485P2657J44121N5673M9630
2094A472968J13922P2032J10459J17348J56520K16193K75750L62673M80551O58818
2084D037234R89253J212836J400417J051606K59131l80263j245675j345757j072064
2075D906718p75083n99629n01867m28199l81526k61984k02160j61083j42607j08609
2065A343971j08197j16444r2751j00738q6730n3239o4140o3163m2505n7413l3761
2054E24890l6017l3826m7030m4328l1176J3782q270O571k9293j9027L2732K1382
$$ y = [383424, 402097, 443692, 445643, 456785, 503403, 482184, 512308, 541739, 556170, 531929, 530389, 590421, 597550, 634875, 655357, 714326, 721663, 718438, 754533, 739426, 785979, 810952, 822939, 860806, 925731, 964315, 939985, 978421, 1026877, 1081402, 1150887, 1223544, 1367665, 1423338, 1472968, 1586890, 1658922, 1769381, 1886729, 2043249, 2259442, 2535192, 2897865, 3378416, 4037234, 5026487, 6239323, 7639740, 8691346, 8950477, 8570214, 7324539, 5978782, 4906718, 4131635, 3532006, 3030139, 2601940, 2220414, 1958430, 1756270, 1595187, 1452580, 1343971, 1235774, 1119330, 1026579, 925841, 839111, 785872, 721732, 658569, 616064, 558651, 524890, 488873, 455047, 408017, 363689, 332513, 346295, 338025, 344596, 315303, 296276, 329008, 350390]
2042C50390k1899l7271j6453k2241j3469M867J3265k582n969k8490Q117J3157
2030B41422k3661l7455j0185Q576j8308k5552K3961O306J8288k1645J3571k3942
2018A51376J3258j84j4528J657M007j3867j1174n311r011k01q390K0250o38o675
2004A20569j2005q284J9487J6791M665k8576k0054J983p021j8807m959l8006J9456
1991D5239L488l9293K4270j6890R070O1164k3144k3644l443k267J2061p711j5407
1978B3493M4896k8936k3522J3208r716j7404L4135m1906k3150L3198J7630J5152
1966C7078k7355r185R405K6759j8310k2801J4904j1636J4327M4277l1071r019
1954A7373m006J4132l3170L579J7112l5550J6882j1090n152L3604j1143k5150
$$ y = [350390, 328491, 291220, 274767, 252526, 239057, 243924, 257189, 254607, 248638, 220148, 228265, 241422, 217761, 180306, 170121, 178697, 160389, 134837, 158798, 165104, 183392, 161747, 175318, 151376, 164634, 164450, 149922, 151579, 155586, 141719, 130545, 125234, 116223, 116022, 107632, 127882, 127244, 120569, 108564, 100280, 119767, 136558, 141223, 112647, 92593, 94576, 87555, 68748, 63789, 25783, 45239, 48727, 9434, 33704, 16814, 25884, 87048, 63904, 40260, 36817, 34550, 46611, 38900, 23493, 68389, 39453, 15931, 29139, 19423, 2019, 36154, -5752, -28902, 4296, 21926, 37078, 9723, 538, 9943, 36702, 18392, -4409, 10495, -1141, 13186, 57463, 26392, 17373, 13367, 27499, -5671, -2092, 15020, -20530, -3648, -14738, -19890, 13714, 2571, -22579]
1942b2579l374j0190L4811K4584M335k6496j6427j3726N130L8031Q842L7205j5283
1929D4863k7157k1073K4611O766j0839l8178P113J0180k7868K8992m521r884j1626
1916b8621K9802l0660Q986M19J5282j239l2261Q030j89j2091L7398j1084J1687
1903d541m172l1322M4115j30k0291l3924K0641K3604L8628l6816k4766N536J8572
1890d866p890j8550l824O832R755j3120k9241L1297m09J7896K8588K267r242O654
1876A6147l0070J6045k1586j3357K6538O08k6185l0843P026K2388P271J343L0994
1863F319n022k7828J0942q330j944K5774j6559R234K8626l2005k481j5439M1p455
1849c6127M4099r827k8730m80j3926J6691K1627q324K1601J0237m0559P529K6597
$$ y = [-22579, -25953, -36143, -1332, 23252, 27587, 1091, -15336, -29062, -23932, 14099, 22941, 60146, 44863, 17706, -3367, 21244, 28010, 17171, -21007, -13894, -3714, -31582, -2590, -7111, -16995, -28621, 1181, -29479, -20493, -20074, -4792, -6031, -38292, -30262, -30451, -42542, -5144, -16228, -4541, -8713, -40035, 4080, 3950, -16341, -50265, -29624, -6020, 32608, -4208, -28974, -23438, -4866, -12756, -31306, -35130, -28298, -18543, -31663, -60904, -29607, -30016, -12120, 16468, 18735, 9493, 16147, -13923, 2122, -19464, -32821, -6283, -5675, -31860, -62703, -55677, -33289, -26018, -24675, 6319, 1297, -26531, -15589, -23919, -25863, -89, -16648, -7414, 21212, -10793, -13274, -28713, -28672, -36127, 7972, -1855, -30585, -31065, -44991, -28300, -6673, -14997, 6604, 16841, -23718, -16189, 10408]
1836A0408n937j0593j8673k4666J8312J4468r873j0549K7897l0164j1253K4514
1824b6109K3113j373J6200k1972R002J6908n534K068j8032L0893J7756j2470J7360
1811D7810j769k8843j3670P432k0408J891M5483k4668n9442K3050K0075k1264
1799b4323P25m438j7719J2614N1801q854j0979K3739k827j747k9579Q672j4591
1786a7506J649j7763j8883j8968L3751j2678K2165R323O9212l2335l6538K240
1774a6331L2235j9213m2005L6067k3k5910j8035K2154R350R934j8779j5749O779
1761c9526K959o174n924J8931j0748k713K5577J881k0246J6966J5485J092l447
1748e887k2738J6403J2257L111J7017n1359J0508Q330j1893k5584K7005K2273
$$ y = [10408, 4471, -6122, -24795, -49461, -31149, -16681, -26554, -37103, -9206, -39370, -50623, -26109, -2996, -4369, 11831, -10141, -1139, 15769, 10235, 12303, -5729, 25164, 42920, 30450, 47810, 46041, 17198, 3528, 10960, -9448, -7557, 37926, 13258, -46184, -23134, -3059, -24323, -23598, -28036, -45755, -33141, 18660, 9806, -1173, 22566, 19739, 17992, -11587, -2915, -17506, -15857, -33620, -52503, -71471, -37720, -50398, -28233, -18910, 50302, 17967, -18571, -16331, 15904, -3309, -45314, -9247, -9270, -35180, -53215, -31061, -21711, -11777, -30556, -46305, -39526, -36567, -42741, -48665, -29734, -40482, -43195, -17618, -15737, -35983, -19017, -3532, -2440, -5887, -28625, -12222, 35, 3146, 20163, -31196, -20688, -12358, -24251, -49835, -22830, -557]
1736e57k2216J0665k6737J2727j0365k158K2177j225l0091J5318m559J0269l07
1723b7059j1698l943J6766J8451K4969j4469N219l1225L830K1421J4097K573l932
1710A5000j5940m2280m3574M9722Q760J4824k8727p018K1374J5874L563K706K7653
1697B1937K407k5476p696p086j625l0J742m1326o780J8296M360M088K81J3803
1683b3105o065M4373j2458j3102o87k7149J9454N057L080P936M821m949j8074
1670b0868l1208L8716L4768l0815o902j4951K3163j9694k3210O892J1174J1410
1658b1525J7302R198j3477K810j2640k6333j2353K2245M2552l042p189N213J0363
1645A3124r067k7773q456P645q275J0758N813l51M987j7208J575L7491J4764j8595
$$ y = [-557, -22773, -12108, -38845, -26118, -36483, -38641, -16464, -17689, -47780, -32462, -37021, -26752, -27059, -38757, -42700, -25934, -7483, 17486, 3017, 8236, -22989, -19159, 2262, 16359, 18932, 15000, -940, -43220, -86794, -37072, -28312, -13488, -42215, -49233, -27859, -11985, -8422, -5716, 21937, 24344, -1132, -8828, -15914, -17539, -17569, -15827, -57153, -63933, -45637, -41277, -37189, -36908, -23105, -29170, 15203, 2745, -10357, -11044, -38193, -18739, -13682, -10602, -2666, 2155, -2794, -20868, -52076, -13360, 21408, -9407, -16309, -31260, -8097, -27791, -51001, -44109, -32935, -21525, -4223, 4975, -8502, -5692, -18332, -44665, -57018, -34773, 7779, 4737, -2452, 2761, 13124, 4057, -23716, -32172, -24527, -32802, -22044, -16231, -16582, -11595, -28803, -27228, 10263, 25027, 6432]
1631F432m6326J3343j3283o1408N5372K1714J1642K2832k4821K6750K5022k6421
1619A0848j9171J627J8908l8463M6640o570k7911l5786K0808K0050k445o132j506
1606a9103L614j6303L7770l6978N133k107J0691m389J8532l2159k0032r172J1700
1593e2803O464j8180J7253K2406M116N685j4060J450J9228P82j2559k6703n763
1580e2684N540J2622K942l560O1011m3455k5970p581J3627R500J440q930J0319
1567b5179J9295J0126q181J1334k5078j2900l752k0669K1618J8458j8404J9288
1555a4044J1782q692o625k1697k771O7096R633j1217M69m4696R131O16j8942N458
1541b4499K2495J73R946M06r586l8765L71j978L0671Q249P919j4259K4790J5259
$$ y = [6432, -39894, -26551, -39834, -101242, -45870, -24156, -12514, 10318, -14503, 12247, 37269, 10848, -8323, -6696, 12212, -26251, 20389, 13819, -14092, -49878, -29070, -9020, -11465, -17597, -19103, -15489, -31792, 5978, -31000, -25867, -27974, -17283, -21672, -3140, -35299, -55331, -64503, -52803, -46339, -64519, -47266, -24860, -20744, -15059, -29119, -27669, -8441, -7659, -20218, -46921, -52684, -47144, -34522, -31580, -35140, 25871, -17584, -43554, -51135, -37508, -28008, -26568, -35498, -25179, -5884, 4242, -3939, 7395, -17683, -30583, -34335, -55004, -33386, -14928, -33332, -14044, -2262, -10954, -17579, -39276, -42047, 25049, 34682, 23465, 23934, -20762, -11631, -11015, -29957, -24499, -2004, -1831, 8115, 8521, -1065, -39830, -39459, -41437, -10766, -2517, 5402, -8857, 15933, 31192]
1527C1192o250l7915m768j4338o345N867j388q497o810K6614K7645k1232n816
1514b2041j6052o817K8579q627l3788N261J0815k6654K5870L6068o503l102O100
1501a0891J1500M1291j8705m3198j6740Q040J3785n328j3175K8253j209k3830
1489c0207J740L6070m966N340m801m2845J2556K155Q895M128K1833j2574n151
1476g827J268j5784J863l9713R195L1964k350J5981j2945K5417M28n1389j8986
1463f2878L7013J0749r299J3870q351j9828j592j0786j34K20L0659J6190Q857
1450D690n669p268k3916L3721j6928j5983J262l4695L8000Q358j5126J1057K9124
1437F627k189J6253J81k4652K354j3223K3792k123k7179l9672k5911L3933J6902
$$ y = [31192, 24942, -12973, -17741, -32079, -38424, -32557, -33945, -42442, -49252, -22638, 5007, -16225, -22041, -38093, -44910, -16331, -24958, -58746, -53485, -42670, -69324, -43454, -7386, -13889, -16991, -10891, 609, 41900, 23195, -20003, -36743, -28703, -14918, -20246, -33421, -5168, -6377, -30207, -28467, 7603, 2637, 7977, 3176, -39669, -27113, -24958, -16063, -11935, 9898, -2676, -7827, -6559, -22343, -20480, -60193, -50998, -19034, -21384, -5403, -18348, 7069, 7497, -43892, -62878, -25865, -15116, -24415, -10545, -18896, -38724, -40316, -51102, -51236, -51016, -20357, -4167, 4690, -979, -8247, -32163, 1558, -15370, -31353, -30091, -64786, -26786, -18428, -33554, -22497, 6627, 4438, 20691, 20872, -3780, -1426, -14649, 9143, 7020, -20159, -59831, -85742, -51809, -34907]
1424c4907K3072L8748j7943l117j1428k4470K6849K2928m255l6411j6356J883
1412c5407K5041O689j143m7506K078r553L4870L1251m8497k8093M1851N659p850
1399c0610k2547L9435R009p866J482J198o050k2183j8625K2504L2198N110n3888
1386e0833j197L5529k5562l481M730J8768j2428J6967n0662o753K6976J4548J7545
1373a5853K9733j0139l8340l405J4420k0726J0253K9202m3591j5638L4369P475
1361b2240j1425J6345m1605j5423K4268K0099k0322L8466L014j1510n401k774
1349b8508P241J8321l629k0463J4028K804J2536l2259l5114M4821J3197j5685
1337b2710n14j5724K7797o937n989R305K2647j3962k3031L648J6551p208j0440
$$ y = [-34907, -11835, 26913, 8970, 5853, -5575, -30045, -3196, 19732, 15477, -20934, -37290, -35407, -10366, -3677, -4820, -52326, -50248, -59801, -24931, 6320, -42177, -70270, -28419, -22760, -30610, -53157, -13722, -4713, -12579, -11097, -9899, -15949, -38132, -56757, -34253, -2055, 3055, -50833, -52030, -16501, -42063, -45544, -40814, -22046, -34474, -17507, -68169, -74922, -47946, -33398, -15853, 13880, 3741, -34599, -38004, -23584, -44310, -34057, -4855, -48446, -64084, -29715, -22240, -33665, -17320, -58925, -74348, -50080, -29981, -50303, -11837, -8823, -20333, -25734, -28508, -21267, -2946, -6575, -27038, -13010, -10206, 2330, -29929, -65043, -20222, -7025, -22710, -23224, -38948, -11151, -18088, -24077, -14772, 7875, -6087, -29118, -25470, -8919, -16127, -26567]
1324b6567P357J7189k055Q989l258p766j8546J3975J0093M626O269j0583n253
1311e530j6603l4926K2451J8095j4828m594J2130K6468N156m1792K657K5985k3260
1298b8591K977o458Q087N840J3032j8482j4458j1437N2K5517K1932J553j6278
1285a6714j2256J7472K4784q007k1582L177k5166J9708J2357k3899J4814P949
1273g363N857l6813j9273L1155K2191k3184O33j8792K523J1406P806k5899J3025
1260c6728J6806j0168J7231J5931k4846Q585M2977k1640k0328k2441P223L230
1248b4168K1601J1233m0580j9191K3666j9955n454J0381K360L7988j13j0070L584
1235h718n982M129o680r986M897j8896J6024L8516l9593J3233j5311J5567J1202
$$ y = [-26567, -19210, -2021, -4076, 4913, 1655, -6111, -24657, -10682, -589, 4037, 10306, -277, -5530, -22133, -57059, -34608, -16513, -31341, -35935, -23805, 2663, 7819, -33973, -31316, -5331, -28591, -25614, -32072, -23985, -18145, -5113, -23595, -38053, -49490, -49438, -23921, -1989, -436, -16714, -28970, -11498, 13286, 5279, -16303, -13126, -38292, -18584, -6227, -30126, -15312, -7363, -1506, -38319, -57592, -26437, -4246, -27430, -26797, -45589, -43066, -31660, -23854, -49753, -36728, -19922, -30090, -12859, 3072, -21774, -13189, 29788, 8148, -12180, -34621, -27398, -24168, -2567, 8666, -31914, -51105, -27439, -47394, -52848, -42467, -40107, -2119, -2232, -12302, -8718, -14700, -10571, -17251, -27237, -22340, -41236, -25212, 13304, -26289, -13056, -28367, -12800, -1598]
1222a598l3195J5695L8456l7894m5947L1660p620N235M125q860J9043R116L523
1209h261r429Q124Q555O574J0433k9572L3378L2938m8430O769q786n875K2671
1196A9089n785l614m5606o7k1644l627J300J0538J4585k1571L0769N0671l5050
1183a0012k3165R119o629J6774J8589k8827j3011Q326J2748Q951q070p725K7574
1170D642p155o699Q55J8197N119j9132j8969R950m140m3214K6842K4578j7060
1157b6186L084K0825p803l2989j2764L2519K6625j4686k3598K5846R356l094j979
1144d844j5050M180o129q94N3063m3731l6714K8284Q751m662J9609p633j5770
1131b1540P387j1661n579j4668L1952n09P962K5280m5575J0900j3152k8458J8114
$$ y = [-1598, -34793, -19098, 19358, -18536, -64483, -32823, -40443, -35208, -31083, -39943, -20900, -11784, -8261, -17690, -9566, -1011, 5563, 15996, -13576, 19802, 52740, 4310, 11079, 2293, -3582, 19089, 13304, 9690, -35916, -35983, -57627, -61254, -59954, -49416, -34831, -56402, -25633, 25038, -10012, -33177, -24058, -30687, -13913, 4676, -24151, -37162, -28836, -16088, -7137, -15207, -22932, 4642, -2513, -9212, -8357, 9840, 14959, -4173, -23142, -13192, -17332, -60546, -33704, -9126, -26186, -23102, -2277, -10080, -43069, -55833, -23314, 3311, -11375, -34973, -9127, 229, -2865, -4844, -19894, -15714, -21843, -22737, 30326, -13405, -50119, -21835, -13084, -17746, 1863, -5770, -21540, -14153, -25814, -31393, -46061, -14109, -14618, -6656, 18624, -26951, -16051, -29203, -57661, -39547]
1118c9547L4774J3890q573J3639J2236j9456o331K184K2127k9750k5200r800M6512
1105F705J634K458k0665k3413J5411m728J466L2110R23k5045o172k165k150O743
1091a6888L2984k1910j5657o005K1295j1491J9483K2448J6076k1351l376k2556
1079f948j663L8615j310l4526K2258j6570j4657j6780n487K1779p986l407q647
1066c5329J7555j3867l929L2336k1219k9432j5032L1839L2986J1957k7227k9903
1054d9265K1598K2827J5146p288J0747J2509j8190l4344J5710j5123J628K3856
1042a89m401J7316l7049O448j6669r503P8798k1482n60n855j5173J53j6621j774
1028b6561K8726r561r381j0018L7363o215l331l6602j8055K1619j2416J0872P101
$$ y = [-39547, -4773, 9117, 544, 14183, 26419, 6963, 632, 2816, 24943, -4807, -30007, -39807, 6705, 8339, 10797, -9868, -33281, -17870, -22598, -21132, 10978, 11901, -13144, -19316, -21481, -23631, -16888, 16096, -5814, -21471, -27476, -6181, -17672, 1811, 24259, 40335, 18984, 15608, -6948, -8611, 30004, 28694, -5832, 16426, -144, -14801, -31581, -37068, -15289, -23275, -26682, -35329, -17774, -31641, -35570, -3234, -24453, -53885, -68917, -37078, -4092, 7865, -19362, -49265, -27667, -4840, 10306, 3018, 13765, 26274, 8084, -26260, -10550, -25673, -24045, -189, -4590, 12726, -24323, -17875, -34544, -44047, 34751, 13269, 12709, 6854, -8319, -8166, -24787, -26561, 2165, -7396, -16777, -26795, 10568, 4353, 1022, -35580, -53635, -32016, -44432, -33560, -26459]
1015b6459k9239N499K3058K6518j5868j5013J3803P941n440o894K4355j0020q18
1002h577l5927K6634K8376o552p192k6314K760L3386J564L6244l6371l0023J8824
989c168J1876O032j056k1030N87j4261O225K0395O226k4738k3768R716J7629q516
975a7851L34L5892k3126j8576M580L7724J0937l6252k2509J2378r827J4824L2250
962B0778l9923K4686R838K110j3539j1679R822KK919k5994m796k1962j0536K4543
948c3731k6959M108K0910K8937J0052n931j3524q601K4236k0234j5307K100J2890
935b1054j0016K4106L0834O346J9631k8464m0514j7207P890J2488J0788K366k4640
922b7446J146k0894K8385J5632j6173R510j4180j1501K1513K0080J1541l0944
$$ y = [-26459, -55698, -50199, -27141, -623, -16491, -31504, -17701, -9760, -15200, -22094, 2261, -7759, -8577, -44504, -17870, 10506, 3954, -3238, -29552, -26792, 6594, 8158, 44402, 8031, -21992, -3168, 8708, 14740, 13684, -7346, -6759, -21020, -14795, 5600, 11826, -12912, -36680, -26964, -9335, -17851, -17517, 18375, -4751, -23327, -18747, 18977, 29914, -6338, -28847, -16469, -26296, -11472, 20778, -19145, 5541, 15379, 17489, 3950, -7729, 2093, 2095, 5014, -20980, -25776, -47738, -58274, -33731, -60690, -56582, -35672, -6735, 3317, -2614, -16138, -24739, -503, -20737, -36044, -33944, -21054, -31070, -6964, 23870, 30216, 49847, 21383, -19131, -36338, -28448, -15960, -5172, -2806, -27446, -26300, -47194, -18809, -3177, -19350, -9840, -24020, -35521, -14008, 6072, 17613, -13331]
910a3331J2311L403L790J7731l943p710k7792K8285K8171l2636j0119K335J664
897B159l0958K4572M0209l6569k3572J5455r443K8641o719o761j256K9034J3729
884C8521l5654J7152K7190k2799j8577j2913j1225n492J7424k1313N460j4141
872c6367R067J1353Q251L9112k2014O092k7789J7017l1846L0931K3947j6617j7645
859f508j71P034M61j1243k80J9879Q669n517K3404l2093j343m851p918M977j632
844g132R079J3257k2633J2442j5378l24O72q895R9j7127L7414J9179l9365n264
830b3976J9819L6446p511k488L2803r579J134k7809j1994k5091m408M0807J7382
817C5535l4270l730j3028J0443j0597N4084j0634r967M5113j8874j6709n770K4933
$$ y = [-13331, -1020, 2383, 6173, 23904, 19961, 12251, -15541, 12744, 40915, 8279, -1840, 495, 2159, -28799, -4227, 35982, -587, -24159, -8704, -18147, 10494, 3775, -2986, -4242, 24792, 38521, 2867, 20019, 47209, 24410, 5833, -7080, -18305, -23797, -6373, -27686, -22226, -36367, -27300, -15947, -7696, 31416, 9402, 15494, -12295, 4722, -27124, 3807, 27754, 11137, -6508, -6679, 355, 816, -10427, -10707, 9172, 17841, 12324, 35728, 3635, 2292, -2559, -10477, -5500, -7132, 1947, 15204, -7429, 5013, -10365, -10689, -10017, -18912, -18813, -35940, 1474, 20653, -18712, -23976, -4157, 32289, 24778, 22290, 55093, 45514, 46648, 18839, 6845, -18246, -22654, 18153, 35535, 1265, -2465, -15493, -5050, -15647, 38437, 27803, 17836, 62949, 44075, 27366, 21596, 46529]
804D6529K915l7102k1964L745J2731N556j9517k3030J2583J9458M4162l050k1295
791B1721k1069k123K756k5536j7334K0447J4495m503j4650L1426J1723K586K041
778B1980l171j279J1416j2874k4211M028o291J622J1492n558J8047j3985l3245
765c2029L1096J5894j9524m6560J6807M552k563O447O615J5206K934k0496P293
752a4328K4193q982J041l6578j2497M2931j5983N395k188j1667j5582J8822K8236
739B813M868R826j991J437m777k3772m913K1628L6831l105n845K5723j720p156
725D9847q143l7705Q013q855m8164J4806M3600j511J632j3640j2428K6557N331
712A9340k4771J8585l054k1539J4812M1975r919k5464k649k6681r207L417L7857
$$ y = [46529, 49444, 12342, -9622, -5877, 6854, 12410, -7107, -30137, -17554, 1904, 46066, 43016, 21721, 652, -1471, 1285, -24251, -41585, -21138, -6643, -11146, -25796, 5630, 17353, 19939, 21980, 18809, 17530, 28946, 16072, -8139, -4111, -10402, -8780, 2712, -2846, 15201, 1216, -32029, -933, 14961, -4563, -51123, -34316, -29764, -32327, -25880, -19265, -4059, -1125, -21621, -14328, 9865, 883, 1924, -34654, -47151, -4220, -20203, -14808, -16996, -28663, -44245, -25423, 2813, 7681, 17507, 15516, 16953, 12176, -11596, -16509, 5119, 41950, 38845, 33000, 58723, 57003, 49847, 41704, 3999, 12012, 3157, -45007, -30201, 13399, 11888, 13520, -120, -12548, 14009, 19340, -5431, 13154, 10100, -11439, 3373, 45348, 35429, 9965, 7316, -19365, -28572, -25155, 12702]
699A2702j3447j3670J0787R493M0807j3633j8918n910n576n576j4953L409o44
686a5129M0137o367j7380J6380K3572j8830k6991j313k2424K8210j6978j2745
674b9858j3817k5606K5429K6950k9522J4094L8666k4115m344M0886N727o789J4403
661C2104M135N553j1418j182k638p724O191L065j0380r318K4348K0859m4275j9075
647i755J2431R339K3256K18L0932m851l2717j1292l883n867k5826K1236K9202
634C2423j868k8360J465P663j7320l148J5727M2194M196k5277k1509k9749K2321
621a242P174m405n637J8764J5759k8009q350K0528k0764K2357j7248L2973l409
608B8491K899j0348k8350j275j4111k0534L4745N889L432L3648k0518k190l0465
$$ y = [12702, -745, -14415, -3628, 5865, 46672, 33039, 14121, 8211, 2635, -2941, -17894, -14485, -15129, 25008, 18641, 1261, 17641, 41213, 22383, -4608, -5921, -28345, -135, -17113, -29858, -43675, -69281, -43852, -16902, -46424, -32330, 6336, -17779, -22123, 18763, 24490, 17701, 32104, 36239, 41792, 30374, 29192, 26554, 18830, 25021, 28086, 17706, 8388, 32736, 53595, 9320, -9755, 2676, 12015, 35271, 35489, 66421, 61570, 28853, 17561, 13678, 7811, -18015, 3221, 32423, 30555, 2195, 3660, 11323, -5997, -9145, 6582, 48776, 52972, 27695, 6186, -23563, -1242, 5932, 1527, -4110, 14654, 30413, 2404, -5946, 14582, -6182, 16175, -1073, 31900, 28491, 31390, 21042, -7308, -8583, -22694, -43228, -8483, -2594, 838, 34486, 13968, 11778, -18687]
595a8687J9253k4464L876L5540N558j8385p785j2679L4674r842J966J9605Q160
582C6790J9143m7441L25k8681L882J4213K4755J1406k0974l3691k64J3561o723
569a3699k168K7200L4945l3108l5222K242K6419j0412K9339K3842j2631l2316
557D431P167k6189L9460L2188n766r587l8935j4232n483J4384k0872J4090p722
544a7066M2705J3118j4934m904j2043J7626j5729j1791m058Q514K6982K0506k3564
531B5362j8951L1833j9658o835J907k1667J5782m126J3941P245R180R897N564
518D9474k4936j0239q304j3316J025K7703M929K4470J3035q785q587k5435Q072
505B9106j1371k9144p546M4788K5251k1298p402l6404J3654L7243k8850k8945
$$ y = [-18687, 566, -23898, -20022, 15518, 21076, 2691, -5094, -17773, 16901, 7059, 9025, 28630, 36790, 55933, 8492, 8817, -19864, -15982, -1769, 22986, 34392, 13418, -20273, -20537, -6976, -13699, -15867, 11333, 46278, 13170, -22052, -19810, 6609, -3803, 25536, 49378, 36747, 4431, 11598, -14591, 24869, 57057, 51291, 41704, 2769, -11463, -16946, -2562, -23434, -9344, -17066, 25639, 38757, 23823, 18919, 6876, 24502, 8773, -3018, -7076, 1438, 28420, 48926, 25362, 6411, 38244, 18586, 11751, 13658, -8009, 7773, 3647, 17588, 24833, 34013, 43910, 49474, 24538, 14299, 5995, -7321, -6296, 21407, 26336, 50806, 63841, 55056, 46469, 21034, 29106, 17735, -11409, -18955, 25833, 51084, 29786, 22384, -14020, -366, 36877, 8027, -20918]
493b0918J4279L6748n925P962q03k0997K4784P426j1440l107K5474k4512m568
480B4403P548J499m2333K6590K1706k136k085J697l5714L334M5510p977L9354
467H1396l8886m8552r602L2347J9731j5847m698M521L7675k3747k0020K8086M991
454D7395k6023K1189P38k3463J141O444J4759k340J8567k6186K5854l8413J5598
441C5260m974P72L26l9588J6752m055o176P356j270Q858K2334l1354p935J4840
427A1146j5688K469K2829J504N824M420l131p096R713L5369m8830Q806k2811m556
413c2M541J7753O671q004r865K4646o09p722o697l2313L8272Q43q820Q23j1303
398H184J1196m280L1881j6001k9679L1299o864J784o872J3665l7524J2744K2698
$$ y = [-20918, -6639, 30109, 24184, 32146, 31343, 10346, 35130, 42556, 31116, 28009, 53483, 28971, 24403, 31951, 33450, -8883, 17707, 39413, 37277, 35192, 36889, 1175, 4509, 50019, 42042, 81396, 42510, -6042, -15644, 16703, 36434, 20587, 15889, 20410, 58085, 34338, 14318, 42404, 47395, 21372, 42561, 43299, 19836, 20977, 27421, 42180, 39840, 58407, 32221, 58075, 19662, 35260, 30286, 31058, 31384, -8204, 8548, 4493, -1683, 5673, 4403, 13261, 35595, 4241, -3694, 11146, -4542, -2073, 20756, 22260, 28084, 32504, 29373, 22277, 31990, 67359, 18529, 27335, 4524, -32, 4509, 22262, 28933, 20929, 11064, 35710, 35101, 27379, 20682, -11631, 26641, 27484, 18664, 19487, 8184, 19380, 15100, 46981, 30980, 1301, 32600, 25736, 27520, 20648, 34313, -3211, 9533, 32231]
385C2231J3681k1073j318k3881l7100j0559J1959N8495J6996m5159J8540J3186
373B5998j3464K4934M048m351N078k2869k9974K3113J9064O390n56k3005k9932
360a5526K7704M292N030j2170J9357Q923P924P355j7257j3135p767L201N838j8713
346E056p375K7558K2766j7096k9046J2491K4816j4476k1055J8313j4606K1712
334B9058q559J9762l506n49J4201o313l857j1143m497J7011j0366K13K0951N74
320E2980J4913k0113k4738k8751J6315K0902j6698m273J1184K5720k9406j3932
308D103K1896J6561m975j2546J800k3645O714J4977J5642L0264j9262j252k3209
295B7068l2719J2275n361J22J1257K6408k514k0757j3613L6355K4309j4843K0141
$$ y = [32231, 45912, 24839, 23521, -360, -37460, -48019, -36060, 22435, 39431, -5728, 12812, 25998, 12534, 37468, 41516, 37165, 42243, 19374, -10600, 12513, 31577, 37967, 37411, 14406, -15526, 12178, 16470, 21500, 9330, 28687, 37610, 45534, 52889, 35632, 22497, 14730, 17931, 23769, 5056, -2319, 25239, 48005, 30909, 1863, 14354, 39170, 24694, 3639, 21952, 7346, 29058, 20499, 40261, 36755, 36206, 50407, 44094, 40237, 29094, 24597, 41608, 31242, 31455, 52406, 52980, 67893, 47780, 23042, -5709, 10606, 31508, 14810, 10537, 21721, 47441, 18035, 4103, 25999, 42560, 37585, 25039, 26839, 3194, 9908, 24885, 40527, 70791, 51529, 50277, 27068, -5651, 6624, 1263, 1385, 12642, 39050, 36536, 15779, 2166, 38521, 62830, 47987, 68128]
282F8128k4391j7024J6956k5060l3079M187k165J2021J6641J4411O821M491k3048
269A8889J0078M186j795j0933J0227J965K1396J1976J2040m6279J766R820k114
256D1222p752k8184L1270k622K7678M656k5651k6907l1694j8518K6751J2424M477
243G150l993L20M062L0405k8252k5837L9774l534j0031J2694m13j8977M808L1275
229C9451j2673O993k4242L3832p08J8448k9625l3488L70j995M4443L2680j4958
216E8528J30k9467J3781k1539j7204K6090o891L3228k881j4159J2841k5194l4
203B7229q530l0374K7982K8998J1183l7865K155N085P733P799M18m094L9285l1549
189D5455k3202J5594k2657p990R319J6357l0515K5188J5439j2619K4989l92j9132
$$ y = [68128, 43737, 26713, 43669, 18609, -14470, -10283, -12448, -427, 16214, 30625, 37446, 41937, 18889, 28967, 33153, 31358, 20425, 30652, 32617, 54013, 65989, 78029, 31750, 33516, 43336, 41222, 33470, 5286, 36556, 33934, 61612, 66268, 40617, 13710, -17984, -36502, -9751, 2673, 7150, 3157, 3477, 7539, 37944, 9692, -16145, 23629, 20095, 10064, 22758, 22345, 3368, 8176, 39451, 26778, 33771, 9529, 43361, 42653, 61101, 31476, -2012, -1642, -3637, 40806, 73486, 58528, 58658, 29191, 42972, 21433, 4229, 30319, 23428, 56656, 53775, 39616, 52457, 27263, 27229, 18699, -11675, 16307, 45305, 56488, 18623, 20778, 25863, 33596, 41395, 41813, 37719, 77004, 45455, 22253, 37847, 15190, 7200, 16519, 32876, 2361, 27549, 42988, 30369, 55358, 54966, 35834]
176C5834k062J4976r290j7639j302Q021j7862K5308j806Q048J2030j8237J706
163C7725J7844n844j0425L3388J3757m7640J0114J4500o329l0155K4340J974l2960
150B0289m292l472q313O5977N833m3002Q286M230p537j3336R262j0747J5746j9537
136A9387K0747J9527O151l0503n328J6949J4435j9321K6047N380k8647j1301J1319
123D4842m358k1883k7659r563K4446J0743K2695J838l917j347Q122m716Q498l732
109D4009K989o559J5315L412k9364n923J2784P128o92r799J9533j0485j0812L2420
95F3956k3250r527j6121r39Q551Q942K40Q176p958l6J7036l813m008j4139M08
80B7518n773o258J7961J1238q747q327R450N776l687J6541P895m615k9303J121
$$ y = [35834, 33772, 48748, 39458, 21819, 20517, 28538, 10676, 35984, 34178, 42226, 54256, 36019, 37725, 55569, 49725, 39300, 72688, 86445, 38805, 48919, 63419, 57090, 26935, 51275, 53249, 20289, 15997, 12525, 4212, 70189, 76022, 33020, 41306, 45536, 37999, 24663, 33925, 23178, 38924, 19387, 40134, 59661, 65812, 35309, 29981, 46930, 61365, 42044, 68091, 73471, 44824, 33523, 44842, 40484, 18601, -9058, -18621, 5825, 16568, 39263, 41101, 37184, 35837, 43959, 39243, 47741, 44009, 46998, 40439, 55754, 59166, 29802, 23879, 36663, 43791, 43099, 33300, 52833, 42348, 31536, 63956, 40706, 31179, 15058, 14119, 22670, 31612, 31852, 40028, 32070, 32034, 49070, 45257, 41249, 27110, 27518, 21745, 15487, 33448, 44686, 35939, 27612, 37062, 42838, 39151, 55692, 63587, 58972, 29669, 30790]
66C0790K8918q080k5748p423J238P285L3734j044q571j0859J1908j1493k89j7219
52B3147j4568L9036q269o043M82m63J2734k483P527J4710j8223j1052j2336Q130
38C2329P960L406l824J5315o972j7351q621J6875J4431p723j1482O564k5214j917
24A3776K0367k365K993K6011K9683l683j5924j3981j0801n96J0086j6014m39K6789
10F5902q117r140l06J2729j7573j4269m805J8070l446m002
0C5043
$$ y = [30790, 59708, 51628, 25880, 18457, 19695, 26980, 60714, 59670, 51099, 40240, 52148, 40655, 40366, 23147, 8579, 47615, 39346, 33303, 33785, 33322, 46056, 43573, 51100, 65810, 47587, 36535, 24199, 32329, 40289, 43695, 39871, 55186, 48214, 30863, 22242, 39117, 53548, 45825, 34343, 40907, 15693, 13776, 34143, 31778, 34771, 60782, 90465, 86782, 70858, 56877, 46076, 45480, 55566, 39552, 39113, 65902, 57785, 48645, 48339, 61068, 43495, 29226, 24421, 42491, 39045, 35043]
$$ Imaginary data points
##PAGE= N=2
##DATA TABLE= (X++(I..I)), XYDATA
16383i53894K4748L5509R278j7230K5943M606K7548J296R73K3982K7311J0758
16371g79172K4725J7649P392K4512J2719J4112K0379K1500K4300K1919R21L767
16359e85277L3253O812K2933J0723k5612L3972L2321K706q259L4822J912J9572
16347d20122K7446L0438J469j6755J1952J7858J4744K7646K217J1394L4556O550
16335b50607Q581J7824J2465p110J1131K3640M0412J2408J6961J6009n405P822
16323i5869J3608L679J3001P423M8907M029J4136J7176K062K2071o276p342K1176
16310E7781L3323m104L8187O227Q689L7896j4772J016K5973o992K9804P245K1025
16297B41298l872J8961K1566K6073J3418N498j3966K2079M0254k5668K3311K8022
$$ y = [-953894, -929146, -893637, -884359, -901589, -875646, -871040, -843492, -842196, -841223, -817241, -789930, -779172, -754447, -736798, -729406, -704894, -692175, -678063, -657684, -636184, -611884, -589965, -589044, -585277, -552024, -545212, -522279, -511556, -537168, -503196, -470875, -468169, -476428, -441606, -439694, -420122, -392676, -362238, -360769, -377524, -365572, -347714, -332970, -305324, -303107, -291713, -257157, -250607, -242026, -224202, -211737, -218847, -207716, -184076, -143664, -131256, -114295, -98286, -103691, -95869, -82261, -78582, -65581, -58158, -9251, -5222, 8914, 26090, 28152, 50223, 43947, 36605, 57781, 91104, 87000, 125187, 131414, 140103, 177999, 163227, 164243, 190216, 183224, 213028, 220273, 241298, 237426, 256387, 277953, 304026, 317444, 322942, 308976, 331055, 371309, 345641, 368952, 396974]
16285C96974j5875L0507k2984R645m099k098K3289L5123K8910n146M3584j3058
16273E04772K5356j7957P853J1088K9836K428j4519J3976L9981j2481K4265m193
16261F10405K8317J4663l303K9696j360j4463K847J0644o420L4570K6367M34L341
16248G35738j5365K5708L3285K0564n454j034L5557j1255j9555J0739m526J2975
16236H17377K1930J5899J3940k6361J6907R58J3528o42m765K1833M4691j336j3339
16223I20620J5961j7918k1747M0759L2929L0794J5724k8949J3037k65l7120K1948
16211I85773P560K8581j8097j149p5K9908n8J8904m157j6673J1988R367L6039
16198A087911L3265j2870j4212J1896J0847l8300P215K2941o785k421K0174K4108
$$ y = [396974, 381099, 411606, 388622, 398267, 394168, 392070, 415359, 450482, 479392, 474246, 517830, 504772, 530128, 512171, 520024, 531112, 560948, 563376, 548857, 562833, 602814, 590333, 614598, 610405, 638722, 653385, 650082, 679778, 678418, 663955, 666802, 677446, 671026, 705596, 731963, 732397, 735738, 720373, 746081, 779366, 799930, 794476, 793442, 828999, 817744, 798189, 808928, 804402, 817377, 839307, 855206, 869146, 842785, 859692, 860650, 874178, 873536, 868771, 890604, 935295, 933959, 920620, 936581, 918663, 896916, 937675, 970604, 1001398, 1017122, 988173, 1001210, 1000945, 963825, 985773, 993333, 1021914, 1003817, 1002668, 1002593, 1032501, 1032443, 1051347, 1047190, 1030517, 1042505, 1051872, 1087911, 1121176, 1108306, 1094094, 1105990, 1116837, 1078537, 1085752, 1108693, 1101908, 1099487, 1119661, 1143769]
16186A143769J8446J4311k2795m5456L324L0842Q636J4047k2745Q012L0576K1876
16174A202843K684m152j954J597J5301J1532P31j9008q356K6192k7345q898K0790
16161A211957K8443k3094j105J7833k7375Q206k835j383L7197N592p967N43L0210
16148A276222J8280j853l4286L4617J3227k0175l4276L0149j1197m8252k835K8632
16136A248253L7102P616K0599L977n542K662K503p138L6980p248k7694J4176L995
16123A330241j2891j5153n125o506L2544J2950l819j5071K3684k187j3402j7587
16111A307678J767j779J9897J3921J8375J1237K618n487j5907j8916L84m261M5201
16098A374728m284j8673j6052k3250P16p746J7718K5225N9242j728k5337k143
$$ y = [1143769, 1162215, 1176526, 1153731, 1108275, 1111599, 1142441, 1151077, 1165124, 1142379, 1150391, 1180967, 1202843, 1205527, 1201375, 1199421, 1201018, 1216319, 1227851, 1228582, 1209574, 1201218, 1227410, 1200065, 1191167, 1211957, 1240400, 1217306, 1216201, 1234034, 1206659, 1214865, 1212030, 1210647, 1247844, 1253436, 1245469, 1246012, 1276222, 1294502, 1292649, 1258363, 1292980, 1306207, 1286032, 1251756, 1281905, 1270708, 1222456, 1219621, 1248253, 1285355, 1292971, 1313570, 1317547, 1312005, 1314667, 1317170, 1310032, 1347012, 1339764, 1312070, 1326246, 1330241, 1317350, 1302197, 1297072, 1290566, 1323110, 1336060, 1332241, 1317170, 1340854, 1338667, 1325265, 1307678, 1309445, 1307666, 1327563, 1341484, 1359859, 1371096, 1373714, 1368227, 1352320, 1333404, 1333788, 1329527, 1374728, 1370444, 1351771, 1335719, 1312469, 1313185, 1305439, 1323157, 1348382, 1407624, 1405896, 1380559, 1378416]
16086A378416M032O306L554o583j0188j1218K757j2208M1613j8316J2265M1740
16074A432170Q37l7254k5982n447L0151M351k1813k4047J2854M3116j170Q04j6156
$$ y = [1378416, 1382448, 1388754, 1392308, 1385725, 1375537, 1364319, 1367076, 1354868, 1396481, 1378165, 1390430, 1432170, 1433007, 1395753, 1369771, 1364324, 1394475, 1398826, 1377013, 1352966, 1365820, 1408936, 1407766, 1408570, 1392414]
$$ [...]
##END NTUPLES=NMR SPECTRUM
##END=
