##TITLE=1H_EC-3296(IV-2)
 CDCl3
 8 sc, 
 7.6.2023
##JCAMPDX= 6.0         $$ Bruker NMR JCAMP-DX V2.0
##DATA TYPE= NMR SPECTRUM
##DATA CLASS= NTUPLES
##ORIGIN= UXNMR, Bruker Analytische Messtechnik GmbH
##OWNER= root
$$ XWIN-NMR		Version 3.5
$$ Wed Jun  7 15:59:31 2023 Russian Standard Time (UT+4h)  she@DPX200
##.OBSERVE FREQUENCY= 200.13135
##.OBSERVE NUCLEUS= ^1H
##.ACQUISITION MODE= SIMULTANEOUS
##.ACQUISITION SCHEME= undefined
##.AVERAGES= 8
##.DIGITISER RES= 18
##SPECTROMETER/DATA SYSTEM= spect
##.PULSE SEQUENCE= zg30
##.SOLVENT NAME= CDCl3
##.SHIFT REFERENCE= (INTERNAL, CDCl3, 0, 15.7634)
##AUDIT TRAIL= $$ (NUMBER, WHEN, WHO, WHERE, WHAT)
$$ ##TITLE= Audit trail, XWIN-NMR		Version 3.5
$$ ##JCAMPDX= 5.01
$$ ##ORIGIN= Bruker BioSpin GmbH
$$ ##OWNER= she
$$ F:/spectra/data/she/nmr/H-F/1/pdata/1/auditp.txt
$$ ##AUDIT TRAIL=  $$ (NUMBER, WHEN, WHO, WHERE, WHAT)
(   1,<2023-06-07 15:58:19.14 +0400>,<she>,<DPX200>,
      <created by zg, POWCHK disabled, PULCHK disabled
       configuration hash MD5:
       00 E9 B6 7A A2 85 ED C7 34 08 36 98 17 FE 4E 26
       data hash MD5: 16K
       60 AA 01 DE 54 3F F1 FC 33 99 68 C5 AD 80 F9 DD>)
(   2,<2023-06-07 15:58:21.48 +0400>,<she>,<DPX200>,
      <Start of raw data processing
       efp BC_mod = 2 LB = 0.24 FT_mod = 6 PKNL = 1 PHC0 = -20062.12 PHC1 = 9.85272 SI = 16K 
       data hash MD5: 16K
       86 D9 F4 C0 D2 A5 B6 28 D3 FD FB 84 AF 62 00 EA>)
(   3,<2023-06-07 15:58:41.82 +0400>,<she>,<DPX200>,
      <pk PHC0 = -2.628753 PHC1 = 3.2 
       data hash MD5: 16K
       DB 6E EF 09 11 4B 89 86 93 33 7D A0 84 6C 85 EF>)
(   4,<2023-06-07 15:58:44.92 +0400>,<she>,<DPX200>,
      <abs ABSG = 5 
       data hash MD5: 16K
       94 C4 F5 AC 3C 27 32 9F B5 66 2F 28 CE C8 B3 0C>)
$$ ##END=
$$ 
$$ hash MD5
$$ 01 9A 4A D2 B6 83 0F DD AC D0 7D 42 B2 30 E3 AC
##$RELAX= 
##$RELAX= 
##$RELAX= 
##$RELAX= 
##$RELAX= 
##$RELAX= 
$$ Bruker specific parameters
$$ --------------------------
##$DU= <F:/spectra>
##$EXPNO= 1
##$NAME= <H-F>
##$PROCNO= 1
##$TYPE= <nmr>
##$USER= <she>
##$AMP= (0..31)
100 100 100 100 100 100 100 100 100 100 100 100 100 100 100 100 100 100 
100 100 100 100 100 100 100 100 100 100 100 100 100 100 
##$AQSEQ= 0
##$AQ_mod= 1
##$AUNM= <au_zg>
##$AUTOPOS= <>
##$BF1= 200.13
##$BF2= 200.13
##$BF3= 200.13
##$BF4= 200.13
##$BF5= 200.13
##$BF6= 200.13
##$BF7= 200.13
##$BF8= 200.13
##$BYTORDA= 1
##$CFDGTYP= 0
##$CFRGTYP= 5
##$CHEMSTR= <none>
##$CNST= (0..31)
1 1 145 1 1 1 1 1 1 1 1 1 1 1 1 1 1 1 1 1 1 1 1 1 1 1 1 1 1 1 1 1 
##$CPDPRG= <>
##$CPDPRG1= <>
##$CPDPRG2= <>
##$CPDPRG3= <>
##$CPDPRG4= <mlev>
##$CPDPRG5= <mlev>
##$CPDPRG6= <mlev>
##$CPDPRG7= <mlev>
##$CPDPRG8= <mlev>
##$CPDPRGB= <>
##$CPDPRGT= <>
##$D= (0..31)
0 1.2 0 0 0 0 0 0 0 0.06 0 0.03 0 0 0 0 0.0002 0 0 0 0 0 0 0 0 0 0 0 0 
0 0 0 
##$DATE= 1686139098
##$DBL= (0..7)
120 120 120 120 120 120 120 120 
##$DBP= (0..7)
150 150 150 150 150 150 150 150 
##$DBP07= 0
##$DBPNAM0= <>
##$DBPNAM1= <>
##$DBPNAM2= <>
##$DBPNAM3= <>
##$DBPNAM4= <>
$$ [...]
##$SUBNAM3= <"">
##$SUBNAM4= <"">
##$SUBNAM5= <"">
##$SUBNAM6= <"">
##$SUBNAM7= <"">
##$SUBNAM8= <"">
##$SUBNAM9= <"">
##$SW= 18.05172834244
##$SWIBOX= (0..15)
0 0 2 0 0 0 0 0 0 0 0 0 0 0 0 0 
##$SW_h= 3612.71676300578
##$TD= 16384
##$TD0= 1
##$TE= 0
##$TE2= 300
##$TE3= 300
##$TEG= 300
##$TL= (0..7)
0 120 120 120 120 120 120 120 
##$TP= (0..7)
150 150 150 150 150 150 150 150 
##$TP07= 0
##$TPNAME0= <>
##$TPNAME1= <>
##$TPNAME2= <>
##$TPNAME3= <>
##$TPNAME4= <>
##$TPNAME5= <>
##$TPNAME6= <>
##$TPNAME7= <>
##$TPOAL= (0..7)
0.5 0.5 0.5 0.5 0.5 0.5 0.5 0.5 
##$TPOFFS= (0..7)
0 0 0 0 0 0 0 0 
##$TUNHIN= 0
##$TUNHOUT= 0
##$TUNXOUT= 0
##$USERA1= <user>
##$USERA2= <user>
##$USERA3= <user>
##$USERA4= <user>
##$USERA5= <user>
##$V9= 5
##$VALIST= <valist>
##$VCLIST= <CCCCCCCCCCCCCCC>
##$VD= 0
##$VDLIST= <DDDDDDDDDDDDDDD>
##$VPLIST= <PPPPPPPPPPPPPPP>
##$VTLIST= <TTTTTTTTTTTTTTT>
##$WBST= 1024
##$WBSW= 4
##$XGAIN= (0..3)
0 0 0 0 
##$XL= 0
##$YL= 0
##$YMAX_a= 140286
##$YMIN_a= -173214
##$ZGOPTNS= <>
##$ZL1= 120
##$ZL2= 120
##$ZL3= 120
##$ZL4= 120
##$ABSF1= 15.76011
##$ABSF2= -2.291739
##$ABSG= 5
##$ABSL= 3
##$ALPHA= 0
##$AQORDER= 0
##$ASSFAC= 0
##$ASSFACI= 0
##$ASSFACX= 0
##$ASSWID= 0
##$AUNMP= <proc_1d>
##$AZFE= 0.1
##$AZFW= 0.1
##$BCFW= 0
##$BC_mod= 2
##$BYTORDP= 0
##$COROFFS= 0
##$CY= -3
##$DATMOD= 1
##$DC= 0
##$DFILT= <>
##$DTYPP= 0
##$F1P= 0
##$F2P= 0
##$FCOR= 1
##$FTSIZE= 16384
##$FT_mod= 6
##$GAMMA= 0
##$GB= 0
##$INTBC= 1
##$INTSCL= 3.70164e-10
##$ISEN= 128
##$LB= 0.24
##$LEV0= 0
##$LPBIN= 0
##$MAXI= 10000
##$MC2= 0
##$MEAN= 0
##$ME_mod= 0
##$MI= 1.114404
##$NCOEF= 0
##$NC_proc= -6
##$NLEV= 6
##$NOISF1= 3.799351
##$NOISF2= 2.8
##$NSP= 0
##$NTH_PI= 0
##$NZP= 0
##$OFFSET= 15.76342
##$PC= 1
##$PHC0= -20064.75
##$PHC1= 13.05272
##$PH_mod= 1
##$PKNL= yes
##$PPARMOD= 0
##$PSCAL= 0
##$PSIGN= 0
##$REVERSE= no
##$SF= 200.130001626296
##$SI= 16384
##$SIGF1= 3
##$SIGF2= 2
##$SINO= 5.538805
##$SIOLD= 16384
##$SREGLST= <1H.CDCl3>
##$SSB= 0
##$STSI= 16384
##$STSR= 0
##$SW_p= 3612.71676300578
##$SYMM= 0
##$S_DEV= 0
##$TDeff= 16384
##$TDoff= 0
##$TI= <>
##$TILT= no
##$TM1= 0
##$TM2= 0
##$TOPLEV= 0
##$USERP1= <user>
##$USERP2= <user>
##$USERP3= <user>
##$USERP4= <user>
##$USERP5= <user>
##$WDW= 1
##$XDIM= 16384
##$YMAX_p= 409957785
##$YMIN_p= -300299
$$ End of Bruker specific parameters
$$ ---------------------------------
##NTUPLES= NMR SPECTRUM
##VAR_NAME=  FREQUENCY,     SPECTRUM/REAL,   SPECTRUM/IMAG
##SYMBOL=    X,             R,               I
##VAR_TYPE=  INDEPENDENT,   DEPENDENT,       DEPENDENT
##VAR_FORM=  AFFN,          ASDF,            ASDF
##VAR_DIM=   16384,         16384,           16384
##UNITS=     HZ,            ARBITRARY UNITS, ARBITRARY UNITS
##FACTOR=    0.220516191357247, 1,           1
##FIRST=     3154.73329124573, 0,            0
##LAST=      -457.983471760052, 0,           0
##MIN=       -457.983471760052, -300299,     0
##MAX=       3154.73329124573, 409957785,    0
$$ Real data points
##PAGE= N=1
##DATA TABLE= (X++(R..R)), XYDATA
$$ [...]
8796 18586095 19986964 21590221 23310504 25036352 26595925 27654955 28316903 28721298
8788 28721298 29063375 29323271 29543692 29987777 30564908 30858793 30613019 29681187 28334374
8779 28334374 26861612 25215872 23492316 21933282 20833056 19905986 18659920 17288301
8771 17288301 16107781 15230514 14693040 14356979 14102988 13961378 13912177 13975706 14220277 14621783
8761 14621783 15036956 15364435 15713936 16168628 16862096 17665064 18564470 19446064 20070476
8752 20070476 20238724 19764998 18774313 17747980 17206945 17038385 17047741 17196396 17202110 16708962
8742 16708962 15596421 14001650 12335031 10946954 9823258 9058417 8526615 8122271 7827283
8733 7827283 7567476 7252526 6974285 6696713 6402842 6139113 5899975 5675503 5457676 5311739
8723 5311739 5198412 5099017 5015846 4939315 4877573 4853461 4837315 4842926 4874178 4953906 5083000
8712 5083000 5237238 5444321 5675398 5956658 6273311 6685859 7229259 7885205 8759454 9994013
8702 9994013 11692686 14313413 18075186 21760800 22762831 19913932 15423913 11951630
8694 11951630 9764287 8214751 7101519 6251324 5611010 5130102 4792039 4472108 4199043
8685 4199043 4078714 3956311 3867217 3780818 3701773 3645739 3560873 3522509 3531483 3531226 3549024 3579956
8673 3579956 3600566 3650748 3713322 3786598 3916099 4018251 4056759 4066141 4024880 3945133 3905249
8662 3905249 3857658 3804386 3743172 3725888 3760114 3762864 3789460 3800445 3842947 3855738 3934148 4022188
8650 4022188 4076021 4178555 4317031 4457060 4625039 4821192 5036780 5322236 5645461 6029659
8640 6029659 6527791 7079752 7692542 8362157 8957228 9429406 9908814 10516067 11233968 11865159
8630 11865159 12177245 12223455 12342170 12558775 12638912 12472250 12225675 12049814 12103923 11991022
8620 11991022 11464542 10770921 10193660 9874278 9723864 9381617 8902602 8536050 8317291
8611 8317291 8292272 8376146 8614668 8965583 9454324 9955207 10416421 10891282 11459228 12176856
8601 12176856 13078588 14061315 14965837 15620548 15959208 15860350 15324924 14588904 14071355 13927868
8591 13927868 14112776 14485315 14730936 14644246 14016653 13047548 11778294 10485548 9412726
8582 9412726 8674563 8178719 7955669 7704382 7179854 6762420 6425265 6211987 6086434 6122461
8572 6122461 6206650 6361514 6554052 6654121 6702245 6690162 6780273 6948585 7059384 7057088 6932103
8561 6932103 6823477 6781879 6668152 6480267 6218904 6023656 5940375 5749385 5354631 4853455
8551 4853455 4435426 4187094 4002228 3695121 3313064 2934448 2627947 2434817 2273982 2106375
8541 2106375 2001780 1901929 1848690 1769756 1675374 1584080 1521532 1481229 1402014 1358714 1264574
8530 1264574 1218897 1182086 1127859 1075985 1003607 954565 945766 919271 889180 861999 816202 771734
8518 771734 740219 712592 665794 660440 641600 626452 578919 594569 558120 525743 507105 474521
8506 474521 489920 492735 441635 413864 418409 435573 400695 393287 388956 364969 366294 376855 368858
8493 368858 347504 350068 320132 307742 304935 298092 288415 279205 302222 310421 314416 339493 352778
8480 352778 308735 227198 198348 208579 239245 260926 245772 244563 257569 260341 239470 222152
8468 222152 252686 254259 208450 211908 245288 245497 244480 235755 254416 251174 261265 253322 244941
8455 244941 244381 259696 233485 226297 203747 204613 200570 198806 222193 228346 207432 219822 224033
8442 224033 207406 195896 178894 167809 182227 191138 198884 183629 142973 142456 144416 152713 179853
8429 179853 205504 208010 227284 234592 231537 232423 211579 167828 171009 202224 211195 222538 193427
8416 193427 192158 195595 199550 215386 237268 206257 175824 157901 197817 203108 185994 141960
8404 141960 147786 126828 113900 149238 139923 129374 95708 107385 96527 93081 40445 68526
8392 68526 61659 53419 74236 101007 93791 97248 84719 70650 82516 80846 70179 86479 106281
8379 106281 106240 89152 88761 90981 100626 71689 74266 54275 31702 20796 -10482 895 49855
8366 49855 39577 -20000 3795 8370 30363 -9265 24378 19005 33526 63905 24900 36004
8354 36004 49584 33734 17888 28595 44616 45105 24000 -1039 -14750 -3614 -32879 -67214
8342 -67214 -87918 -45371 -35939 -17108 -40956 -42882 -15647 663 31093 16926 -9816 -15080
8330 -15080 -9360 -25824 -40297 -54083 -27639 -15950 -10423 -33651 3029 23127 -11172 7591
8318 7591 31150 -2503 -29893 -25735 14168 17848 -2805 -3638 -8534 -19498 -37308 -51162 -30599
8305 -30599 -2009 -14002 -33738 -67787 -43679 -58204 -28140 -27463 30981 38083 -1149 -2312 -5041
8292 -5041 15022 24589 19302 -39314 -31988 -64357 -60452 -17442 -11752 -14146 -31813 -65797 -41242
8279 -41242 12192 -32982 -22584 14667 10278 -3943 6935 39986 42909 41118 44143 57612 27499
8266 27499 2083 35970 20136 18208 59226 49115 46299 48159 61833 36132 72656 31509
8254 31509 29755 47434 25868 84254 41364 -3772 33610 60493 40009 49007 54301 66563
8242 66563 75528 55084 62724 109074 102818 71236 96873 77982 53032 103723 86674 54752
8230 54752 65553 69931 98388 100496 102421 88630 129938 135550 121620 142060 117728 95139 97690
8217 97690 56111 70228 58298 34098 23409 35745 59928 63412 47071 28633 14897 27807
8205 27807 55912 42093 -4211 7878 85546 101027 74223 38738 45870 109915 168446 176293
8193 176293 286409 -125095 -300299 -120765 -126416 -80648 -109580 -68496 -63707 -49344 -24091
8182 -24091 -51674 -13781 -36205 -55807 29338 3979 -15493 -24175 -2531 -12433 -35543 -39319
8170 -39319 -64273 -42547 -49147 -11486 15691 -8511 -15621 -25619 -2112 1213 -6568 -21850 -31667
8157 -31667 -27867 -44477 -24590 16116 13543 -18150 -25745 -36097 -32158 -19918 -51237 -12299 -26150
8144 -26150 -48782 -38855 -71108 -71551 -53507 -79719 -67643 -43139 -19304 -6283 6080 -7335
8132 -7335 -26008 -22097 -19847 -3259 22101 -902 -3236 -1679 6859 13100 -6536 40636 -2658
8119 -2658 -5385 5788 13185 -21666 -50496 -36083 -24324 -18352 -18255 -16617 -44823 -41845 -4998 -16919
8105 -16919 -6821 7901 -18430 2989 3777 -13303 7361 -8568 -8090 3847 13583 8878 -36309
8092 -36309 -18332 -1112 -17623 -11012 -15820 20550 22464 34180 -3326 -56032 -22639 -15381 -29112
8079 -29112 -20309 -17236 -5991 -14360 -33025 -25633 -33014 -20553 -7370 -13975 -17000 -29285 -33031
8066 -33031 -29323 -19371 -8676 747 16757 25812 29506 43548 35029 -2172 -25125 -19407 -22586
8053 -22586 -50393 -14949 33365 58207 38339 29551 32653 51473 23042 39738 47384 55423 30318
8040 30318 15210 33768 5541 31459 35534 37189 43096 37391 41263 17907 -40574 788 11536
8027 11536 8503 15072 -10310 -11904 -29732 10864 43044 52477 40961 18335 16539 38842 36314
8014 36314 49798 64135 30021 29902 70904 61141 34956 33325 32368 46213 15548 -3081 -1049
8001 -1049 -1185 40350 31287 24157 19389 13579 25237 2001 -4124 39805 28967 -870 51320
7988 51320 67294 66670 37767 31860 25960 18641 7608 24733 14415 15194 17350 28394 25113 40985
7974 40985 94352 80609 47987 27782 64838 47684 36867 18298 36029 50567 65353 54640
7962 54640 11745 3934 422 18522 12599 4600 33022 48756 59660 49510 18722 26686 46816
7949 46816 50484 53255 35192 41663 29639 24658 51491 78176 60106 59454 44010 21993 31670
7936 31670 54958 39191 -2878 -3255 28140 31476 26239 66361 82605 64155 65219 78678 46366
7923 46366 83033 68934 32970 41723 34342 31692 57707 52985 40211 49122 56366 63975 88113
7910 88113 91896 101157 90376 91027 65610 93681 87393 64671 57326 80734 84552 85628 125963
7897 125963 152483 157958 163191 162231 125752 133515 126233 138583 131988 121908 130049 87835 80588
7884 80588 110028 96550 110838 95431 128320 93780 74136 72793 103460 153216 112534 108133
7872 108133 121167 174562 140503 134967 153619 143993 112416 110136 127655 138531 147428 138308 174252
7859 174252 207060 211174 186032 211876 226869 212813 236439 248547 272682 270042 235406 201104
7847 201104 222268 214758 247570 259286 232225 241460 244750 253278 234889 267096 251298 270746
7835 270746 263507 248041 275501 278783 269276 254988 275213 304348 321663 294140 312866 335026
7823 335026 328389 355981 375483 409675 389460 387606 391029 411271 398006 400930 452310 443786 455902
7810 455902 489943 493479 528466 533957 513202 276402 371125 512022 520265 562918 536815 571309
7798 571309 610067 649380 644799 648599 667670 729377 720226 733245 769437 831565 851867 880887
7786 880887 926272 996045 1041529 1063483 1095193 1149418 1277063 1380905 1446367 1525394 1674284
7775 1674284 1830551 1997652 2205901 2477276 2841675 3216394 3635028 4134740 4690423 5026869
7765 5026869 5026790 4723994 4419455 4301581 4360876 4489950 4800411 5137042 5145501 4708532 4080797
7754 4080797 3460303 2913995 2533335 2247462 2024996 1847478 1723625 1618387 1547009 1479690
7744 1479690 1421722 1409694 1418202 1388697 1356020 1343518 1335144 1311563 1322195 1339656 1306912 1321116
7732 1321116 1324904 1301015 1294254 1326788 1282149 1317137 1325080 1335582 1382002 1393111 1421242 1457936
7720 1457936 1509528 1533452 1593553 1631688 1674333 1714840 1745455 1750578 1832581 1947008 2023770
7709 2023770 2137741 2225317 2289054 2406759 2538982 2692955 2879454 3076400 3309767 3609180
7699 3609180 3962673 4334046 4822062 5435896 6158145 7111526 8162278 9248664 10630418
7690 10630418 11940505 12317190 11658462 10726745 10072485 9824315 9901424 10238596 10955822
7681 10955822 11403196 10883110 9485120 7940782 6541047 5438793 4643682 4027992 3577673
7672 3577673 3208951 2920747 2674872 2473968 2354533 2237669 2134690 2028826 1935778 1848617
7662 1848617 1776464 1687525 1590451 1596168 1581012 1511470 1482449 1445993 1394705 1347164 1327400 1322238
7650 1322238 1313128 1317259 1313927 1269537 1230487 1221991 1213066 1196868 1202176 1204035 1202040 1249581 1255196
7637 1255196 1252269 1246433 1234153 1262124 1264682 1255476 1260937 1267522 1336866 1380691 1396217 1419952 1454916
7624 1454916 1521608 1581033 1640962 1697299 1747140 1839166 1931234 2078520 2196861 2298851 2497923
7613 2497923 2686831 2930860 3203390 3549188 3987648 4515915 5275408 6295710 7588626
7604 7588626 8903730 9762083 9497011 8158086 6618688 5388258 4489859 3847084 3355302
7595 3355302 2961716 2727129 2523301 2359982 2253809 2132839 2068899 2023765 1999227 1955579
7585 1955579 1912644 1887000 1895156 1900730 1890536 1924795 1974485 2006967 2051101 2068487 2137479 2230370
7573 2230370 2339700 2421056 2572762 2744729 2881869 3092651 3343303 3661756 4033708 4530654
7563 4530654 5173138 6026965 7240574 8742181 10209141 10988704 10356875 8685561 6985128
7554 6985128 5659294 4685421 3961269 3432079 3046895 2774902 2537408 2331939 2181901
7545 2181901 2118478 2046552 1980477 1934969 1858829 1821336 1837750 1839263 1840984 1890095 1952898 2044404
7533 2044404 2131532 2243327 2425377 2720322 3123813 3574881 3991190 4110106 3746154 3199689
7523 3199689 2644941 2280690 2030493 1796612 1646642 1522892 1481796 1414525 1350364 1308267
7513 1308267 1335316 1327162 1256494 1246317 1253454 1230427 1201663 1223258 1254971 1238176 1257407 1247210
7501 1247210 1255871 1351585 1404003 1456855 1483109 1553888 1642041 1742857 1798675 1870060 1953089
7490 1953089 2049392 2218307 2437186 2693481 3062199 3529739 4155393 4853010 5395986 5439424
7480 5439424 4898110 4054293 3329738 2789242 2411242 2157027 1919046 1718889 1577142 1487317
7470 1487317 1376254 1276406 1205826 1178749 1117013 1047294 1001510 950053 939405 896075 838315
7459 838315 813245 807762 780054 733415 672384 653344 669341 656701 652741 602350 585161 574557
7447 574557 597726 599503 554286 560839 546567 495251 514279 497750 486696 473194 448148 427377
7435 427377 410576 409397 422039 407390 424522 419744 395898 429405 401169 359084 370343 374649
7423 374649 384999 374521 397761 392730 366600 377143 386237 384007 365399 367470 372465 369721 398420
7410 398420 411137 411964 414449 406722 405624 400106 404353 433714 430009 425286 458093 421701 398389
7397 398389 381696 383834 408030 430966 400637 386423 397291 387884 408081 416273 425928 434822 428442
7384 428442 434171 460504 454727 441849 439806 433055 419093 422008 425393 413188 426248 474006 462572
7371 462572 440965 447530 429208 389942 377387 419835 448242 454020 443293 440061 459606 423033
7359 423033 438185 461891 468801 460815 437751 456639 459446 491220 489053 468383 461407 462379 501567
7346 501567 535839 520711 555215 519913 503136 497919 538354 571235 551159 527722 527784 561023
7334 561023 595337 603829 568775 577659 598871 593789 611171 627057 641445 644066 665892 677742
7322 677742 667998 692324 721015 728036 737020 739018 743965 772598 775684 804472 865355 873951 830350
7309 830350 831513 848867 851131 837929 874787 942873 960646 946439 953589 981917 1011120 1018845
7297 1018845 998153 1014946 1049813 1067557 1051277 1084240 1124155 1130466 1149645 1157963 1206877 1170274
7285 1170274 1211026 1203836 1195647 1197866 1238201 1263866 1318998 1353048 1343388 1346559 1387143 1411360
7273 1411360 1431885 1477648 1490294 1492807 1500927 1592273 1634368 1690959 1699822 1689040 1757182 1767032
7261 1767032 1752753 1783419 1872138 1924398 1950764 1988769 2025850 2104571 2149192 2197025 2242208
7250 2242208 2237977 2271294 2326856 2368202 2450337 2472325 2518578 2545364 2631610 2721146 2788613 2824501
7238 2824501 2876187 2917660 2950789 3032265 3137721 3173854 3200930 3265587 3336265 3418128 3469989
7227 3469989 3515833 3570955 3654057 3680182 3740933 3792130 3845935 3927646 3959103 4015662 4076032
7216 4076032 4144729 4182589 4236375 4268555 4329394 4352323 4400919 4410225 4430762 4454151 4410064 4422396
7204 4422396 4450499 4442893 4442980 4441699 4421115 4390491 4356895 4374012 4340808 4303687 4240943 4230092
7192 4230092 4180841 4174825 4111677 4072862 4076433 4022434 3990364 3932571 3857994 3821842 3783155 3736986
7180 3736986 3722070 3675029 3640133 3616827 3612793 3601574 3544590 3496683 3446040 3403960 3382324 3423232
7168 3423232 3441772 3376447 3381121 3373076 3388450 3422959 3430761 3404909 3385241 3391291 3428831 3441415
7156 3441415 3449665 3510921 3531146 3594197 3635032 3667492 3793111 3903239 3997817 4174942 4366752
7145 4366752 4545345 4824530 5139036 5536096 6002807 6592459 7343792 8131684 9022843 10077754
7135 10077754 10996857 11242298 10811621 10166329 9689910 9491053 9510552 9747337 10203086 10412154
7125 10412154 10016910 9080917 7964778 6974784 6182841 5531192 5069454 4762962 4449741
7116 4449741 4209709 4053625 3934537 3854418 3788058 3734353 3676912 3667855 3695511 3755171 3745528
7105 3745528 3760154 3773053 3854919 4023992 4209486 4351315 4505306 4728247 5045312 5433902
7095 5433902 5915411 6466592 7098206 7843414 8667247 9286202 9366857 8997463 8492678 8186138
7085 8186138 8050024 8073569 8344399 8739381 8826449 8349628 7458390 6510172 5683749 5067502
7075 5067502 4580390 4244187 3991957 3786646 3607615 3477163 3370364 3277684 3231628 3195426
7065 3195426 3117306 3055856 3046709 3039449 3023859 3005334 3031938 3058881 3027516 3066967 3061493 3066934
7053 3066934 3075222 3104853 3145470 3137288 3168464 3216689 3274314 3314717 3353176 3402991 3455190 3523322
7041 3523322 3621195 3685103 3743168 3802380 3911684 4028988 4090042 4205383 4351409 4445140 4582054
7030 4582054 4716397 4849242 5001445 5150342 5347556 5544998 5786094 6012945 6274744 6500866
7020 6500866 6803563 7110023 7407920 7736683 8098553 8500393 8940379 9428430 9926663 10466417
7010 10466417 11016975 11532281 12096516 12715084 13330580 13935126 14523218 15102050 15583578
7001 15583578 16012629 16374544 16718780 16939560 17032129 17085318 17031681 16876452 16614365 16288941
6991 16288941 15926462 15469428 14962898 14392038 13827223 13258708 12683417 12056263 11427603
6982 11427603 10848078 10280638 9747060 9244879 8724528 8280459 7855800 7456745 7080271
6973 7080271 6723272 6372549 6055150 5783868 5555381 5305068 5109548 4901425 4694433 4490287
6963 4490287 4287052 4110787 3963124 3819822 3704918 3558904 3414222 3325304 3214986 3122920
6953 3122920 3008272 2919429 2862136 2780923 2698350 2624762 2559225 2468138 2421496 2359989 2294144
6942 2294144 2226167 2163676 2096147 1993389 1976787 1937000 1881602 1833857 1788385 1720709 1672807
6931 1672807 1614153 1586295 1531952 1486294 1433825 1396400 1388037 1363547 1318239 1295569 1264030 1230986
6919 1230986 1171776 1150152 1104139 1135350 1123404 1057213 1065079 1026528 993196 959005 905928 920124
6907 920124 906836 874653 837571 790930 806378 767042 756201 766374 710526 700146 699047 674607
6895 674607 711060 742063 717641 721588 660297 617135 620809 606707 614533 616838 581393 537700
6883 537700 483295 473352 459308 447367 488317 461961 468393 433959 441450 463371 428483 443203
6871 443203 444272 434756 418957 389633 365495 375142 390625 385236 363411 381868 391488 389626 383279
6858 383279 343887 358750 353815 323636 327503 342495 307176 347480 325359 317941 295391 300633
6846 300633 302805 303292 324636 317837 281701 265432 276599 294854 279619 266409 259152 250298 263013
6833 263013 287547 262375 239821 234395 195521 230013 242354 231999 212839 208953 241613 240224
6821 240224 220631 230894 261067 234629 234631 211894 171053 183679 166509 158357 169751 170025 215275
6808 215275 211175 189144 218237 236595 214085 209531 271169 241154 233680 206916 203315 195212 199212
6795 199212 184719 196184 175880 154436 168722 182150 158817 174836 168609 152889 157440 137712
6783 137712 171667 148804 108602 120741 119777 172753 175687 171354 109184 104627 111449 99907 106820
6770 106820 117402 152415 131916 153293 151876 151850 131135 130890 175400 197140 142235 117219 123908
6757 123908 102539 85175 92878 123829 111078 132246 112569 55768 77913 95444 109787 89705
6745 89705 79644 78311 98755 92799 77666 75630 113573 136719 93197 68265 47413 57858
6733 57858 80968 91104 111869 88979 105810 81948 46416 46358 52605 61075 75126 70514 68944
6720 68944 70845 41282 75944 86659 88269 99031 87942 65849 65655 56814 36879 33730 8107
6707 8107 46570 22085 30533 62250 77160 54687 43974 12742 -3501 20663 19901 28410 53068
6694 53068 73020 48444 6376 -9630 33921 31402 27926 9645 16658 28489 25447 -8556 10861
6681 10861 31984 33302 35816 52963 52867 47596 19876 42743 70776 39675 29022 8792 -6336
6668 -6336 10004 6372 18068 43262 45532 49697 8885 15300 10863 10389 -3513 11491 35883
6655 35883 28338 -7490 12911 -2924 18322 7239 3361 37375 19610 13766 -12426 26928
6643 26928 -5353 -26364 -9274 -8840 -7931 19105 30119 8497 -3471 -16277 6690 6049 -16112
6630 -16112 -51929 -41676 -38071 -49473 -16268 -13134 -31542 -27898 -20760 -10900 -38626 -36283 -15894
6617 -15894 -24219 22816 35763 9255 -1729 12077 -132 12645 15630 6796 10913 29359 43951
6604 43951 27000 -16182 6821 34967 28486 20453 14361 6619 -25263 -19202 7024 2987 15588
6591 15588 47068 18188 -18289 -9615 2739 -30754 -38626 12729 1065 2937 -12720 -27706
6579 -27706 -7461 10941 30332 -2416 -52686 -42034 -3182 5657 -20710 -32529 -524 8477
6567 8477 30254 55133 42162 50768 18884 -28083 -32587 -22877 3198 -8419 -15332 6701 16212
6554 16212 -13179 -2786 -1341 -973 -17929 -11875 -12064 -7830 -13664 -36411 277 -10512 -3100 -31322
6540 -31322 -8840 -3510 -19868 -20216 -30022 -16750 10046 30347 17121 -15839 -3096 -25190 -10792
6527 -10792 23977 -43746 -36969 -5894 -37495 -58588 -13189 -12791 -35615 -34642 -5388 -17778 20998
6514 20998 16899 28074 28392 -7583 -19695 -39441 -8392 5180 -28092 -64399 -34852 -25496 -32078
6501 -32078 -41360 -45606 -72326 -73659 -62334 -64011 -50880 -57116 -51185 -31677 -38305 -21289 -35973
6488 -35973 -90479 -81051 -70605 -57588 -46487 -57409 -35718 -31532 -40373 -32723 -35321 -48398 -7335
6475 -7335 -3963 -14861 -18121 -25746 -15434 -20655 -37231 -46598 -39704 -52907 -39686 -41055 -4093
6462 -4093 -10088 -18888 -7710 -14859 -26765 -25077 -26081 -40991 -15610 -3100 -26573 -12308 -2645
6449 -2645 -29183 -28858 -36721 -20818 -36806 -15143 10111 -24904 -28195 -2187 -35935 -51266 -39342
6436 -39342 -42721 -48451 -62277 -53003 -52375 -19613 -32145 -38304 -50087 -13782 -11005 -18049 -18188 -47977
6422 -47977 -43917 -12077 -30648 -44824 -21934 -52558 -51067 -29339 -36479 -25411 -34179 -12110 -5899
6409 -5899 1622 -7203 -63138 -30131 -41702 -43150 -15892 -10140 -31651 1025 2113 -35948 -54678
6396 -54678 -42327 5634 12399 -20892 -43728 -9921 9293 8254 -15219 17067 -15395 -25709
6384 -25709 -32141 -37592 -14229 -68488 -54472 -37409 -57799 -47289 -47675 -32429 -43539 -34957 -30399
6371 -30399 -46198 -55679 -69958 -21576 -31968 -26984 -30100 9421 23403 -10196 -11510 -7670 -43508
6358 -43508 -59566 -25992 -32663 -43436 -46173 -54250 6324 -7918 4744 -29269 -31631 6799 -13103
6345 -13103 4239 -9590 -38766 -37720 -34304 -6894 -10063 -63254 -42945 -16520 -27077 -10947
6333 -10947 -29763 -16388 -22916 -31508 -33454 -2659 14387 7068 26487 2716 -13461 -42541 -35649
6320 -35649 -7016 -11799 -23624 -42292 -40669 -27454 -22539 -36123 -37296 -8596 -13263 -62653 -59957
6307 -59957 -28510 -22577 -21682 -26675 2610 10794 15591 -7074 -13991 11377 -4584 -59307 -27886
6294 -27886 -29397 -19613 6 6492 14545 18334 46348 -8917 -21332 736 -18364 -43596 -40251
6281 -40251 -24661 -79368 -22145 -18758 -49438 -32810 -37091 -70311 -44522 -35571 -38626 -15907 -42869
6268 -42869 -53369 -9309 15667 -30812 -34442 -21276 -50708 -66148 -68230 -19373 -13966 -17829 -18274
6255 -18274 -41865 -38734 -11700 2179 -14592 -15143 -37 12226 -1980 -29258 -26569 -20516 -6691
6242 -6691 2982 12816 9474 -8653 -15425 -9146 9118 -9482 -43901 -39602 -57676 -40058 -17911
6229 -17911 -53121 -64091 -56401 -28564 -17906 -4489 -7439 -27916 -69672 -64468 -39607 -50367
6217 -50367 -75904 -41880 -26411 -42601 -56454 -18840 16327 -7800 -32370 -30140 -46384 -75694
6205 -75694 -63626 -29472 -23194 -5770 -10645 -8050 -12923 -9638 -35673 -38221 -40076 -17243 -19534
6192 -19534 -38108 -44795 -48166 -50868 -57029 -55504 -54710 4460 -25330 -16660 -6160 -25553 -34580 -7095
6178 -7095 7 -22748 -36238 -20729 -21824 -24692 -21732 -25862 -9309 -19931 -4564 -4592 -25477 -5984
6164 -5984 -1624 29172 -20308 -44715 -33154 -35186 -16603 -20912 -18477 -21507 -38787 -26007 10131
6151 10131 -7301 -6587 7693 12668 11131 -21406 -50595 -24023 -51901 -51676 -21111 -18691 -31114
6138 -31114 -26727 -20776 -42540 -91364 -57521 -42780 -34659 -51207 -28310 -296 -9554 9627 1966
6125 1966 -27509 -53771 -47164 -49767 -47823 -37868 -19293 -13926 -40284 -15166 -51346 -64359 -50803
6112 -50803 -41398 4764 12402 16807 17581 3271 -33675 -40031 -39183 -32671 -13982 -9694 1371 -31189
6098 -31189 -52967 -56213 -45701 -24719 -20870 -5713 -2841 2296 -33442 -18984 -43316 -8793 27558
6085 27558 -13703 -47545 -38948 1115 29940 7070 -38113 -72670 -52717 -42740 -40932 -20519
6073 -20519 -31884 -32795 -29608 -58206 -46504 -30057 -25596 -34997 -57259 -48211 -49959 -31868 -6137
6060 -6137 -13244 -13735 -28548 -31685 -56589 -42138 -56097 -42987 -60540 -35857 -874 1926 -9692
6047 -9692 -18063 -10232 -24490 -16506 -16933 -3336 -6440 -20548 -13457 32232 -9686 -3366 7114 -17283
6033 -17283 -44712 -71168 -69969 -33766 -40498 -21133 -23852 -34000 -34580 -45864 -32923 -45974 -52351
6020 -52351 -69514 -16469 13959 -7594 3115 -19685 -43512 -12705 10302 -2837 -5880 -15729
6008 -15729 -5204 1509 17661 1197 -543 -8133 -34300 -23666 13683 -23871 -20232 -12722 13141
5995 13141 -1155 -44901 -25020 -6786 11381 596 9703 -42069 -75874 -36713 21274 -10448
5983 -10448 4268 -19394 -41520 -34377 -25565 7252 -21067 -26291 9057 -15783 -17406 4869 -4250
5970 -4250 2405 -6114 -24103 -25522 -6472 24527 6018 4296 -36201 -17728 -8315 -29055 -2557
5957 -2557 2861 22993 11860 16997 7354 7072 2466 -25822 7121 -2262 8746 2941 -45133 1788
5943 1788 4081 -9245 -5738 -35111 -48618 -12717 -20038 -25708 -50530 -40088 -26466 -19307 21478
5930 21478 34816 23723 6197 -24507 -33985 -30774 -5927 -834 -12088 -7291 -4848 -15698 -29760
5917 -29760 -27582 -9379 -29363 -14305 -23527 -18234 29840 1596 -38035 -31310 -9249 -23346 -33840
5904 -33840 -17130 -4977 -32063 -50859 -15736 919 11413 31506 46825 9627 3868 18941
5892 18941 1653 -35138 -2316 -3861 13035 53782 5895 9606 37101 6786 -21673 -27813
5880 -27813 -24253 15865 25213 -8678 -8404 -4947 -10266 11510 11019 -3869 42051 57009 36687
5867 36687 23782 23380 28895 -28546 -13825 -5124 -6338 752 25309 30637 44995 20662 13055
5854 13055 20973 22724 42255 33145 -3468 -34807 -26078 -33275 -11009 -37818 -75811 -14365 -2107
5841 -2107 -15897 -58512 -37792 -27901 -25015 8102 -4479 -50705 -21063 -28524 -13349 5397 -22506
5828 -22506 -27619 -42243 -34510 10305 -2744 -40698 -32196 1094 6268 3080 5715 30484 29735
5815 29735 2788 -18064 -19892 -28178 -18087 -20893 -2846 12759 -5014 7944 -12146 -1887
5803 -1887 -16597 -13289 -46124 -14905 -16239 -28213 -20285 7332 -21879 -59341 -47195 -47916 -29779
5790 -29779 -1571 -12840 -40473 -20105 -40222 -20953 -11342 -25405 -46094 -35863 -23449 18678
5778 18678 12464 -3947 29987 17651 19137 -1854 -20790 -37389 -19938 -15964 13412 2289
5766 2289 6687 21890 -12112 -17655 5671 9939 -8290 -33835 -39200 -34194 -29809 -10477 -19406
5753 -19406 -1258 42682 14043 -7860 -11042 9648 36904 -30399 -48629 -50824 -20199 8301
5741 8301 -23710 -65 -4180 -18083 7544 21772 21370 16465 3355 7187 -24011 -24345 -25769 -31226
5727 -31226 -57589 -28462 -3598 -4324 16515 9078 -6379 -7424 -27048 -73854 -63007 -33770 -46397
5714 -46397 -48582 -32480 -23744 -9608 15168 46415 16886 -6581 -34775 -34596 -5372 -28737 -19875
5701 -19875 9436 -31843 -38249 342 -11717 -4808 12 1682 -3421 -9667 -17449 -4554 -1266
5688 -1266 2859 -20698 -12885 27449 -24083 -22070 -23145 -32940 -23745 -10907 -695 11821 6162
5675 6162 7295 36153 16979 -15158 46208 29508 22871 33423 5640 -13707 -1341 -17066
5663 -17066 7380 1354 -14010 14273 -9684 10080 1997 13443 -16315 -5007 11412 9506
5651 9506 -2839 4620 40379 21478 -6196 -6199 -13626 -20650 11118 -9420 -24491 -23520 -29606 -27201
5637 -27201 -22192 22295 40637 19732 19099 -18191 -44612 -35320 -36192 -39455 -21167 -11650 2549
5624 2549 6969 3792 25810 2015 16697 24787 -23687 473 4558 13108 12311 10280 -853 3961
5610 3961 51942 12922 -11932 8212 16260 35012 31710 26451 24596 32580 44616 13591 3637
5597 3637 11450 32155 11666 18451 31124 32825 45197 22831 3049 -1326 8367 -322 -10544
5584 -10544 -3923 10568 20671 25315 19070 45940 23126 -8720 20527 13614 -12878 37321 15175
5571 15175 -22029 -16507 -20646 -28844 20650 39472 27334 21478 1181 6734 2647 11445 11020 11618
5557 11618 46006 57778 53255 71253 57299 24819 32604 22381 21369 16603 33754 25033 41374
5544 41374 78551 78303 63278 18229 25164 -9614 -8975 5483 6649 14501 22295 8581 1365 27649
5530 27649 3879 2070 12688 12127 16465 24306 57721 35644 58178 45701 52824 72857 63482
5517 63482 34674 17792 38352 63938 65751 67771 63983 83658 67126 68424 65035 23313 21159
5504 21159 43077 23837 36678 76756 69819 41376 43653 47920 50832 62749 66740 67403 95129
5491 95129 94179 101772 82001 65860 61340 78193 66920 49834 86862 108649 122977 114270 122134
5478 122134 127624 130117 177055 185675 182735 210403 221751 262634 257453 280773 265265 252358 230402
5465 230402 228094 217235 201730 167686 137054 125053 111907 126327 121938 125717 114144 113109
5453 113109 99916 84230 121978 112805 108050 119951 125764 144530 145920 118811 117639 125695 126223
5440 126223 119312 107294 95293 101863 95871 143214 144344 146071 143619 144642 131600 123868 105289
5427 105289 104699 96933 99609 113368 109250 105272 108675 116039 94833 149598 130337 124537 72589
5414 72589 40614 42550 86991 158774 160129 132798 124179 101205 103819 126169 146454 140843 83990
5401 83990 82248 122133 135622 101622 84375 129590 128896 103088 134851 146289 155665 123071 137565
5388 137565 162685 163734 162491 126611 120879 152711 147577 111751 118591 142729 127067 155605 171188
5375 171188 174052 169056 148033 127842 144025 154515 183884 160722 150630 148432 120136 145296
5363 145296 163251 165576 161581 151326 139462 160393 172364 134625 97464 115158 116938 135754
5351 135754 110013 119202 107839 116983 113107 103316 130634 139792 170894 137993 145259 154652 181992
5338 181992 221068 190889 197238 216873 223596 200178 202591 200256 199140 192540 216519 227844 194989
5325 194989 176544 176254 179793 194922 197391 202874 204628 204597 235412 222337 207917 224036 244193
5312 244193 246524 250849 256183 249164 244611 264253 297673 278674 286746 275560 272520 287176 291382
5299 291382 301718 317528 270644 293185 327241 296365 299482 334971 334083 323111 328407 349214
5287 349214 377365 375467 375463 377648 389180 396041 398619 393747 377874 407400 433292 420335 440590
5274 440590 462133 495901 527247 531809 550248 538201 556522 587987 584999 604226 607060 586762
5262 586762 607162 614495 619588 646914 653254 696270 758210 779763 785383 806173 804958 820002 848833
5249 848833 874026 878492 867473 912455 971276 937188 1003230 1042188 1073871 1083836 1070891 1117829
5237 1117829 1167089 1199324 1225906 1236448 1282824 1362897 1389669 1423205 1447094 1508429 1562351
5226 1562351 1606792 1652835 1725468 1756375 1811714 1881029 1930447 1981169 2054669 2121678 2174283
5215 2174283 2231031 2259065 2338033 2412203 2495457 2554856 2654211 2747308 2842900 2908342 2977691
5204 2977691 3078499 3217377 3308410 3430259 3537077 3656638 3807971 3949462 4096381 4268430
5194 4268430 4432967 4635651 4865656 5069750 5346654 5643203 5952798 6340353 6772313 7238025
5184 7238025 7792599 8482802 9262756 10141637 11163731 12409475 13892149 15613751 17627660
5175 17627660 20027004 22901589 26059798 29126307 32402182 35649547 37905842 38919796
5167 38919796 38910161 38033952 35915208 32680573 28924977 25183859 21531357 18196632 15459078
5158 15459078 13234130 11451948 10054835 8973977 8094058 7329720 6683789 6164251 5716555
5149 5716555 5297753 4949380 4620522 4316672 4086660 3878413 3656972 3473218 3292474 3153179
5139 3153179 2999028 2859471 2738952 2622173 2558800 2448576 2351192 2245633 2130294 2034748
5129 2034748 1918464 1866370 1780276 1687971 1587379 1530328 1476490 1424153 1372765 1326426 1274246
5118 1274246 1240489 1215407 1184607 1129882 1083679 1060639 1040923 994420 982488 978315 922310 859991
5106 859991 813234 821673 831353 802621 800277 785163 743772 719582 702960 687256 662136 641690
5094 641690 653784 609634 557579 557690 562606 571470 563782 554829 527671 503366 501192 469480 468626
5081 468626 475385 476084 437650 394726 377540 386261 389188 377429 382975 368384 374127 383657 384830
5068 384830 348153 356641 305521 292124 296882 280525 290803 332639 318033 322572 316723 308585 275952
5055 275952 286855 281679 278213 243820 243201 255141 268121 280841 296671 275241 215349 212773 234407
5042 234407 235603 226693 252439 246557 207022 248497 258485 238434 223361 214279 241933 220744 182636
5029 182636 201042 201799 181933 222989 228371 210963 167212 163867 153775 142372 130652 175819
5017 175819 195537 185923 168162 169023 165105 175959 194528 191456 183419 168716 171178 135001 133402
5004 133402 155194 127981 127444 118140 139541 116712 122093 140462 131309 137818 147499 114279 150905
4991 150905 161592 167662 186988 132751 126597 146328 174056 149297 139333 116512 118271 152698
4979 152698 146073 90392 109688 99460 112078 107382 84729 56503 86725 95939 77358 77674 94995
4966 94995 115603 107482 88861 71058 89898 91298 117185 74705 73182 84229 47632 35235
4954 35235 11465 19261 44380 22839 53888 58508 65534 65764 55825 67231 87406 115416 121249
4941 121249 98518 58128 70456 73039 79799 73078 55672 60792 54074 34399 47548 74998 51971
4928 51971 59799 86857 91292 76619 44539 65474 102826 99273 74365 90644 85250 39668 72714
4915 72714 79632 52906 77034 121959 109461 101084 110990 98970 79226 86465 91458 88992 104506
4902 104506 105595 88585 96219 71910 81014 73542 87782 82666 82184 57624 50903 68608 69879
4889 69879 101887 87205 107554 94048 85129 101476 123311 134179 147585 118231 92847 103238
4877 103238 160093 189140 166249 171869 194681 199258 230497 187971 211416 235171 225239 288618
4865 288618 292319 357706 332828 331555 329605 314634 307406 270637 250998 233749 226389 217481 201867
4852 201867 190607 197401 167938 163252 179495 174097 145723 171970 159963 142854 118384 99828
4840 99828 124976 127179 121905 127326 98032 118885 110648 126709 154140 163810 159582 184591 199409
4827 199409 185985 201693 220842 224305 217760 179040 153000 177712 180760 190428 164348 189192
4815 189192 192917 173118 146910 137177 198663 215691 204504 196566 189481 204459 210999 181411 160662
4802 160662 134845 167211 166720 144846 166038 167035 165959 187765 196814 186164 225932 208092 218521
4789 218521 191486 179613 205569 211761 189164 189635 181485 219276 233179 240056 250683 234778 232078
4776 232078 192152 211433 190270 214054 205791 204528 210934 176930 135686 139656 183544 226623
4764 226623 212866 187341 201048 176083 198851 203810 198139 233722 240685 221563 207562 159518
4752 159518 182387 177174 168616 190481 152694 136456 127504 154198 154190 147543 167752 156491 178509
4739 178509 184108 187751 170447 161968 177481 163061 150998 178234 174656 165374 203260 181167 166163
4726 166163 135304 142624 179700 171138 152336 166650 168895 165256 136011 118248 134601 151652
4714 151652 154668 127317 156056 141430 112911 121937 126363 136646 119823 80903 82189 93825
4702 93825 95024 111082 119084 85560 61307 27262 71791 107063 81810 97533 113689 103706
4690 103706 88183 40332 50847 84302 75152 68589 54399 -5678 40301 91430 51534 41231
4678 41231 60919 89165 69309 57669 45723 32336 28005 54757 52890 40548 36587 43785 28667
4665 28667 8505 24996 75669 100007 83494 31988 40802 29060 29972 56489 48245 33538 46524
4652 46524 62256 41598 25667 55571 38573 18651 33880 21232 35611 73519 86823 82090
4640 82090 76520 45640 44931 63574 68024 81402 80466 68369 57829 44557 56223 86324 108893
4627 108893 94017 65143 58206 57922 51940 56284 76694 80344 88617 99479 85633 78147 72773
4614 72773 49467 32540 52452 42643 14690 11296 54193 62016 18670 16007 42464 44840 66228
4601 66228 40354 22695 27222 45700 64456 62442 47922 31648 40209 55112 65599 87556
4589 87556 78417 61244 76697 76657 16281 30245 69024 60136 68880 44705 52972 43146 61940
4576 61940 64364 65251 66846 55945 75922 69497 38238 52784 69775 83530 71124 27656 -1041
4563 -1041 7247 28569 66905 71306 99047 128475 85689 81203 61920 50396 54584 62498 89183
4550 89183 81942 67098 84558 81439 60020 55385 94017 94833 71898 49174 43047 61880 91561
4537 91561 87527 61197 68806 77490 74595 72477 87461 89976 71181 79768 89983 90571 93792 88601
4523 88601 104528 111244 127008 123005 98956 82506 88461 68357 80217 110367 100956 123590 113248
4510 113248 113305 104610 94035 113895 118779 128782 95163 101660 103401 91490 66028 55006 73187
4497 73187 85432 123100 135231 141835 158471 149920 119292 123354 101843 105943 104043 97629 118444
4484 118444 120050 111976 126067 132690 136681 133292 138075 145550 144504 170364 168385 157720 130636
4471 130636 114039 109620 98033 113696 161979 164000 152334 158047 137746 135181 109700 80462
4459 80462 100795 151413 150679 163261 166599 180456 194034 210725 192862 170056 206364 225837
4447 225837 199267 214104 238714 221620 216258 215834 212457 225690 233111 239237 244909 240659 223213
4434 223213 218326 253114 257882 276134 256725 268809 282452 268886 246962 238747 280259 313002
4422 313002 261384 240644 276321 301707 286070 274639 289275 268278 277736 261844 227465 255328
4410 255328 249153 300038 290278 296686 328947 304592 314860 334745 338041 324381 314043 339405
4398 339405 355821 333290 353183 330787 322215 384378 363581 371202 405371 411873 421848 393189
4386 393189 372939 395409 395705 388575 358952 368602 362178 322279 307410 297097 338903 336411 322882
4373 322882 323280 314104 320037 360317 331358 334198 369697 380872 368084 355922 362097 435173 438218
4360 438218 429082 415405 411541 461715 524604 548136 582345 596710 597611 653468 660508 645864 636263
4347 636263 630917 602349 585730 549056 509617 453341 464670 445122 431775 464900 459400 466650
4335 466650 454218 455018 480344 495598 525321 512938 492926 479721 484753 525578 520146 504153
4323 504153 516877 527760 573955 572045 585055 614428 592111 625654 634951 609228 576031 559191
4311 559191 620697 647569 625040 632822 601512 633315 658362 658222 659935 678325 720505 712388 713292
4298 713292 772633 761715 812105 804386 815654 867503 921657 959716 1004496 1039766 1011731 979349
4286 979349 917208 855078 857232 857905 835074 810268 812753 829552 794432 795691 794527 779390 788261
4273 788261 824305 848079 838397 800743 809561 796681 811516 823396 847035 829893 841508 823383
4261 823383 794856 834526 889045 875256 878424 887895 875084 893176 925930 909169 940539 927428
4249 927428 912656 931901 937859 941836 951102 952737 961131 1006847 1016835 1025392 1067456 1065216 1067054
4236 1067054 1126275 1139126 1142063 1160162 1173866 1212025 1244873 1281523 1327960 1321389 1346236 1408274
4224 1408274 1457567 1498538 1566167 1594254 1612988 1729478 1851294 2009104 2137480 2245017
4214 2245017 2448235 2635199 2794256 2861266 2883371 2819664 2723717 2580851 2439530 2296024
4204 2296024 2143029 2010112 1948787 1891391 1861630 1875988 1863040 1810678 1784702 1825118 1831020
4193 1831020 1818574 1846581 1850320 1850019 1899815 1902317 1937273 1991096 2033491 2041951 2014956 2048895
4181 2048895 2122965 2125196 2145388 2190000 2222774 2221548 2238874 2305002 2386015 2420322 2493922 2576980
4169 2576980 2615421 2697821 2772764 2858955 2946945 3037344 3092746 3172416 3260729 3305558 3351007
4158 3351007 3383010 3471764 3572557 3653551 3776699 3879571 4014941 4178267 4315934 4506390
4148 4506390 4719754 4921613 5162101 5391746 5660977 5943228 6213339 6467831 6771520 7062339
4138 7062339 7348239 7630968 7898069 8157735 8434448 8665748 8857230 9043025 9181896 9341796
4128 9341796 9430771 9515373 9585964 9634925 9667843 9700521 9649536 9632446 9642688 9675247 9746835
4117 9746835 9794081 9836359 9850550 9884961 9936713 9917065 9927389 9893564 9852056 9862510 9839336
4106 9839336 9766884 9754534 9795581 9860254 9940989 10017165 10096403 10213079 10422061 10645737 10910640
4095 10910640 11219253 11537284 11767014 11971020 12049687 12055812 11996289 11954582 11982284 12146943
4085 12146943 12342655 12561767 12825262 13139484 13444115 13770286 14178296 14693319 15273984
4076 15273984 15912235 16647277 17534755 18563351 19821197 21344435 23173161 25364845 28007028
4067 28007028 31247613 35193198 39678041 45103382 51778195 58092670 62905828 67244001
4059 67244001 70596733 70391645 66648875 61453716 55586729 48892346 42431099 36926943
4051 36926943 32436888 28996743 26425208 24488667 23012360 21944189 21242593 20805330
4043 20805330 20568030 20481071 20411432 20110600 19516231 18769575 18113843 17584423 17179235 16849526
4033 16849526 16673453 16566010 16542379 16625698 16846170 17124181 17444331 17812469 18213470 18680504
4023 18680504 19184631 19658569 20078523 20408790 20642467 20862407 21103358 21388898 21791937
4014 21791937 22363220 23063440 23986502 25162789 26597034 28344654 30385534 32844400 35801580
4005 35801580 39263515 43394263 48431351 54637006 61543982 68614040 76084270 81537477
3997 81537477 81209141 75154328 66844060 58848476 52122225 46893332 42792089 39473221
3989 39473221 36620426 34108964 31958102 30166068 28664360 27560999 26787572 26250064
3981 26250064 25883942 25662782 25425412 25114161 24702019 24229148 23629284 23050133 22498950
3972 22498950 22064123 21771076 21611081 21576344 21598436 21572262 21418135 21069418 20555009 19949081
3962 19949081 19315662 18682948 18221005 17951352 17741302 17727953 17828037 18078102 18546088 19127883
3952 19127883 19883259 20725491 21633704 22554388 23374526 23903560 24035507 23687355 22939586
3943 22939586 21879580 20602755 19338578 18231585 17217532 16344213 15677818 15153002 14757813
3934 14757813 14562686 14488660 14542110 14653478 14849059 15102502 15394909 15741568 16055045 16269517
3924 16269517 16229043 15885334 15277824 14516402 13604447 12733569 11905373 11165127 10511200 9983732
3914 9983732 9531884 9151100 8810289 8554058 8330650 8192364 8064830 7946139 7877649 7856124
3904 7856124 7846230 7899370 7935408 8068108 8226730 8374063 8680646 8982825 9295479 9622567
3894 9622567 9907991 9999677 9954300 9765156 9458066 9162312 8848642 8561795 8406828 8218290
3884 8218290 8018777 7847406 7624594 7400934 7297201 7239556 7188425 7257667 7427268 7639880
3874 7639880 7866636 8143517 8393096 8531671 8542260 8454553 8299734 8167591 8103381 8065995
3864 8065995 8005759 7928104 7741972 7483044 7185242 6917707 6703191 6500253 6306468 6193317
3854 6193317 6131824 6116623 6162058 6177796 6212253 6274869 6326600 6364935 6412882 6450167 6525847
3843 6525847 6650009 6788287 6978521 7242950 7547849 7909055 8315068 8785305 9359840 10036551
3833 10036551 10732990 11502965 12235401 12844350 13266134 13382473 13152711 12644036 12001737
3824 12001737 11359798 10726473 10126148 9632836 9286986 9011280 8837397 8728787 8704229 8757782
3814 8757782 8878859 9100217 9369535 9661019 10051599 10544834 11097013 11688086 12270717 12784080
3804 12784080 13090923 13034450 12601701 11989071 11343700 10783547 10333988 10088114 9964945 9894368
3794 9894368 9933185 10141211 10428429 10806439 11230719 11711420 12202356 12653505 12970901 13084089
3784 13084089 12992894 12821934 12636169 12434080 12333731 12408741 12614176 12945592 13407540 13889498
3774 13889498 14397629 14815414 15028397 14957269 14647830 14205688 13713573 13245275 12820853 12532251
3764 12532251 12340412 12159118 12041510 11963118 11799144 11548402 11232917 10824000 10359824 9941396
3754 9941396 9589858 9321195 9116253 9013053 9006340 9026771 9143406 9354610 9648328 10008234
3744 10008234 10409889 10861977 11319685 11741066 12066266 12220353 12223133 12104499 11939543 11877979
3734 11877979 11861602 11924670 12029204 12114725 12057611 11751029 11163242 10394922 9585035 8818892
3724 8818892 8203058 7697193 7288356 6969969 6728709 6551994 6485213 6448723 6493555 6540131
3714 6540131 6635472 6817082 7014898 7280211 7547900 7789546 7967832 8041276 8061348 8022066
3704 8022066 8012391 8001306 8003394 8042202 8087116 8162777 8160727 8022251 7746081 7362835 6921943
3693 6921943 6431505 5972061 5566280 5242892 4971764 4742901 4570972 4520024 4418295 4342818
3683 4342818 4308359 4346458 4427080 4498745 4575606 4661475 4697201 4640500 4525522 4390581 4235200
3672 4235200 4093223 3977751 3916273 3912328 3947004 4003891 4080936 4212221 4332849 4457473 4471574
3661 4471574 4325012 4036518 3700004 3406106 3134767 2923602 2740541 2545855 2475736 2421198
3651 2421198 2319458 2267897 2262899 2215386 2162800 2135596 2120941 2122662 2121833 2141334 2166221 2205399
3639 2205399 2280052 2312251 2408025 2496741 2571123 2633768 2723307 2789755 2774445 2685290 2603619
3628 2603619 2471386 2353983 2217128 2119958 2021938 2005788 2003439 1988508 2005342 2023980 2100039
3617 2100039 2144668 2201306 2248193 2217323 2173426 2138320 1990026 1867320 1746972 1654449 1566381
3606 1566381 1488269 1406014 1380605 1381621 1353601 1322445 1270571 1248110 1258389 1211825 1163154 1149510
3594 1149510 1185739 1157880 1156108 1139441 1092163 1092567 1079932 1084461 1079612 1099649 1112292 1131996
3582 1131996 1141702 1098484 1082618 1064244 1016012 1048826 1058497 1074153 1084859 1080459 1054377 1059032
3570 1059032 1089208 1112135 1116562 1127898 1136929 1149161 1165512 1138035 1145625 1161147 1150062 1126588
3558 1126588 1114496 1150525 1153956 1163361 1167494 1194664 1199976 1218237 1190092 1193793 1220228 1243713
3546 1243713 1271162 1296140 1319968 1326983 1306625 1321003 1301479 1320024 1375239 1382000 1386926 1345049
3534 1345049 1365346 1407211 1411518 1444519 1500420 1519652 1557614 1608755 1662737 1727198 1791094 1843473
3522 1843473 1924167 2059382 2159704 2243427 2397969 2562405 2705705 2815809 2871164 2860243
3512 2860243 2837038 2734043 2587189 2394128 2211674 2066175 1955672 1902930 1863825 1812452
3502 1812452 1782168 1739903 1760891 1717312 1717413 1686472 1693414 1716116 1688386 1682781 1682501 1670519 1703611
3489 1703611 1680360 1663532 1648819 1661376 1636030 1640358 1612355 1634165 1663086 1684887 1732548 1761186
3477 1761186 1789076 1767177 1766919 1780933 1814881 1871695 1894180 1901606 1918588 1938813 1991556 2013170
3465 2013170 2007759 2045526 2087148 2087658 2101674 2129125 2166373 2220243 2251136 2299178 2314092 2334877
3453 2334877 2364615 2359584 2420036 2442381 2516871 2537696 2550934 2618614 2611823 2572214 2632237 2659574
3441 2659574 2662918 2689368 2772163 2842190 2947592 2985037 3069869 3184692 3269067 3318805 3360280
3430 3360280 3397878 3467253 3511097 3536057 3603890 3644788 3732353 3815516 3856117 3904141 3989894
3419 3989894 4087694 4221686 4352175 4462634 4585218 4717087 4808679 4873115 4940587 5039856
3409 5039856 5111811 5145785 5208075 5315323 5465412 5657140 5835068 5959655 6142106 6302799
3399 6302799 6426422 6605468 6784625 6949659 7115602 7299523 7509979 7684312 7912714 8090990
3389 8090990 8335590 8560222 8781312 8985692 9205761 9446462 9692357 9962819 10264655 10567005
3379 10567005 10864748 11154792 11434447 11725009 12063363 12406525 12739452 13068301 13475419
3370 13475419 13894334 14261190 14721937 15244698 15762669 16295177 16774599 17271301 17825886
3361 17825886 18437895 19067930 19760478 20498177 21282012 22071033 22891907 23794541 24804276
3352 24804276 25864947 27065834 28385996 29868030 31502251 33390325 35499955 37954189
3344 37954189 40753003 44158922 48217171 52933288 58307828 64525598 71719931 80297640
3336 80297640 90588170 103130504 119267329 140784703 164561422 189344216 218901465
3329 218901465 238715380 230288627 198725903 163220239 132217692 108364087 91199703
3322 91199703 78303590 68627903 61217768 55428483 50552251 46499180 43093928 40386735
3314 40386735 38160010 36335089 34666832 33266870 32068960 31157671 30378668 29800436 29318883
3305 29318883 29071676 29042569 29169137 29526618 30092782 30679096 31404936 32084828 32122926 31320835
3295 31320835 29899106 28415475 27148369 26142418 25418094 24876813 24539392 24284847 24090406
3286 24090406 23973619 23933691 23911023 24004506 24152522 24425246 24759357 25095999 25399154 25697064
3276 25697064 26016480 26300170 26636143 27021568 27417599 27840570 28295243 28786560 29327262
3267 29327262 29966105 30695828 31552605 32448138 33273893 34093007 34986062 35954173 37071195
3258 37071195 38251178 39519748 40832881 42236709 43802592 45473042 47324684 49358213
3250 49358213 51631634 54185813 57038445 60274360 63967645 68216885 73142187 78858109
3242 78858109 85612636 93541302 102681053 113088565 125053527 138944409 155340292 175064713
3234 175064713 199077298 228905977 265960642 308118874 351545636 391328116 409957785
3227 409957785 391487545 345098977 291053532 241961669 202453680 171663885 147644632
3220 147644632 128899615 113950614 101706568 91381697 82598379 75183122 68948854
3213 68948854 63649230 59054814 54980424 51379777 48187943 45378867 42831537 40518238
3205 40518238 38436776 36551999 34792893 33201612 31745038 30386526 29078553 27893840
3197 27893840 26718593 25604445 24500854 23405024 22396068 21426880 20576194 19830551 19122154
3188 19122154 18396375 17651154 16911630 16268964 15645067 15049955 14526928 14073685 13633408
3179 13633408 13186805 12747600 12337715 11944085 11543922 11169554 10813975 10487453 10165608
3170 10165608 9885096 9613675 9372939 9101166 8812636 8574204 8387226 8208297 7993906
3161 7993906 7825306 7632572 7444872 7300190 7103988 6928178 6796920 6631596 6531828 6447596
3151 6447596 6343203 6209196 6023476 5837346 5645988 5450580 5292136 5193257 5088573 4961601
3141 4961601 4838559 4701744 4583062 4475011 4380581 4347062 4316540 4251485 4179433 4158154 4071660
3130 4071660 3955309 3822938 3669580 3544119 3494367 3473380 3511855 3511679 3461663 3401924 3303218
3119 3303218 3274980 3243603 3177185 3118676 3115158 3088392 3051880 2988082 2900064 2817795 2744782 2708495
3107 2708495 2691932 2677999 2624489 2658990 2667619 2628241 2551675 2517510 2484162 2490459 2468231 2411053
3095 2411053 2385913 2359612 2325902 2334684 2333977 2248999 2184487 2149771 2106327 2088137 2069529 2043084
3083 2043084 2043785 2051565 2016767 1973737 2010460 1983905 1956633 1958828 1965647 1919287 1911099 1861584 1796246
3070 1796246 1751406 1748628 1744499 1691544 1651296 1650713 1641810 1616984 1618272 1607217 1572767 1588399 1620198
3057 1620198 1649016 1686558 1700507 1714866 1750309 1817882 1855654 1844700 1863326 1879893 1927164
3046 1927164 1977885 2017900 2089822 2187026 2235366 2281875 2305871 2209762 2099025 1924115 1768560
3035 1768560 1594783 1453816 1329103 1224221 1172027 1126216 1115777 1138140 1116902 1057116 1013464
3024 1013464 1040516 985428 915856 903886 875444 895704 921971 912712 905499 910357 938402 926390
3012 926390 936035 864111 807128 779692 768813 789012 781934 754944 740198 751469 768699 750350
3000 750350 743699 773123 729849 693542 692812 678051 665515 696183 697834 701907 699733 693266 698261
2987 698261 699594 736587 735127 700758 701579 724586 724698 734671 759272 742372 736569 724220 716634
2974 716634 734896 720426 720026 741705 672995 751803 734439 718316 728204 738658 748305 746837 724630
2961 724630 711615 717015 766328 773558 764959 812159 869162 908560 977923 976500 1013633 1098653
2949 1098653 1186472 1263027 1383769 1549947 1674870 1773190 1914260 2057021 2146931 2209760
2939 2209760 2220195 2144336 2039949 1893683 1669023 1535930 1378546 1239698 1115105 1022509
2929 1022509 942622 890461 840370 789188 735334 700178 673539 666344 652161 622023 608824 578125
2917 578125 553017 530145 516170 507419 503619 483117 433272 437663 454813 476050 470701 486570
2905 486570 478881 429628 418322 419580 359788 388762 401925 382063 360646 339597 345351 326971
2893 326971 323989 320881 353872 354177 344318 341237 321153 312283 363388 421308 379780 375102 372210
2880 372210 373928 351107 346418 337681 351722 366777 351337 318735 321484 302472 258843 285713
2868 285713 276865 269265 265603 288949 295532 293575 296800 230747 220572 219196 254013 260203 223199
2855 223199 224013 220438 228806 215310 203390 246153 257400 241923 243891 236844 232905 236781 235200
2842 235200 244619 224771 251585 236875 224743 237521 219828 224500 247203 247785 244938 256152 257179
2829 257179 253661 231397 255403 256648 241604 236348 220326 232581 230160 214045 196354 184184
2817 184184 200290 187141 172241 172153 212587 232305 205477 204121 187088 188244 167044 145269 162026
2804 162026 142952 146918 193689 159951 155992 175023 156087 178942 156260 134732 131336 158687
2792 158687 147136 137922 149061 157201 119807 110728 144595 173615 171078 176667 167548 171818 130435
2779 130435 141451 162587 143819 120362 109994 150783 159283 116755 104870 128685 162800 144749
2767 144749 144319 114763 102867 112165 104156 85697 95180 124292 124773 97286 85689 68773 94864
2754 94864 127271 113033 72293 61619 34356 46260 56768 55377 46585 37995 73376 97649
2742 97649 58325 54499 59446 58756 65915 37275 83561 67975 74759 85726 82413 116088 135769
2729 135769 115497 82179 72378 79756 78582 91500 66653 78683 92109 82836 73393 52521 22527
2716 22527 53468 84518 114425 98786 69143 58056 39355 46380 57178 56676 49900 30044 20303
2703 20303 28675 53244 32882 71737 70593 52696 64746 17856 16251 43706 70840 69052 76633
2690 76633 65339 78274 88424 89519 77662 52123 45868 42968 50681 44046 60350 76773 40023
2677 40023 43882 40615 12675 50140 70205 91926 113220 94570 80573 87481 36721 15911
2665 15911 -10702 100 64946 68179 97983 96728 67231 77706 36587 7345 -512 3154 -20942
2652 -20942 28295 55944 24757 37333 58798 43129 56962 24021 2213 10290 37380 37091
2640 37091 33720 42606 33905 44360 94824 71110 26199 39655 25902 36798 36875 43482 61005
2627 61005 24259 8384 51305 46574 7065 29780 61654 39878 33032 46667 61649 54670
2615 54670 86819 107771 72798 56347 67910 61701 47833 46713 38616 61447 75259 8307
2603 8307 20044 25329 35634 55602 48594 23567 53880 43610 36041 36151 -11045 -4622 32035
2590 32035 19275 46747 63536 49575 48851 21380 -1721 16153 39835 54974 46093 34674
2578 34674 43840 35664 19977 32362 17442 -5659 21216 28050 37771 20146 -10959 15814 19375
2565 19375 -3410 -937 3213 57670 20649 8558 21840 23515 49936 56149 71456 28156 56171
2552 56171 -2358 -35683 -40817 3234 15880 2067 -18057 -6545 15135 19977 26506 11900
2540 11900 -5477 5061 -4939 -7201 -8238 -4719 16371 -6551 1905 -11256 -12469 -17006 14914
2527 14914 3640 4682 18899 44428 46892 36053 48648 60109 25235 8739 35177 32081
2515 32081 25554 59966 52813 67929 36456 17266 11728 -1991 34860 49702 54082 73036 73632
2502 73632 73264 46529 45061 49967 48799 60147 61525 36006 23681 37342 35560 30793 11108
2489 11108 38747 8058 42365 18467 14413 11890 30722 35495 27062 43863 54317 67015 44847
2476 44847 19943 -3578 21808 11559 1603 -15336 9680 41836 41609 39904 49897 16811 32136
2463 32136 52679 47888 50277 27976 40527 17253 27607 34374 54049 40361 42849 55429 46093
2450 46093 23369 5359 22629 334 20500 17076 25688 21493 -3544 -14140 4452 9629 3230
2437 3230 3452 20676 8589 11829 -9322 -7430 -33370 -16233 9701 24690 35364 31572 42856
2424 42856 22958 19102 31076 16280 32930 38716 32937 19477 21972 27888 23718 7673 5431
2411 5431 -4211 5650 28331 38445 6979 28202 24257 41210 59484 52245 58565 75160 68128
2398 68128 54064 60153 27972 3250 -7135 9268 2228 37670 30681 12536 23906 14361 2097
2385 2097 28753 40761 35254 28128 19177 12208 13663 -29921 -39396 -31399 -17245 10335 23082
2372 23082 34002 18740 -18660 7867 21635 17460 -7960 -40880 -41743 -43071 -10976 3283 -16090
2359 -16090 9107 25282 24808 -7576 -9378 -15526 -6447 -9573 471 26671 49084 59741 87888
2346 87888 63991 116471 101283 71845 47035 37322 72096 46662 9581 9668 10088 5475 -13375
2333 -13375 -3296 -2356 17907 17673 18446 17210 -9941 2108 9857 2960 16203 9385 -13292 3734
2319 3734 20778 10411 12230 10630 19870 14520 19599 28944 -12592 26484 -3854 -31533 -16904
2306 -16904 -7607 -27032 -24758 22285 7520 13060 11916 25315 44634 50375 39601 -17943 8818
2293 8818 23260 42181 709 -181 -17150 14731 -24609 -22176 11321 -17965 10467 45559 25115
2280 25115 10395 6342 27136 20506 16931 14965 -14143 703 -17514 -25894 5504 43225 28687
2267 28687 -6683 44325 44568 27140 8461 8507 36169 28366 -6586 10299 -6861 16255 15404
2254 15404 13757 36002 41787 56659 45001 57209 53783 32487 14893 18822 -11 24392 36698
2241 36698 22241 20729 33485 8234 -893 -5425 24769 45105 603 9806 17287 7173 2871
2228 2871 -493 18461 17942 48590 48046 23252 37063 32814 45475 50037 3567 22563 9014
2215 9014 15022 44184 78373 54981 44858 41704 -650 -3057 68451 97390 83261 59465 85893
2202 85893 93660 89559 71224 56559 37299 38604 56915 53737 55774 75905 97102 82393 103253
2189 103253 81431 82070 75149 85787 88825 73639 49693 49827 53854 85533 55669 23782 39695
2176 39695 67218 90366 104494 93828 79717 133593 108489 93638 56035 28865 69776 63497
2164 63497 95390 126753 145571 153564 114692 118704 140376 141151 136104 131839 110368 102642 136887
2151 136887 161239 195502 204787 195961 172858 186283 218160 219799 220816 233548 226995 227996 247993
2138 247993 265702 258251 314784 309246 285372 280082 256579 296158 308065 302655 315309 344413
2126 344413 333810 398997 392401 378528 445435 468250 463725 475070 517798 521812 531358 582280
2114 582280 623815 639808 619194 610983 659193 676068 687319 724132 758988 778297 804645 830714
2102 830714 894685 946380 946461 1018060 1116771 1188167 1275044 1382034 1508140 1637840 1769810
2091 1769810 1869599 1988031 2112889 2234789 2469371 2764124 3146440 3640131 4251937 4999585
2081 4999585 6078815 7562582 9059010 10834031 11597241 10100531 7923145 6059729
2073 6059729 4774866 3934191 3290574 2780032 2409341 2095467 1851560 1725955 1620983
2064 1620983 1519336 1439544 1377698 1263505 1165157 1096998 1012725 902181 857904 803061 749534
2053 749534 721831 667321 614769 597140 577028 566350 554095 516518 501985 503641 455050 449285
2041 449285 475376 432959 396812 381505 371785 335275 313976 297611 297163 285883 279640 270284 273362
2028 273362 233920 239328 237029 229008 204796 184338 185807 203666 154412 168946 157352 163739 170657
2015 170657 127120 128361 141297 157911 164106 203212 190128 178223 140946 139941 130479 145862
2003 145862 123301 123807 103284 100976 120021 122190 77513 69425 61078 66663 92024 91890 70398
1990 70398 76757 61173 67002 47408 86503 84311 66574 68991 61696 52753 94861 54135 46950
1977 46950 79587 77132 91208 77750 52105 71826 54278 53323 36744 25048 75988 14537
1965 14537 34489 81872 70118 42563 42870 42906 40377 49775 66428 21559 9195 -7032 1586
1952 1586 -17698 -3147 14248 30005 54771 59257 28726 26307 59683 45010 17800 8659 6856
1939 6856 16955 -20663 -1015 -19324 -12544 6796 7157 3033 -12667 -498 12895 43391 10196
1926 10196 18212 29267 6089 10213 19472 26603 10880 13185 7583 19802 -1371 22833 63641
1913 63641 41508 25851 32866 32869 1777 21818 -8122 2917 -2124 -9032 8453 3520 -2955 18010
1899 18010 6896 23763 17745 3881 30399 29436 -187 -11433 19149 6780 36477 53151
1887 53151 45148 49435 -13704 -19737 -19560 -17591 -17244 -36838 -6561 -6205 -17523 32017 29160 10395
1873 10395 -19891 -29274 -18728 -19328 -36611 -6746 18294 -30871 -36310 -19609 -14796 -25339 8487
1860 8487 6140 -50 -13150 12790 16901 23941 16238 22121 7439 19570 20257 18386 26009 -4820
1846 -4820 -855 27190 -5536 3368 19355 -613 11893 1219 -24736 -46495 -26233 -27669 3228
1833 3228 7804 12128 6023 -9585 -20773 -38552 -20841 -29885 -13383 -35458 -34873 -49183 -8023
1820 -8023 19891 -16373 -24752 23647 32667 15905 -3110 -11179 -5018 -3882 3303 73552 89919
1807 89919 54383 69510 47624 19671 -9776 22433 16898 16671 45451 36015 45710 19913 -12772
1794 -12772 -3273 7030 4929 8248 14624 33239 5867 -7305 -13200 -34478 -35030 -25494 8851
1781 8851 -2806 32640 8602 -11825 -6680 28865 30536 21877 15907 10265 -7110 -9917 -9073 41164
1767 41164 53852 34203 19812 33409 -854 11121 2233 -5912 -16356 -31088 -23165 -12418
1755 -12418 -10156 -15118 -12870 -27284 -30959 -48306 -22792 -2215 -29037 -28027 -22256 339 -5822
1742 -5822 9352 32633 10891 25981 20927 -4427 -18603 -3825 -8095 -3830 -24763 -15026 -33594
1729 -33594 -21430 4566 -2790 -5011 -18675 -42913 -66762 -44830 -5771 37717 10254 -40864
1717 -40864 -27816 -7753 1444 4307 -14702 -24145 5845 26215 -25524 -4458 -12630 15239 26888
1704 26888 2388 3778 -28299 -24983 -24306 -18025 3259 2136 -213 -12625 -32203 -7002 -46396
1691 -46396 -14751 16278 2001 -30625 -12214 7127 -19032 555 13951 -14064 -8147 -10202
1679 -10202 -20620 -29985 -29736 -79252 -70022 -41908 -10440 -27676 -39643 -28265 -25796 -11476 -36874
1666 -36874 -20268 -46965 -42624 -32302 -57352 6632 19656 -14577 -28488 -9985 -41952 -45432
1654 -45432 -47617 -21235 -3341 -38700 -41283 -40651 -41209 8443 -21997 -17118 -13690 -31473 11185
1641 11185 40151 27485 -26305 -20944 -805 -12502 -30568 -32726 -16988 7774 -6684 -29889
1629 -29889 -46129 -43019 -22435 -24428 -53136 -44088 -38906 -13391 -9877 -38638 -35883 -8293 786
1616 786 -33843 -32171 23016 9964 -29861 -23012 -8892 7904 -1154 -4883 -5507 -9946 -1634 7047
1602 7047 24873 -12538 -28321 -58898 -64228 -49844 -50275 -16574 -26787 -31732 8927 12184 19243
1589 19243 26672 -438 -5264 -26266 -14100 -39380 -23517 -18070 -25331 -21547 -3766 12661 15767
1576 15767 13421 -13521 3408 -10073 13453 -2725 -23944 8341 34839 9287 -23597 -40407
1564 -40407 -38001 -27023 -37412 -46507 13367 -4996 -2009 -11030 -9920 -18850 16132 -16171 -24937
1551 -24937 -10941 -23077 -11 10860 -33742 7929 -15346 -22181 -33138 -39344 -28442 -25914
1539 -25914 -72070 -45395 -10949 -33108 -22509 5359 30646 20732 -3491 -30269 4495 19448
1527 19448 19283 -16499 -52858 -56421 -6566 14148 4598 -15058 22625 -21097 -679 10755 4723
1514 4723 -14150 -11756 10106 9732 -14967 -14721 -29845 -13057 8766 23340 35778 29233 -13533
1501 -13533 -15319 -4973 23729 34237 -4724 -8394 -5283 23917 -10922 -21993 -31879 -38333 -32775
1488 -32775 -13009 -21031 -69011 -11923 3852 -36648 -37784 9043 19567 31975 26579 30233 5508
1475 5508 -486 -6347 20591 -10228 -10568 -16197 4514 10128 -19414 -19904 -17103 -24151 -12656 14797
1461 14797 -25357 -6857 -2269 22296 13505 -14014 2530 -22761 -23617 -15455 -11058 8086 1728
1448 1728 2535 13342 6555 635 14606 -17525 -2143 7823 -8779 30185 7828 -44919 -28167
1435 -28167 3301 -16433 -24466 -7674 2916 -18516 -40185 -47854 -25993 13432 32617 52189
1423 52189 17756 -11133 6229 -1943 6533 17790 -16189 -25235 -9505 11210 -4940 -3793 -26945
1410 -26945 -6892 -5292 -12308 -34826 -35869 -15260 10021 -676 -26622 -19659 -25721 14377 38432
1397 38432 39293 34767 53474 39504 32601 6425 -14244 10400 26127 20693 23340 11797 10260
1384 10260 13606 -13396 5735 11219 25448 4923 8661 -5619 -25090 -229 23487 31893 -4971
1371 -4971 -22526 -5613 -23612 -18291 -26644 -44467 -10417 4200 -20009 -30600 -44160 -14021
1359 -14021 14194 -1498 -25281 -35131 -35919 -39556 -20818 -37380 -54857 -16980 -38046 -22219 -12690
1346 -12690 21359 38195 -25320 -29893 6929 10444 -8026 -7298 1759 7430 9164 12694 16382 19610
1332 19610 21775 -8208 -23374 -29048 -16130 -27306 -20824 -29803 -36757 -13041 -9967 1413 -15804
1319 -15804 -16591 -37517 -45411 -11438 12739 15812 13476 -14488 -27067 -48341 -27520 -10843 11000
1306 11000 11735 -8575 -20874 20284 -12415 -24919 -21300 -31251 -9175 35002 42161 7128 14280
1293 14280 38420 25685 8733 -4298 -4271 20348 36745 14340 5244 12334 14766 -2923 24669
1280 24669 -64 -48863 -31730 -13226 -17083 -4487 15979 -17218 -15943 -34056 -29680 -11850
1268 -11850 -10026 -18904 -15303 -20614 -30138 -14474 704 -6316 -12710 -17366 1002 -21445 -37441
1255 -37441 8908 28558 -32356 -1142 13609 -34442 -45678 -40200 -20699 -4281 -6486 -4588
1243 -4588 -10521 5246 16464 -840 -25082 -34317 -38447 -21939 -24379 -26340 -5241 -7138 -6420 7490
1229 7490 19168 -11112 40392 10051 22206 16074 -3623 30386 15564 -19032 -2634 -10910
1217 -10910 7615 14750 -16606 -2292 -15157 -27064 -13267 794 -5874 1952 -1493 -904 35201
1204 35201 21552 -11406 -32563 -56611 -16481 -4236 -9656 11689 -31681 -44855 -46027 -39864
1192 -39864 -26798 -10499 39975 30691 4358 -1979 -4642 -18214 -12456 1199 -28313 -20812 13498
1179 13498 -5232 -37203 -37857 -25617 -50150 -44149 878 5162 6626 5883 -62398 -60209 -46350
1166 -46350 -17382 -25956 -36786 5119 -27942 -48804 -46584 -7851 -29112 -58846 -31042 -19796
1154 -19796 -16182 -60582 -40162 -31115 -10939 10828 -20130 -40182 16843 11559 -17613 9072
1142 9072 38978 19051 20472 10540 -558 -29855 -51608 8369 4024 -16800 -18612 -7904 -17860
1129 -17860 -11572 -3448 196 -5044 -27267 1416 2459 -48030 -32461 -13331 14719 9352 -28011
1116 -28011 -20037 -30167 -10512 23865 40344 -7693 -20670 -8857 -17579 -35640 -56040 -40818
1104 -40818 -10331 -3237 -15019 -14453 -1899 4513 -14520 -25893 18465 17227 -12251 -6568 12481
1091 12481 43609 26761 1397 3952 3992 -25479 -54764 -23314 4804 -24680 30815 23770 21586
1078 21586 15948 -17516 -6742 2347 13014 31935 8981 11528 22547 -561 -3955 -25477 -46655
1065 -46655 -35951 -62322 -46106 -43417 -47429 -8297 -12950 -5261 -4986 -27378 -18896 -11676 -29692
1052 -29692 -22336 -25187 -15722 16291 757 -29009 -16920 -28809 2016 28704 5688 6490 -6698
1039 -6698 -36244 -61100 -33644 -27206 -41774 -19122 -18320 -48818 -47296 -45918 -54976 -65661 -36166
1026 -36166 20203 41509 54320 15357 34973 11271 -20244 -16953 -19149 -2194 -8029 -14265 -23081
1013 -23081 -25420 -37326 -17977 -12387 4078 -37143 -73426 -63595 -22475 6886 12651 34319 21118
1000 21118 -223 18941 16287 -4011 -455 -1074 -17466 -20088 -7825 20087 25467 15217 41412
987 41412 34241 -6568 6037 8519 -14053 -18964 -10593 3459 5201 -3885 6671 2140 1954 -12137
973 -12137 -13234 -709 -3175 17056 -22846 -29166 -25480 -31477 -18562 18118 16022 40174 37601
960 37601 32917 37739 30269 14767 24588 6852 -9440 -8493 -1444 -10399 -22699 -3471 -31726 -1873
946 -1873 28414 26813 -23549 -9513 6433 -16610 -10935 -28719 -43158 -45682 -17156 15817 14352
933 14352 20183 22365 -3916 10006 17819 -4390 -32005 -8 14291 19019 -21024 -28196 -27794
920 -27794 -7077 -4938 -16570 -22135 2857 33363 -4728 -722 -11365 -1932 -15490 2805 18822
907 18822 11396 898 683 7367 -28030 -7510 14055 21575 15792 19207 31412 17576 -15547
894 -15547 -26675 -16068 4827 -7427 -3738 13590 -598 -960 -45719 -45520 -16948 -17447 -13352 21167
880 21167 8169 2099 -589 16036 -4507 -1121 -6900 -9356 -3423 -20633 -14730 -26641 -9129
867 -9129 17827 -12854 -9415 -27096 -23456 -11389 -30459 -6003 -37570 -45411 -24785 2075 22798
854 22798 12435 -11678 -13780 -12149 -23529 -14174 -5902 38478 33537 -4951 4196 -1760 -17737
841 -17737 -14329 13711 -9329 -1890 -19994 -15744 2500 1426 12099 4130 -14375 -4719 14305
828 14305 19152 -19564 -20200 12572 -1677 -30678 1552 12355 -37634 -51640 -54766 -22446 -3787
815 -3787 -1540 3850 4663 -5221 -3266 -18551 35383 16484 7703 18483 43022 43375 -3022 -14775
801 -14775 -16888 -13700 8740 -25121 -26742 -6600 15517 14829 21990 5505 10938 58770 7991
788 7991 -5419 -4037 139 -48357 -20766 -8207 -16904 3675 -9367 -30645 -36897 -29330 -32973
775 -32973 -14557 8077 -1359 40010 19598 -42434 -24655 6586 -25042 -44012 -21063 11458
763 11458 3157 -36614 -34139 -26650 -19685 -43225 -38510 -11731 3058 -8341 -42379 -26677 -5259
750 -5259 -15609 -15467 -21378 -20036 1726 -3393 16437 21242 18363 3409 -8949 -30049 -52938 -22605
736 -22605 38130 6244 -3579 15535 -10280 646 -14113 4794 28323 25181 21551 22838 26542
723 26542 19989 2493 -23147 -5553 2467 6639 4007 2034 -13483 -3514 8275 -5677 -5878 9730
709 9730 14460 20557 25030 29844 12626 12055 4470 6997 5544 -3173 16875 19468 53146 59621 19325
694 19325 -607 43993 31465 -11056 -6367 9536 -1104 3744 -20933 -28317 4140 4916 -19584
681 -19584 -11815 11491 2991 -6466 -12437 -7171 26149 44295 49171 -2246 29553 13680 -12378
668 -12378 -42068 -14434 -8245 -16378 -8644 -14320 -15630 -213 7585 2388 -2500 -7347 3848 -23934
654 -23934 -26565 -25993 3503 -46063 -30761 -8628 -18121 2990 34588 24159 5335 8001 17039
641 17039 36191 38621 1460 -20176 15199 27406 35819 -4263 -34330 -36326 -21568 -5277 8820
628 8820 24054 -11337 -11545 -24440 3579 -15252 -30918 -13283 -26143 -43247 -25702 -34393 -22120
615 -22120 -34736 -30477 -33526 -24683 -3328 13022 4766 6522 46006 40705 28120 32095 44196
602 44196 -2656 -25538 1335 40971 10819 -23465 -29257 -12711 16724 7539 -22415 -4037
590 -4037 -12409 -10738 -16236 -11499 -53016 -41157 -16120 -18685 -8919 -6760 -3579 -23094 -8338 -4398
576 -4398 -33058 -1154 26062 24047 3561 24382 3161 -11179 14196 -18269 -23399 -23313 -18090
563 -18090 -43508 -1104 23983 -3492 -15248 9172 13854 29940 32954 17227 27452 33575 -2030
550 -2030 33827 37214 34154 45031 35132 33264 26079 36662 3038 5831 2963 -3056 12353 40387
536 40387 44519 21758 3977 -39771 -27075 -18169 8309 42889 24509 32027 29005 40394 23331
523 23331 20555 22908 4548 26024 26628 3072 8946 5463 17124 20231 8580 -15095 10952
510 10952 20891 4484 18995 -702 456 17017 -1667 -12273 -17513 -11140 -21425 15392 18150
497 18150 5739 -17187 -20847 3724 -5790 -43972 -37246 -3378 -17259 -31306 -43958 -29481 -30802
484 -30802 -4717 8286 2509 26007 54101 38940 31407 5615 -2702 5925 19069 -3572 1473
471 1473 -6433 -7474 -4680 15810 31361 16085 -6056 -6729 5993 23338 18338 -9787 -14878 -36800
457 -36800 -10629 -19444 -12977 -3567 -33788 -7700 -22975 -57637 -6636 3490 22283 3164 -3765
444 -3765 25291 34382 3169 -26400 -9048 -22415 18973 34744 35526 37235 15860 -651 -26929
431 -26929 -51776 -60849 -25603 3127 1830 -1587 -2506 20601 7044 -5257 -13953 -715 -27622
418 -27622 -13744 -8290 -16169 24821 4919 -252 -8843 -14482 1570 8479 -4231 30924 39481
405 39481 13708 9597 15494 13063 17662 8116 3923 -16335 -20773 -23004 8133 -12390 10397 21176
391 21176 26185 -106 -44515 -1102 -7081 17517 24523 2504 -6819 12350 26645 11134 -5009
378 -5009 -23211 -35860 -25354 5901 -24672 -12029 2524 262 16432 17605 9182 1258 7061
365 7061 -17407 9907 16036 4150 11700 -8382 7289 40548 33514 40988 32158 27332 30964 22724
351 22724 29233 18670 905 26576 33312 17815 -8751 -7480 9909 17168 -4212 23549 28855
338 28855 2929 7456 5217 -5310 583 1485 1229 -3451 4807 -13924 12711 4193 6058 22236
324 22236 24761 32696 76510 70599 27802 -6435 -31496 -30869 -23883 -13449 2682 -13003 -54108
311 -54108 -28092 -15942 -12066 -15762 -14326 -9752 17492 20184 21273 31195 38770 11006 -314 -14364
297 -14364 -24092 -17671 3085 19052 23368 -8024 10022 11231 13970 -16565 -25661 7397 10668
284 10668 36426 -4272 -49880 -6166 -11921 11302 -4864 4222 -19066 -5673 46696 29675
272 29675 30253 21478 10466 20163 47301 45805 4183 -14854 -4740 25267 27509 27179 2566 4091
258 4091 -12508 -10362 14283 -28929 -19220 9375 -9994 6534 58162 23625 8980 -27650 2886
245 2886 72504 39601 46504 34407 -24519 -3982 7654 -7424 -13992 23208 19070 37190 33274
232 33274 11642 16465 49842 47738 27664 20566 11829 -27505 17574 36434 15908 -5092 -10690
219 -10690 16742 11247 283 -11497 21357 61425 19719 14066 24586 25369 -4377 15135 10836
206 10836 -29665 -39718 -48887 -11504 -35 22685 26117 31623 15876 9584 7725 39680 46121
193 46121 9215 30974 -19287 -914 -8783 -21934 21054 35627 -11611 3863 35338 29523
181 29523 25102 8504 17001 -24198 -1291 -1020 -21024 -39227 -16637 -14217 -32469 -29946 -12653
168 -12653 -34078 -17669 15602 21320 33705 -17978 8593 15960 -5755 -6474 -16088 10255 5189
155 5189 14303 29647 7539 -19179 14280 20916 -4223 -11843 23731 38668 48570 53054 40816
142 40816 -5227 5457 37880 35351 22581 1986 8450 17879 24484 21132 -4346 -6262 10119
129 10119 45235 32059 15643 17560 812 -13179 -10640 2141 13749 -7057 14672 -7721
117 -7721 -11567 12898 15785 1412 -1969 -11612 -17248 -21341 6951 13520 4733 20371 9420 3032
103 3032 1519 18589 3556 11366 29741 28719 10089 7884 9511 30714 26191 -7075 10074
90 10074 33619 1297 34843 19070 5113 -6924 10619 -8489 -11568 -24654 -12252 16055
78 16055 -2431 16100 32518 21203 27667 18062 33302 29023 60 9665 25334 42193 520
65 520 4750 35338 31338 12588 12612 -1717 10227 3492 6605 22910 4093 1140 -3207 -5202 14143
50 14143 21436 36790 21839 32068 10444 17150 31709 3212 10485 15652 12394 -6047 3130
37 3130 -5790 24933 13437 14068 27246 8313 -11453 -1606 8999 -4813 -9356 12889 23789
24 23789 7208 7417 21038 13207 19260 -1791 1955 -14442 5359 439 -11812 13873 11421 4851
10 4851 -14879 3575 29797 18839 10995 28662 16381 40741 7454 13376
0 13376
$$ Imaginary data points
##PAGE= N=2
##DATA TABLE= (X++(I..I)), XYDATA
16383 -724278 -701037 -674454 -645507 -652609 -651979 -627655 -612418 -629995 -653689 -627008 -601342 -578437
16371 -578437 -582859 -545527 -539964 -538322 -519936 -508080 -493902 -491438 -478617 -470169 -470051 -442931 -424023
16358 -424023 -426477 -421266 -404386 -378194 -370944 -367857 -358192 -365110 -337943 -337066 -335198 -328185 -305342
16345 -305342 -279180 -285144 -301279 -262659 -257250 -258740 -235841 -207067 -197673 -195581 -205704 -182291
16333 -182291 -167166 -154514 -161699 -153094 -136004 -130337 -134779 -136296 -132020 -135248 -118867 -108472 -62263
16320 -62263 -51039 -37232 -9319 -5914 -3934 5121 11445 47856 41778 34016 42018 63322 65167
16307 65167 96207 93535 99480 82878 112786 134554 131349 136211 160052 150021 150470 170287 181736
16294 181736 159524 174790 191867 205351 188239 188620 216575 246031 258798 227932 235465 264158
16282 264158 277900 285510 296182 307602 284975 299508 313496 312599 328555 351735 366130 366693
16270 366693 363945 347038 358297 369210 367102 380046 375420 388011 425878 444116 459326 431983
16258 431983 441854 467165 460563 460758 472168 504366 505232 492567 506176 500659 511859 498040 510280
16245 510280 530344 545853 553313 542595 553393 561482 542224 561313 574655 603165 615093 633208
16233 633208 613974 611170 634963 637943 624757 636416 624612 616862 591089 655453 693154 671931
16221 671931 680787 671350 654378 649198 636994 651709 685899 686257 686442 663107 705802 661248 666977
16208 666977 698188 682430 692998 708769 731376 734907 712968 722347 712559 723010 729179 741954
16196 741954 759149 746109 750102 775656 792986 792536 808367 831925 813158 779570 815911 818678
16184 818678 828754 838278 802441 808280 764240 777883 802056 806950 831567 833677 865533 875363
16172 875363 854059 868870 855293 834335 815697 822379 876487 862768 890138 857986 868290 883936
16160 883936 877461 867604 861415 874841 850779 872634 895867 893735 874254 888555 909184 938064
16148 938064 913601 892420 904020 908630 890303 910267 931494 899142 918122 896409 905846 895096
16136 895096 916007 922802 917664 896937 934155 928617 918749 955088 955440 948467 942314 920614 914188
16123 914188 902504 895880 933133 950461 933101 916985 914631 938060 953544 945073 935555 926032
16111 926032 944781 941423 957116 963144 941294 968918 955249 941035 955288 944086 944067 913517
16099 913517 925163 967943 988835 972367 974297 955091 946775 909136 898092 905272 958064 987882
16087 987882 984308 975854 969393 979984 988664 946585 949904 969432 953705 959431 991698 961991 943721
16074 943721 958431 962156 938177 966744 973913 979691 960549 1006831 1025798 975969 967901 964830
16062 964830 957950 980941 988216 955304 957452 1011942 988636 956965 986116 981356 973993 954346
16050 954346 966939 994366 1003709 986403 1008607 982681 987935 980252 979180 993791 980605 959141
16038 959141 964998 983239 1000927 951523 938109 945114 940172 969365 965362 946271 970081 973492
16026 973492 982850 1007421 996729 956636 964427 995710 980392 951057 952029 934641 979758 965317
16014 965317 967897 1000485 957122 942642 952115 952991 962232 990631 988050 1006074 1007331 987136 1014324
16001 1014324 1017651 966495 992175 1005177 1017875 1014536 966715 940899 960716 978201 1008439 1002773
15989 1002773 1011997 1017344 1015023 998264 989194 1006467 1008097 1008026 981358 1000861 980928 1001019 980081
15976 980081 966121 987865 996137 978601 969687 981534 990306 971901 950694 1009093 1012204 1001967
15964 1001967 994551 1024255 1003610 981499 1015098 997705 991845 958247 966103 968199 966299 965949 945542
15951 945542 968605 987408 1015935 1024922 967722 959320 997578 1000305 996865 997774 972437 992414 986380
15938 986380 1003875 1008122 990099 973864 1004578 1023826 1009749 1038057 1033993 1002095 1017547 1011582
15926 1011582 1006931 1003728 984851 992290 992591 960135 987954 1036498 1011314 1020061 994208 1002168 1012653
15913 1012653 1002053 1018914 1001121 962135 956569 949038 946123 960226 1005301 1002527 1014192 1008661
15901 1008661 999737 1028484 993659 976283 1003569 990922 973097 975932 983985 1000422 1005166 1006986
15889 1006986 1022118 992095 997222 1021638 1046742 980058 979920 973047 959720 985958 973165 970984
15877 970984 963221 1005529 1028438 1002994 1012641 1018445 1017999 1000958 996435 987681 999590 1008620 1002261
15864 1002261 990946 987817 1020175 1025243 1026723 1017659 997449 1020043 1017584 976544 988183 1020126
15852 1020126 1000565 1004353 1028960 1021960 1008601 1026737 1021221 993333 1003188 1028337 1031705 1036902
15840 1036902 1040877 1028637 1020574 1012516 1016080 1017615 1021912 1031581 1007316 1007978 1020625 1019282 1025828
15827 1025828 1001462 1012435 1001595 1008944 1010769 1008807 1011464 1046908 1024732 1006484 992751 1009357
15815 1009357 1017215 1012891 1009299 1008296 1008824 1005025 1018945 1024292 1029562 1013012 1014374 1014588 982796 996709
15801 996709 1025120 1042209 1034206 1035368 1012797 998222 1024751 997568 986494 1008798 1020823 1037222
15789 1037222 1051938 1067623 999391 972116 970082 986172 996334 1002097 1007507 1007556 1015284 1003715 1008810
15776 1008810 1012570 1006761 1019360 988974 998030 1013565 996088 1022453 1030981 1018057 1026548 1056835
15764 1056835 1044142 1001061 998054 1009331 974509 1005239 1013343 983757 1000288 1008925 1041658 1017848
15752 1017848 981630 990256 985931 983613 1004187 1057391 1052017 1036697 1036141 1014565 990456 1022890
15740 1022890 1023264 1025717 1030498 1044856 1033248 1018109 1025376 1011250 1005655 1040694 1029635 1016723
15728 1016723 1038603 1032774 1014451 1031890 1048250 1019883 1023369 1039161 1011076 1030743 1015603 1010434
15716 1010434 1042383 1018350 1031408 1071649 1083468 1045254 1005006 1000778 998111 1013169 1013259 1022440
15704 1022440 1004220 1000143 1007331 1012691 1013190 1009106 974516 978448 1002859 1023783 1015328 1014370 1009042
15691 1009042 1016427 983117 991235 1014218 1005146 1001213 1008876 1026423 1018817 1052773 1052396 1035981 1027256
15678 1027256 1034154 1043180 1029082 1016661 1013208 1031270 1029502 1024560 1006552 995299 996541 1004855 1045645
15665 1045645 1012658 1009965 1038830 1070501 1040367 1013511 1007600 1027402 1041429 1042572 1044121 1045540
15653 1045540 1015730 1021803 1026432 1015072 1020210 1032417 1058048 1067862 1033114 1037701 1001979 993445
15641 993445 985404 992369 973765 1012818 1029656 991840 1049012 1031192 1012921 1008235 1013809 1027047
15629 1027047 1010440 1027571 1058483 1023384 1014641 1053487 1036526 1033244 1047717 1017822 1008353 1015718
15617 1015718 1011628 1032390 1040586 1036967 1052764 1050892 1007789 1016003 1017062 1039206 1055367 1030035
15605 1030035 1029198 1025102 1032188 1071689 1068051 1026722 1023756 1007786 1005949 1023061 1055452 1066307 1023951
15592 1023951 1021964 1003892 1003753 1036411 1068329 1037699 1036010 1042656 1062473 1057978 1018382 1043624
15580 1043624 1043111 1040278 1033691 1026356 1017252 1015820 1019746 1049576 1040353 1035351 1043144 1034366 1003283 1009570
15566 1009570 996640 1031596 1040841 1020433 994537 1016775 1062023 1078468 1052737 1054639 1052779 1047240
15554 1047240 1046147 1040668 1073754 1080019 1048932 1033870 1040978 1048756 1041685 1074334 1031390 1019398
15542 1019398 1029407 1024890 1011172 1007215 1032012 1050297 1065906 1081196 1075165 1048787 1047236 1040318
15530 1040318 1014541 1057709 1060431 1055685 1064568 1090346 1057807 1041092 1031922 1009901 1063981 1047168
15518 1047168 1039620 1045888 1034258 1006157 1026164 1048211 1072166 1080455 1054436 1037171 999635 992882
15506 992882 1035596 1041709 1052824 1056256 1079313 1055197 1009384 1028653 1053288 1038964 1066208 1059534
15494 1059534 1037617 1027731 1031433 1044140 1090619 1072020 1062817 1028091 1021144 1016785 1005034 1001362
15482 1001362 1028503 1031962 1044331 1038044 1021339 1045254 1049218 1067432 1058780 1043682 1024627 1043814
15470 1043814 1029471 1074275 1070202 1033644 1042307 1049198 1053340 1044123 1040962 1028949 1049628 1039180
15458 1039180 1065389 1075764 1060673 1055125 1054750 1045463 1060919 1042243 1039263 1026922 1013930 991177
15446 991177 1011059 1023234 1045619 1047440 1015267 1007596 1017973 1046454 1066734 1026657 1011218 1027961
15434 1027961 1043071 1058323 1034557 1031570 1030439 1052289 1050529 1061890 1065853 1073748 1093843 1067665
15422 1067665 1060588 1078108 1035167 1050094 1059342 1081776 1066899 1059983 1069327 1098573 1070434 1053443
15410 1053443 1053985 1053764 1033945 1086372 1066611 1031265 1032035 1047097 1048915 1030060 1044581 1030775 1016212
15397 1016212 1024163 1024568 1009426 1025859 1053674 1039641 1019122 1020405 1002204 1013387 1036384 1061059
15385 1061059 1055278 1039807 1022185 1050447 1061679 1048319 1038185 1011711 1020270 1016266 1006810 1045706
15373 1045706 1066344 1079845 1063144 1027759 1050424 1045947 1043412 1075594 1095009 1087462 1079632 1080674
15361 1080674 1067272 1056284 1077544 1065180 1071341 1076699 1081824 1082980 1078068 1086012 1078670 1043327 1047410
15348 1047410 1062118 1087360 1059201 1046227 1056624 1032269 1035361 1049139 1062623 1038094 1020250
15337 1020250 1018699 1032300 1018907 1032126 1031391 1046323 1027050 1010494 1027130 1065289 1062336 1048898
15325 1048898 1048268 1050284 1039492 1022187 981905 1034499 1008959 991128 1071054 1074623 1077686 1072330
15313 1072330 1062620 1049989 1042141 1049089 1038013 1033094 1077654 1057818 1080507 1125904 1094560 1057533
15301 1057533 1053286 1070515 1063002 1104458 1076196 1081492 1050664 1027222 1026372 1042587 1047265 1059454
15289 1059454 1120406 1092309 1053709 1039734 1064134 1049781 1075048 1047900 1038291 1055616 1080580
15278 1080580 1077186 1053465 1050682 1036703 1036414 1057916 1050418 1028255 1059542 1064915 1071538 1075221 1035950
15265 1035950 1045814 1023033 1049572 1069811 1058428 1073074 1083359 1096193 1083181 1087396 1074026 1066785
15253 1066785 1061152 1117634 1140658 1069161 1081480 1069765 1053698 1063788 1078059 1084692 1064761 1045898
15241 1045898 1037880 1028208 1089551 1124458 1074265 1082291 1080553 1045538 1042770 1083535 1070340 1081602
15229 1081602 1058293 1062322 1071993 1082972 1066786 1082832 1102161 1092134 1057530 1063583 1081595 1065040
15217 1065040 1061984 1113759 1137668 1120309 1117973 1092725 1114069 1081961 1062437 1067759 1048499 1059442
15205 1059442 1077867 1093358 1099343 1094525 1087977 1063380 1070844 1064233 1028859 1047717 1061553 1046855
15193 1046855 1071499 1087516 1101549 1106363 1100825 1079090 1096340 1099061 1099054 1079035 1085967 1088132 1079620
15180 1079620 1112653 1094554 1065477 1049526 1071838 1077267 1052803 1060813 1047631 1064210 1077445 1063824
15168 1063824 1077081 1060547 1081112 1084222 1074406 1060775 1060678 1088665 1086172 1108040 1084808 1112297
15156 1112297 1140554 1107602 1075972 1074728 1071062 1059966 1066909 1091190 1113129 1105660 1041523 1049434
15144 1049434 1071696 1057845 1091464 1097226 1114910 1119748 1088978 1108021 1111069 1088428 1106919 1088469
15132 1088469 1071415 1080983 1064487 1078895 1064206 1072889 1063592 1080052 1118117 1113017 1113698 1111298 1110681
15119 1110681 1091428 1109196 1109880 1124482 1094708 1072149 1097505 1074038 1054554 1076353 1070382 1088699
15107 1088699 1096405 1092213 1090467 1073938 1121034 1126709 1124051 1121076 1118320 1105515 1079496 1090141 1058898
15094 1058898 1078348 1048715 1039331 1073068 1077528 1103078 1096176 1055738 1070276 1091579 1076957 1032789
15082 1032789 1039810 1068447 1091364 1052961 1050694 1104271 1088440 1090838 1076382 1085560 1097583 1078022
15070 1078022 1062975 1060326 1067410 1136815 1136142 1118772 1119937 1099694 1106826 1121031 1114151 1099092 1080428
15057 1080428 1056032 1056823 1105705 1138125 1080665 1056431 1074715 1054253 1064517 1099323 1100449 1124426
15045 1124426 1069419 1050089 1084701 1097151 1099817 1081107 1090428 1103657 1103116 1071090 1085066 1084045
15033 1084045 1101740 1074601 1053500 1082511 1086827 1103763 1131603 1127644 1121053 1122633 1135191 1122547
15021 1122547 1088196 1108814 1103816 1106190 1106207 1149409 1132663 1136245 1140107 1108064 1086487 1088058 1103681
15008 1103681 1083849 1080385 1097781 1124435 1096247 1065157 1068586 1080811 1126982 1112993 1130923 1102633
14996 1102633 1121753 1114221 1091400 1090129 1115070 1100567 1107194 1102561 1046713 1060607 1065483 1109716
14984 1109716 1066524 1073972 1088759 1087300 1096054 1103014 1099348 1114121 1103503 1109940 1101483 1094396 1093681
14971 1093681 1134212 1137015 1110346 1131999 1118851 1114365 1102251 1109728 1096291 1101335 1125177 1121776
14959 1121776 1122764 1116605 1103063 1086608 1108996 1094376 1099045 1089084 1091293 1067433 1092646 1101457 1134481
14946 1134481 1139364 1108509 1140224 1143100 1145122 1111559 1111210 1101924 1141493 1146441 1120542 1101120 1101426
14933 1101426 1103040 1102560 1106217 1101660 1071519 1042159 1068264 1075799 1080388 1132015 1133931 1112656 1099612
14920 1099612 1086482 1091171 1086433 1092122 1091614 1077782 1081904 1104138 1096137 1083767 1078631 1098824 1117937
14907 1117937 1095894 1077247 1082818 1123657 1080049 1072530 1130732 1090385 1072960 1075485 1066992 1101802
14895 1101802 1106344 1091968 1108609 1141917 1135130 1115806 1121284 1120961 1114005 1126387 1125326 1098948 1142988
14882 1142988 1129446 1086600 1099280 1132226 1096838 1097449 1120654 1155270 1145229 1148136 1128732 1098075
14870 1098075 1115821 1132039 1109179 1107879 1118121 1112952 1117849 1129497 1128835 1133728 1109354 1079924
14858 1079924 1064670 1079472 1108462 1124843 1148637 1144734 1123072 1128033 1125173 1133972 1156391 1172514
14846 1172514 1166471 1134351 1121976 1140652 1160002 1133307 1161564 1142163 1121741 1117063 1124818 1123759
14834 1123759 1129954 1132989 1130931 1143242 1151880 1165144 1175773 1139156 1129029 1102815 1117261 1125640
14822 1125640 1131246 1107556 1137407 1106023 1106670 1120665 1088524 1102964 1128705 1112093 1093668 1130265
14810 1130265 1121703 1112684 1116128 1117089 1133666 1150885 1150778 1147469 1122052 1101809 1094355 1100533 1126136
14797 1126136 1127001 1135824 1120615 1136703 1149148 1115278 1092866 1118371 1094089 1136147 1124911 1091789
14785 1091789 1109487 1148084 1145128 1165745 1150974 1142960 1149292 1139502 1116487 1106207 1091629 1111121
14773 1111121 1111139 1109122 1139185 1160819 1144007 1105888 1129160 1117875 1123059 1111150 1135282 1103546
14761 1103546 1082296 1067991 1067943 1047418 1050807 1090849 1132478 1126225 1118272 1106901 1119289 1120268 1168081
14748 1168081 1154324 1138304 1146749 1145141 1125256 1153468 1128541 1111386 1158969 1190457 1149693 1143548
14736 1143548 1126520 1131704 1119186 1119208 1139426 1151966 1109515 1122565 1129001 1138147 1132320 1104902 1125542
14723 1125542 1123854 1107656 1076867 1065794 1097761 1118000 1098715 1114352 1184141 1142952 1147465 1145258
14711 1145258 1139732 1124573 1093168 1130908 1114776 1095751 1126873 1172585 1148749 1154380 1147859 1159378
14699 1159378 1148183 1156317 1185984 1169624 1140840 1136135 1128654 1137663 1140039 1120199 1100617 1129700
14687 1129700 1151484 1158602 1114359 1132342 1121729 1106921 1138125 1134723 1113822 1143060 1155017 1148458
14675 1148458 1136365 1171161 1128689 1147850 1171267 1130188 1147514 1151022 1150217 1125082 1144367 1157942
14663 1157942 1139771 1132002 1164130 1137440 1112169 1112762 1134941 1137189 1130055 1091528 1078533 1097773
14651 1097773 1131701 1159193 1113656 1113285 1122988 1130489 1114232 1135424 1140288 1148464 1157166 1154990 1153448
14638 1153448 1123296 1095789 1135506 1178505 1164865 1149680 1136379 1106391 1119456 1157566 1177571
14627 1177571 1129399 1143449 1157476 1152639 1133572 1120770 1140166 1140835 1139934 1148877 1171942 1148757
14615 1148757 1147161 1145179 1134105 1142297 1166165 1139183 1126684 1116910 1109857 1121773 1136781 1208733
14603 1208733 1208310 1150253 1139154 1136503 1168246 1193272 1166674 1139634 1122900 1131078 1140167 1156466
14591 1156466 1154978 1155075 1165664 1187455 1150810 1131870 1174592 1169280 1162561 1149317 1154120 1167638 1130223
14578 1130223 1144877 1144847 1158263 1173481 1177325 1181209 1162792 1159604 1145292 1164971 1176084 1153996
14566 1153996 1162252 1180356 1168568 1151931 1132768 1136357 1129162 1125001 1141159 1126272 1124690 1131063
14554 1131063 1116889 1127348 1154586 1190935 1181418 1148520 1119878 1088584 1130152 1162812 1158085 1170963
14542 1170963 1180684 1149943 1136021 1147515 1125159 1154687 1177432 1172839 1143820 1153499 1166550 1170181
14530 1170181 1180925 1162743 1146831 1148922 1148106 1166213 1155101 1138044 1103486 1159375 1157496 1189052
14518 1189052 1187963 1196548 1171593 1163749 1187906 1175543 1179154 1159761 1196786 1199453 1180699 1193297
14506 1193297 1170645 1158160 1178152 1172263 1175887 1190751 1165942 1163636 1173227 1157449 1165059 1170368
14494 1170368 1135724 1155367 1191925 1192851 1176549 1147941 1155147 1170300 1198791 1187019 1164715 1146527
14482 1146527 1185112 1207012 1205475 1185357 1171783 1165945 1156036 1130434 1159544 1187337 1159875 1157495
14470 1157495 1157077 1180601 1184239 1202049 1178628 1145916 1163868 1139473 1138064 1163856 1139947 1149618
14458 1149618 1158943 1166728 1210427 1204082 1219394 1179815 1157307 1166750 1178362 1178078 1195750 1166069
14446 1166069 1171183 1164571 1144493 1165998 1162209 1148286 1164491 1189695 1189491 1197694 1209030 1202004 1181829
14433 1181829 1167952 1164887 1170292 1186824 1184250 1181588 1180508 1177127 1136931 1148434 1168865 1167707 1169700
14420 1169700 1170490 1181512 1173689 1166527 1157439 1156325 1192946 1224998 1198353 1165267 1174173 1190216 1205585
14407 1205585 1192759 1186249 1195288 1178081 1186202 1209380 1192963 1176067 1187316 1157903 1183470 1159937
14395 1159937 1170278 1187491 1187598 1218096 1217381 1209533 1186681 1180742 1177444 1197596 1197435 1162514 1182055
14382 1182055 1214511 1185375 1161446 1188181 1213359 1191605 1207733 1217735 1195376 1194988 1198926 1183950
14370 1183950 1196531 1189252 1182923 1206769 1185260 1172518 1161712 1156048 1148843 1200364 1215400 1172795
14358 1172795 1197891 1177163 1141237 1176517 1203419 1196059 1172969 1172844 1147248 1170524 1197608 1179593
14346 1179593 1163409 1180246 1191009 1176028 1175892 1148987 1151914 1158032 1182749 1189037 1173608 1175405
14334 1175405 1192393 1203559 1188766 1148498 1131387 1184883 1188158 1191412 1172069 1167790 1144430 1120989
14322 1120989 1157422 1183653 1196035 1197907 1193356 1179988 1174223 1186675 1214298 1224109 1183673 1165318
14310 1165318 1174413 1190179 1179998 1201128 1214792 1203822 1196116 1207377 1201560 1205973 1266537 1209638
14298 1209638 1226589 1237257 1229268 1223647 1210599 1214359 1198315 1186856 1195015 1190709 1192734 1187698 1208244
14285 1208244 1194448 1179539 1225145 1198090 1177273 1203774 1212905 1196831 1173485 1148974 1184531
14274 1184531 1200034 1212230 1220839 1196812 1168232 1186917 1214465 1203799 1200889 1191673 1211078 1178306
14262 1178306 1164807 1202118 1191425 1190602 1189733 1194179 1203126 1216097 1185144 1191408 1214051 1208604 1200908
14249 1200908 1219162 1196666 1225437 1215251 1230320 1238895 1201061 1204823 1210886 1217771 1209286 1224292
14237 1224292 1210660 1182733 1184646 1208470 1227852 1210553 1232870 1257771 1199377 1185377 1211507
14226 1211507 1221642 1238787 1178281 1147171 1162104 1178458 1220151 1222320 1262616 1250774 1250653 1269419
14214 1269419 1262168 1220478 1223864 1196300 1189411 1224918 1214981 1213303 1203838 1218588 1215923 1215563 1235489
14201 1235489 1210811 1200415 1200895 1216541 1209345 1218683 1225902 1239092 1223498 1213570 1181934 1162825
14189 1162825 1212679 1208535 1184395 1178690 1193135 1173319 1180948 1207255 1239172 1225625 1228805 1218847
14177 1218847 1235039 1243538 1178567 1204906 1211799 1191399 1202581 1209733 1197142 1208811 1198921 1222798
14165 1222798 1229537 1219993 1206801 1202371 1225245 1211171 1227955 1203244 1193162 1188968 1220007 1241244
14153 1241244 1228356 1203581 1197787 1235871 1225147 1219955 1210479 1197073 1193082 1174226 1221010 1228793
14141 1228793 1187215 1174254 1180921 1206280 1179963 1185444 1214612 1203042 1209613 1232117 1201512 1229199
14129 1229199 1228955 1214709 1198283 1216362 1230133 1222928 1208957 1212582 1219407 1237041 1244764 1233398
14117 1233398 1217757 1205002 1211945 1217647 1206100 1232751 1254481 1254766 1257370 1251264 1223316 1236015
14105 1236015 1260387 1251134 1236381 1212810 1241808 1254373 1215205 1179666 1194873 1196704 1239345 1240282
14093 1240282 1238234 1235926 1256097 1231201 1248900 1258449 1271344 1251421 1216739 1209007 1189379 1177443
14081 1177443 1206528 1235057 1215730 1209176 1181450 1209252 1250217 1242589 1251805 1231756 1227146 1253229
14069 1253229 1255087 1238134 1229711 1250052 1264325 1241592 1207668 1202752 1216177 1212249 1209560 1206137
14057 1206137 1225861 1229773 1213081 1242540 1232386 1222321 1250538 1236279 1219047 1238705 1256175
14046 1256175 1247704 1217289 1229697 1258650 1268101 1226010 1243845 1281020 1250610 1242712 1241115 1228550
14034 1228550 1216109 1239089 1262907 1211441 1193640 1239336 1226257 1250491 1267444 1262021 1276044
14023 1276044 1276004 1257539 1228784 1188948 1221746 1213238 1240541 1242036 1254583 1246114 1223794 1258664
14011 1258664 1245637 1228923 1243339 1240133 1245741 1242635 1203770 1201574 1200522 1193353 1238086 1276527
13999 1276527 1250380 1254518 1264196 1239915 1223757 1219677 1215546 1219270 1248398 1255390 1194754 1220690
13987 1220690 1236766 1226848 1233110 1247215 1240784 1255425 1245175 1243454 1238541 1272644 1258773 1222238
13975 1222238 1251509 1252627 1242658 1249697 1242387 1253848 1250205 1249622 1225043 1246564 1249985 1232662 1231623
13962 1231623 1230507 1227761 1233591 1225553 1206275 1252215 1263218 1250333 1277145 1243735 1215810 1216687
13950 1216687 1223510 1242138 1275670 1267131 1229060 1248530 1241947 1210149 1236781 1243861 1259513 1281565
13938 1281565 1285650 1270434 1264368 1271581 1274271 1281527 1290525 1286417 1292290 1274122 1262970 1239073 1263509
13925 1263509 1262403 1250335 1279670 1277276 1273439 1270761 1261726 1241204 1236925 1253387 1244627 1229612 1225702
13912 1225702 1257616 1301525 1257896 1267821 1247907 1270121 1281471 1266495 1234619 1237276 1258489 1290557
13900 1290557 1251176 1310081 1296779 1260219 1256344 1239598 1235753 1265549 1275242 1260537 1236720 1250251
13888 1250251 1281208 1270389 1256183 1227678 1234975 1190886 1195979 1220666 1219278 1217862 1263902 1288690
13876 1288690 1254363 1219006 1233660 1234609 1245880 1267659 1282395 1320166 1288031 1282139 1280200 1255667
13864 1255667 1237907 1231674 1256823 1269213 1272873 1278254 1275412 1240512 1230536 1238626 1218953 1213661 1247138
13851 1247138 1255268 1282940 1285290 1292524 1311587 1289829 1286419 1292624 1280127 1285310 1276509 1271216 1271320
13838 1271320 1300014 1263240 1263139 1290106 1244730 1241356 1229320 1233086 1263466 1281951 1260845 1282073
13826 1282073 1290823 1290518 1276160 1260871 1268915 1269208 1290903 1247627 1241099 1250192 1277372 1310510 1274032
13813 1274032 1260043 1254861 1224460 1241815 1242395 1254996 1277319 1261506 1276393 1263333 1267162 1284690
13801 1284690 1261802 1253432 1256341 1242151 1271813 1279412 1273513 1291501 1259158 1275099 1310208 1294671
13789 1294671 1250705 1267516 1305662 1287257 1268431 1250964 1269187 1292810 1288305 1280837 1288535 1258045
13777 1258045 1307211 1298250 1289973 1241306 1218671 1232998 1270365 1271838 1282455 1292921 1276535 1278548
13765 1278548 1285592 1319859 1308743 1324580 1344971 1296835 1277982 1291130 1279157 1289784 1291527 1303879
13753 1303879 1323429 1313337 1312091 1300516 1324323 1333773 1305401 1327107 1285319 1293973 1300508 1306389
13741 1306389 1292753 1290431 1273665 1293982 1321823 1307583 1286502 1275733 1302222 1309710 1276175 1314050
13729 1314050 1353841 1329686 1327515 1303883 1278189 1330925 1325997 1294223 1282527 1301200 1277777 1287431
13717 1287431 1296559 1312992 1315500 1297095 1298478 1315857 1319233 1314958 1282427 1285073 1299793 1317757
13705 1317757 1323975 1295738 1277651 1275744 1259048 1277573 1293187 1297582 1295527 1277580 1309023 1339041
13693 1339041 1327876 1303127 1305115 1304381 1323549 1328723 1323689 1304281 1312111 1298292 1281344 1294492
$$ [...]
##END NTUPLES=NMR SPECTRUM
##END=
