##TITLE=1H_EC-3296(IV-1)
 CDCl3
 8 sc, 
 8.6.2023
##JCAMPDX= 6.0         $$ Bruker NMR JCAMP-DX V2.0
##DATA TYPE= NMR SPECTRUM
##DATA CLASS= NTUPLES
##ORIGIN= UXNMR, Bruker Analytische Messtechnik GmbH
##OWNER= root
$$ XWIN-NMR		Version 3.5
$$ Thu Jun  8 14:26:08 2023 Russian Standard Time (UT+4h)  she@DPX200
##.OBSERVE FREQUENCY= 200.13135
##.OBSERVE NUCLEUS= ^1H
##.ACQUISITION MODE= SIMULTANEOUS
##.ACQUISITION SCHEME= undefined
##.AVERAGES= 8
##.DIGITISER RES= 18
##SPECTROMETER/DATA SYSTEM= spect
##.PULSE SEQUENCE= zg30
##.SOLVENT NAME= CDCl3
##.SHIFT REFERENCE= (INTERNAL, CDCl3, 0, 15.77)
##AUDIT TRAIL= $$ (NUMBER, WHEN, WHO, WHERE, WHAT)
$$ ##TITLE= Audit trail, XWIN-NMR		Version 3.5
$$ ##JCAMPDX= 5.01
$$ ##ORIGIN= Bruker BioSpin GmbH
$$ ##OWNER= she
$$ F:/spectra/data/she/nmr/H-F/1/pdata/1/auditp.txt
$$ ##AUDIT TRAIL=  $$ (NUMBER, WHEN, WHO, WHERE, WHAT)
(   1,<2023-06-08 14:25:06.06 +0400>,<she>,<DPX200>,
      <created by zg, POWCHK disabled, PULCHK disabled
       configuration hash MD5:
       00 E9 B6 7A A2 85 ED C7 34 08 36 98 17 FE 4E 26
       data hash MD5: 16K
       B0 C4 51 95 4C C3 BC 42 4E 29 4C 9F 3A 2E 85 F4>)
(   2,<2023-06-08 14:25:08.73 +0400>,<she>,<DPX200>,
      <Start of raw data processing
       efp BC_mod = 2 LB = 0.24 FT_mod = 6 PKNL = 1 PHC0 = -20264.89 PHC1 = 9.45272 SI = 16K 
       data hash MD5: 16K
       F1 6D C4 BF 62 CE 75 73 AE 63 B0 3C 27 7F 18 B2>)
(   3,<2023-06-08 14:25:23.07 +0400>,<she>,<DPX200>,
      <pk PHC0 = -1.302904 PHC1 = 2 
       data hash MD5: 16K
       65 9F 4D FE 59 ED 22 A5 BF 11 46 23 61 DC 5F 6B>)
(   4,<2023-06-08 14:25:26.45 +0400>,<she>,<DPX200>,
      <abs ABSG = 5 
       data hash MD5: 16K
       93 61 22 25 B9 42 DB 7F 1E 32 19 0C E8 D0 AC 33>)
$$ ##END=
$$ 
$$ hash MD5
$$ 41 EB E0 E7 9F B7 BC 67 B9 15 33 CD 01 88 C5 AB
##$RELAX= 
##$RELAX= 
##$RELAX= 
##$RELAX= 
##$RELAX= 
##$RELAX= 
$$ Bruker specific parameters
$$ --------------------------
##$DU= <F:/spectra>
##$EXPNO= 1
##$NAME= <H-F>
##$PROCNO= 1
##$TYPE= <nmr>
##$USER= <she>
##$AMP= (0..31)
100 100 100 100 100 100 100 100 100 100 100 100 100 100 100 100 100 100 
100 100 100 100 100 100 100 100 100 100 100 100 100 100 
##$AQSEQ= 0
##$AQ_mod= 1
##$AUNM= <au_zg>
##$AUTOPOS= <>
##$BF1= 200.13
##$BF2= 200.13
##$BF3= 200.13
##$BF4= 200.13
##$BF5= 200.13
##$BF6= 200.13
##$BF7= 200.13
##$BF8= 200.13
##$BYTORDA= 1
##$CFDGTYP= 0
##$CFRGTYP= 5
##$CHEMSTR= <none>
##$CNST= (0..31)
1 1 145 1 1 1 1 1 1 1 1 1 1 1 1 1 1 1 1 1 1 1 1 1 1 1 1 1 1 1 1 1 
##$CPDPRG= <>
##$CPDPRG1= <>
##$CPDPRG2= <>
##$CPDPRG3= <>
##$CPDPRG4= <mlev>
##$CPDPRG5= <mlev>
##$CPDPRG6= <mlev>
##$CPDPRG7= <mlev>
##$CPDPRG8= <mlev>
##$CPDPRGB= <>
##$CPDPRGT= <>
##$D= (0..31)
0 1.2 0 0 0 0 0 0 0 0.06 0 0.03 0 0 0 0 0.0002 0 0 0 0 0 0 0 0 0 0 0 0 
0 0 0 
##$DATE= 1686219905
##$DBL= (0..7)
120 120 120 120 120 120 120 120 
##$DBP= (0..7)
150 150 150 150 150 150 150 150 
##$DBP07= 0
##$DBPNAM0= <>
##$DBPNAM1= <>
##$DBPNAM2= <>
##$DBPNAM3= <>
##$DBPNAM4= <>
$$ [...]
##$SUBNAM3= <"">
##$SUBNAM4= <"">
##$SUBNAM5= <"">
##$SUBNAM6= <"">
##$SUBNAM7= <"">
##$SUBNAM8= <"">
##$SUBNAM9= <"">
##$SW= 18.05172834244
##$SWIBOX= (0..15)
0 0 2 0 0 0 0 0 0 0 0 0 0 0 0 0 
##$SW_h= 3612.71676300578
##$TD= 16384
##$TD0= 1
##$TE= 0
##$TE2= 300
##$TE3= 300
##$TEG= 300
##$TL= (0..7)
0 120 120 120 120 120 120 120 
##$TP= (0..7)
150 150 150 150 150 150 150 150 
##$TP07= 0
##$TPNAME0= <>
##$TPNAME1= <>
##$TPNAME2= <>
##$TPNAME3= <>
##$TPNAME4= <>
##$TPNAME5= <>
##$TPNAME6= <>
##$TPNAME7= <>
##$TPOAL= (0..7)
0.5 0.5 0.5 0.5 0.5 0.5 0.5 0.5 
##$TPOFFS= (0..7)
0 0 0 0 0 0 0 0 
##$TUNHIN= 0
##$TUNHOUT= 0
##$TUNXOUT= 0
##$USERA1= <user>
##$USERA2= <user>
##$USERA3= <user>
##$USERA4= <user>
##$USERA5= <user>
##$V9= 5
##$VALIST= <valist>
##$VCLIST= <CCCCCCCCCCCCCCC>
##$VD= 0
##$VDLIST= <DDDDDDDDDDDDDDD>
##$VPLIST= <PPPPPPPPPPPPPPP>
##$VTLIST= <TTTTTTTTTTTTTTT>
##$WBST= 1024
##$WBSW= 4
##$XGAIN= (0..3)
0 0 0 0 
##$XL= 0
##$YL= 0
##$YMAX_a= 460915
##$YMIN_a= -631618
##$ZGOPTNS= <>
##$ZL1= 120
##$ZL2= 120
##$ZL3= 120
##$ZL4= 120
##$ABSF1= 15.78215
##$ABSF2= -2.269699
##$ABSG= 5
##$ABSL= 3
##$ALPHA= 0
##$AQORDER= 0
##$ASSFAC= 0
##$ASSFACI= 0
##$ASSFACX= 0
##$ASSWID= 0
##$AUNMP= <proc_1d>
##$AZFE= 0.1
##$AZFW= 0.1
##$BCFW= 0
##$BC_mod= 2
##$BYTORDP= 0
##$COROFFS= 0
##$CY= -3
##$DATMOD= 1
##$DC= 0
##$DFILT= <>
##$DTYPP= 0
##$F1P= 0
##$F2P= 0
##$FCOR= 1
##$FTSIZE= 16384
##$FT_mod= 6
##$GAMMA= 0
##$GB= 0
##$INTBC= 1
##$INTSCL= 3.70164e-10
##$ISEN= 128
##$LB= 0.24
##$LEV0= 0
##$LPBIN= 0
##$MAXI= 10000
##$MC2= 0
##$MEAN= 0
##$ME_mod= 0
##$MI= 1.114404
##$NCOEF= 0
##$NC_proc= -4
##$NLEV= 6
##$NOISF1= 3.799351
##$NOISF2= 2.8
##$NSP= 0
##$NTH_PI= 0
##$NZP= 0
##$OFFSET= 15.77003
##$PC= 1
##$PHC0= -20266.19
##$PHC1= 11.45272
##$PH_mod= 1
##$PKNL= yes
##$PPARMOD= 0
##$PSCAL= 0
##$PSIGN= 0
##$REVERSE= no
##$SF= 200.130000302399
##$SI= 16384
##$SIGF1= 3
##$SIGF2= 2
##$SINO= 5.538805
##$SIOLD= 16384
##$SREGLST= <1H.CDCl3>
##$SSB= 0
##$STSI= 16384
##$STSR= 0
##$SW_p= 3612.71676300578
##$SYMM= 0
##$S_DEV= 0
##$TDeff= 16384
##$TDoff= 0
##$TI= <>
##$TILT= no
##$TM1= 0
##$TM2= 0
##$TOPLEV= 0
##$USERP1= <user>
##$USERP2= <user>
##$USERP3= <user>
##$USERP4= <user>
##$USERP5= <user>
##$WDW= 1
##$XDIM= 16384
##$YMAX_p= 421837346
##$YMIN_p= -137980
$$ End of Bruker specific parameters
$$ ---------------------------------
##NTUPLES= NMR SPECTRUM
##VAR_NAME=  FREQUENCY,     SPECTRUM/REAL,   SPECTRUM/IMAG
##SYMBOL=    X,             R,               I
##VAR_TYPE=  INDEPENDENT,   DEPENDENT,       DEPENDENT
##VAR_FORM=  AFFN,          ASDF,            ASDF
##VAR_DIM=   16384,         16384,           16384
##UNITS=     HZ,            ARBITRARY UNITS, ARBITRARY UNITS
##FACTOR=    0.220516191357247, 1,           1
##FIRST=     3156.05611300515, 0,            0
##LAST=      -456.660650000626, 0,           0
##MIN=       -456.660650000626, -137980,     0
##MAX=       3156.05611300515, 421837346,    0
$$ Real data points
##PAGE= N=1
##DATA TABLE= (X++(R..R)), XYDATA
$$ [...]
6732I554K1065m914j0082L982l371q044k926n130k578M1592k2378o014P885K97
6718A8938J8216L177l5930m905Q727j1068K1748J9637o205K8440L9365l1552k1886
6705D6702J417J5008j115J2872j1315k3593n514J4016J125j7569k6731j3697O248
6692b146n305j4869K1025n721k8444j0407m225J7445J040R216j9030J89J2064
6679b9168j044J5297l5774J6022k411n220L995r564J9036L202j3380L7000J2529
6666A0520k0941J957l9676k3687K1231J6677M254R269j4116j6233K3522j3466
6654d0689l250K6799J4454p797k2793j2227m063J0394O549K7558J5255k5880m474
6641b0164O820k04p573j1944o549P122R918Q287k0599j4090O75p82Q991J6134
$$ plain form
6732 9554 30619 25705 15623 19605 16234 8190 5264 134 -2444 39148 16770 10756 18641 18938
6718 18938 37154 40331 4401 -504 8223 -2845 18903 38540 32335 60775 100140 68588 46702
6705 46702 48119 63127 62012 74884 63569 39976 34462 48478 49603 32034 5303 -8394 -2146
6692 -2146 -7451 -22320 -1295 -7016 -35460 -45867 -50092 -32647 -31607 -22391 -41421 -41232 -29168
6679 -29168 -30212 -14915 -50689 -34667 -37078 -42298 -38303 -47867 -28831 -25629 -39009 -2009 10520
6666 10520 -10421 -8464 -48140 -71827 -50596 -33919 -29665 -20396 -34512 -50745 -27223 -40689
6654 -40689 -43939 -17140 -2686 -10483 -33276 -45503 -49566 -39172 -32623 -5065 10190 -15690 -20164
6641 -20164 -13344 -13548 -21121 -33065 -39614 -32492 -22574 -14287 -34886 -48976 -48301 -49083 -40092 -23958
6627b3958j7657J2706J8092j5552l442n21K784J0272J966l5246M921K0674J2096
6614a2865l416j2675l045j3453J7223J3983J49k7059J536k426J2470L95o224O810
6600b8597q404j4206j5812J7377m207j2069K2111O365J1200qo171J4406J973j6774
6586c2816j3069o340O189O055n903k7213Q424M0049O748K044k6151J8394m129
6573b7718L140j1980j0591j2454j0683p535J3258K2395m099k7064J6699J5191
6561d1441r386K0260N509O223q233J5088j5767N292r049K407Q515k6426K6362
6548b0646m201J6492J1669k9682j8890K1657p234n247q638k741L4632k6050j9879
6535e8758L1598k180K170k004j2189j3799k877j0020K1386K4801q275l130Q016
$$ plain form
6627 -23958 -41615 -28909 -10817 -26369 -29811 -30332 -27548 -17276 -15310 -50556 -45635 -24961 -12865
6614 -12865 -16281 -28956 -32001 -45454 -28231 -14248 -14099 -41158 -39622 -42048 -29578 -29183 -35407 -28597
6600 -28597 -37001 -51207 -67019 -49642 -53849 -65918 -43807 -37442 -26242 -26250 -32421 -18015 -16042 -32816
6586 -32816 -45885 -52225 -46036 -39981 -45884 -73097 -64673 -24624 -17876 -15832 -41983 -23589 -27718
6573 -27718 -24578 -36558 -47149 -59603 -70286 -77821 -64563 -42168 -46267 -73331 -56632 -41441
6561 -41441 -50827 -30567 -25058 -18835 -27068 -11980 -27747 -22455 -31504 -29097 -20582 -47008 -20646
6548 -20646 -24847 -8355 3314 -26368 -45258 -23601 -30835 -36082 -44720 -47461 -12829 -38879 -58758
6535 -58758 -27160 -29340 -27170 -29174 -41363 -55162 -58039 -68059 -46673 -21872 -30147 -33277 -25261
6522b5261j6380j6009J5069K9310L307l2163L746K3021k9126K3781N050p721J9822
6509c554j1508J570j2368J1227J9246J6316k7948M101j6177k3542n30m499N083
6496d2583J2862L339k6892j3520J1322j0745L746N134m13o024J2237l0615j4622
6483i6774J9182r74K4571K0851j2773l564n570j8488J9306J0938O659r665k5693
6470g1994o16K0642L463j0490j8110J856L3651r251L597K9167k1678J3227l012
6457b9548l4877O994k502J5642O148J532j1330p852J1528P037r740N32P180q520
6443d7776q987Q27J2459k6506j8247P512K8657l947j2457P319J5406K6212q012
6430b7540m0243n114j3135k8355N0754J114P172O846n144N422p937K9635j4209
$$ plain form
6522 -25261 -41641 -57650 -42581 -13271 -9964 -42127 -38381 -15360 -44486 -20705 -15655 -23376 -3554
6509 -3554 -15062 -13492 -25860 -14633 4613 20929 -7019 -2918 -19095 -42637 -43167 -47666 -42583
6496 -42583 -29721 -26382 -53274 -66794 -55472 -66217 -62471 -57337 -57750 -63774 -51537 -82152 -96774
6483 -96774 -77592 -78566 -53995 -33144 -45917 -49481 -55051 -73539 -54233 -43295 -36636 -46301 -71994
6470 -71994 -72610 -51968 -48505 -58995 -77105 -75249 -41598 -50849 -47252 -18085 -39763 -26536 -29548
6457 -29548 -64425 -57431 -59933 -44291 -38143 -36611 -47941 -55793 -44265 -37228 -46968 -46436 -39256 -47776
6443 -47776 -56763 -55936 -43477 -69983 -88230 -80718 -52061 -56008 -68465 -61146 -45740 -19528 -27540
6430 -27540 -67783 -72897 -86032 -114387 -63633 -62519 -55347 -48501 -53645 -48223 -56160 -26525 -40734
6417d0734K37j6424J424L1846k4487o869R387k972J8537Q588l2351p917K4182
6404c7553l732l6278R215K2116k420J4011M985N696r931n325p148l006j0569M904
6390e5035J4765n631N323k5322J7338l632L39N491k1024l83L2704M948l5475K2265
6376d3329J0743j2618K6366j8075j9064j8741L7690M579J4678j0058p545J8267
6364a7107k3785k0703k405O785K1434J7488j7741j2167P646K8550k8345j0380
6352e0730j1855j0166l371M592j4576K2420L021J7368M663J3596j115J53k7731
6339e3731j4544K8925R894k263j1715P797R485l9914k7560J6919K4373k984r616
6326f4934K4614J8078l2960j4881j6885K2350K6924R944l82j2120o971J0976M901
$$ plain form
6417 -40734 -40497 -56921 -55497 -23651 -48138 -55007 -45620 -48592 -30055 -21467 -53818 -61735 -37553
6404 -37553 -41285 -77563 -68348 -46232 -48652 -34641 -29656 -23960 -33891 -39216 -46364 -49370 -59939 -55035
6390 -55035 -40270 -45901 -40578 -65900 -48562 -52194 -51855 -46364 -67388 -67771 -35067 -30119 -65594 -43329
6376 -43329 -32586 -45204 -18838 -36913 -55977 -74718 -37028 -32449 -17771 -27829 -35374 -17107
6364 -17107 -40892 -61595 -64000 -57215 -35781 -18293 -36034 -48201 -40555 -12005 -40350 -50730
6352 -50730 -62585 -72751 -76122 -71530 -86106 -63686 -60665 -43297 -38634 -25038 -26153 -26000 -53731
6339 -53731 -68275 -39350 -29456 -31719 -43434 -35637 -26152 -66066 -93626 -76707 -52334 -55318 -64934
6326 -64934 -40320 -22242 -55202 -70083 -86968 -64618 -37694 -27750 -28132 -40252 -47223 -36247 -31346
6313c1346j2565N387n140N532j2683K963j594J1212K095k5508L545M657J3831
6300c9614o280q557Q641R381j3359j065J5207p160k9309j3050L5383J2154J532
6287c6096o410k6623l067K6263j6561K6664K4708m994k2583n003J758k2904N301
6274e9547q559K5801L724P14n077j7806N908J2512J5742j4075N437P807J8201
6261i218j4998p162j5174l582r770n252M1753M689j3708Q930j0172j9364j6336
6248f9364K1554l553K6602j7583J0943q794K0539k0132m581J1505n519J5814N097
6235a7472O327l4771r478r392J1234J1110J5399l411K243K4431q069j6036J0087
6222a7798J6927j9375k691N721o513K6932k4636j9238k0055m83J6369j9602o254
$$ plain form
6313 -31346 -43911 -38524 -43664 -38132 -50815 -47852 -49446 -38234 -36139 -61647 -58102 -53445 -39614
6300 -39614 -45894 -54451 -45810 -36429 -49788 -50853 -35646 -42806 -72115 -85165 -49782 -37628 -36096
6287 -36096 -42506 -69129 -72196 -45933 -62494 -35830 -11122 -16116 -38699 -43702 -41944 -64848 -59547
6274 -59547 -68106 -42305 -38581 -37867 -42944 -60750 -54842 -42330 -26588 -40663 -35226 -27419 -9218
6261 -9218 -24216 -31378 -46552 -50134 -59904 -65156 -23403 -18714 -32422 -23492 -33664 -53028 -69364
6248 -69364 -47810 -51363 -24761 -42344 -31401 -40195 -19656 -39788 -44369 -32864 -38383 -22569 -17472
6235 -17472 -11145 -45916 -55394 -64786 -53552 -42442 -27043 -30454 -28211 -3780 -11849 -27885 -17798
6222 -17798 -871 -20246 -22937 -17216 -23729 3203 -21433 -40671 -60726 -61209 -44840 -64442 -70696
6209g0696L8236O941k3013j5705K3643L5712j3866L814l5425r886L5440k0256
6197d5061j3J1950r607J2647j162j2821M987l4605j832L3234Q993J21j0481N777
6183c7873J9334l9446O921j00j27j3975J4823L2587R724k8062P820l0095J2647
6170d5822k17k9921k5283L2977j605j908J4860P006M949L405P247J350r912J69
6156d2705n39P49R320K834N770k3519l896j2995J6720N375L2175k1902k2016j3287
6142f7916N384K130o913K8419k504N748K998k6863J4548P04j5686O59J1560o893
6128e4625R828r723R639K4396L52o656L430j3456j3857J4806j787K1188j6438
6115c2903j0636R990j1373j8430l0565L1611j0617J7115J9080J2588O12k2012
$$ plain form
6209 -70696 -32460 -25519 -48532 -64237 -40594 -4882 -18748 -14934 -50359 -60245 -24805 -45061
6197 -45061 -45074 -33124 -42731 -30084 -31246 -44067 -39080 -73685 -75517 -42283 -33290 -33169 -43650 -37873
6183 -37873 -18539 -57985 -51064 -51164 -51291 -65266 -50443 -17856 -8132 -36194 -28374 -58469 -45822
6170 -45822 -46039 -75960 -101243 -68266 -69871 -71779 -56919 -49913 -44964 -41559 -34312 -32962 -42874 -42705
6156 -42705 -43244 -42495 -33175 -30341 -24571 -48090 -51986 -64981 -48261 -42886 -10711 -32613 -54629 -67916
6142 -67916 -62532 -60402 -67315 -38896 -41400 -35652 -32654 -59517 -44969 -44265 -59951 -59292 -47732 -54625
6128 -54625 -44797 -54520 -44881 -20485 -20133 -26789 -23359 -36815 -50672 -35866 -37653 -16465 -32903
6115 -32903 -43539 -33549 -44922 -63352 -93917 -62306 -72923 -55808 -36728 -24140 -23528 -45540
6103d5540R677K433j2192j5605J9605K7069j4553m064j9442j0304L0604K4100
6091h212j700Q904m4139o420J2803j1232K9469o42j8355q267k492M612N788J1728
6077b8155j0856j2269L4477K5168j9775r673j2604k2591q00J2794J9727n093J2377
6064a7273j034j5872j5767q321J7614R156K0066j9153k3819K4904J2258k4109
6052d1350l757j4287J3282J8947j2628P12j6361K289o924L0192j0390N200R656
6039b5419j1285j5218J4343K7538j835o584q063K3675l594L908k8583j947j314
6026c4378L414J2706J4028O364l800J134n679M849l4394P100K1505n074k6642
6013c8867r26J0548L2484k6488j6425L712R607j1975J6725l844j541q615j323
$$ plain form
6103 -45540 -35863 -33430 -45622 -61227 -41622 -14553 -29106 -33170 -52612 -62916 -32312 -8212
6091 -8212 -9912 -1008 -45147 -51567 -38764 -49996 -20527 -21169 -39524 -47791 -50283 -45671 -39883 -28155
6077 -28155 -39011 -51280 -16803 8365 -11410 -21083 -33687 -56278 -57078 -44284 -24557 -29650 -17273
6064 -17273 -18307 -34179 -49946 -58267 -40653 -31497 -11431 -30584 -54403 -29499 -17241 -41350
6052 -41350 -45107 -59394 -46112 -27165 -39793 -39081 -55442 -53153 -60077 -29885 -40275 -35075 -25419
6039 -25419 -36704 -51922 -37579 -10041 -11876 -18460 -26523 -2848 -6442 -2534 -31117 -33064 -34378
6026 -34378 -30964 -18258 -4230 2134 -1666 -532 -6211 -1362 -35756 -28656 -7151 -12225 -38867
6013 -38867 -39793 -29245 3239 -23249 -39674 -35962 -26355 -38330 -21605 -25449 -26990 -35605 -36928
6000c6928P521j9767K079L2543K881p626M652j0895o494k0216R220J7904J2720
5987a2406o500k702J2766o829m904J893p164p078m505J3184o787j0725J328J736
5973c8693J1220J6038j1329n217N990j5955J0740J3015J1040J3203l0420k7808
5961d8176K8654m424Q87L4184l826l879l171k487j8949l0397J0962K6463J3663
5948d96P39j4768J2922q464k1491J1053k224k1106L4236J1302j3748R985M612
5935B552m4653M439K6325R019J7306j5277l5147J3367o233k251J0111k779q655
5922c1876j1231J50K7582r095J564J945m150k7927n805K1119K2477m476m397K5869
5908A749j5838j5645J40m3K960N70R308J0669k2827K6791J421k1985K6643n89
$$ plain form
6000 -36928 -29407 -49174 -47095 -14552 -11671 -19297 -14645 -25540 -32034 -52250 -43030 -25126 -12406
5987 -12406 -18906 -21608 -8842 -15671 -20575 -18682 -25846 -32924 -37429 -24245 -31032 -41757 -40429 -38693
5973 -38693 -27473 -11435 -22764 -27981 -21991 -37946 -27206 -14191 -3151 10052 -20368 -48176
5961 -48176 -19522 -23946 -23059 11125 7299 3420 249 -2238 -21187 -51584 -40622 -14159 -496
5948 -496 243 -14525 -1603 -10067 -31558 -20505 -22729 -43835 -9599 1703 -12045 -2060 2552
5935 2552 -42101 -37662 -11337 -2318 14988 -289 -35436 -22069 -28302 -30553 -20442 -23221 -31876
5922 -31876 -43107 -42957 -15375 -24470 -22906 -20961 -25111 -53038 -58843 -37724 -15247 -19723 -24120 1749
5908 1749 -14089 -29734 -29594 -29637 -26677 -26107 -16799 -6130 -28957 -2166 -745 -22730 3913 3324
5894C324L942k4809J5567P346j4362l206r764K22J7161R879P835m668k604n837
5880B6m4709L4407N325j5199J687J2812p41R17p318J5716R030K5746j1955k7674
5866a930J5765n953J597J496j6977J0321K4947J9584k9306p757l3795K8089Q049
5853A4130J8473j9062p122J4044M730P641q258k442j7653j2158J7082J7332j7308
5840I429J4559K490j403k7237K0615K7788j388n569o947j1138Q240K2464J5688
5827F7591K3197k8516k3307m004l8974K5153L237j8341Q86Q929o282L4706L045
5814D7320k6496k8089N26Q43J1052L0516K0685j7585p763J0449l701m057L939
5801C7639J3678O688P642r250J3043l251J3484K0182l3328k9597k4684Q101j0437
$$ plain form
5894 3324 7266 -17543 -1976 5370 -8992 -12198 -21962 -21740 -4579 5300 13135 8467 5863 26
5880 26 -44683 -10276 -4951 -20150 -18463 -5651 -6392 -5475 -12793 2923 11953 37699 25744 -1930
5866 -1930 13835 7882 9479 10975 -6002 4319 29266 48850 19544 11787 -22008 6081 14130
5853 14130 32603 13541 6419 20463 25193 32834 24576 22134 4481 -7677 9405 26737 9429
5840 9429 23988 26478 25075 -2162 18453 46241 44853 39284 32337 21199 29439 51903 67591
5827 67591 90788 62272 38965 34961 -4013 21140 24377 6036 6922 15851 9569 44275 47320
5814 47320 20824 -7265 -6739 -5896 5156 35672 56357 38772 31009 41458 37757 33700 37639
5801 37639 51317 58005 65647 56397 69440 66189 79673 99855 66527 36930 12246 20347 9910
5788I910K6112K3449l1649l561L241j1235l0829J5593j4786J684N258J846K1782
5775A6815J5026r787k2445r958p042K086J1503J0952J0998J5672j213M267l053
5762C3821j3707j8828r938R744K3667J4848m6142J5018O170n850J025j0070P388
5749G146k2441j5892K4952N089k9137J6855K0657m891l503j173N01p634M916j0808
5735a5363o672K2356q492o287J4169q795J044j2845j7934J6501Q015K3331N294
5722A4322k7456n998o465j0878L4441O723l2608K7482j4973r089M0664o329K911
5709A2747k110j1312k2509J6715J7167N517k5053j2428O543l688O803J4736m569
5696a441k867j2371j405J3603J3561l499j5414K424Q687J2846j0946Q760J3471
$$ plain form
5788 9910 36022 59471 27822 24261 27502 16267 -14562 1031 -13755 -12071 -6813 -4967 16815
5775 16815 31841 22054 -391 -10349 -17391 -15305 -3802 7150 18148 33820 32607 36874 33821
5762 33821 20114 1286 -8652 1092 24759 39607 -6535 8483 14653 8803 9828 -242 7146
5749 7146 -15295 -31187 -6235 -1146 -30283 -13428 7229 2338 -1165 -2338 -1837 -9471 -4555 -15363
5735 -15363 -22035 321 -8171 -14458 -289 -9084 -8040 -20885 -38819 -22318 -14303 9028 14322
5722 14322 -13134 -19132 -25597 -36475 -2034 4689 -27919 -437 -15410 -24499 16165 9836 12747
5709 12747 10637 -675 -23184 -6469 10698 16215 -8838 -21266 -14723 -18411 -11608 3128 -1441
5696 -1441 -4308 -16679 -18084 -4481 9080 5581 -9833 -7409 1278 14124 3178 11938 25409
5683B5409j5916J9651j3489P55L384K277k097k9317M715j4121O930L3475k83j4800
5669F573J2949K3931k4297J0783J494j4429P746j820k703j8901L027P747J7878
5656B9978O400m4597r0j0280q493K2353j8559J0105m129k965J0946L8174j8756
5643A0087j8233J9332k030j6871J8291q977m848J0868O26k752J5986P701k4039
5630E141k447P266k405R77j4643k4802L889K2357J1227j4970j6871J2707r035
5617b1609M955J5780J9192L663J5295k6317P216Q34k5197Q281L0119K3418k0340
5604C5290j3260j4509j9939K6027K1217j7079n36J6433N307n1605L1791M002J5213
5591C8352K504k2966K2508N148k0934m069K3706o161r299k5244O239M010J5274
$$ plain form
5683 25409 9493 29144 15655 16410 19794 22071 19974 -9343 -4628 -18749 -11819 21656 21373 6573
5669 6573 19522 43453 19156 29939 31433 17004 24750 22930 20227 1326 4353 12100 29978
5656 29978 36378 -8219 -8309 -18589 -27082 -4729 -23288 -13183 -17312 -20277 -9331 28843 10087
5643 10087 -8146 11186 9156 -7715 10576 1599 -3249 7619 8245 5493 21479 29180 5141
5630 5141 2694 9960 7555 8532 -6111 -30913 -27024 -4667 6560 -8410 -25281 -12574 -21609
5617 -21609 -16654 -874 18318 21981 37276 10959 18175 19009 -6188 2093 32212 55630 35290
5604 35290 22030 7521 -12418 13609 34826 17747 17211 33644 38951 -12654 19137 23139 38352
5591 38352 40856 17890 40398 45546 24612 20543 44249 38088 28789 3545 9784 13794 29068
5578B9068Q16j8642p038M491O836m997p217O648J9719j2994J2924J432M367N419
5564D0832j4716r377q287p314J8226K090r725l246L0202L16p621m116q624M885
5550B3525K21l4801J2194j3006j6736J5152O126R584J9658O099J4665j1632N296
5537C6345K7819Q303k9670j2011j2953R679K1464N966l110m336r707Q32K8767
5524F7388l0269L0335r222l982l386K4957k239N552Q495j5k5384J9904J7760n466
5510I4428R038k1618J8366q168k1471j4048K5955j3630k1608L3678o14k112P472
5497H5668j4224J0030K2537j404j9491j2174j313K611L7924Q767k3596j0902J1389
5484I5822m261J1865N070r467r319l759K2417q908L7056K5497j2129j0189J9817
$$ plain form
5578 29068 29884 11242 4204 8695 15531 10534 3317 9965 29684 16690 29614 31046 35413 40832
5564 40832 26116 16739 8452 1138 19364 21454 11729 8483 38685 39001 31380 27264 18640 23525
5550 23525 23746 -11055 1139 -11867 -28603 -13451 -7325 2259 21917 28016 42681 31049 36345
5537 36345 64164 72467 42797 30786 17833 27512 48976 54942 51832 47496 37789 38621 67388
5524 67388 37119 67454 58232 54250 50864 75821 73582 79134 87629 87614 62230 82134 99894 94428
5510 94428 103466 81848 100214 92046 70575 56527 82482 68852 47244 80922 80308 78196 85668
5497 85668 71444 81474 104011 102607 83116 70942 69629 72240 110164 118931 95335 84433 95822
5484 95822 91561 103426 108496 99029 89710 85951 108368 99460 136516 162013 149884 139695 159512
5471A59512n282J7497K5831N287K4617L4674L6818K8240K0298J9818K8965L1971
5459D28246L2034M0769M046j444J4135j8743n5246n8158j7932p546k7031m1109
5447B92021o0825k7460p923L544R263j7349J0026R254r295k9524J399j2586J5696
5434A76241k969J6804m891j705Q570j1162J0264r685j1887J0071j622O216l0076
5421A54169L099K297K958K4671j463j263j0042J5100j4025m489k7313j020M789
5408A47468m424R68J7685j3579j1163J1749j0509L029O881J1490L890J3414O02
5395A77501J5836J4009r991j3482l9666J5250P187k635M066J9341N675k970J319
5382A91440q664J1201j8121P868J475m512Q721O806j6313M73K5837q221j0355
$$ plain form
5471 159512 154230 171727 197558 202845 227462 262136 298954 327194 347492 367310 396275 428246
5459 428246 460280 501049 505095 503651 517786 499043 443797 385639 367707 360161 333130 292021
5447 292021 231196 203736 195813 199357 208620 191271 201297 210551 201256 171732 173131 160545 176241
5434 176241 173272 190076 185185 183480 192050 180888 191152 181467 169580 179651 178029 184245 154169
5421 154169 157268 159565 162523 187194 185731 184468 174426 189526 175501 171012 143699 142679 147468
5408 147468 143044 144012 161697 148118 136955 148704 138195 141224 148105 159595 163485 176899 177501
5395 177501 193337 207346 197355 183873 144207 159457 166644 164009 168075 187416 193091 190121 191440
5382 191440 182776 193977 175856 183724 185199 180687 189408 196214 179901 180374 206211 197990 187635
5369A87635J7446R158j6176R40J600J0866K0408R350r771M246J1078O916l534
5356B50162K87l6087J9384K6825j5960o524j954j3449J7789J5814p753J5689k0565
5343B43658n602j1465J3427O761k803j682J911J4660L959k4547P814J0903L0572
5330B87566j0108J2691P988j8546M575M496J6978J8790O374k5456J4679k4110
5318B95917J1031M1722l707P91r361P255J3437K20P650k0823m653K105K414M6319
5304C90317M8300p198J2248K0575m586L413K5013J1921J3831L799Q781j155K2577
5291E47836j561P009q449L2973K1337J3832J2023j2566q608O30K7062j1187J007
5278F21338J1897K8916j7608J4379K4804K340M3275J705q469O518K2458J5996
$$ plain form
5369 187635 205081 214239 198063 199003 200603 211469 231877 241227 231456 235702 246780 253696 250162
5356 250162 250449 214362 233746 260571 244611 238087 236133 222684 240473 256287 248534 264223 243658
5343 243658 238056 226591 240018 246779 243976 242294 244205 258865 262824 238277 246091 256994 287566
5330 287566 277458 290149 298137 279591 284166 288662 305640 324430 330804 305348 320027 295917
5318 295917 306948 348670 344963 345754 336393 343648 357085 357305 364955 344132 339479 341584 343998 390317
5304 390317 438617 431419 443667 464242 459656 463069 488082 500003 513834 517633 526414 525259 547836
5291 547836 546275 553284 544835 577808 599145 612977 625000 612434 603826 604456 631518 620331 621338
5278 621338 633235 662151 644543 658922 683726 686066 729341 731046 722577 729095 751553 767549
5266G67549O01J1734J6220L9760J7378m431P829m253J588O766K9248L9066N3071
5253I82126N576K3833M7843L672M6979J6329M5860N5806N1004K0061M6338N0559
5241A395986L4971K4291L5319M5131M0156L9636L4319L317M3443L8852R1738M4614
5229A871773O1547R3615O0347L2720M2216N0665Q5408N2646O2452R7823Q9035
5218B600247Q8129P0697R5675J35306J25883Q4460J24617J22095J61637J49472
5208C758218J43243J42334J36834J16996J27195J31173J56077J42126J26908J78429
5198E159533J43184J43197J69244J73143J84430J57618J59247J87920K15471K21436
5188F914423K13128K17534K53091K97247L05436L09238L68113L48757M20819M69991
$$ plain form
5266 767549 768150 779884 796104 835864 853242 848811 856640 852387 853975 860741 889989 929055 982126
5253 982126 987702 1011535 1059378 1063050 1110029 1126358 1172218 1228024 1279028 1299089 1345427 1395986
5241 1395986 1430957 1455248 1490567 1535698 1575854 1615490 1649809 1653126 1696569 1735421 1827159 1871773
5229 1871773 1933320 2026935 2087282 2120002 2162218 2212883 2298291 2350937 2413389 2511212 2600247
5218 2600247 2688376 2759073 2854748 2990054 3115937 3200397 3325014 3447109 3608746 3758218
5208 3758218 3901461 4043795 4180629 4297625 4424820 4555993 4712070 4854196 4981104 5159533
5198 5159533 5302717 5445914 5615158 5788301 5972731 6130349 6289596 6477516 6692987 6914423
5188 6914423 7127551 7345085 7598176 7895423 8200859 8510097 8878210 9226967 9647786 10117777
5178A0117777N64981O45565P03201Q01683R09316R78561J156744J292696J493765
5169A8664289J691374J919469K227595K562961K956722L443202M071719M941210
5161D2478541N495076N628781N996092O161013N234395L246934J267153n10263
5153G4997722k668797m917919o470881p190055p149713o814343o035617n013581
5145B8736816m073791l230394k526947k004239j615883j340954j131893r43336
5137A1869379p92504o86302o15751n09365m87744m14650m08216l94748l53439
5128G206660l62593l26420l25971l12900k81745k47968k83254k43868j75057k05086
5118D441798k14390j81964j82189j70586j49698j61311j37366j23994j03416j03478
$$ plain form
5178 10117777 10682758 11328323 12031524 12833207 13742523 14721084 15877828 17170524 18664289
5169 18664289 20355663 22275132 24502727 27065688 30022410 33465612 37537331 42478541
5161 42478541 47973617 53602398 59598490 65759503 70993898 74240832 75507985 74997722
5153 74997722 72328925 67411006 60940125 53750070 46600357 39786014 33750397 28736816
5145 28736816 24663025 21432631 18905684 16901445 15285562 13944608 12812715 11869379
5137 11869379 11076875 10390573 9774822 9265457 8777713 8363063 7954847 7560099 7206660
5128 7206660 6844067 6517647 6191676 5878776 5597031 5349063 5065809 4821941 4646884 4441798
5118 4441798 4227408 4045444 3863255 3692669 3542971 3381660 3244294 3120300 3016884 2913406
5108B913406j21616j10170j14118j16661q0863n6954q2903p6486o3162p4735l6720
5097A979018l7511o0489m0830n3164k3979k8006l3990n2101m0803k1866m3144
5086A543135n1282l9202j1520k0893k6185k3985q905l4842m5765k7529l1241o7456
5074A154330q451l3778n7014k8651j9832n1814l5991k2136m1355j5681m105j1933
5062H23589p926j1502q930J1992j963P705m8726m6070l523O663J0298j273k8075
5049G02259m8860k9869j8060j6290j884q544k3145l1080L569j476P553l791L825
5036E34207l2274o266M220j852P853j2528k3261j1144K569j7277N736k0729q835
5023D20419J1613L46j3902k3830n615J187q043K237J6681k2652L307k4953n913
$$ plain form
5108 2913406 2791790 2681620 2567502 2450841 2369978 2313024 2230121 2153635 2090473 2015738 1979018
5097 1979018 1941507 1881018 1840188 1787024 1763045 1735039 1701049 1648948 1608145 1586279 1543135
5086 1543135 1491853 1452651 1441131 1420238 1394053 1370068 1361163 1326321 1280556 1253027 1221786 1154330
5074 1154330 1145879 1112101 1055087 1026436 1006604 954790 918799 896663 855308 839627 835522 823589
5062 823589 815663 804161 795231 807223 805260 812965 764239 718169 714646 721309 731607 730334 702259
5049 702259 653399 623530 605470 589180 587296 578752 555607 524527 528096 526620 534173 530382 534207
5036 534207 501933 495667 499887 498035 505888 493360 470099 458955 461524 444247 449983 429254 420419
5023 420419 432032 432378 418476 394646 389031 390218 382175 384412 401093 378441 381748 356795 350882
5010C50882R578j3609O834J8674p474M360j0376K8085j7777j9923J5241j1452
4998C53043L012k1491J3841M36Q099k9057o639p13M166J448J7375o170o287j5004
4984C16059k4982L788M261p813M044M1358j5948m4749N149J8970J174k5636P878
4971B83553O704r552j6081j7120L709l3895J7899J5899k1140q044j8044k294R59
4958B02553J659j5644m639K7007J247j9610N223J506j2246j3065J3269O795J2550
4945B06605j2388J346j2719M121J327j2917j8152k621J0302n40j0958P906j3889
4932A47423M55O896J4517j0370J6108n413m3200J7025K1811j1190j415k0102k3744
4919A08801K0488Q158J2480J3902j4913k2895J0284r256J8059M92J7373p801O76
$$ plain form
5010 350882 360460 346851 353685 372359 364885 369245 358869 386954 369177 349254 364495 353043
4998 353043 356055 334564 348405 348841 356940 327883 321244 320531 324697 326145 343520 337350 331063 316059
4984 316059 291077 294865 299126 291313 295357 336715 320767 276018 281167 300137 301311 275675 283553
4971 283553 290257 280705 264624 247504 251213 217318 235217 251116 229976 221932 203888 201594 202553
4958 202553 204212 188568 183929 210936 212183 192573 197796 199302 187056 173991 187260 194055 206605
4945 206605 194217 195563 182844 186965 188292 175375 157223 154602 164904 164364 153406 161312 147423
4932 147423 147878 154774 169291 158921 175029 169616 126416 143441 165252 154062 152647 132545 108801
4919 108801 129289 137447 149927 163829 148916 126021 136305 127049 145108 145600 162973 155172 155848
4906A55848o331J4538j616o819m83L132p65p693j0915J4287J2415q937m690k3734
4892A28237J0911o591P54J7098j5436j5018J5219L8781p569j8963r502L7321j0134
4879A65108N045K2492j1088R219o354L959o328k064J8659j2924L9837J9488k8529
4866B16520M087K5387K0777K7449m318j3505K9441Q682K1906M9734M8469M5394
4854D80023J4831K1068k8229j5617L4697K815m8069m8861j5011o195m7850l8516
4842C05086l2757m2267o631j0841l342j3687L2610j1635M273m361j4298L156j2817
4829A92489M934N125l7582J0301L324k1571R579j2072j51K8080p467J3573K4611
4816B13173k6266j7111j4780K328l399L474K792J7048R729k5377j0843P037J7068
$$ plain form
4906 155848 149517 164055 162439 155620 155137 158269 157504 149811 138896 153183 165598 156661 151971 128237
4892 128237 139148 132557 133311 150409 134973 119955 135174 173955 166386 147423 137921 175242 165108
4879 165108 170153 192645 181557 190776 184422 188381 182053 179989 198648 185724 225561 245049 216520
4866 216520 220607 245994 266771 294220 289902 276397 305838 314520 336426 386160 434629 480023
4854 480023 494854 515922 487693 472076 506773 509588 461519 412658 397647 391452 343602 305086
4842 305086 272329 230062 223431 212590 209248 195561 228171 216536 220809 216448 202150 205306 192489
4829 192489 197423 202548 164966 175267 178591 157020 166599 154527 154376 182456 174989 188562 213173
4816 213173 186907 169796 155016 157344 153945 157419 160211 177259 186988 161611 150768 157805 174873
4803A74873KM855j4196l1027M538J1523J8711M837p247M363R097n28k3891j8418
4789A37492L0090L7464O942M880N239l727j5115j2511J3418M0891k8475M0401
4777B56989r361l3059J9379j986j56m912l80K146j6843p325J7372K9568j821L003
4763B52614p655j5459K0313j188R70R922J593o199k39q131j5898O156j0833j4088
4749B11878Q597K9685K1095k3746K4930N495j5997j2819P056k8254p717K4467
4737B44670j5367q45K2971L571k4724K9026J0326r688R301L500m104J860J4546
4724B85043J9056J5989o861r284j3148k1590M360O202l8466N285L2563J0425n342
4711B84232J073j9895k681Q10O786N317L9153j719m202j234o716l837K0765J8738
$$ plain form
4803 174873 174875 179730 165534 134507 139045 150568 169279 174116 166869 171232 180329 179801 155910 137492
4789 137492 167582 205046 211988 216868 222107 218380 203265 190754 204172 245063 216588 256989
4777 256989 247628 214569 233948 231962 231806 226894 226514 228660 211817 204492 221864 251432 249611 252614
4763 252614 244959 229500 249813 248625 249595 259517 261110 254911 254672 246541 230643 236799 225966 211878
4749 211878 220475 250160 271255 247509 272439 277934 261937 249118 256174 227920 220203 244670
4737 244670 229303 228458 251429 255000 230276 259302 269628 259940 269241 272741 268637 270497 285043
4724 285043 304099 320088 313227 303943 290795 269205 273565 279767 241301 246586 279149 289574 284232
4711 284232 285305 265410 262729 263539 270325 275642 314795 313076 308874 307640 300924 297087 317852 336590
4697C36590P689k7085k2091P021p165K555O903M77j0844j184J7368J4112j6320
4684C08026j3363l2508J4978L776k197J0030o296l849J1403J0608k1978j4019
4672B64611K2457r466P747k8243K347m868K3793J2909r879l900k1349j6600K350
4659B41909J4320m062n548N349K6990j296J4768j8964M097q851K4100j3526k0723
4646B58563K0160l667N586q496K2826l217k1998L738N801j403O730n108l4005
4633B45510J3007K7486j1306r816Q802l2250K4527K6353j3248o579J4373P15q652
4620B78922j4448j8525r238o502M3854J0938n052J2942q917j4454L2206K014j938
4607C01802j0221k7299J8740L488k66K774K84l393J8735J0645n277m658o018N834
$$ plain form
4697 336590 344279 317194 295103 302124 294959 297514 304417 304894 294050 292866 310234 324346 308026
4684 308026 294663 262155 277133 280909 278712 288742 282446 278597 290000 300608 278630 264611
4672 264611 287068 277602 285349 257106 259453 254585 278378 291287 281408 277508 256159 239559 241909
4659 241909 256229 252167 246619 251968 278958 277662 292430 273466 277563 268712 292812 279286 258563
4646 258563 278723 275056 280642 272146 294972 291755 269757 273495 279296 277893 284623 279515 245510
4633 245510 258517 286003 274697 264881 273683 241433 265960 292313 279065 272486 286859 287574 278922
4620 278922 264474 245949 236711 230209 274063 285001 279949 292891 283974 269520 301726 303740 301802
4607 301802 291581 264282 283022 286510 286244 289018 289302 285909 304644 315289 310012 305354 299336 305170
4593C05170j6592R190n423J6974Q407K5250j0867l564j1066P131J4194K1268j9817
4580C40255k9095K0238Q613J3405j9461K1604M588j549k1560j015K550J8091K0640
4567C77304j175L0842K666q770j0040k0398K451J9186r794J0312J0399q472m944
4554C89567J1928J174k3000p33J9216R344K2887N175k2600J3860K255N897O405
4541D41375J9673P981p098N030j3319L471j067m802J4447J4518p32j8794j2086
4528D48597M519K0166r252O978L3357J1162K430q377l2440n564O610P55K1650
4515E00591j6456L7205K0313l2202k7090J7049K3884J650K012N220M065J168L1041
4502E68450l725k1299j8584L0830J4398Q319P322Q800r936j7850L1743O348O29
$$ plain form
4593 305170 288578 297768 292345 309319 317726 342976 332109 328545 317479 324610 338804 360072 340255
4580 340255 311160 331398 340011 353416 333955 355559 360147 358598 337038 336023 338573 356664 377304
4567 377304 376129 406971 409637 400867 390827 370429 372880 392066 382272 392584 402983 394511 389567
4554 389567 401495 402669 379669 378936 398152 407496 430383 435558 412958 426818 429073 434970 441375
4541 441375 461048 469029 461931 466961 453642 457113 456046 451244 465691 480209 479477 460683 448597
4528 448597 453116 473282 464030 471008 504365 515527 517957 509580 477140 471576 478186 478941 500591
4515 500591 484135 521340 541653 509451 482361 499410 523294 524944 526956 532176 536241 537409 568450
4502 568450 564725 543426 524842 555672 570070 578389 585711 594511 584575 566725 598468 604816 605445
4489F05445L3003M1714Q071k3430r680O560o205K710p092O587J4579O30J5571
4476F88463q538N457J0763O590k0995j7324K4250J2640K0403K0461M117j106p953
4463G37228J247r841K7060J2868J2701J5226J0057m91l09K5661j0799m711K8528
4450H44425L592J2504j8667J763J5162K2476n855P158Q385Q051P387j863J6321
4437I20839Q024J7717J8026J7252P111J9095J7648L009K7143J7244K3154N4064
4425A150326L7417k0566K5335p92n4701k639j6203J7688k8308O428K7380K6275
4413A167640k0672J2986k4780P008M0365R257q209M138K3910j4006N086K7734
4401A230457O149K589O83J1099J4870J0133M3295n525q354M4326l388m025O224
$$ plain form
4489 605445 638448 680162 688233 664803 655123 661683 655478 658188 651096 657683 672262 672892 688463
4476 688463 679925 685382 696145 702735 681740 664416 688666 701306 721709 742170 746287 745181 737228
4463 737228 738475 728634 755694 768562 781263 796489 806546 806055 805746 831407 820608 815897 844425
4450 844425 848017 860521 841854 843617 858779 881255 875400 882558 890943 898994 906381 904518 920839
4437 920839 928863 946580 964606 981858 988969 1008064 1025712 1028721 1055864 1073108 1096262 1150326
4425 1150326 1187743 1167177 1192512 1191720 1137019 1134380 1118177 1135865 1107557 1113985 1141365 1167640
4413 1167640 1146968 1159954 1135174 1142182 1182547 1191804 1183595 1187733 1211643 1197637 1202723 1230457
4401 1230457 1236606 1239195 1239878 1250977 1265847 1275980 1319275 1313750 1305396 1349722 1346334 1342309 1348533
4388A348533K3066J4632M498j7796Q628K1152P196J7075j0233K9842L2081Q427
4376A487101j6988R266K0870l294M827O899K1467L3203L5691j9390m668L1219
4364A606203K2702J4779k5254K9108J5196R613J6184K795R572O926M5125L9564
4352A792513K454Q47L2518K6648M6854K0281J053N3250L3411J2861j2944J94K2846
4339B032786J2243M812J9017N4487N0044L7858M2836O1440P4997M6091M8067N1764
4327B536442L1308k7500k4605n6001o6573m2766l4068l9473n5571n0662l377Q679
4315B175833o915k2901k036m464k1303M902L427J7290M2232p682q397J0257J7497
4302B197740J649j4231M048J5007J984m3090L0254Q433j6922r879K2868j2305
$$ plain form
4388 1348533 1371599 1386231 1390729 1372933 1381561 1402713 1409909 1426984 1416751 1446593 1478674 1487101
4376 1487101 1470113 1479379 1500249 1496955 1501782 1508681 1530148 1563351 1599042 1579652 1574984 1606203
4364 1606203 1628905 1643684 1618430 1647538 1662734 1672347 1688531 1691326 1700898 1707824 1752949 1792513
4352 1792513 1794967 1795814 1828332 1854980 1901834 1922115 1923168 1976418 2009829 2022690 2009746 2009940 2032786
4339 2032786 2045029 2049841 2068858 2123345 2173389 2211247 2254083 2315523 2390520 2436611 2484678 2536442
4327 2536442 2567750 2540250 2515645 2459644 2393071 2350305 2316237 2276764 2221193 2170531 2167154 2175833
4315 2175833 2168918 2146017 2143981 2139517 2118214 2123116 2126543 2143833 2186065 2178383 2169986 2180243 2197740
4302 2197740 2199389 2185158 2189206 2204213 2206197 2163107 2193361 2201794 2184872 2174993 2197861 2185556
4290B185556J7230J4409k6149L514j429L5754R408r169J691l3413P510L8981J4255
4277B258148M627J951K0339j0939K3653j282K4751J3161K6045K2891r608O189
4265B379926j9333n704j4983j4279n004n01K4417O721j0695J5908J6932K2690
4253B396095k9217P248J4625K4248P623k0297K172L3258J5752j160J4922J921
4241B467190m617k8654m36k4247m7816J659m83k2202l607j0k3713o114L4416j0206
4227B331160j9042q840K3983L7144L8642J8098j4457L6088N9442N2308P9415N2752
4215B686693O8901J07042P5220P6671J09001J33444J07858N2333P3394R8878J54301
4204C743736K24258K34852K95879K86595K45972J15930P942j31882k75345k90507
$$ plain form
4290 2185556 2202786 2217195 2191046 2194560 2193131 2228885 2238293 2229124 2230815 2197402 2204912 2243893 2258148
4277 2258148 2262775 2264726 2285065 2274126 2297779 2296497 2321248 2334409 2360454 2383345 2373737 2379926
4265 2379926 2360593 2354889 2339906 2325627 2320623 2320122 2344539 2351260 2340565 2356473 2373405 2396095
4253 2396095 2366878 2374126 2388751 2412999 2420622 2400325 2402497 2435755 2451507 2450347 2465269 2467190
4241 2467190 2462573 2433919 2433483 2409236 2361420 2363079 2362596 2340394 2336787 2336777 2313064 2306950 2341366 2331160
4227 2331160 2312118 2303278 2327261 2364405 2403047 2421145 2406688 2442776 2502218 2554526 2633941 2686693
4215 2686693 2755594 2862636 2937856 3014527 3123528 3256972 3364830 3417163 3490557 3589435 3743736
4204 3743736 3967994 4202846 4498725 4785320 5031292 5147222 5155164 5023282 4747937 4457430
4194D457430l31072l18560k96240k60335j54791j26528j22844q3751p4820m7127
4184B641362o1382l7653k5495k3090n7576J2122K0620l4417k3003P5109N242j8770
4172B473069j1820l594L930j1614N259j4621K3622j2426k7140J8871J7629m738
4160B456427j4514j175L2974K0036K5771J0886J2867K3094L4650J7910j4366q846
4148B595714n1m394M5190k442N0227L5940L6360L573R279K0403M0710J3332K1239
4135B865080M5510N5279P0536P2620M9635Q5276J31987J53828R1402J20604J29716
4124C871473J28847J54994Q8023P0334N018k8986l8377m468M6361L6149M7121
4113D376489M1125R2165R1361P4525O6396R4369J25403J04864J04421J31074J52129
$$ plain form
4194 4457430 4126358 3807798 3511558 3251223 3096432 2969904 2847060 2763309 2688489 2641362
4184 2641362 2579980 2542327 2516832 2493742 2436166 2448288 2468908 2434491 2411488 2486597 2491839 2473069
4172 2473069 2461249 2457655 2461585 2449971 2455230 2440609 2464231 2451805 2424665 2443536 2461165 2456427
4160 2456427 2441913 2440738 2473712 2493748 2519519 2530405 2543272 2566366 2601016 2618926 2604560 2595714
4148 2595714 2595663 2591269 2636459 2634017 2684244 2720184 2756544 2760117 2769396 2789799 2830509 2843841 2865080
4135 2865080 2910590 2965869 3036405 3109025 3158660 3243936 3375923 3529751 3621153 3741757 3871473
4124 3871473 4000320 4155314 4243337 4313671 4318689 4289703 4251326 4246858 4293219 4329368 4376489
4113 4376489 4417614 4509779 4601140 4675665 4742061 4836430 4961833 5066697 5171118 5302192 5454321
4102E454321J10007J43746J57166J63692J85978K02604K03706K26010K41637K74790
4092G363657K94562L21545L47048L56194L65843L48987L27968L65534L70253L74936
4082A0836527M20751M99287N37965O07934P01881P95773Q49330R29294R36567
4073A7115309Q01814O27692L63544R8974j38201l06196l18252k72471j47961J2614
4063A7836866J28447K32499M03795N18333O30761P82359R76672J128243J302682
4054B3940657J444058J605793J836707K101905K350593K719519L160219L773964
4046D2933415M534177N490386O260029P133069Q819927J0713461J0636567R584496
4038A06105527Q768540P206500K838528k975072p380693j0189944j1922646j2805268
$$ plain form
4102 5454321 5564328 5708074 5865240 6028932 6214910 6417514 6621220 6847230 7088867 7363657
4092 7363657 7658219 7979764 8326812 8683006 9048849 9397836 9725804 10091338 10461591 10836527
4082 10836527 11257278 11756565 12294530 12902464 13604345 14400118 15249448 16178742 17115309
4073 17115309 17917123 18544815 18908359 19007333 18869132 18562936 18244684 17972213 17824252 17836866
4063 17836866 17965313 18197812 18601607 19119940 19750701 20533060 21509732 22637975 23940657
4054 23940657 25384715 26990508 28827215 30929120 33279713 35999232 39159451 42933415
4046 42933415 47467592 52957978 59218007 66351076 75171003 85884464 96521031 106105527
4038 106105527 114874067 122080567 124919095 121944023 114563330 104373386 92450740 79645472
4030G9645472j2125970j0408393q472151o641107n011386l805838k914550k204810
4022B8061267j668385j354949j262431j258910j174215j069145r18376q22301
4014A8532555p09021o53120n83010n31572m44117m28480l57488l12088k55869
4005A4257790k63388j74631j66599j59319j49588j41572j55011j35650j08154
3996A2803878n6619n544N8205J37414K14879K52552L36152M17061N26507O62750
3986A5347235Q07904R12149J053131J260228J570834J762740J813962K052229
3978B6580412K256913J821045K68548j472248k556476k771230k535178k086694
3970A9505092j644720j318210j077154q53206o48630m91765l43976k39412j45236
$$ plain form
4030 79645472 67519502 57111109 48638958 41997851 36986465 33180627 30266077 28061267
4022 28061267 26392882 25037933 23775502 22516592 21342377 20273232 19354856 18532555
4014 18532555 17823534 17170414 16587404 16055832 15611715 15183235 14825747 14513659 14257790
4005 14257790 13994402 13819771 13653172 13493853 13344265 13202693 13047682 12912032 12803878
3996 12803878 12747259 12741715 12799920 12937334 13152213 13404765 13740917 14157978 14684485 15347235
3986 15347235 16155139 17067288 18120419 19380647 20951481 22714221 24528183 26580412
3978 26580412 28837325 30658370 30926918 29454670 26898194 24126964 21591786 19505092
3970 19505092 17860372 16542162 15465008 14611802 13963172 13471407 13127431 12888019 12742783
3961A2742783j32877p7212p3299j40562j83333k15397k85497l05352l72489l97452
3951A0559313m37180m25206l92364l04385k53493k05461j10318m5395K240J3871
3941H401622P5732J20979J41746R4435N5341m3738j17804j07945q2156m262j3412
3930H520538M0082J02526J25479J39057Q4685L7578n989o2742j03807j71819j49922
3919H555666j16389j08858m0877j08539j23673j74879k75545l35699l63647m04620
3909F502940l56892l45611l23432k58455k32894j92921j56592j03173j08686n9986
3899D364298l8094K542L3253J0535R821N7152J01325O6629Q9905K5005j0856r7143
3887D614372j00114j53417j66996j63233j70751j49524q0667o4204o8966l1168
$$ plain form
3961 12742783 12609906 12532694 12459395 12318833 12135500 11920103 11634606 11329254 10956765 10559313
3951 10559313 10122133 9696927 9304563 9000178 8746685 8541224 8430906 8385511 8387751 8401622
3941 8401622 8477354 8598333 8740079 8834514 8889855 8846117 8728313 8620368 8538212 8533950 8520538
3930 8520538 8560620 8663146 8788625 8927682 9012367 9049945 9043956 8981214 8877407 8705588 8555666
3919 8555666 8439277 8330419 8289542 8181003 8057330 7882451 7606906 7271207 6907560 6502940
3909 6502940 6146048 5800437 5477005 5218550 4985656 4792735 4636143 4532970 4424284 4364298
3899 4364298 4326204 4328746 4361999 4372534 4382355 4439507 4540832 4607461 4697366 4722371 4711515 4614372
3887 4614372 4514258 4360841 4193845 4030612 3859861 3710337 3629670 3565466 3496500 3465332
3877C465332j7790l0160k461m3356k409O287k480J6931M3297J9427k5007m3763
3865C383848n3088p7606p8882o4562k7839K5382k938K1026L2486N2594O6111J816
3853C278348j0010j6632l7482n3342q1498k7936m0897n0660q709j3492m587J4095
3841B947198k7390L4216N7530O1949Q4312O8475R0661J35363J91504J80760K07875
3830D032453K42407K51762K37671J99598J29585O7681k7137j24830k12768k46588
3820D549834k19677k14195j50461j48102j42870q1025m7290o8315j0787K8462
3810C495574N7153M0001J06034J04577J36187K18801K53263K32459K54339K30676
3800E129064J65727O5359n5798j97758k21223k44021j97836q9700o7221j2077
$$ plain form
3877 3465332 3447542 3417382 3414921 3371565 3369156 3375443 3372963 3389894 3433191 3452618 3427611 3383848
3865 3383848 3330760 3253154 3174272 3109710 3081871 3107253 3104315 3125341 3157827 3210421 3276532 3278348
3853 3278348 3268338 3251706 3214224 3160882 3079384 3051448 3010551 2959891 2951182 2937690 2933103 2947198
3841 2947198 2919808 2954024 3011554 3073503 3157815 3226290 3316951 3452314 3643818 3824578 4032453
3830 4032453 4274860 4526622 4764293 4963891 5093476 5161157 5134020 5009190 4796422 4549834
3820 4549834 4330157 4115962 3965501 3817399 3674529 3593504 3546214 3477899 3467112 3495574
3810 3495574 3552727 3592728 3698762 3803339 3939526 4158327 4411590 4644049 4898388 5129064
3800 5129064 5294791 5360150 5304352 5106594 4885371 4641350 4443514 4353814 4286593 4274516
3790D274516N1326J15374J17643J07565J61935J30139R6407K5482k9131n2107
3780D999149q4589n0884k9311k9040L1131Q1287J03395J24049J43404J86225J11587
3769E586403Q869q5990j45539j80033j64795j31509j48501j30670o1658l4238
3759D512339Q53m057j7351j9502p0269j26426j28579j24400r3173n5872j8547
3748C855016K1549O352O2265R4151J03802J25934J00455Q7600J08168J25240J38676
3737D829208J41813J44957J08758J05911O3671K7036K9677j01645j71465l06276
3727D871645l53987l07652l51501k85431k07566j85328j45608j03865r4105q4010
3717B752592k6572o7694l0924k1573j0700K7926M7455M9117Q1090O9519O8810
$$ plain form
3790 4274516 4325842 4441216 4558859 4666424 4828359 4958498 5054905 5080387 5051256 4999149
3780 4999149 4914560 4863676 4834365 4805325 4836456 4917743 5021138 5145187 5288591 5474816 5586403
3769 5586403 5595272 5509282 5363743 5183710 5018915 4887406 4738905 4608235 4546577 4512339
3759 4512339 4513192 4509135 4491784 4472282 4402013 4275587 4147008 4022608 3929435 3873563 3855016
3748 3855016 3876565 3882917 3945182 4039333 4143135 4269069 4369524 4457124 4565292 4690532 4829208
3737 4829208 4971021 5115978 5224736 5330647 5394318 5421354 5451031 5349386 5177921 4871645
3727 4871645 4517658 4210006 3858505 3573074 3365508 3180180 3034572 2930707 2836602 2752592
3717 2752592 2726020 2658326 2627402 2605829 2595129 2623055 2670510 2719627 2800717 2870236 2939046
3706B939046L6070J5768q20k2460l1876j0465J6437K0524K1465M7944N4298l8250
3694C047681k5087j09540j61952j35668j46810j35854j13675q5660p3623n4324
3684B005488m8942j8056K3661L623j0557O3803K0308o68L9272L1501N814l8477
3672B076770k8130n7495m5225n1409o737n042J5827L9324K3666L5322K5261j5871
3660B006261n0545j24733j28592j08769j01665p6813l3369m1882m2255l1342j9689
3649A246607j9362k4495K413p813K204j0931p385J67L620J8907o614o888K392
3636A192822M4909M5778L8725O5222N7119M7801L7340L7395l0138m4597j2887
3625A479489l5431n2699m2546k5098j917l0620k1961M2796L4711L2986N6318L2630
$$ plain form
3706 2939046 2975116 2990884 2990064 2967604 2935728 2925263 2941700 2962224 2983689 3031633 3085931 3047681
3694 3047681 3022594 2913054 2751102 2615434 2468624 2332770 2219095 2133435 2059812 2005488
3684 2005488 1956546 1938490 1962151 1965774 1955217 2019020 2039328 2038660 2077932 2109433 2115247 2076770
3672 2076770 2048640 1991145 1945920 1894511 1887774 1882732 1898559 1937883 1961549 1996871 2022132 2006261
3660 2006261 1955716 1830983 1702391 1593622 1491957 1415144 1381775 1339893 1297638 1266296 1246607
3649 1246607 1227245 1202750 1205163 1197350 1199554 1188623 1181238 1181405 1185025 1203932 1197318 1190430 1192822
3636 1192822 1237731 1283509 1322234 1387456 1444575 1492376 1529716 1567111 1536973 1492376 1479489
3625 1479489 1444058 1391359 1348813 1323715 1321798 1291178 1269217 1312013 1346724 1379710 1436028 1468658
3613A468658O8238M1963Q1707J08785J26068J36502J43217J50041J46007J28510
3603B599696J13228K8766p5326j55025j86816j96078j90167j62788j32052j29076
3593A514362p8782q1840o8021m5655m5643j5101j3955m821l0328O169q026j4979
3581A113380N801j9892N805J3827J1821j138k6863j3256k0095l5433j6381j9168
3569I98408j2822j025J4336L3352l6961n4564K4468J0876o201Q318n880N583q052
3556I69836J6326j3650j913L0430J5390n510K2080L0925J8925J1366j069J0585
3544A103721k0042j1602K4994j4039j0300o819K9195Q613J9667J4988j9683q626
3532A110067q067J2703L2828L9300O38q262J1682J9449M790L3301L7609K0255
$$ plain form
3613 1468658 1536896 1578859 1660566 1769351 1895419 2031921 2175138 2325179 2471186 2599696
3603 2599696 2712924 2741690 2666364 2511339 2324523 2128445 1938278 1775490 1643438 1514362
3593 1514362 1435580 1353740 1285719 1240064 1194421 1179320 1165365 1160544 1130216 1136385 1128359 1113380
3581 1113380 1119181 1099289 1105094 1118921 1130742 1129604 1102741 1089485 1069390 1033957 1017576 998408
3569 998408 985586 984561 998897 1032249 995288 940724 965192 976068 969867 978185 972305 977888 969836
3556 969836 986162 972512 970599 1001029 1016419 1010909 1032989 1063914 1082839 1094205 1093136 1103721
3544 1103721 1083679 1072077 1097071 1083032 1072732 1065913 1095108 1103721 1123388 1138376 1118693 1110067
3532 1110067 1102000 1114703 1147531 1186831 1187469 1179207 1190889 1210338 1215128 1248429 1286038 1306293
3520A306293L3566K5094J1302J7128K0260L7625L8730M4393N3097J7232k269N7564
3508A660015N5775J8158M7625K4872J1820M61l7833n0914k9295m6295n916j1523
3496A636950l1155l6647K5458P876K1527n046m5717l1703K6153M6690J891K5826
3484A642103L0892O319M3600Q804J9623k0369l7897r759j3872J2388J5071L6025
3472A732928N7414L5917L1998J7094M9963N5610O9751M5939L1193M9906N2958
3461B230671M7462M3212P9885N6368L3492N0696O2752L3422M3656L3239K4535
3450B739390N2967K8595J9333L3851J0193K315K5286L8641J4929M5310M5415O7123
3438C123348O7540O8754O2357L3091N0053N3221N7588N1836N688N3875M3433L1719
$$ plain form
3520 1306293 1339859 1364953 1376255 1393383 1413643 1451268 1489998 1534391 1587488 1604720 1602451 1660015
3508 1660015 1715790 1733948 1781573 1806445 1818265 1818726 1780893 1729979 1700684 1654389 1648473 1636950
3496 1636950 1605795 1569148 1594606 1602482 1624009 1618963 1573246 1541543 1567696 1614386 1616277 1642103
3484 1642103 1672995 1679314 1722914 1731718 1751341 1730972 1693075 1683316 1669444 1681832 1696903 1732928
3472 1732928 1790342 1826259 1858257 1875351 1925314 1980924 2050675 2096614 2127807 2177713 2230671
3461 2230671 2278133 2321345 2401230 2457598 2491090 2541786 2604538 2637960 2681616 2714855 2739390
3450 2739390 2792357 2820952 2840285 2874136 2884329 2886644 2911930 2950571 2965500 3010810 3056225 3123348
3438 3123348 3190888 3259642 3321999 3355090 3405143 3458364 3515952 3567788 3573476 3627351 3670784 3702503
3426C702503M0967J01466Q6129P3605L7268L1504L3251Q5327J39237J22605J22136
3415D575998J23866J09523J43600J61887J74163K00047K19264K04232K30020J86752
3405F329352J95481J60350J83995J38366J12978Q8442J18058J14037J20175J57494
3395G718728K35934K37597K43752K36078K75621K94368K83079K99324K54050K31645
3385A0310176K59848K34767K48839L03817L94294M26941M26221L82796L74598
3376A3362297M52311N28347N52684O28626P20954P94627P11607O27407N63426
3367A8942286N58872N45887N18677N42967N34870N69282O44234P11952Q36387
3358B4405414Q58362P96712P56554P09406O87726P57858Q86925J023376J014394
$$ plain form
3426 3702503 3743470 3844936 3931065 4004670 4041938 4073442 4106693 4192020 4331257 4453862 4575998
3415 4575998 4699864 4809387 4952987 5114874 5289037 5489084 5708348 5912580 6142600 6329352
3405 6329352 6524833 6685183 6869178 7007544 7120522 7208964 7327022 7441059 7561234 7718728
3395 7718728 7954662 8192259 8436011 8672089 8947710 9242078 9525157 9824481 10078531 10310176
3385 10310176 10570024 10804791 11053630 11357447 11751741 12178682 12604903 12987699 13362297
3376 13362297 13814608 14342955 14895639 15524265 16245219 17039846 17751453 18378860 18942286
3367 18942286 19501158 20047045 20565722 21108689 21643559 22212841 22857075 23569027 24405414
3358 24405414 25263776 26060488 26817042 27526448 28214174 28972032 29858957 30882333 31896727
3349C1896727R90480J090756J199164J259951J309689J429704J578946J642628
3341D2398045J806848K192701K622057L155179L673359M113729M515071N009312
3333F9486301N529898O073728O704541P768729R114555J0916910J2656018J4222157
3325A42472837J5432963J8493058K4167412L2380755L5562525L8291433M8699922
3318C55500905M9185030J7151411k9814440n6270846n9574222n2041309l9966781
3311A84169748l0083922k3247027j7851867j3647269j0374566q346792p112678
3304G3505627o344577n433235m584688l725024l054055k435606k035912j688843
3296D4203687j511872j381083j449656j511102j560223j370391j240317j111463
$$ plain form
3349 31896727 32887207 33977963 35177127 36437078 37746767 39176471 40755417 42398045
3341 42398045 44204893 46397594 49019651 52174830 55848189 59961918 64476989 69486301
3333 69486301 75016199 81089927 87794468 95563197 104677752 115594662 128250680 142472837
3325 142472837 157905800 176398858 200566270 232947025 268509550 306800983 355500905
3318 355500905 404685935 421837346 392022906 335752060 276177838 224136529 184169748
3311 184169748 154085826 130838799 112986932 99339663 88965097 80618305 73505627
3304 73505627 67161050 61727815 57143127 53418103 50364048 47928442 45892530 44203687
3296 44203687 42691815 41310732 39861076 38349974 36789751 35419360 34179043 33067580
3288C3067580r77624p87653o57180n37639m12446k04620p1523O1642j14927o01140
3278B8764470j136799j297321j302162j079177r40119p49022o89612n83541n27321
3269B0459396m59969l68144l09199l01469k38599j57675n0307j161J3036M0764
3259A8626673L5835O3600Q5217N1983J21584J58852K52454K58839K23155K07721
3249B0085913K90175K86550K89759M00748M56636N23970O66634P64832R43268
3240B4708485J095227J285677J417350J525132J727903J918980K084604K412059
3232C8175417K867930L410786M002973M556434N201377N986942P192682R100042
3224H0494583J1446083J3206983J4323375J4834307J0824598n8404j1772094j7732171
$$ plain form
3288 33067580 32089956 31302303 30645123 30107484 29695038 29490418 29418895 29480537 29365610 28764470
3278 28764470 27627671 26330350 25028188 23949011 23008892 22259870 21570258 20986717 20459396
3269 20459396 19999427 19631283 19322084 19020615 18782016 18624341 18574034 18572873 18585909 18626673
3259 18626673 18662508 18726108 18811325 18863308 18984892 19143744 19396198 19655037 19878192 20085913
3249 20085913 20376088 20662638 20952397 21353145 21809781 22333751 23000385 23765217 24708485
3240 24708485 25803712 27089389 28506739 30031871 31759774 33678754 35763358 38175417
3232 38175417 41043347 44454133 48457106 53013540 58214917 64201859 71394541 80494583
3224 80494583 91940666 105147649 119471024 134305331 145129929 145071525 133299431 115567260
3216A15567260j8172534j5702523j2537635r880657p841997o189289m888685l964259
3208C6389681l292211k861606k481150k156045j802273j507223j264178j056493
3200A9968502r40664q28876p49761p21646o90265p12968o80015o74519o08328
3191A3361460n79765n30322n21431m82692m83133m37224l91435l46635l16792
3182I272031l13079l52982k90212k98840k50511k52697k16095k03140k07013j93694
3172F693768j87707j87246j80024j74419j63705j50088j07956j13602j16870j44087
3162E168064q8971o1597n0873j13173j26178j02690j03946j17523j37328r0507
3152D175278l7112l8979p1974o9582o5155q3777l7350l1395o1457p9315n4316
$$ plain form
3216 115567260 97394726 81692203 69154568 59273911 51431914 45242625 40353940 36389681
3208 36389681 33097470 30235864 27754714 25598669 23796396 22289173 21024995 19968502
3200 19968502 19027838 18198962 17449201 16727555 16037290 15324322 14644307 13969788 13361460
3191 13361460 12781695 12251373 11729942 11247250 10764117 10326893 9935458 9588823 9272031
3182 9272031 8958952 8605970 8315758 8016918 7766407 7513710 7297615 7094475 6887462 6693768
3172 6693768 6506061 6318815 6138791 5964372 5800667 5650579 5542623 5429021 5312151 5168064
3162 5168064 5079093 5017496 4966623 4853450 4727272 4624582 4520636 4403113 4265785 4175278
3152 4175278 4138166 4099187 4027213 3957631 3892476 3808699 3771349 3739954 3678497 3599182 3544866
3141C544866r1184q8886q2910j07970q7962j06996m7596p0887p4560m2517p5854
3130B667544n1977m7826k7157m1662m0755p1560p7999n4478J5519l1591k1593
3119B216465l5538M007k9943o9329n7113o3361m0770l9621l5955m1265j6847n7770
3107A732960q770k2376n118k5172j5240m2838m1577j8852r658k2845k8828k2612
3095A469074M258l931J8707j6264o5107m6381l4973k2457k5988N610J0315K7316
3083A320179j516j4344j7546k104N158k0587K125l503K0396J8810P376j0367n500
3070A298577j5482m131j2698l2700q542k696j1878L4263k2824j1872l8363j3586
3058A158068m4775m4708j3072O797J5270n620K1555K1792K6878L3276r283J2669
$$ plain form
3141 3544866 3453682 3364796 3281886 3173916 3085954 2978958 2931362 2860475 2785915 2743398 2667544
3130 2667544 2615567 2567741 2540584 2498922 2458167 2386607 2308608 2254130 2269649 2238058 2216465
3119 2216465 2180927 2184934 2154991 2085662 2028549 1965188 1924418 1884797 1848842 1807577 1790730 1732960
3107 1732960 1724190 1701814 1696696 1671524 1656284 1613446 1571869 1553017 1543359 1520514 1491686 1469074
3095 1469074 1473332 1469401 1488108 1471844 1406737 1360356 1325383 1302926 1276938 1282548 1292863 1320179
3083 1320179 1318663 1304319 1286773 1284669 1289827 1269240 1271365 1267862 1288258 1307068 1314444 1304077 1298577
3070 1298577 1283095 1278964 1266266 1233566 1225024 1222328 1210450 1244713 1221889 1210017 1171654 1158068
3058 1158068 1113293 1068585 1055513 1062310 1077580 1071960 1093515 1115307 1142185 1175461 1166178 1178847
3046A178847p620L7967J8423K4563J5885K3797K9133P0192M1914P5156J15104
3035A623361J03049J34276J89274K10765J52367J11009M6314k8173j03578k09212
3025B229452k33373j77422j91515j67606j38994j23865j12396q3517p9912k0389
3015I00463j7495n8202o0275m1199l0880m5082O167K588j453O076J9627j0744
3003F69591O052J5335l0447J7595J975l1624k550L527j4992k6629N588l4890k2187
2990E56344p065l53l652k7513J287k5183m91K977K1689k2715o769p350o011K6413
2976E01608q383j8011k4390l022K228l7217o221J951J3495j3285J747j5760j5058
2963C79682J088l7303l3454J111L222L686K2943M9567P764J310j0717K6724M0788
$$ plain form
3046 1178847 1171227 1209194 1227617 1252180 1268065 1291862 1320995 1391187 1433101 1508257 1623361
3035 1623361 1726410 1860686 2049960 2260725 2413092 2524101 2570415 2542242 2438664 2229452
3025 2229452 1996079 1818657 1627142 1459536 1320542 1196677 1084281 1000764 920852 900463
3015 900463 882968 824766 764491 723292 692412 647330 653497 656085 654632 660708 680335 669591
3003 669591 675643 690978 660531 678126 680101 648477 645927 649454 634462 607833 613421 578531 556344
2990 556344 549279 548926 545274 517761 519048 493865 493374 496351 518040 495325 488556 481206 475195 501608
2976 501608 493225 475214 450824 447802 450030 412813 406592 408543 422038 408753 410500 394740 379682
2963 379682 380770 343467 310013 311124 314346 318032 340975 390542 398306 399616 388899 415623 456411
2950D56411J1971O383K9165J4270K1018M678J9999J718K9118J1599J5069J4414
2938F35813K7280M6545O7584O5849N4022L3440N9319j1972k7297n0019m9226n5427
2926G95911n5858o8605p2447m9817m3797k2708l6426o091k9692j4609J5359p900
2914D03320k5071J9635J2338p592l497j1076p107l240k9104J7437o15J0415J984
2901C77827j500J3896m184j539m453k6762q280L0865J5604j0449k866K3283j025
2888D00417K214l3843k8027K8201K1498J2879l336j0251k6177q626J1791J9406
2876C86146Q354M063p947L358J3711J1693j5952q292k5746l511k7848l00j3714
2863C24015l2835K1865J0351j5621L6129K3243L318j7260J8801N353J2647j799
$$ plain form
2950 456411 468382 474765 503930 518200 539218 543896 563895 565613 594731 606330 621399 635813
2938 635813 663093 709638 777222 843071 897093 930533 989852 977880 950583 900564 851338 795911
2926 795911 740053 671448 599001 549184 505387 482679 446253 440162 410470 395861 411220 403320
2914 403320 378249 397884 410222 402630 399133 388057 380950 377710 348606 366043 365428 375843 377827
2901 377827 376327 390223 386039 384500 380047 353285 345005 375870 391474 381025 378159 401442 400417
2888 400417 402631 368788 340761 368962 390460 403339 400003 389752 363575 354949 366740 386146
2876 386146 394500 398563 390616 393974 407685 419378 403426 395134 369388 365877 338029 337729 324015
2863 324015 291180 313045 323396 307775 343904 367147 370465 353205 372006 377359 390006 388207
2851C88207j0250k1273J1794J6382J1108J9707j707j2490j6151O685n632j2110
2839C74270k6183r694M210k2483j8675J9637Q435L247l2905k6172Q165J5995j0364
2826B87483K558j7361j0903J0226k5221k706j2245j5765o226L854L775J3457k9488
2813B01438k2670K7340o710k1343j8456m554M411k1145K853J967K3257L159Q424
2800A77971l011j2078p943j4517K6449M068l1013O731p374k5494K5401j8484j5023
2787A05683L271r634J8306l6373L3586J9136k3041m388j3277k872j0241p585M213
2774G6784q245K6169j5348r367J2957N341J4855P823L046l1054j3650P306J6803
2761I3420p627R691N672r454r63M452n438j3522l4278L3983J6999O130m912j87
$$ plain form
2851 388207 377957 356684 368478 384860 395968 415675 413968 401478 385327 392012 386380 374270
2839 374270 348087 338393 342603 320120 301445 321082 329517 332764 299859 273687 281852 297847 287483
2826 287483 290041 272680 261777 272003 246782 244076 231831 216066 209840 213694 217469 230926 201438
2813 201438 178768 206108 199398 178055 159599 155045 159456 138311 141164 143131 166388 169547 177971
2800 177971 174960 162882 154939 140422 166871 170939 139926 146657 139283 113789 139190 120706 105683
2787 105683 108954 99320 117626 81253 114839 133975 110934 106546 93269 90397 80156 72571 76784
2774 76784 68539 94708 79360 69993 82950 88291 103146 110969 114015 82961 69311 76617 93420
2761 93420 85793 95484 101156 91702 90739 95191 89753 76231 41953 75936 92935 99065 94153 93966
2747I3966j1556r527j9795J0988Q361r171n715L2778k4240mK5055j4909k6599
2734D9632L1133p575L480J099J945L202L981M920j0904k6828L957j6295J4950
2721E6697J219j2220k5798J7297k60R297j350n711K08J3611j6717k3074q64J4578
2707B6913J9522p060K6810j708K70o952j9430n968L8131j8249n446m551q118l697
2693C0467P690R376J5613j0618L418k2338K943o27k4619R962J4015L188K573m699
2679C6344N950k1104K0349k0885K525J7172j085p920R498k8061M038N799K8607
2666E1227L017n847k5461k085l276l091j33k2588K3230R717j4309m287L849k7264
2652a7301J4632K3834j2364J6743l971j9719K7047M354O403K26n2203L3640J8545
$$ plain form
2747 93966 82410 72883 53088 64076 72437 63266 57551 90329 66089 66085 91140 76231 49632
2734 49632 80765 73190 76670 77769 79714 82916 86897 91817 80913 54085 58042 41747 56697
2721 56697 57916 45696 19898 37195 36935 46232 44882 39171 39379 52990 36273 13199 12335 26913
2707 26913 46435 39375 66185 64477 64747 57795 38365 32397 70528 52279 46833 42282 34164 30467
2693 30467 38157 47533 63146 52528 55946 33608 36551 35924 11305 21267 35282 38470 41043 36344
2679 36344 42294 21190 41539 20654 23179 40351 39266 31346 40844 12783 16821 22620 51227
2666 51227 54244 48397 22936 20851 17575 14484 14351 -8237 14993 24710 10401 6114 9963 -17301
2652 -17301 -2669 21165 8801 25544 21573 1854 28901 33255 39658 39884 -12319 21321 39866
2639C9866j1130M99K2795m523j3167J867p948K6224P654k0053k1890l404o606
2626A0184O60j0497K1181J2229K661R45k51k529J3858o06K1018k8837l0786J0671
2612A9901K1650K1985l2363J6666K9598j1939j0898j3298p982N162J1743j5174
2600C5051J3825k2955n874L1228j3838l5290j4605o483J8209J6324k0612M2438
2588C7418N377k0901j0042J966P72j481o005r978M951j843k399J6013J8438K119
2574C4405K065j8116K7839O695l544r672r779j504K964k165m808j8697M182J1929
2560B1794M607J0065O974j6323k0721k3159o814K5522K378J9571j0619L394K125
2547A8794o786J8867L384j2782j4987L1307j8378l1173K6391J5551j0664k024
$$ plain form
2639 39866 28736 29235 52030 47507 34340 36207 28259 54483 62137 42084 20194 16790 10184
2626 10184 10844 347 21528 33757 36418 37363 37112 34583 48441 47835 68853 40016 9230 19901
2612 19901 41551 63536 31173 47839 77437 65498 54600 41302 33320 38482 50225 35051
2600 35051 48876 25921 20047 51275 37437 2147 -12458 -18941 -732 15592 -5020 37418
2588 37418 42795 21894 11852 13818 14590 13109 7104 -2874 2077 234 -2165 13848 32286 34405
2574 34405 36470 18354 46193 52888 49344 39672 29893 28389 31353 29188 24380 5683 9865 21794
2560 21794 26401 36466 43440 27117 6396 -16763 -23577 1945 4323 23894 13275 16669 18794
2547 18794 12008 30875 34259 21477 6490 37797 19419 -11754 14637 30188 19524 17500
2535A7500k0190j2816J0661J1460R707j2725J2753j0260k453J1637j8196k798
2523e720L063M057M48j5841K1878J4884j8283P066j1203j4549K4019j3678r669
2510a3528K4310k449Q519j5017p183L0841k207k1937K2742j7938j6231K2292L358
2497A5572K391j0428k2751Q21K7897o459j3007J7461R36J580K701n450p700l052
2483E12N507j0076R657K293J7314Q34J640J357p556k6868L0880N636l2114o812
2469g796p681J3375J3426n944j3790L5962j4515r501K22j6795K1613R072k2992
2456e344L694j3110k521K0538r707J5700m302k7842L0700J7388k4113J0021k2678
2443a1576k5408R189J6248J1889o250N426k82O20J2286O460j7434j1931K1679
$$ plain form
2535 17500 -2690 -15506 -4845 6615 16322 3597 16350 6090 3637 15274 -2922 -5720
2523 -5720 -2657 1400 1848 -13993 7885 22769 4486 11552 349 -14200 9819 -3859 -13528
2510 -13528 10782 8333 16852 1835 -5348 25493 23286 1349 24091 6153 -10078 12214 15572
2497 15572 17963 7535 -15216 -14395 13502 7043 -5964 11497 12433 14013 16714 11264 3564 512
2483 512 6019 -4057 5600 7893 25207 26041 27681 29038 21482 -5386 25494 31130 -984 -7796
2469 -7796 -15477 -2102 11324 5380 -8410 27552 13037 3536 3758 -13037 8576 17648 -5344
2456 -5344 -1650 -14760 -17281 3257 -6450 9250 4948 -22894 7806 25194 1081 11102 -11576
2443 -11576 -36984 -27795 -11547 342 -5908 -482 -764 -144 12142 18602 1168 -10763 10916
2430A0916r344J0117J8972j520l3256j8066n108R312Q403J0493K284N532k671
2417F064k1788j0617O870J6720J5825j8135j3128j309k153k3009p239K8093M467
2404a9339R864q70K0251N685m840j4711P764N749K813l3751J9336J0479m499J0642
2390A4573n965j5119K3725k4470K444M031k0941Q289J9759O153m290q639R207
2377H757l04k6490J4472j3999l800K6032M611o816J2038k6332O27O2M34K8114
2363A7406k1369J325K0178q726J7018j8280J4392q444j1641J872R142m894q990
2350a011n388k997L2366J0152O864K289o838P486n060J5870o012k62k294j859
2336D3306j6496r164j69k4739k5147K3831J603q355m599J3025n514O241p903J532
$$ plain form
2430 10916 1572 11689 30661 29141 -4115 -22181 -27289 -17977 -9574 919 3203 8735 6064
2417 6064 -15724 -26341 -19471 -2751 13074 -5061 -18189 -19498 -21651 -44660 -51899 -23806 -19339
2404 -19339 -9475 -10345 9906 15591 10751 -3960 3804 9553 12366 -21385 -2049 8430 3931 14573
2390 14573 8608 -6511 17214 -7256 -4812 -781 -21722 -13433 6326 12479 8189 -450 8757
2377 8757 8453 -18037 -3565 -17564 -21364 4668 9279 2463 14501 -11831 -11204 -11142 -10708 17406
2363 17406 -3963 -2638 17540 8814 25832 7552 21944 13500 1859 3731 12873 7979 -1011
2350 -1011 -6399 -9396 22970 33122 39986 42275 35437 42923 37863 53733 47721 47459 45165 43306
2336 43306 26810 17646 17477 -7262 -32409 -8578 -6975 -15330 -19929 -6904 -12418 -6177 -14080 -12548
2322a2548J9696j3906K153L0828O221k3413J0778O817J5465n937o167j4178J5893
2309C1702o770j6001j9367o193J1969R946k951j9252J2045M252Q66k582m3060
2296d5396O766K5935N718p16J2298j4245O000R39J0897j3734k3171J9198J2091
2283B580r89m56J0372J1883j3975j7846J3315J2190J907k1746k1292L4031O308
2270A6282k2883k496J5245j253J6172k4731K869J5202j3326J0608l5899k297O028
2257b0479J5990O877J6990l341l5109J2579R099j1694j248J6121k9364j1814J0823
2244b4570O428K1898j732j7828K1784q939k2820L678Q384R332K1744j3352N549
2231I556n683J4378K0001j3013N126j5268J1787J1153j5366j5802j0802j0600
$$ plain form
2322 -12548 7148 -6758 -4605 26223 32444 9031 19809 26626 42091 36154 29987 15809 31702
2309 31702 24932 8931 -10436 -16629 -4660 5286 2335 -16917 -4872 -620 246 -2336 -45396
2296 -45396 -38630 -12695 -6977 -7693 4605 -9640 -3640 -2701 8196 -5538 -28709 -9511 2580
2283 2580 1591 1135 11507 23390 9415 -8431 4884 17074 18981 -2765 -24057 9974 16282
2270 16282 -6601 -9097 6148 4895 21067 -3664 -795 14407 1081 11689 -24210 -26507 -20479
2257 -20479 -4489 2388 19378 16037 -19072 -6493 2606 -9088 -10336 5785 -23579 -35393 -24570
2244 -24570 -18142 3756 2024 -15804 5980 -2959 -25779 -22101 -13717 -4385 17359 4007 9556
2231 9556 3873 18251 38252 25239 30365 15097 26884 38037 22671 6869 -3933 -14533
2219a4533j456L934M3936k614k6941j0318P252J9626R728N999P5k051J001j7209
2205A6429J1566l102k0644j1622L340J5183J4705j0924N498l0453l836K3080K8474
2192C7694K382n386o703J443L575m361l2887j5055K1952K9824J3688j258q274
2179C6634N76R956P730Q783Q024j6783j1107J1583Q394k559r114J1084q646K6421
2165H0976K1560j142l759j7644J3567L7348j4911k5835K523J7516P739j437k2304
2152I4197l3642K1404L8482J1065j3563J0011J303K554J7149j4467k642P094J5125
2139A54070j735K8807N617p658O517l87L313J6692O232Q093p744m587k213J9105
2125B24122J1321K7693J8007K6980J2807P250M946l161J8493K8487j6001J881
$$ plain form
2219 -14533 -15989 -12055 31881 29267 2326 -7992 -740 18886 28614 34613 34688 32637 33638 16429
2205 16429 27995 24893 4249 -7373 -4033 11150 25855 14931 20429 -10024 -13860 9220 37694
2192 37694 40076 34690 27987 29430 33005 28644 -4243 -19298 2654 32478 46166 44908 36634
2179 36634 37210 47166 54896 63679 71703 54920 43813 55396 63790 61231 52117 63201 54555 80976
2165 80976 102536 101394 97635 79991 93558 130906 115995 90160 92683 110199 117938 116501 94197
2152 94197 60555 81959 120441 131506 117943 127954 129257 131811 148960 134493 131851 138945 154070
2139 154070 152335 181142 186759 179101 185618 185231 188544 205236 211468 219561 211817 207230 205017 224122
2125 224122 235443 263136 281143 308123 320930 328180 333126 329965 348458 376945 360944 362825
2113C62825J9728K1916m067L47L2753M251J6786J0201J0246K9716M3216L5937
2101E83855J7062r830K9239K9231j378M2402O4666M4858M6204P1233P5526P0245
2089A063313R4582J29997R3826J09486R8372O6727J35893J43637K26004K46060
2079B407897K84669L04312M37404O35659Q77317R46598J156162J356689L05883
2070H712590j130854j608570j386286r63034o62975n08449m33320l29121k06202
2061A483779j27149p4065p0617p7232p0131l5903p6928p7477p0583n4358l5416
2050G13920m0021k7077l9275m7226l5391m5111p728J3389m9225k9651k2018K783
2038C87369l8314j3805N534l325j1205l626l7374l2331j2839k972j1942j3797
$$ plain form
2113 362825 382553 404469 400402 400749 433502 437753 454539 464740 474986 504702 547918 583855
2101 583855 600917 591087 620326 649557 648179 690581 755247 800105 846309 917542 993068 1063313
2089 1063313 1157895 1287892 1381718 1491204 1589576 1656303 1792196 1935833 2161837 2407897
2079 2407897 2692566 2996878 3434282 4069941 4947258 5893856 7050018 8406707 8712590
2070 8712590 7581736 5973166 4586880 3623846 2960871 2452422 2019102 1689981 1483779
2061 1483779 1356630 1282565 1211948 1134716 1064585 1028682 951754 874277 803694 749336 713920
2050 713920 673899 646822 607547 560321 524930 479819 472091 485480 436255 406604 384586 387369
2038 387369 349055 335250 340784 337459 326254 322628 285254 252923 240084 237112 225170 211373
2026B11373m532o709K6220m0602j3496M57k9484j7028J7712j0763j5902j2774
2014A04472L5964m426j8256q216l327J0784j8663N556K923l542L1728k3189j5060
2001I6748j1593O322k351j2342j8332J2366N39J0386K8908j7182k5158L2960j2242
1988H9029k5558K210k7340p497J6309r253P180j8211O90K8947Q496j7217j1122
1975C6663K1074k2460J8005K4185j2317j0720l2074j4501J2487J0678K7178j0283
1963D7915N450j4589J4275m329k5683l897L1585l0394j9629J7177p846n987L7952
1950D2000k9133R522j8938J2283K7566k1506K87j9742r404O927R381K0398N620
1937C5261q13j5173q719O756J1305r398k2452j991m565O515L603O443J274J207
$$ plain form
2026 211373 206841 200132 226352 185750 172254 172711 143227 126199 143911 133148 117246 104472
2014 104472 140436 136010 117754 109538 106211 116995 98332 103888 106811 103269 134997 111808 96748
2001 96748 85155 91477 89126 76784 58452 70818 71357 81743 110651 93469 68311 101271 89029
1988 89029 63471 65681 38341 30844 47153 37900 45080 26869 27559 56506 65002 47785 36663
1975 36663 57737 35277 53282 77467 65150 54430 22356 7855 20342 31020 58198 47915
1963 47915 53365 38776 53051 48722 23039 19142 50727 20333 704 17881 10035 4048 42000
1950 42000 12867 22389 3451 15734 43300 21794 22081 2339 -7065 -138 9243 29641 35261
1937 35261 34448 19275 10556 17312 28617 19219 -3233 -5224 -9789 -3274 329 6772 8046 9253
1923I253k6621J1142J448J7588l498j1550J9011O510K4359l928k541k5613k7950
1910a2390J1381n031k019j692J244R53Q921k0217k885K5905J4277M132Q126q974
1896B1731k4678o021Q511j074J7987k3095J9575k1613j3602J5300K274Q802N032
1883I129J4493J259k4179j0548L432j438J6546j1985R561K1416l8314q076J1156
1870g548k0946J484j544m751J4129J4131j4342K3966j1998k5921J0600J9583J8224
1857A5067j8436O375p015j6089j1312k401M6233R388j8279m575k580j0833K3316
1844H859j7418k496n391l847K049j3219P186J1165K4267o149p482N836l175O415
1830F600j5068j3203K3612J4703q631j0005n002j2062q129J3755K064j0856Q450
$$ plain form
1923 9253 -17368 -6226 -4778 12810 9312 -2238 16773 23283 47642 43714 41173 15560 -12390
1910 -12390 -1009 -6040 -8059 -9751 -8507 -7554 1367 -18850 -21735 4170 18447 22579 30705 21731
1896 21731 -2947 -8968 -457 -1531 16456 -6639 12936 -8677 -22279 -6979 -4705 4097 9129
1883 9129 23622 24881 702 -9846 -6414 -7852 8694 -3291 6270 27686 -10628 -18704 -7548
1870 -7548 -28494 -27010 -28554 -33305 -19176 -5045 -19387 4579 -7419 -33340 -22740 -3157 15067
1857 15067 -3369 3006 -4009 -20098 -31410 -33811 12422 21810 3531 -1044 -3624 -14457 8859
1844 8859 -8559 -11055 -16446 -20293 -18244 -31463 -24277 -13112 11155 5006 -2476 3360 185 6600
1830 6600 -8468 -21671 1941 16644 8013 -1992 -6994 -19056 -27185 -13430 -11366 -22222 -13772
1817a3772p858j2555P177p255Q955p760n0199M5773K6344K4998J3843j1697k402
1804A3592M56J2465j7160j5460k50K0750m478k702p88J711k4250q710J0475J8133
1790C784J0603l3553l367J9119M306j0838K2355M114j9942M116k4329j2062K1084
1777a4610n493J5420m166N477J2886k3267O890J9077j3105k6567j2851q686K8896
1764b0099J4368J46K107J0330n780k3196O710J4176O857k969j9275O02K3905l049
1750D833P611k5229j4888K6905J9579j9523j9992J6325l811P778M422k6084M728
1737a7346K7047k0278j8904q3M205L564L2836m58j0782j3897k3000j1478M283
1724d4291K5809J4702O567j6973J280K8969o739l2578P202j5276j6542L7835K299
$$ plain form
1817 -13772 -21630 -34185 -27008 -34263 -25308 -33068 -83267 -37494 -11150 13848 27691 15994 13592
1804 13592 14048 26513 9353 -6107 -6357 14393 9915 7213 6425 8136 -16114 -24824 -14349 3784
1790 3784 14387 -19166 -22533 -3414 892 -9946 12409 16523 -3419 697 -23632 -35694 -14610
1777 -14610 -20103 -4683 -8849 -3372 9514 -13753 -6863 12214 -891 -27458 -40309 -48995 -20099
1764 -20099 -5731 -5585 -3478 6852 1072 -22124 -15414 -1238 5619 2650 -16625 -16023 7882 4833
1750 4833 12444 -12785 -27673 -768 18811 -712 -20704 -4379 -8190 -412 4010 -22074 -17346
1737 -17346 9701 -10577 -29481 -29564 -25359 -21795 11041 10583 -199 -14096 -37096 -48574 -44291
1724 -44291 -18482 -3780 2787 -14186 -12906 16063 9324 -23254 -16052 -31328 -47870 -10035 -7736
1711g736j0596Q512L5116p981j225m5097R766K4707j3091J2192j7854N527q098
1698a5858m438l939L4035p532k3345J069Q351N104R90J5697j4320j9817J3487
1685a0516L1570j0304l0328L5889J5418k4190j9357m34K143n852j4992J5280l945
1672a9618j2902j4469R496Q558k2847M279L4525j3445J3879J1943J442r991j560
1659a0710K1750m698k3344K893K442l369k1876K0040L0679l7316Q949r30K5751
1646A0261j7009q008M850j145J611q214j1512j4693J2800J1442J2524N909q405
1633i589j1897j2220j014k2469k481K9925J3497K1340J6667j8117n628j358R03
1620b441k1600J7484j6698l742O175N400P436K4234O825l1368l098O363K5824
$$ plain form
1711 -7736 -18332 -9820 25296 17315 16090 -29007 -19241 5466 -7625 4567 -13287 -7760 -15858
1698 -15858 -20296 -24235 9800 2268 -21077 -20008 -11657 -6553 -5563 10134 -4186 -24003 -10516
1685 -10516 21054 10750 -19578 16311 31729 7539 -11818 -12252 -10109 -15961 -30953 -15673 -19618
1672 -19618 -32520 -46989 -37493 -28935 -51782 -47503 -12978 -26423 -12544 -601 841 -9150 -10710
1659 -10710 11040 6342 -17002 -14109 -11667 -15036 -36912 -16872 13807 -23509 -14560 -15490 10261
1646 10261 -6748 -14756 -9906 -11051 -9440 -17654 -29166 -43859 -31059 -19617 -7093 -1184 -9589
1633 -9589 -21486 -33706 -34720 -57189 -59670 -29745 -16248 5092 21759 3642 -1986 -3344 -2441
1620 -2441 -24041 -6557 -23255 -26997 -20822 -15422 -7986 16248 23073 -8295 -11393 -5030 20794
1607B0794j5867N69j6403r493J9891p960J5357J7999j2251j0872j2308q660J1829
1594g375J5009k1125j9095j69J7793k986K8868m590k0006k298j2559k989J2653
1581a8869J5719N975k465k2305J7474k1556j2093J1005K5071Q779p429K2916j1038
1568A1184j4065j3133P376j9647M806L2065N325j2982j3393Q414l4385O320K9094
1555c021J4887j6506k1601K6615J8426j4000p800m229j6301o329L0325R480l681
1542F265j0252l051p121k5204K2580L4163j0777l048j752J051j7183l1602J5262
1529c0669J4093j7237Q828o604k2539P023K0591K0021k9262j7943N976P763J1195
1516b8764J3082K732p48j726m282p520K6609n939n730j9366k157J1821J4327k0907
$$ plain form
1607 20794 4927 5496 -10907 -20400 -509 -8469 6888 24887 12636 1764 -10544 -19204 -7375
1594 -7375 7634 -13491 -32586 -32755 -14962 -17948 10920 6330 -13676 -15974 -28533 -31522 -18869
1581 -18869 -3150 2825 360 -21945 -4471 -26027 -38120 -27115 -2044 6735 -694 22222 11184
1568 11184 -2881 -16014 -8638 -28285 -23479 8586 13911 929 -12464 -4050 -38435 -32115 -3021
1555 -3021 11866 -4640 -26241 374 18800 4800 -3000 -7229 -23530 -29859 466 9946 6265
1542 6265 -3987 -7038 -14159 -39363 -16783 17380 6603 3555 1803 2854 -14329 -45931 -30669
1529 -30669 -16576 -33813 -24985 -31589 -54128 -47105 -26514 -6493 -35755 -53698 -47722 -39959 -28764
1516 -28764 -15682 -12950 -13698 -15424 -19706 -27226 -617 -6556 -12286 -31652 -33809 -21988 -7661 -28568
1502b8568L3110J6466j9672m001j7020l70l121Q142L073R541j5556L317j4622
1489b9281j204L3458J3037k8867J4130M504j4461k0848n968L1492J3231o829l35
1476B059r626m0490P222K6056K2715J2963j7793k2600n715j8903O262R004K4399
1463d447K575m398p625j2355M880J5876J0968k026j0563j3416M593j0146J5394
1450a0690J3059j8896J0119l0587j9647L4127J3334J5032Q922j0302L64q836k0042
1437b4043m68L059J5555q32j4810q601J1479J142j6699K392K2832o860P131J3881
1423E158j4028j028q965o547K7277J1506L668k6275k768j203k444L126r706K7071
1409D842k023L131L875j3724M960Q498j9842J0438K5973p811P504k8532j1749
$$ plain form
1502 -28568 4542 21008 1336 -2665 -19685 -20055 -23176 -15034 -11961 -2420 -17976 -14659 -29281
1489 -29281 -30485 2973 16010 -12857 1273 5777 -8684 -29532 -35500 -4008 9223 2394 2059
1476 2059 -7567 -48057 -40835 -14779 7936 20899 3106 -19494 -25209 -44112 -37850 -28846 -4447
1463 -4447 -1872 -6270 -13895 -26250 -21370 -5494 5474 3448 -7115 -20531 -15938 -26084 -10690
1450 -10690 2369 -16527 -6408 -36995 -56642 -22515 -9181 5851 14773 4471 4835 -4001 -24043
1437 -24043 -24511 -21452 -5897 -6729 -21539 -30140 -18661 -17519 -34218 -31826 -8994 -15854 -8723 5158
1423 5158 -8870 -9898 -18863 -25410 1867 13373 17041 -9234 -12002 -13205 -15649 -12523 -22229 4842
1409 4842 2819 5950 9825 -3899 1061 9559 -10283 155 26128 18317 25821 -2711 -14460
1396a4460o619R016J8436L242j3998j8995j2815J7771j7294N704K3825J5172j3439
1383d454P001l8895M161j907O407K7080j0085J0972k0491K817K412J7383j7303
1370a4902q15j558j6924M528O076l960k529J8800j93M244k318P327J2715k2602
1356a2111J4211j9040J9683j4016M881J2458k1389L7604j1909j8541j4109J347
1344b0931j8728l2884L4305K2660P843M54l313p400R546P013Q66R31j8156J2560
1330e234r912P326J6427l3258M4445p224j5528l2997R389L6058k8796O29J2788
1317e887K276o739o897l100P254J0788o380O883l462n941j1634J4333J3032O146
1303A0672o518j7593j3372J3978m455l901L0378j1916k3157J6566k859k4758J4505
$$ plain form
1396 -14460 -21079 -12063 6373 9615 -4383 -23378 -36193 -18422 -35716 -30012 -6187 8985 -4454
1383 -4454 2547 -36348 -32187 -34094 -27687 -607 -10692 280 -20211 -17394 -14982 2401 -14902
1370 -14902 -15717 -17275 -34199 -29671 -23595 -27555 -30084 -11284 -11477 -7233 -9551 -2224 10491 -12111
1356 -12111 2100 -16940 2743 -11273 -6392 6066 -15323 22281 10372 -8169 -22278 -20931
1344 -20931 -39659 -72543 -38238 -15578 -7735 -7281 -10594 -17994 -8448 -1435 -569 362 -17794 -5234
1330 -5234 -15146 -7820 8607 -24651 19794 12570 -2958 -35955 -26566 9492 -19304 -18675 -5887
1317 -5887 -3611 -10350 -17247 -20347 -13093 -2305 -8685 -1802 -5264 -11205 -22839 -8506 4526 10672
1303 10672 4154 -13439 -26811 -12833 -17288 -21189 9189 -2727 -25884 -9318 -12177 -36935 -22430
1290b2430J3086M317J189J3294j6281n525J4870k2581k95l980j8654j3509J8466
1277c8033J6557R033J257K0748p439q660O714k0513M450J2980J166L513O919l1402
1263b2710k4700J7507m583J148K8702M645q158p092j8551R47J2065j7474M4076
1250E822j230j1006M653j107k3762K1422N356j0130j0835K503N451K5816O598
1237A9551k2222l9835J5840M0263q089k8073J301K7577K6010n78j298q512k2864
1224i29k2220J1142L341p037j8186K5257L3737m3424J4484j770J030j7978J433
1211b1120K1388m94J7746j5806l2297Q618J3570M365K8499j3168j5411N302j2971
1198a1779r412J3265K2340l998l8104J0027J0972P051L3232p144j8297m224j1976
$$ plain form
1290 -22430 -9344 -5027 -3838 9456 -6825 -12350 2520 -20061 -20356 -24336 -42990 -56499 -38033
1277 -38033 -21476 -12443 -11186 9562 2123 -6537 177 -20336 -15886 -2906 -1740 1773 8692 -22710
1263 -22710 -47410 -29903 -34486 -33338 -4636 9 -8149 -15241 -33792 -32845 -20780 -38254 5822
1250 5822 4592 -6414 -1761 -2868 -26630 -5208 148 -9982 -20817 -18314 -12863 12953 19551
1237 19551 -2671 -42506 -26666 13597 5508 -22565 -21264 6313 32323 31745 30447 21935 -929
1224 -929 -23149 -12007 -8666 -15703 -33889 -8632 25105 -18319 -3835 -5605 -4575 -22553 -21120
1211 -21120 268 -226 17520 1714 -30583 -21965 -8395 -4030 24469 11301 -4110 1192 -11779
1198 -11779 -21191 -7926 14414 10416 -27688 -17661 -6689 362 33594 26450 8153 3929 -8047
1185h047J6325J3163j8965p421j4994K706J0732j8011j2012j230J823O408N316
1172b4207J1336j2018J7738o791N186l095K1344Q493k8488J0309L8266j2655k8059
1159b641J3253N172l5983j2373j555R324j167j814L025L439K0624P827l213J7847
1145B1765j413k1956j8145o457J4267Q806k0726Q335m492J1739J0788r615J9834
1132A2730l3447J1934J0765j2662J6782J5875j1064j2394m872R700L263L107M101
1119A3818j5777j4368J38J9865o363m750R045m45L725k9038j1399K9655j8863
1106b4757J8819O394j8140J6249j3234k0285L5612J3284j2744M279J1372j3005
1094C844M605j0501q319P016J660j0488j8778J9059J3040J2296j7894j9208l985
$$ plain form
1185 -8047 8278 21441 2476 -4945 -19939 -17233 -6501 -24512 -36524 -37754 -35931 -29523 -24207
1172 -24207 -12871 -24889 -7151 -13942 -8756 -11851 9493 17986 -10502 -193 38073 25418 -2641
1159 -2641 10612 15784 -20199 -32572 -34127 -24803 -25970 -27784 -24759 -21320 -696 7131 3918 21765
1145 21765 20352 -1604 -19749 -26206 -11939 -3133 -23859 -15524 -20016 -8277 2511 -7104 12730
1132 12730 -20717 -8783 1982 -10680 6102 21977 10913 -1481 -6353 3347 6610 9717 13818
1119 13818 -1959 -16327 -16189 3676 -2687 -7437 1608 1163 4888 -24150 -35549 -5894 -24757
1106 -24757 -5938 456 -17684 -1435 -14669 -34954 658 13942 1198 5477 16849 3844
1094 3844 8449 -2052 -10371 -3355 -1695 -12183 -30961 -11902 1138 13434 -4460 -23668 -27653
1081b7653L5010l523n147j0176M2J298J9882j3367j3225J85K0896J7309p163J0362
1067B4730p571j301o431N3K0354j6779r961K1109j1318l3114J7122L0615k8395
1054h87O54n335j0611J7683j794k811N985j4531J9686l285k6044J0291J1858j0702
1040i843l7236J9380L9883J6781k9329q129J2046j6686o992M731L0943n590k1
1027I938q042k706K0431L359k445j7557l491j8004K3664J27J5926n806m5189j2810
1013d2605K0451L3789j2147m30j615o750O708P51J5821J0804k4341j4618k328
1000a6510Q216p821Q716p38q912O673K6319r094p437K261l1546k289p126J8013
986b1275j2622j1390K4424L4736m195p919j6726k695J766M659L5804k3439K2626
$$ plain form
1081 -27653 7357 3834 -1313 -11489 -11447 -10149 9733 -3634 -16859 -16674 4222 21531 14368 24730
1067 24730 17159 15858 9427 9480 29834 13055 3094 24203 12885 -20229 -3107 27508 -887
1054 -887 -233 -5568 -16179 1504 -290 -3101 2884 -11647 8039 4754 -21290 -10999 859 -9843
1040 -9843 -47079 -27699 12184 28965 -364 -8493 3553 -13133 -20125 -15394 15549 9959 9938
1027 9938 1896 -810 19621 22980 20535 2978 -513 -18517 5147 5274 21200 15394 -29795 -42605
1013 -42605 -22154 11635 -512 -942 -2557 -9307 -2599 -1848 13973 24777 436 -14182 -16510
1000 -16510 -8294 -16115 -7399 -8137 -17049 -10376 15943 6849 -588 1673 -29873 -32162 -39288 -21275
986 -21275 -33897 -45287 -20863 13873 9678 1759 -14967 -17662 -15896 -11237 24567 1128 23754
973B3754n910j3970k042o601O129j1775M927J4745k6290O288J8455J858R113j08
959A8573J922m281j9104n561l4475Q109R437J4545J2469l349J6272K607l54M027
945B0837j1966m571j1184j4468k520l134p485J2500K3029k4285j264Q872n228
932b0867J5005k795K0475j3941k738j2169p197J145p680J3945M2697j4641m2554
919c1315Q596N229O254j8631K0006O391K7597n996O162k2364P451j0945Q538n075
905A898J5542K233n975m987o807N49k1230j0312K2513l511L37K7183m64k3307
891f338o239J4259J1668j7936j5436L0545k340q841P982j0684M8372p079k0783
878A7150J6945j5749l623k0339J1003j5513K584N614J4271k5413n920j4100L8061
$$ plain form
973 23754 17844 3874 1832 -4769 1360 -10415 -5488 9257 -17033 -10745 7710 9568 18681 18573
959 18573 20495 16214 -2890 -8451 -42926 -34817 -25380 -10835 1634 -1715 14557 17164 16810 20837
945 20837 8871 4300 -6884 -21352 -23872 -27006 -34491 -21991 1038 -23247 -24511 -15639 -20867
932 -20867 -5862 -8657 11818 -2123 -4861 -17030 -24227 -23082 -30762 -16817 25880 11239 -31315
919 -31315 -22719 -17490 -11236 -29867 -9861 -3470 24127 18131 24293 1929 9380 -1565 6973 1898
905 1898 17440 19673 13698 8711 1904 2453 -18777 -29089 -6576 -10087 -9750 17433 16969 -6338
891 -6338 -12577 1682 13350 -4586 -20022 10523 8183 -658 7324 -3360 45012 37933 17150
878 17150 34095 18346 14723 -5616 5387 -10126 -7542 -1928 12343 -13070 -18990 -33090 4971
865D971K3072q289m602R568J9307q627l8905N873N376N583k967R081R24m0769
851b0404L765m443R940j5862Q347J8557j6240L0180q207j3381J5285J949j3830
838d344j5160M7259M57n3086k0115M8365j3117O716J1111r699n609O223j0021
825a1020p138L639R841K3862k7407n879j109J0220J3657J295J0147J5017j4047
812B1078q748Q9m744J7525j1390m1863J5417J7861L372j0409k388j143N216k463
798b590L737r106J993L655j1584j4319P741J9392k5119p307J8179J7060J7345
785A9077J753l9803J888L3037R717Q696j2112K842q637M306J4959j5758J3855
772C3820j3678k0175M118R289Q13j1129M484M773j8115J285K894K821J1104k7228
$$ plain form
865 4971 28043 19754 15152 24720 44027 35400 -3505 2368 7744 13327 10360 19441 20365 -20404
851 -20404 -16639 -21082 -11142 -27004 -18657 -100 -16340 13840 5633 -7748 7537 9486 -4344
838 -4344 -19504 27755 28212 -24874 -44989 3376 -9741 -3025 8086 -1613 -7222 -999 -11020
825 -11020 -18158 -14519 -4678 19184 -8223 -14102 -15211 -4991 8666 9961 20108 35125 21078
812 21078 12330 12419 7675 25200 13810 -28053 -12636 5225 8597 -1812 -4200 -5343 -127 -2590
798 -2590 1147 -7959 -5966 -2311 -13895 -28214 -20473 -1081 -26200 -33507 -15328 1732 19077
785 19077 20830 -18973 -17085 15952 25669 34365 22253 25095 16458 20764 35723 19965 33820
772 33820 20142 -33 4085 13374 14187 3058 7542 12315 -5800 -4515 -1621 1200 12304 -14924
758a4924N941P005J4351k937j3172k3004K4944K7062k658l006n950o619k2736
745a5703J6420N720j8793j579L1345R296p678k2452K8892o186r723j934k9359
732b1734j5570J7839K0065J0094J910J3957j4904j5582p045P037L295K084l2542
719c1096R092J0796m872m775L5619q214N573J1840j4770J4913p366R059j8106
706G693j5998k6921o213J9119J9678k770j308m225j6323J3702M250J7713M00j9824
692a1027j2144K3171P346j9749m429k0219J0109k2137J5738K0106K0298J683q976
679b30P003K8388l373k9131L76J0162k4964J6505p922j7373J2777n63k954m137
665a5436K6368j7019k7614p145J1710L8827j9172J8608k2888R865k841m137k04
$$ plain form
758 -14924 -8983 -1978 12373 9436 -3736 -26740 -1796 25266 22608 19602 13652 7033 -15703
745 -15703 717 6437 -12356 -13935 17410 26706 19028 -3424 25468 19282 9559 7625 -21734
732 -21734 -37304 -19465 600 10694 12604 26561 11657 -3925 -10970 -3933 -638 1446 -31096
719 -31096 -22004 -11208 -16080 -20855 14764 6550 12123 23963 9193 24106 16740 25799 7693
706 7693 -8305 -35226 -41439 -22320 -2642 -5412 -6720 -10945 -27268 -13566 -9316 8397 8797 -11027
692 -11027 -23171 0 7346 -12403 -16832 -37051 -26942 -49079 -33341 -13235 7063 8746 -230
679 -230 6773 35161 31788 2657 3033 13195 -11769 4736 -3186 -20559 -7782 -8345 -11299 -15436
665 -15436 10932 -6087 -33701 -40846 -29136 9691 -9481 9127 -13761 -3896 -6737 -10874 -11078
652a1078m983K7356j2134K4713r449J1355L937o474k1469j278J1806r797N047
639G552r260m342J1427M273J6977J1636j2764p077l947J0155l63k4224l666p582
625a1205k906K5129M686R195j4567K5480j7088k9229o57L3148J0045k6121K521
612H431l04l697J0811p744j3040K5551n475n165j1282J0251p237o888L0512J1248
598C5972J821o498k2479J963r470j2171q255J9935O935K2206j9412q724J6424
585A8247j030M371J0959m1869M708k7164L796N0637o803k6980j9360J9801k1599
572c2286Q863J4614J8695K3686j6994m1910M7Q716M048J8769j6701k2528K0434
559a2547L96J4210J9164K3188j7097j3291O830J1689J719l5399J5268P501M307
$$ plain form
652 -11078 -16061 11295 -839 23874 14425 25780 29717 23243 1774 496 12302 2505 7552
639 7552 -1708 -6050 5377 9650 26627 38263 25499 18422 14475 24630 24267 43 -3623 -11205
625 -11205 -14111 11018 15704 24899 10332 35812 18724 -10505 -11162 21986 32031 5910 8431
612 8431 8127 4430 15241 7497 -5543 20008 14533 9368 -1914 8337 1100 -5788 24724 35972
598 35972 37793 31295 8816 10779 1309 -10862 -19117 818 7753 29959 10547 1823 18247
585 18247 17217 21588 32547 -9322 -4614 -31778 -27982 22655 15852 -11128 -30488 -10687 -32286
572 -32286 -23423 -8809 9886 33572 16578 -25332 -25285 -16569 -12521 6248 -10453 -32981 -12547
559 -12547 -12151 2059 21223 44411 27314 14023 20853 32542 34261 -1138 14130 21631 25938
546B5938l764l0161N334O497j3557L167m839K0479p635k183R364j0002J6122O053
532B0813k2339l011J6330J7244k3175m285l805J2007J1414j4763K504J7535o552
519A9917R474j3009j4051J2217J3022p546j5464j376q921j349k9283K4717L4166
506B2514m623N85j7921j4336K931q791K1408j0325J5072M281K2682j2625k5581
493d729O739K858K1261N708r238L08M55j74r906K0740J442j6928k1248j159K2183
478A8312j7124R696J0980O138J6999k8953J5603O772j2581j2606j486j7386J3164
465G528L8123j2928K846j0852m3857Q84J9749R431l159Q554j0016j1602J3062
452G763r076R933R694m243j0060K3408k8483j5402J3255O140r911J0701O160j3573
$$ plain form
546 25938 22174 -7987 -2653 3844 -9713 -6546 -11385 9094 1459 -724 8640 -1362 14760 20813
532 20813 -1526 -4537 11793 29037 5862 1577 -2228 9779 21193 6430 8934 26469 19917
519 19917 29391 16382 2331 14548 27570 20024 4560 3184 -5737 -7086 -36369 -11652 22514
506 22514 17891 18476 555 -13781 -10850 -19641 1767 -8558 6514 10795 33477 20852 -4729
493 -4729 2010 4868 26129 31837 22599 22907 23362 23188 13282 34022 35464 18536 -2712 -3871 18312
478 18312 1188 10884 21864 28002 45001 16048 31651 38423 25842 13236 11750 -5636 7528
465 7528 45651 32723 35569 24717 -19140 -18256 1493 10924 7765 16319 6303 -5299 7763
452 7763 -1313 8620 18314 14071 4011 27419 -1064 -16466 -3211 2929 -6982 3719 9879 -3694
438c694J844J3364o979Q1o063R649J2222J5444k2758j5442J8140n550J5072J230
424B6560k3428n791n320K1420J3J3358k154p518J222j2985k1940N571K0364O781
410A6153L7537j8702l3227k0928R934K0284n952k525Q65k0982J0339R655P380
397I831k560j1023q255J825N54l130l27J4529L9617m053l9514j035Q820J1692
383A6971j3628J2290K468j2470J3272r063J5091J0982k7558q52O145q99r222J5208
369A8735j9712p081p537J6532M935k6538R273J6294P200l2046J0908n390K6345
356A1918J0444j3608l923j0766J3343o349p049J0265N396N276j019k132k5775
343a3979K2868J1154j5290L640J8694k3449o815k98J8007m863k0261k478L0876
$$ plain form
438 -3694 -1850 11514 4535 4616 -1447 8202 20424 35868 13110 -2332 15808 10258 25330 26560
424 26560 3132 -2659 -7979 13441 13454 26812 24658 17140 18362 5377 -16563 -10992 9372 16153
410 16153 53690 34988 1761 -19167 -9233 11051 5099 2574 3439 -17543 -7204 2451 9831
397 9831 7271 -3752 -12007 -10182 -9628 -12758 -13085 1444 41061 37008 -2506 -3541 5279 16971
383 16971 3343 15633 18101 5631 18903 9840 24931 35913 8355 7503 13648 12749 3527 18735
369 18735 -977 -8058 -15595 937 5872 -20666 -11393 4901 12101 -19945 -9037 -14427 11918
356 11918 22362 8754 4831 -5935 7408 1059 -5990 4275 9671 14947 13928 11796 -13979
343 -13979 8889 20043 4753 8393 27087 3638 -3177 -3475 14532 9669 -10592 -13070 17806
330A7806J1957j8953j1327j8657L6135J7540k0551J4391k866j5545J0750k0003
318F77j6905J6359K7402m320q075p278j3720P663J6284p054J6245q532j5019K4313
304B8040L964j9388l197r11k8635J3396K7363k0192J64M000N514m392J921K4478
290C2125N732l2755J955M719M356P069J2250r851k2001j2726P134K2748Q298j8211
276A0842k640J062k870J8485J2525k0525P638k8365l848K4385J6698j5237q477
263I673J6790j1206j1339m614k0547N52Q102J0632J1747k6315L8471j7565l0386
250b6005Q716K3643M384J0603n109n135o024j5989Q710K1666j4350J5234P156
237B7500j5163J4191l0212j4863J0006M450J1042J3342j7051k4852J1746l798
$$ plain form
330 17806 29763 10810 -517 -19174 16961 34501 13950 28341 25475 9930 20680 677
318 677 -16228 131 27533 23213 15138 7860 -5860 1803 18087 11033 27278 18746 3727 28040
304 28040 32004 12616 9419 8508 -20127 -6731 20632 440 604 4604 10118 5726 7647 32125
290 32125 37857 5102 7057 11776 16132 23201 35451 25600 3599 -9127 -1993 20755 29053 10842
276 10842 8202 9264 6394 24879 37404 16879 24517 -3848 -7696 16689 33387 18150 9673
263 9673 26463 15257 3918 -696 -21243 -20691 -12589 -1957 9790 -16525 21946 4381 -26005
250 -26005 -17289 6354 10738 21341 16232 11097 5073 -10916 -2206 19460 5110 20344 27500
237 27500 12337 26528 -3684 -18547 -8541 -4091 6951 20293 3242 -21610 -9864 -13662
225a3662o89K524O550R859R812m115o580l963j4570j7084q243M172K2330j1781
211b5440O920J8320L248J4993j1684j1674l750j4617K732J1690k532N042J8588
198A1836j5881K642K0851L47k0019J761J0115P664j9349k2989M019m45N52p274
184b6170K6988J2404k7458j4991J9674j1806J5300J7569n603O607K662l3761K185
171a6400K6756O755r346l0090j1434J193J6509L7899l351q949q816k0941j335
158b1550J8654k752j2082j0731K8998q031j5466K4134j3871j3246n690R255J910
145b0468M156n781j1134O209O320j2643J686P672j002O443K770M237q628K2444
131B281j1513j9531J3668q233k95N420N220j2405J217K035j2230J878N362j1204
$$ plain form
225 -13662 -14351 -11827 -5277 4582 14394 10279 3699 -264 -14834 -31918 -40161 -35989 -13659 -25440
211 -25440 -18520 -200 3048 18041 6357 -5317 -9067 -23684 -20952 -9262 -11794 -6752 11836
198 11836 -4045 -1403 19448 19795 -224 1537 11652 19316 -33 -23022 -19003 -19448 -18896 -26170
184 -26170 818 13222 -14236 -29227 -9553 -21359 -6059 11510 5907 12514 15176 -18585 -16400
171 -16400 10356 17111 7765 -22325 -33759 -32566 -16057 21842 18491 9542 726 -20215 -21550
158 -21550 -2896 -5648 -17730 -28461 537 -7494 -22960 1174 -12697 -25943 -31633 -22378 -20468
145 -20468 -16312 -22093 -33227 -27018 -20698 -33341 -31655 -23983 -24985 -18542 -15772 -11535 -20163 2281
131 2281 -9232 -28763 -15095 -23328 -23623 -18203 -12983 -25388 -24171 -22136 -34366 -32488 -27126 -38330
117c8330j4029j3198K1946J4696k786m475j789J0872l715N623l762m0281J683
104f7545K7484O88j6481J6973M048j1778O167q190j62l934J1172R251j1788l467
90d7562n666r616N152k132J0828R100j7881P456J298j2818O518k2971J0400k469
76g0363k228j6496J4980O708j3166K1649j1827m124M56j2702M589k10k3661J9443
62h6952J5883J7211m426j0113j1709k192N641k62J2741J795j8099J4756M199k9562
48i1089N071J2825j4854k638O896m507K2410k2316j4592J0277k803K689n758Q147
34i0242N234q875J951M492j3602L768J258J4099J0746l596j0776r685m508m917
20a04653R331j6007J2739n185j226K826k478J278o566n972m889L728k0121p85
$$ plain form
117 -38330 -52359 -65557 -43611 -28915 -31701 -36176 -37965 -27093 -30808 -25185 -28947 -69228 -67545
104 -67545 -40061 -39373 -55854 -38881 -34833 -46611 -40444 -48634 -48796 -52730 -41558 -32307 -44095 -47562
90 -47562 -53228 -62844 -57692 -59824 -48996 -39896 -57777 -50321 -49023 -61841 -55323 -78294 -67894 -70363
76 -70363 -72591 -89087 -74107 -67399 -80565 -58916 -70743 -74867 -74411 -87113 -82524 -82734 -106395 -86952
62 -86952 -71069 -53858 -58284 -68397 -80106 -82298 -76657 -76919 -64178 -62383 -80482 -65726 -61527 -91089
48 -91089 -86018 -73193 -88047 -90685 -83789 -88296 -65886 -88202 -102794 -92517 -95320 -92631 -98389 -90242
34 -90242 -85008 -93883 -91932 -87440 -101042 -97274 -96016 -81917 -71171 -74767 -85543 -95228 -99736 -104653
20 -104653 -95322 -111329 -98590 -103775 -105001 -102175 -104653 -103375 -109941 -115913 -120802 -117074 -137195 -137980
6a37980J9285P39J032N640Q521p64
0a03527
$$ plain form
6 -137980 -118695 -117956 -116924 -111284 -102763 -103527
0 -103527
$$ Imaginary data points
##PAGE= N=2
##DATA TABLE= (X++(I..I)), XYDATA
16383f26020J0412J7437n414L4649L4606l524J8037J0049M719J1165q444R827
16371d92501J5293l91K1207J4017J9753m229P478J9829R915J8814M85K3757J0482
16358c36091P619R958j69J1371J8901L038R322L2757J1495J4410Q645J7914j9364
16345b10194n407O960J7339J5609J5709O760M121J2631j0848J3343J1773P108
16333a15096R850n669O200K8715J1441M314Q764J4901J687J9248l226m593J9529
16320c935J2051L7489K5377J1928q540J2697J8174J5381L798j7411L989K7394
16308A38392P184K34L0161j090j5912K1071J13m734J8993K4253J1426J3903J430
16295B45424R349L60p59Q308J1403k080k869J7130L2033M647j0090P766K4276
$$ plain form
16383 -626020 -615608 -598171 -603585 -568936 -534330 -537854 -519817 -509768 -505049 -493884 -502328 -492501
16371 -492501 -477208 -477599 -456392 -442375 -422622 -426851 -419373 -399544 -389629 -370815 -370330 -346573 -336091
16358 -336091 -328472 -318514 -318683 -307312 -288411 -285373 -276051 -243294 -231799 -217389 -208744 -190830 -210194
16345 -210194 -215601 -208641 -191302 -175693 -159984 -153224 -149103 -136472 -147320 -133977 -122204 -115096
16333 -115096 -105246 -110915 -104715 -76000 -64559 -60245 -51481 -36580 -34893 -15645 -18871 -23464 -3935
16320 -3935 8116 45605 70982 82910 74370 87067 105241 120622 124420 107009 110998 138392
16308 138392 145576 145810 175971 174881 158969 180040 180153 175419 194412 218665 230091 243994 245424
16295 245424 254773 255133 254374 262682 274085 272005 269136 286266 318299 322946 312856 320622 344898
16282C44898o031N997J1710R084n629J5184K1470J050o999j5239J3569K4573p132
16269D06505K5970J5182j3146J0686J2917J4413l386K3808J1899N811o827K6739
16257E30571J925j5968o539K3435J9172k570o968N243L405K2295J6989J4037J5006
16244F20033n517o688J3982j0651J0958J6872O24j0490q145J0890O726K9654J1999
16231F80247J1570k6337k248J9273j162p958J4667r665Q445J5039n863J5890J1793
16218G23691Q557k8680J7870k1956J6543J5555J3627J9318P07K513j1019m718
16206G52008k420k152O750L9524Q43j9752J6585n409j4139K436K9525J0767J5810
16193H30376P389r166M451J177j3921r83J6290J4667J9903k7125k62r254N844
$$ plain form
16282 344898 338867 344864 356574 365658 360029 375213 396683 397733 390734 375495 389064 413637 406505
16269 406505 432475 447657 434511 445197 458114 472527 469141 492949 504848 510659 503832 530571
16257 530571 532496 516528 509989 533424 552596 550026 543058 548301 551706 574001 590990 605027 620033
16244 620033 614516 607828 621810 611159 622117 638989 639613 629123 620978 631868 638594 668248 680247
16231 680247 691817 665480 663232 682505 681343 673385 688052 678387 686832 701871 696008 711898 723691
16218 723691 732248 703568 721438 699482 716025 731580 745207 764525 765232 767745 756726 752008
16206 752008 749588 747436 754186 793710 794553 774801 791386 785977 771838 774274 803799 814566 830376
16193 830376 837765 828599 833050 834227 820306 819323 835613 850280 870183 843058 842796 833542 839386
16180H39386R245K7429P583j2897Q958P424J9633r357J671J260J3467q646o032
16167H99124j6629q625J5041K0721J4623K67N567O804r674p061M904R502p804
16154I26760m909K1748j0111L984L9859p222r249l787n080p090p072J9334j8056
16141I39109k0744Q413J5979k7517L0168K0934J2649j4270j6434L1023M094l2396
16129I51008N203J207N89q498M771n976K249K7515p23r409L695J606M752q917
$$ plain form
16180 839386 848631 876060 883643 870746 879704 887128 906761 897404 899075 900335 913802 905156 899124
16167 899124 882495 873870 888911 909632 924255 924522 930089 936893 927219 920158 925062 934564 926760
16154 926760 921851 943599 933488 937472 977331 970109 960860 957073 951993 944903 937831 957165 939109
16141 939109 918365 926778 942757 915240 945408 966342 978991 964721 948287 979310 983404 951008
16129 951008 956211 957418 958007 949509 954280 948304 950553 978068 977345 967936 971631 973237 977989 969072
$$ [...]
##END NTUPLES=NMR SPECTRUM
##END=
