##TITLE=1H_EC-3293(VII-35)
 CDCl3
 8 sc, 
 17.5.2023
##JCAMPDX= 6.0         $$ Bruker NMR JCAMP-DX V2.0
##DATA TYPE= NMR SPECTRUM
##DATA CLASS= NTUPLES
##ORIGIN= UXNMR, Bruker Analytische Messtechnik GmbH
##OWNER= root
$$ XWIN-NMR		Version 3.5
$$ Wed May 17 13:51:14 2023 Russian Standard Time (UT+4h)  she@DPX200
##.OBSERVE FREQUENCY= 200.13135
##.OBSERVE NUCLEUS= ^1H
##.ACQUISITION MODE= SIMULTANEOUS
##.ACQUISITION SCHEME= undefined
##.AVERAGES= 8
##.DIGITISER RES= 18
##SPECTROMETER/DATA SYSTEM= spect
##.PULSE SEQUENCE= zg30
##.SOLVENT NAME= CDCl3
##.SHIFT REFERENCE= (INTERNAL, CDCl3, 0, 15.7348)
##AUDIT TRAIL= $$ (NUMBER, WHEN, WHO, WHERE, WHAT)
$$ ##TITLE= Audit trail, XWIN-NMR		Version 3.5
$$ ##JCAMPDX= 5.01
$$ ##ORIGIN= Bruker BioSpin GmbH
$$ ##OWNER= she
$$ F:/spectra/data/she/nmr/H-F/1/pdata/1/auditp.txt
$$ ##AUDIT TRAIL=  $$ (NUMBER, WHEN, WHO, WHERE, WHAT)
(   1,<2023-05-17 13:50:02.09 +0400>,<she>,<DPX200>,
      <created by zg, POWCHK disabled, PULCHK disabled
       configuration hash MD5:
       00 E9 B6 7A A2 85 ED C7 34 08 36 98 17 FE 4E 26
       data hash MD5: 16K
       0B BD AD E8 61 B7 95 D0 84 5B AC FF 4D 28 8A BB>)
(   2,<2023-05-17 13:50:05.04 +0400>,<she>,<DPX200>,
      <Start of raw data processing
       efp BC_mod = 2 LB = 0.24 FT_mod = 6 PKNL = 1 PHC0 = -19898.38 PHC1 = 11.05272 SI = 16K 
       data hash MD5: 16K
       3F B0 BA 60 C0 DA 51 6D F3 3B E4 FA 78 5F 11 99>)
(   3,<2023-05-17 13:50:25.70 +0400>,<she>,<DPX200>,
      <pk PHC0 = -8.959116 PHC1 = 12.4 
       data hash MD5: 16K
       77 6E F3 CB D7 06 FC 92 39 81 E8 6F 56 5F 92 CF>)
(   4,<2023-05-17 13:50:29.46 +0400>,<she>,<DPX200>,
      <abs ABSG = 5 
       data hash MD5: 16K
       C7 6B 8A 2C 9C 0A D5 61 8C 50 E5 D5 DE 5C 89 63>)
$$ ##END=
$$ 
$$ hash MD5
$$ 07 C6 31 D4 32 C6 6A E9 3F 01 A1 25 C6 09 FE 3B
##$RELAX= 
##$RELAX= 
##$RELAX= 
##$RELAX= 
##$RELAX= 
##$RELAX= 
$$ Bruker specific parameters
$$ --------------------------
##$DU= <F:/spectra>
##$EXPNO= 1
##$NAME= <H-F>
##$PROCNO= 1
##$TYPE= <nmr>
##$USER= <she>
##$AMP= (0..31)
100 100 100 100 100 100 100 100 100 100 100 100 100 100 100 100 100 100 
100 100 100 100 100 100 100 100 100 100 100 100 100 100 
##$AQSEQ= 0
##$AQ_mod= 1
##$AUNM= <au_zg>
##$AUTOPOS= <>
##$BF1= 200.13
##$BF2= 200.13
##$BF3= 200.13
##$BF4= 200.13
##$BF5= 200.13
##$BF6= 200.13
##$BF7= 200.13
##$BF8= 200.13
##$BYTORDA= 1
##$CFDGTYP= 0
##$CFRGTYP= 5
##$CHEMSTR= <none>
##$CNST= (0..31)
1 1 145 1 1 1 1 1 1 1 1 1 1 1 1 1 1 1 1 1 1 1 1 1 1 1 1 1 1 1 1 1 
##$CPDPRG= <>
##$CPDPRG1= <>
##$CPDPRG2= <>
##$CPDPRG3= <>
##$CPDPRG4= <mlev>
##$CPDPRG5= <mlev>
##$CPDPRG6= <mlev>
##$CPDPRG7= <mlev>
##$CPDPRG8= <mlev>
##$CPDPRGB= <>
##$CPDPRGT= <>
##$D= (0..31)
0 1.2 0 0 0 0 0 0 0 0.06 0 0.03 0 0 0 0 0.0002 0 0 0 0 0 0 0 0 0 0 0 0 
0 0 0 
##$DATE= 1684317001
##$DBL= (0..7)
120 120 120 120 120 120 120 120 
##$DBP= (0..7)
150 150 150 150 150 150 150 150 
##$DBP07= 0
##$DBPNAM0= <>
##$DBPNAM1= <>
##$DBPNAM2= <>
##$DBPNAM3= <>
##$DBPNAM4= <>
$$ [...]
##$SUBNAM3= <"">
##$SUBNAM4= <"">
##$SUBNAM5= <"">
##$SUBNAM6= <"">
##$SUBNAM7= <"">
##$SUBNAM8= <"">
##$SUBNAM9= <"">
##$SW= 18.05172834244
##$SWIBOX= (0..15)
0 0 2 0 0 0 0 0 0 0 0 0 0 0 0 0 
##$SW_h= 3612.71676300578
##$TD= 16384
##$TD0= 1
##$TE= 0
##$TE2= 300
##$TE3= 300
##$TEG= 300
##$TL= (0..7)
0 120 120 120 120 120 120 120 
##$TP= (0..7)
150 150 150 150 150 150 150 150 
##$TP07= 0
##$TPNAME0= <>
##$TPNAME1= <>
##$TPNAME2= <>
##$TPNAME3= <>
##$TPNAME4= <>
##$TPNAME5= <>
##$TPNAME6= <>
##$TPNAME7= <>
##$TPOAL= (0..7)
0.5 0.5 0.5 0.5 0.5 0.5 0.5 0.5 
##$TPOFFS= (0..7)
0 0 0 0 0 0 0 0 
##$TUNHIN= 0
##$TUNHOUT= 0
##$TUNXOUT= 0
##$USERA1= <user>
##$USERA2= <user>
##$USERA3= <user>
##$USERA4= <user>
##$USERA5= <user>
##$V9= 5
##$VALIST= <valist>
##$VCLIST= <CCCCCCCCCCCCCCC>
##$VD= 0
##$VDLIST= <DDDDDDDDDDDDDDD>
##$VPLIST= <PPPPPPPPPPPPPPP>
##$VTLIST= <TTTTTTTTTTTTTTT>
##$WBST= 1024
##$WBSW= 4
##$XGAIN= (0..3)
0 0 0 0 
##$XL= 0
##$YL= 0
##$YMAX_a= 134859
##$YMIN_a= -122196
##$ZGOPTNS= <>
##$ZL1= 120
##$ZL2= 120
##$ZL3= 120
##$ZL4= 120
##$ABSF1= 15.76452
##$ABSF2= -2.28733
##$ABSG= 5
##$ABSL= 3
##$ALPHA= 0
##$AQORDER= 0
##$ASSFAC= 0
##$ASSFACI= 0
##$ASSFACX= 0
##$ASSWID= 0
##$AUNMP= <proc_1d>
##$AZFE= 0.1
##$AZFW= 0.1
##$BCFW= 0
##$BC_mod= 2
##$BYTORDP= 0
##$COROFFS= 0
##$CY= -3
##$DATMOD= 1
##$DC= 0
##$DFILT= <>
##$DTYPP= 0
##$F1P= 0
##$F2P= 0
##$FCOR= 1
##$FTSIZE= 16384
##$FT_mod= 6
##$GAMMA= 0
##$GB= 0
##$INTBC= 1
##$INTSCL= 3.70164e-10
##$ISEN= 128
##$LB= 0.24
##$LEV0= 0
##$LPBIN= 0
##$MAXI= 10000
##$MC2= 0
##$MEAN= 0
##$ME_mod= 0
##$MI= 1.114404
##$NCOEF= 0
##$NC_proc= -9
##$NLEV= 6
##$NOISF1= 3.799351
##$NOISF2= 2.8
##$NSP= 0
##$NTH_PI= 0
##$NZP= 0
##$OFFSET= 15.73477
##$PC= 1
##$PHC0= -19907.34
##$PHC1= 23.45272
##$PH_mod= 1
##$PKNL= yes
##$PPARMOD= 0
##$PSCAL= 0
##$PSIGN= 0
##$REVERSE= no
##$SF= 200.13000735961
##$SI= 16384
##$SIGF1= 3
##$SIGF2= 2
##$SINO= 5.538805
##$SIOLD= 16384
##$SREGLST= <1H.CDCl3>
##$SSB= 0
##$STSI= 16384
##$STSR= 0
##$SW_p= 3612.71676300578
##$SYMM= 0
##$S_DEV= 0
##$TDeff= 16384
##$TDoff= 0
##$TI= <>
##$TILT= no
##$TM1= 0
##$TM2= 0
##$TOPLEV= 0
##$USERP1= <user>
##$USERP2= <user>
##$USERP3= <user>
##$USERP4= <user>
##$USERP5= <user>
##$WDW= 1
##$XDIM= 16384
##$YMAX_p= 408053007
##$YMIN_p= -4661971
$$ End of Bruker specific parameters
$$ ---------------------------------
##NTUPLES= NMR SPECTRUM
##VAR_NAME=  FREQUENCY,     SPECTRUM/REAL,   SPECTRUM/IMAG
##SYMBOL=    X,             R,               I
##VAR_TYPE=  INDEPENDENT,   DEPENDENT,       DEPENDENT
##VAR_FORM=  AFFN,          ASDF,            ASDF
##VAR_DIM=   16384,         16384,           16384
##UNITS=     HZ,            ARBITRARY UNITS, ARBITRARY UNITS
##FACTOR=    0.220516191357247, 1,           1
##FIRST=     3148.99960011192, 0,            0
##LAST=      -463.717162893861, 0,           0
##MIN=       -463.717162893861, -4661971,    0
##MAX=       3148.99960011192, 408053007,    0
$$ Real data points
##PAGE= N=1
##DATA TABLE= (X++(R..R)), XYDATA
$$ [...]
6725B927972M74392N4519j97644R33082n32937q88876N41446L87027l63562N00019
$$ 2927972 3402364 3456883 3259239 4192321 3659384 2770508 3311954 3698981 3335419 3835438
6715C835438N86481Q02925l32678n0357L41269l78375M53377R74309p5901n90264
$$ 3835438 4421919 5224844 4892166 4841809 5183078 4804703 5258080 6232389 6156488 5566224
6705E566224O86187J103580P60331Q75495q44050J43454l4807J249818J136109
$$ 5566224 6252411 7355991 8116322 8991817 8147767 8291221 8256414 9506232 10642341
6696A0642341m95123L71942O3104R7816J63769j011346J83924R6625r05989r16642
$$ 10642341 10147218 10519160 10582264 10680080 10843849 9832503 10016427 10113052 9207063 8290421
6686H290421n28394p66142o3331k68371o03560J12180p15737o50572n59131m17752
$$ 8290421 7762027 6995885 6932554 6664183 6060623 6172803 5457066 4806494 4247363 3829611
6676C829611m6345k85366q41388M6830K70801j027890J05796L09169m28403L25599
$$ 3829611 3783266 3497900 2656512 2703342 2974143 1946253 2052049 2361218 1932815 2258414
6666B258414K74268p9334l52837m42815J96312j92547Q2957L0086p13070O39241
$$ 2258414 2532682 2453348 2100511 1657696 1854008 1661461 1744418 1774504 1061434 1700675
6656A700675r00283J95917n99206k40230L75476j23402L3275m22847m08078J345972
$$ 1700675 800392 996309 397103 156873 532349 408947 442222 19375 -388703 957269
6646I57269O0981k80943R73227k31645j376201j31963L29055l3713m23318n4118
$$ 957269 1018250 737307 1710534 1478889 102688 -29275 299780 266067 -157251 -211369
6636b11369j20034L22293R914n59821N78605K33313J16916k08182j86574L02233
$$ -211369 -331403 -9110 804 -559017 19588 252901 369817 161635 -24939 277294
6626B77294k27938j05555O4742n09216N5322l92998Q13488N72251m38909j199195
$$ 277294 49356 -56199 8543 -500673 -445351 -838349 -24861 547390 108481 -1090714
6616a090714K12287K03771L92062K52786l52732k77582M63124k84372N10084n03959
$$ -1090714 -878427 -674656 -282594 -29808 -382540 -660122 -196998 -481370 28714 -475245
6606d75245J71136L89525l65291L51015o04176o4542J82135J68642n1028L28215
$$ -475245 -304109 85416 -279875 71140 -533036 -597578 -415443 -246801 -297829 30386
6596C0386M43817K2912l99103K33751m17257m12558K8206Q61537J71858j01574
$$ 30386 474203 497115 98012 331763 -85494 -498052 -469846 391691 563549 461975
6586D61975m28401L65201j5891J1897j07925m31106q4148J32095j96159n60678
$$ 461975 33574 398775 382884 394781 286856 -144250 -228398 -96303 -292462 -853140
6576h53140R18216O80643m32056l54421l7857j27537J1207N07890l11651m44380
$$ -853140 65076 745719 313663 -40758 -78615 -206152 -194945 312945 1294 -443086
6566d43086l85695q9121k24053K32004n4260J42104J38937M42819j73049l23847
$$ -443086 -828781 -917902 -1141955 -909951 -964211 -822107 -683170 -240351 -413400 -737247
6556g37247j73439j43637M29080p80667k67464L11026K48288j43850K96877O25574
$$ -737247 -910686 -1054323 -625243 -1405910 -1673374 -1362348 -1114060 -1257910 -961033 -335459
6546c35459j76010M86605L08557m21074N60484m69804l21181M51303k47361q06852
$$ -335459 -511469 -24864 283693 -137381 423103 -46701 -367882 83421 -163940 -970792
6536i70792m75871J16268L04264j56326R84744o75249M74531M04064o40128k00433
$$ -970792 -1446663 -1330395 -1026131 -1182457 -197713 -872962 -398431 5633 -634495 -834928
6526h34928J84012M76009N73102m35738n69380M07631L150r25781L35665k96932
$$ -834928 -650916 -174907 398195 -37543 -606923 -199292 -196142 -1121923 -786258 -1083190
6516a083190k19470L42804M7495l67501M35656K63591M34811K18008L16228p4296
$$ -1083190 -1302660 -959856 -912361 -1279862 -844206 -580615 -145804 72204 388432 314136
6506C14136K86362j5415m24681n20006p02339L0291m25489O5842J03313P27503
$$ 314136 600498 585083 160402 -359604 -1061943 -1031652 -1457141 -1391299 -1287986 -560483
6496e60483N81891l43965m59733K50647J58135m26883j79442R39313k49523J62827
$$ -560483 21408 -322557 -782290 -531643 -373508 -800391 -979833 -40520 -290043 -127216
6486a27216j00269P2087L40280k708j28374j70077j66238N16371R7978m04493
$$ -127216 -227485 -155398 184882 182174 53800 -116277 -282515 233856 331834 -72659
6476g2659l04662k88370p29408N07910m14881K47296K24018J63393L5065n04411
$$ -72659 -377321 -665691 -1395099 -887189 -1302070 -1054774 -830756 -667363 -632298 -1136709
6466a136709Q53963P40848l14752m088r29291L05521k41595j03415K05334Q9157
$$ -1136709 -282746 458102 143350 139262 -790029 -484508 -726103 -829518 -624184 -535027
6456e35027j08883l5797R019N28084k66783K33186j01113K88032p1539L215k9164
$$ -535027 -643910 -679707 -670688 -142604 -409387 -176201 -277314 10718 -60821 -57606 -86770
6445h6770j73467l09503l63039K35979j42357L27149K76180o1010m04765N69937
$$ -86770 -260237 -569740 -932779 -696800 -839157 -512008 -235828 -296838 -701603 -131666
6435a31666O14848r8052j313482l59331J76034R58697m99037j84569l94286M77921
$$ -131666 483182 385130 -928352 -1287683 -1111649 -152952 -651989 -836558 -1230844 -752923
6425g52923L67641k537K65599o22983o35358P79365K39174q04853o499R32368
$$ -752923 -385282 -387819 -122220 -745203 -1380561 -601196 -362022 -1166875 -1173374 -241006
6415b41006l36802N46638M17833p9522r55794l88521p4826N22219l60999j54055
$$ -241006 -577808 -31170 386663 307141 -648653 -1037174 -1112000 -589781 -950780 -1104835
6405a104835O47543o44911L03764n51638j70198N48975O1684P18225L73530p35089
$$ -1104835 -457292 -1102203 -798439 -1350077 -1520275 -971300 -909616 -191391 182139 -552950
6395e52950o60369L08889k24594N50903J15141j013186R47039l71563M83642p98303
$$ -552950 -1213319 -904430 -1129024 -578121 -462980 -1476166 -529127 -900690 -417048 -1215351
6385a215351r3968R22190L65798p2173m50960l36883M49100k56654N92410N78936
$$ -1215351 -1309319 -387129 -21331 -93504 -544464 -881347 -432247 -688901 -96491 482445
6375D82445j050289J54456j40986k34415N63789M46861m24992J98645o99679k41798
$$ 482445 -567844 -413388 -554374 -788789 -225000 221861 -203131 -4486 -704165 -945963
6365i45963J0900N54969M56935o0536q84034R72631q16619K16275L62350q32174
$$ -945963 -935063 -380094 76841 16305 -867729 104902 -711717 -495442 -133092 -965266
6355i65266N50445Q82692r20934o37199J69252P66165K62016m46248M03289o64282
$$ -965266 -414821 467871 -453063 -1090262 -921010 -154845 107171 -339077 64212 -600070
6345f00070M08345M67902L6635K15985n1713o83626N7872m61109K35506k16508
$$ -600070 -191725 276177 312812 528797 477084 -206542 -148670 -609779 -374273 -590781
6335e90781m26083N50003O32378l98886J30487l26237l1827O99274j72129J53422
$$ -590781 -1016864 -466861 165517 -233369 -102882 -429119 -460946 238328 66199 219621
6325B19621N23108J2456r34186o32890r69925k58274J253551M28249J9850J2175
$$ 219621 742729 755185 -179001 -811891 -1781816 -2040090 -786539 -358290 -338440 -326265
6315c26265l18418L14075m01283p8144n07200K19094M31303n38940O17432L24062
$$ -326265 -644683 -330608 -731891 -810035 -1317235 -1098141 -666838 -1205778 -588346 -264284
6305b64284o83193m78561J70122j68465N50537J32439K28945K45606o83740N29146
$$ -264284 -947477 -1426038 -1255916 -1424381 -873844 -741405 -512460 -266854 -950594 -421448
6295d21448K68658n17492j42620m72580M73269L47784M35092n59751L20918r9635
$$ -421448 -152790 -670282 -812902 -1285482 -812213 -464429 -29337 -589088 -268170 -367805
6285c67805l85725K76061J4226M81052M65638m15304J97795l24817j83603K87371
$$ -367805 -753530 -477469 -463243 17809 483447 68143 265938 -58879 -242482 44889
6275D4889o99732j076826k34876J032218N37304K77360l11047l59874L44999j26263
$$ 44889 -654843 -1731669 -1966545 -934327 -397023 -119663 -430710 -790584 -445585 -571848
6265e71848J22014K13257m12734O39026r8753J00304L93110K83602k98703n21568
$$ -571848 -449834 -236577 -649311 -10285 -109038 -8734 384376 667978 369275 -152293
6255a52293K33836k97659q1768L89614j57635k15608o05484J26091R40458K5693
$$ -152293 81543 -216116 -297884 91730 -65905 -281513 -886997 -760906 179552 205245
6245B05245j8318j38878m09236n70125R4545N15605K44032m15216M56766n98108
$$ 205245 186927 48049 -361187 -931312 -836767 -321162 -77130 -492346 -35580 -633688
6235f33688K1681J71706K21210J94629k23228K72445L5529l51788N9454j37614
$$ -633688 -612007 -440301 -219091 -24462 -247690 24755 60284 -291504 -232050 -369664
6225c69664m12067Q04615p52845l1232P50025M13565p60811o85135R8234L15321
$$ -369664 -781731 22884 -729961 -761193 -11168 402397 -358414 -1043549 -945315 -629994
6215f29994k25218j01855l49175M96833M36979p21041l07019M18752Q52859n7072
$$ -629994 -855212 -957067 -1306242 -809409 -372430 -1093471 -1400490 -981738 -128879 -185951
6205a85951m34479R6608O06828r03001R5673J05854j62246l18723l55480j36328
$$ -185951 -620430 -523822 83006 -819995 -724322 -618468 -780714 -1099437 -1454917 -1591245
6195a591245O68385O41460M9351J32704l83822o2429m92580O91120N0061m43160
$$ -1591245 -922860 -281400 -232049 -99345 -483167 -545596 -1038176 -347056 -296995 -740155
6185g40155n53054M34846Q98875M28716J02978k29477k94947n57215k69868j46937
$$ -740155 -1293209 -858363 40512 469228 572206 342729 47782 -509433 -779301 -926238
6175i26238p3277M74143L65157n55042L72529M79378p2665O28304j08317O4481
$$ -926238 -999515 -525372 -160215 -715257 -342728 136650 63985 692289 583972 648453
6165F48453m71997l52746r04976P505N26150k21612j72717p5340M43845R73694
$$ 648453 176456 -176290 -1081266 -1073761 -547611 -769223 -941940 -1017280 -573435 400259
6155D00259n768J3414o36263K85477j04604k69719N76236n2826n77979j2087M62825
$$ 400259 394491 407905 -228358 57119 -47485 -317204 259032 206206 -371773 -383860 78965
6144G8965J82030n04045l2187M22378j55039J51033n18587J59219M9351J53085
$$ 78965 260995 -243050 -275237 147141 -7898 143135 -375452 -216233 -166882 -13797
6134a3797k39836n54837M48642M00231l23598J71631k42446K41892p01571N5294
$$ -13797 -253633 -808470 -359828 40403 -283195 -111564 -354010 -112118 -813689 -758395
6124g58395j63429M31808O15859l88891O99600k9507k80711l70721q8639N75978
$$ -758395 -921824 -490016 125843 -263048 436552 407045 126334 -244387 -333026 242952
6114B42952J81091o52786m95365k4010P94242J45357k45644O7762n6247j73088
$$ 242952 424043 -228743 -724108 -748118 46124 191481 -54163 13599 -42648 -215736
6104b15736O36579o89860J88345M32495p21613R71456L29015N2970n29652o62170
$$ -215736 420843 -269017 -80672 351823 -369790 601666 930681 983651 453999 -208171
6094b08171m04034J187013q2275m744O4372m89545K92209L40932j70040p62264
$$ -208171 -612205 574808 492533 487789 552161 62616 354825 695757 525717 -236547
6084b36547m15223O00888L51208M42243P59705l52268o68743K91771n67916m24570
$$ -236547 -651770 -50882 300326 742569 1502274 1150006 481263 773034 205118 -219452
6074b19452L30679N17848K61074j66442l93403M3556J82549J44088n66105J68813
$$ -219452 111227 629075 890149 723707 330304 373860 556409 700497 134392 303205
6064C03205j77930J85203J35688o99949J45034O07077N9235J26879n25622o63049
$$ 303205 125275 310478 446166 -253783 -108749 498328 557563 684442 158820 -504229
6054e04229Q61606J51198n62806J39011N99616k2783J29416j14922m6638j56328
$$ -504229 357377 508575 -54231 84780 684396 661613 791029 676107 629469 473141
6044D73141M86338q80368M72165o73095J90819N78928K48761l35596N12367l4412
$$ 473141 959479 79111 551276 -121819 69000 647928 896689 561093 1073460 1039048
6034A039048p08863j55431J53528R861N237Q2869m47906k97466Q1996L14019k85739
$$ 1039048 330185 174754 328282 338143 343380 426249 -21657 -319123 -237127 76892 -208847
6023b08847K16605j00013J08688m551K29896N41634j63238j09377j92822n56780
$$ -208847 7758 -92255 16433 11882 241778 783412 620174 510797 317975 -238805
6013b38805Q26956J40955P81210j601527o19194l50757K40036K85143j90081j11962
$$ -238805 588151 729106 1510316 -91211 -710405 -1061162 -821126 -535983 -726064 -838026
6003h38026J66971Q68744O44569m78338m68315o6849O3616P91683n4768n95502
$$ -838026 -671055 197689 842258 363920 -104395 -171244 -107628 684055 629287 33785
5993C3785K23102K75492p94938K01270k01300L87211j85973P9969m29125L50950
$$ 33785 256887 532379 -262559 -61289 -262589 124622 -61351 18618 -410507 -59557
5983e9557J15472Q098M73902l3442m05551M1245m85428l59595K71374N21035j67485
$$ -59557 55915 64013 537915 504473 98922 140167 -345261 -704856 -433482 87553 -79932
5972g9932L85409j59212J75381J82584k64035M83732k25308N60132M5624j64694
$$ -79932 305477 146265 321646 504230 240195 723927 498619 1058751 1104375 939681
5962I39681q63836l66495M68871O49149j34322J59262o03386k55735Q07548p8116
$$ 939681 75845 -290650 178221 827370 693048 852310 248924 -6811 800737 722621
5952G22621o34679P1756Q5725o6176L7852K67935R3876j45410o8317k60235L791
$$ 722621 87942 159698 245423 179247 217099 485034 578910 433500 365183 104948 108739
5941A08739M37459m86667n04109q1762m7501L69908N10382j52342Q9657j97617
$$ 108739 546198 59531 -444578 -526340 -573841 -203933 306449 154107 243764 46147
5931D6147K16215K1101k46804P1328q16954J556269k62500m14207n44639m60614
$$ 46147 262362 283463 36659 107987 -708967 847302 584802 170595 -374044 -834658
5921h34658J139636L20937o20776Q71861m95404l00973N8961J46402p5237P24813
$$ -834658 304978 625915 5139 877000 381596 80623 139584 285986 210749 935562
5911I35562k47787j224823j36774M35594P19717J03010L95464J8530J29046j32408
$$ 935562 687775 -537048 -673822 -238228 481489 584499 979963 998493 1127539 995131
5901I95131P3192K56930k84853n15368o10185k0120P17662N49129p73782m96660
$$ 995131 1068323 1325253 1040400 525032 -85153 -105273 612389 1161518 387736 -108924
5891a08924K29088L87390N91152l30166p27910j390402N59930Q72404M37604p5346
$$ -108924 120164 507554 1098706 768540 40630 -1349772 -789842 82562 520166 444820
5881D44820k30810O66390k77395M71367K45970r83589o76733l3101j54816J91418
$$ 444820 214010 880400 603005 1074372 1320342 336753 -339980 -373081 -527897 -336479
5871c36479P36538l09498j85444J71832J000103n45450L61620r91534O29741J31256
$$ -336479 400059 90561 -94883 76949 1077052 531602 893222 -98312 531429 662685
5861F62685R39877n25067m27149O00763j11961r92931J001319M77101j160815
$$ 662685 1602562 1077495 650346 1251109 1139148 146217 1147536 1624637 463822
5852D63822l40484j70742L80177q5869K71216o63113l7522J94519L27869O69716
$$ 463822 123338 -47404 332773 246904 518120 -144993 -182515 12004 339873 1009589
5842A009589l1990k5674K8392p87562l0350P6066O0599L55963j82607k74950O22815
$$ 1009589 977599 951925 980317 192755 162405 238471 299070 655033 472426 197476 820291
5831H20291M16259K50597R1987j52270K43500L37059j574824K2237p40683K76989
$$ 820291 1236550 1487147 1579134 1426864 1670364 2007423 432599 454836 -285847 -8858
5821h858P62206J26848l7036n04614K97884M50933k62227J41005R2722k57363
$$ -8858 753348 880196 843160 338546 636430 1087363 825136 966141 1058863 801500
5811H01500m20873o48195J91145k9438K6393N55893k73240q0660M1355M92998
$$ 801500 380627 -267568 -76423 -105861 -79468 476425 203185 122525 163880 656878
5801F56878k59944Q0791k49442q32804P48435K49710L28469k0260l14090k81703
$$ 656878 396934 477725 228283 -604521 143914 393624 722093 701833 387743 106040
5791A06040m06208K48307Q90816N59452m23855J48478m59562J92283n08398k08058
$$ 106040 -300168 -51861 838955 1398407 974552 1123030 663468 855751 347353 139295
5781A39295q11755M85118N97408l89573K13468k09450l2641N94576p72482j54762
$$ 139295 -672460 -187342 410066 20493 233961 24511 -8130 586446 -186036 -340798
5771c40798N62473N3396P5584j21651l56281l52652P20179O14986j79943L94602
$$ -340798 221675 275071 350655 229004 -127277 -479929 240250 855236 675293 1069895
5761A069895n15611l47864J069969o72040p2797P59425j109900p3718N67501m88844
$$ 1069895 554284 206420 1276389 604349 531552 1290977 181077 107359 674860 186016
5751A86016P21788K65126m55008P1979j8544k93245P54907r35270J81719p0560
$$ 186016 907804 1172930 717922 789901 771357 478112 1233019 297749 479468 408908
5741D08908m62697j12450M32500j16221k7137n5005k71198k09785M43036K32173
$$ 408908 -53789 -166239 266261 150040 122903 67898 -203300 -413085 29951 262124
5731B62124q484j46471J22730N14395J80825J14586j50715l27757K14466m15867
$$ 262124 253640 107169 229899 744294 925119 1039705 888990 561233 775699 359832
5721C59832M53222L63903m14910M70415k40910m82895p9572N1769M20712J98532
$$ 359832 813054 1176957 762047 1232462 991552 508657 429085 480854 901566 1100098
5711A100098K65636M13547L81742k86568n72812n69160j042853M81089N4825K71713
$$ 1100098 1365734 1779281 2161023 1874455 1301643 732483 -310370 170719 225544 497257
5701D97257J51308k50666K84247M40032J2902J20400N37244q92387L5313M36347
$$ 497257 648565 397899 682146 1122178 1135080 1255480 1792724 900337 935650 1371997
5691A371997k86074J03433O69740m27639J55666k90595o50341O35344k84351M00506
$$ 1371997 1085923 1189356 1859096 1431457 1587123 1296528 646187 1281531 997180 1397686
5681A397686l69079q56669Q11345L90724J30417k05563j9274K0947k46596j52488
$$ 1397686 1028607 171938 983283 1374007 1504424 1298861 1279587 1300534 1053938 901450
5671I01450k62776J42536l88510J3128J53962P5362k06509L63842K88112N90378
$$ 901450 638674 781210 392700 405828 559790 635152 428643 792485 1080597 1670975
5661A670975L10025j860312m1796J79637o23399J277206j42649j91005L5465p25724
$$ 1670975 1981000 120688 78892 258529 -364870 912336 769687 578682 614147 -111577
5651a11577J78627J041654r3797j77616n76573O5391L85660L44294n4425M5214
$$ -111577 67050 1108704 1014907 837291 260718 326109 711769 1056063 1001638 1046852
5641A046852J49844o73493J01462L29031l28913j120629O54562O99908J86364
$$ 1046852 1196696 523203 624665 953696 624783 -495846 158716 858624 1044988
5632A044988j50349l7723N27542J42333l42503N92916p9107r12014M7410N01724
$$ 1044988 894639 856916 1384458 1526791 1184288 1777204 1698097 786083 833493 1335217
5622A335217n02009j4178r1169l04463N95417J3497P74928p72740k81713J267166
$$ 1335217 833208 819030 727861 423398 1018815 1032312 1807240 1034500 752787 2019953
5612B019953M44258q90316k18267j49488O3312J88841P1702K21361Q0443r21548
$$ 2019953 2464211 1573895 1355628 1206140 1269452 1458293 1529995 1751356 1831799 910251
5602I10251k08441Q3674Q75957k91319L90194L22991m30552j45726O99931K69091
$$ 910251 701810 785484 1661441 1370122 1760316 2083307 1652755 1507029 2206960 2476051
5592B476051o86415o82266J93899M89777M22476L33265n94392k2252O48911Q04139
$$ 2476051 1789636 1107370 1301269 1791046 2213522 2546787 1952395 1930143 2579054 3383193
5582C383193q74291m32148P6570j42121p42998k9136R58903l63789k10153M15618
$$ 3383193 2508902 2076754 2153324 2011203 1268205 1239069 2197972 1834183 1624030 2039648
5572B039648n6839J02916j03811O57770j144302L19958k36799N77390p894q54663
$$ 2039648 1982809 2085725 1981914 2639684 1495382 1815340 1578541 2155931 2148037 1293374
5562A293374L15227j95223l54803J351573o28002p04093K17660k115N57798N63007
$$ 1293374 1608601 1413378 1058575 2410148 1782146 1078053 1295713 1293598 1851396 2414403
5552B414403l41673r67908J110763L90793n98218K40248J28290J99828P58770
$$ 2414403 2072730 1104822 2215585 2606378 2008160 2248408 2376698 2576526 3335296
5543C335296q08686j05176K09200O08196n79328m08151K75321J53845j044087
$$ 3335296 2526610 2421434 2630634 3238830 2659502 2251351 2526672 2680517 1636430
5534A636430J62088O66932l40453L98600K60160N68472p9360k59051o95433J47038
$$ 1636430 1798518 2465450 2124997 2523597 2783757 3352229 3272869 3013818 2318385 2465423
5524B465423l21533l64769Q57617l25570J37486J69885K15376O767L49264j99635
$$ 2465423 2143890 1779121 2636738 2311168 2448654 2618539 2833915 2840682 3189946 2990311
5514B990311n44812L51668o4959K84800P5486R1563l42890O00302m18625j35418
$$ 2990311 2445499 2797167 2732208 3017008 3092494 3184057 2841167 3441469 3022844 2887426
5504B887426j77262k1163M95286J40801P73984j72032p40266M23016O76540L93924
$$ 2887426 2710164 2689001 3184287 3325088 4099072 3927040 3186774 3609790 4286330 4680254
5494D680254n22138l46294k26950L2247n78082M63667Q13244m28663k30746j069878
$$ 4680254 4158116 3811822 3584872 3617119 3039037 3502704 4315948 3887285 3656539 2586661
5484B586661L41644J123326J31292M93409M17551r7797l5595l47217k5292r28825
$$ 2586661 2928305 4051631 4182923 4676332 5093883 4996086 4960491 4613274 4587982 3659157
5474C659157k78717J352826m09243M46198L51111K60651J38310n10319N54203
$$ 3659157 3380440 4733266 4324023 4770221 5121332 5381983 5520293 5009974 5564177
5465E564177M20553Q20481M96858j26926O73760Q67565q36777p09377M46061Q45650
$$ 5564177 5984730 6805211 7302069 7175143 7848903 8716468 7879691 7170314 7616375 8462025
5455H462025j024293L4319K90560p29187m81920l84528Q51215P86381m60656m17929
$$ 8462025 7437732 7472051 7762611 7033424 6551504 6166976 7018191 7804572 7343916 6925987
5445F925987K81344J36211L27245L86305l75986L08001L57564J88008l32150R69661
$$ 6925987 7207331 7343542 7670787 8057092 7681106 7989107 8346671 8534679 8202529 9172190
5435I172190l62922k10158J24056o2998K53955K51848J04873r1530n19692J71583
$$ 9172190 8809268 8599110 8723166 8660168 8914123 9165971 9270844 9179314 8659622 8831205
5425H831205p68182J80945L2716j28343o2540p88537n3287P56599p7484o72714
$$ 8831205 8063023 8243968 8276684 8148341 8085801 7297264 7243977 8000576 7923092 7250378
5415G250378J26722R3782l29786k56256K19310L83657q83574j61354J24881J86666
$$ 7250378 7377100 7470882 7141096 6884840 7104150 7487807 6604233 6442879 6567760 6754426
5405F754426L98365r55011O21915l80658j03166j280751k73129J43149o3277o11996
$$ 6754426 7152791 6197780 6819695 6439037 6335871 5055120 4781991 4925140 4861863 4249867
5395D249867L68347L05002j78724j83300k36247p8879r46911q0299N97206O03855
$$ 4249867 4618214 4923216 4744492 4561192 4324945 4246066 3299155 3218856 3816062 4419917
5385D419917O20410m25321m88536l74585K65607J59917j06550n5294M0168L7569
$$ 4419917 5040327 4615006 4126470 3751885 4017492 4177409 4070859 4015565 4055733 4093302
5375D093302l79052J10852j86166o4339L69418k43225J4657M5971k20408M17447
$$ 4093302 3714250 3825102 3638936 3574597 3944015 3700790 3715447 3761418 3541010 3958457
5365C958457K63002k57200r96541L25476L74054j04933k24248R13899M1499j290246
$$ 3958457 4221459 3964259 2967718 3293194 3667248 3562315 3338067 4251966 4293465 3003219
5355C003219O49982M204K17888m41051J96516k24899o55706n4062K43682L84900
$$ 3003219 3653201 3657405 3875293 3434242 3630758 3405859 2750153 2696091 2939773 3324673
5345C324673n78226m47133O46721J20879k20664J16725k52727k2771L11539K60358
$$ 3324673 2746447 2299314 2946035 3066914 2846250 2962975 2710248 2687477 2999016 3259374
5335C259374L645O4287J39594o16951J70980p6820M36908o76841k34233L24196
$$ 3259374 3263019 3327306 3466900 2849949 3020929 2944109 3381017 2704176 2469943 2794139
5325B794139k20124R4084j36728P07052L49152m14601l55940R32711o37418k01707
$$ 2794139 2574015 2668099 2531371 3238423 3587575 3172974 2817034 3749745 3112327 2910620
5315B910620n63561j61808O49550j47276p51565R56279J81615l77746l78484r7557
$$ 2910620 2347059 2185251 2834801 2687525 1935960 2892239 3073854 2696108 2317624 2220067
5305B220067q3319M15131M27913k73404o5979k68330K55614M98100L05693m3933
$$ 2220067 2136748 2551879 2979792 2706388 2640409 2372079 2627693 3125793 3431486 3387553
5295C387553p04653n24640L79129j65743K25526L87742j77244L97575J36900k16297
$$ 3387553 2682900 2158260 2537389 2371646 2597172 2984914 2807670 3205245 3342145 3125848
5285C125848K60485q25040M65097n60295K2717J084283J91820j80127J73344l61287
$$ 3125848 3386333 2561293 3026390 2466095 2488812 3573095 3764915 3584788 3758132 3396845
5275C396845J21251l31889n30429O13742J64917O73866n97161n67951O76905k56361
$$ 3396845 3518096 3186207 2655778 3269520 3434437 4108303 3511142 2943191 3620096 3363735
5265C363735L78678m17505K37157N35173k15246m34721J24890Q35320q90420K79919
$$ 3363735 3742413 3324908 3562065 4097238 3881992 3447271 3572161 4407481 3517061 3796980
5255C796980m24950P9205k29155L4803j41342p9243J40159N38669N43586q39546
$$ 3796980 3372030 3451235 3222080 3256883 3115541 3036298 3176457 3715126 4258712 3419166
5245C419166r70828J67563J82336P01631n78777l34558K45303K71670M44893K64553
$$ 3419166 2448338 2615901 2798237 3499868 2921091 2586533 2831836 3103506 3548399 3812952
5235C812952o35863K3739m3281p60768J140629J12703j63163l52574Q584L66702
$$ 3812952 3177089 3200828 3157547 2396779 3537408 3650111 3486948 3134374 3142958 3509660
5225C509660L47033l73498q52143N30384M92370P8580j57226k42628L59661l57185
$$ 3509660 3856693 3483195 2631052 3161436 3653806 3732386 3575160 3332532 3692193 3335008
5215C335008n96184Q41141J75572o63727L90087J9523K90723M21789j109771J09217
$$ 3335008 2738824 3579965 3755537 3091810 3481897 3501420 3792143 4213932 3104161 3213378
5205C213378N78127j007597N41270M17415k75850R8080Q75286j35378j046893
$$ 3213378 3791505 2783908 3325178 3742593 3466743 3564823 4440109 4304731 3257838
5196C257838n23526K62468O81829L79978p6152M88n7466K89082P8899R7337k08613
$$ 3257838 2734312 2996780 3678609 4058587 3982435 3982923 3925457 4214539 4293438 4390775 4182162
5185D182162L30829M68957r8763o29468k17617r648j12763n63917r4667K00491
$$ 4182162 4512991 4981948 4883185 4253717 4036100 4026452 3913689 3349772 3255105 3455596
5175C455596k73921J119437L73456o56724o78345K97300k84562L73919M66562
$$ 3455596 3181675 4301112 4674568 4017844 3339499 3636799 3352237 3726156 4192718
5166D192718j0551J62385J29804k73998m10448O97331p5215n63574N64185M65879
$$ 4192718 4182167 4344552 4474356 4200358 3789910 4487241 4412026 3848452 4412637 4878516
5156D878516l36257K30422o3163o96458k77098M24054O81833M62505M11870M68091
$$ 4878516 4542259 4772681 4709518 4013060 3735962 4160016 4841849 5304354 5716224 6184315
5146F184315k84576m2951M01458o16165J31711K11657m91184K24631K66708R7559
$$ 6184315 5899739 5856788 6258246 5642081 5773792 5985449 5494265 5718896 5985604 6083163
5136F083163n23852Q37897K88178m32772P34459O7975m09796J70813K12509J139694
$$ 6083163 5559311 6397208 6685386 6252614 6987073 7055048 6645252 6816065 7028574 8168268
5126H168268l51868q27155n324j50981P10964M22853M86763n35622q36033R36788
$$ 8168268 7816400 6989245 6983921 6832940 7543904 7966757 8453520 7917898 7081865 8018653
5116H018653P41463l91008O0249l41804N86018l18329K69118N48327j22883J64544
$$ 8018653 8760116 8369108 8429357 8087553 8673571 8355242 8624360 9172687 9049804 9214348
5106I214348N56167M44141P91848O75266L17483N29175q2988j52420l12342M39943
$$ 9214348 9770515 10214656 11006504 11681770 11999253 12528428 12445440 12293020 11980678 12420621
5096A2420621Q07083J055439n67265n20131l73658M02541P56210J77629j58142
$$ 12420621 13227704 14283143 13715878 13195747 12822089 13224630 13980840 14158469 14000327
5087A4000327m06735M7181K27978m2809O30247R29936m91944r8356l19791K0041
$$ 14000327 13593592 13640773 13868751 13825942 14456189 15386125 14894181 14795825 14476034 14496075
5077A4496075L34413p28530p46885k40623k42574N5600o17298J88166M04069q9024
$$ 14496075 14830488 14101958 13355073 13114450 12871876 12927476 12310178 12498344 12902413 12813389
5067A2813389p22528j70566K73907J31526K5153j84289N95823j76180Q9067M60646
$$ 12813389 12090861 11920295 12194202 12325728 12350881 12166592 12762415 12586235 12675302 13135948
5057A3135948Q81152q82386J19064L40219J79583J217754L64525L30319K06360
$$ 13135948 14017100 13134714 13253778 13593997 13773580 14991334 15355859 15686178 15892538
5048A5892538J045824K6737n01915M73737Q2887o5487l02685M56839N09100J37328
$$ 15892538 16938362 16965099 16463184 16936921 17019808 16954321 16651636 17108475 17617575 17754903
5038A7754903j39189K84782M55303k76347J198403j08540q21575m35410k42854
$$ 17754903 17615714 17900496 18355799 18079452 19277855 19169315 18347740 17912330 17669476
5029A7669476j72520M24248k38589R4936l61196L53303j7070j27738M94608l37529
$$ 17669476 17496956 17921204 17682615 17777551 17416355 17769658 17752588 17624850 18119458 17781929
5019A7781929K407K11485r35928j847l50134M37776M06719J47607K80489m93458
$$ 17781929 17784336 17995821 17059893 17058046 16707912 17145688 17552407 17700014 17980503 17487045
5009A7487045N50445l98968L84289K53602J38765l85557p11656r00651M56882
$$ 17487045 18037490 17638522 18022811 18276413 18415178 18029621 17317965 16417314 16874196
5000A6874196N00295r71620q47728n19402n34878M43975o5960J95454r63609r16531
$$ 16874196 17374491 16402871 15555143 15035741 14500863 14944838 14878878 15074332 14110723 13194192
4990A3194192k80033N22600P71627j031525K7918Q18539l19907q65655M03373
$$ 13194192 12914159 13436759 14208386 13176861 13204779 14023318 13703411 12837756 13241129
4981A3241129l37562J033400P90978L7555P1351n77027R91386L78877J83916j29277
$$ 13241129 12903567 13936967 14727945 14765500 14836851 14259824 15251210 15630087 15814003 15684726
4971A5684726R22342J78569l44098k71936L17859j55166k94300m9268L11361j70882
$$ 15684726 16607068 16785637 16441539 16169603 16487462 16332296 16037996 15988728 16300089 16129207
4961A6129207k74230o87795J14341o99565r70731L76637k60780j366475n41025
$$ 16129207 15854977 15167182 15281523 14581958 13611227 13987864 13727084 12360609 11819584
4952A1819584K91470n45009j075131l22572J45055q44747n88676r95238R30062
$$ 11819584 12111054 11566045 10490914 10168342 10313397 9468650 8879974 7884736 8814798
4943H814798p70427L14504M04237J92981q04907K11393N76828r03462n80413l6439
$$ 8814798 8044371 8358875 8763112 8956093 8151186 8362579 8939407 8035945 7455532 7419093
4933G419093M30841l46883Q08573k57725p90886J100798Q46076o44190j00581
$$ 7419093 7849934 7503051 8311624 8053899 7263013 8363811 9209887 8565697 8465116
4924H465116k92190j21098Q6919l48053n3922m81504k62329k81575P69414O47031
$$ 8465116 8172926 8051828 8138747 7790694 7736772 7255268 6992939 6711364 7480778 8127809
4914H127809L98371k92772j41698M8712l26983j64066L54886M24037k36111j29538
$$ 8127809 8526180 8233408 8091710 8140422 7813439 7649373 8004259 8428296 8192185 8062647
4904H062647m37399Q9979L62714J036172k91731l30963k28375K40229L28828m45619
$$ 8062647 7625248 7715227 8077941 9114113 8822382 8491419 8263044 8503273 8832101 8386482
4894H386482K57036K19068k56040O04937P11930O88260q88748j34378Q43414k79423
$$ 8386482 8643518 8862586 8606546 9211483 9923413 10611673 9722925 9588547 10431961 10152538
4884A0152538P02029q2293l19773q41878j34156n06272N17419J158982K17400
$$ 10152538 10854567 10772274 10452501 9610623 9476467 8970195 9487614 10646596 10863996
4875A0863996n22470j73559R66531P93726m17065l02761J33069n11125j22182
$$ 10863996 10341526 10167967 11134498 11928224 11511159 11208398 11341467 10830342 10708160
4866A0708160J052939K83063p16259J04569J91032P98825L96163L65736m89633
$$ 10708160 11761099 12044162 11327903 11432472 11623504 12422329 12818492 13184228 12694595
4857A2694595K17421J208660l49848m53351j194777l59567O84241R88420Q13445
$$ 12694595 12912016 14120676 13770828 13317477 12122700 11763133 12447374 13435794 14249239
4848A4249239l49222q1097p35870M14315L61210M49108J23502J76249L71409N81834
$$ 14249239 13900017 13818920 13083050 13497365 13858575 14307683 14431185 14607434 14978843 15560677
4838A5560677j060353Q98277O50508M0827L05836O31075Q48939k31463M35645
$$ 15560677 14500324 15398601 16049109 16089936 16395772 17026847 17875786 17644323 18079968
4829A8079968P13796J21929l2834k19375o6968J053814K86018P35511R09275l95536
$$ 18079968 18793764 18915693 18882859 18663484 18596516 19650330 19936348 20671859 21581134 21185598
4819B1185598j98746K60638l63272P38974L2101J49559J48851L90888k90531j28480
$$ 21185598 20986852 21247490 20884218 21623192 21655293 21804852 21953703 22344591 22054060 21925580
4809B1925580O31199M92458J119438J22442n89012J032254K15547P85652R82654
$$ 21925580 22556779 23049237 24168675 24291117 23702105 24734359 24949906 25735558 26718212
4800B6718212Q76709J069645k880O44423J416269N59837J747876J770286K491456
$$ 26718212 27594921 28664566 28661686 29306109 30722378 31282215 33030091 34800377 37291833
4791C7291833L212580L128416L696396L629652L975975N649264O183941Q055912
$$ 37291833 40504413 43632829 47329225 50958877 54934852 60584116 66768057 74823969
4783G4823969R125168R825771R304642P876457L434265k654560q839140j2740004
$$ 74823969 83949137 93774908 103079550 110956007 114390272 111735712 102896572 90156568
4775I0156568j2054634j0890960q262751p234416m757750l332664l993999l197655
$$ 90156568 78101934 67210974 58948223 51713807 46956057 43623393 39629394 36431739
4767C6431739k415151j817024o27732j240403p48477q64676j252914k73228k29507
$$ 36431739 34016588 32199564 31571832 30331429 29582952 28718276 27465362 27192134 26962627
4758B6962627K27914j53396j241448j90740q03260k66171m89410j071234J19605
$$ 26962627 27190541 27037145 25795697 25604957 24801697 24535526 24046116 22974882 23094487
4749B3094487k56573M62902L06415p93098m44632J97932L31808k0454L98557n85629
$$ 23094487 22837914 23300816 23607231 22814133 22369501 22567433 22899241 22878787 23277344 22691715
4739B2691715k8401M57557L19283J064155R51769R47609N94953K4611Q83000P29500
$$ 22691715 22663314 23120871 23440154 24504309 25456078 26403687 26998640 27023251 27906251 28635751
4729B8635751J185646P73982J810968J655237R84110J867366K874062K396579
$$ 28635751 29821397 30595379 32406347 34061584 35045694 36913060 39787122 42183701
4721D2183701L338113N156405N013086N090636O757926P810541Q599195R288610
$$ 42183701 45521814 50678219 55691305 60781941 67539867 75350408 83949603 93238213
4713I3238213P771736M723329K315523m541650r547980j1896692j1624257r110545
$$ 93238213 101009949 105733278 108048801 103507151 93959171 82062479 70438222 61327677
4705F1327677q671222n462179m627918m282731j535457k176404k944773k605984
$$ 61327677 52656455 47194276 42566358 38283627 36748170 34571766 31626993 29021009
4697B9021009j540571j347487j292502k193519j577096r30415j076878m44499
$$ 29021009 27480438 26132951 24840449 22646930 21069834 20139419 19062541 18618042
4689A8618042j160631j83073o22564j606341j641566k3473J67891j81529L0937
$$ 18618042 17457411 17274338 16651774 15045433 13403867 13380394 13548285 13366756 13397693
4680A3397693J60704J00392J7413j094604j77031q61817o23395k54839L86711
$$ 13397693 13558397 13658789 13676202 12581598 12404567 11542750 10919355 10664516 11051227
4671A1051227n70293m08667n19803P38762M55772j86540m46547p65938J55146
$$ 11051227 10480934 10072267 9552464 10291226 10746998 10560458 10113911 9347973 9503119
4662I503119O79714J91063m62796J8320M92591n66981n24640k65377K29841l8023
$$ 9503119 10182833 10373896 9911100 9929420 10422011 9855030 9330390 9065013 9294854 9256831
4652I256831o024j77021n6042l88089n25111J67837L83316L29376K00458o96893
$$ 9256831 9250807 9073786 9017744 8629655 8104544 8272381 8655697 8985073 9185531 8488638
4642H488638k48735n3381O9190q01299P22617l35431o46851L48760k98444k02622
$$ 8488638 8239903 8186522 8255712 7454413 8177030 7841599 7194748 7543508 7245064 7042442
4632G042442R42335M73469j288112P36140P6089J28892P88397N58585m88591q32043
$$ 7042442 7984777 8458246 7170134 7906274 7982363 8111255 8899652 9458237 8969646 8137603
4622H137603o55120J025670J1828o58705l65022O92826L47323L36844m53810L27388
$$ 8137603 7482483 8508153 8519981 7861276 7496254 8189080 8536403 8873247 8419437 8746825
4612H746825p02094J040782J73929m04309k76309m47126L17517L16483j188852
$$ 8746825 8044731 9085513 9259442 8855133 8578824 8131698 8449215 8765698 7576846
4603G576846L21264M23937m71282J051173J10739j58291m45275j68775R71779
$$ 7576846 7898110 8322047 7850765 8901938 9012677 8854386 8409111 8240336 9212115
4594I212115l69092L7280M28587J152133k61095j504930J37762K07232P0452K65229
$$ 9212115 8843023 8880303 9308890 10461023 10199928 8694998 8832760 9039992 9110444 9375673
4584I375673R29296j59026P6041l4141K19969J69186L69294l17476k84261J009269
$$ 9375673 10304969 10145943 10221984 10187843 10407812 10576998 10946292 10628816 10344555 11353824
4574A1353824O96828j00547j43358p06781M49668J690089j13850r91489N46722
$$ 11353824 12050652 11950105 11806747 11099966 11549634 13239723 13125873 12134384 12681106
4565A2681106N1700M73453r645r92310m37867J22961K49064K39305m16385k20043
$$ 12681106 12732806 13206259 13196614 12204304 11766437 11889398 12138462 12377767 11961382 11741339
4555A1741339R900j235425N84845r79095j84697M55411p5770K33736k01291R8016
$$ 11741339 11751239 10515814 11100659 10121564 9936867 10392278 10316508 10550244 10348953 10446969
4545A0446969J13691J73081L28152k46657O1432J61279L13439l43573k31127R4746
$$ 10446969 10560660 10733741 11061893 10815236 10876668 11037947 11351386 11007813 10776686 10871432
4535A0871432m68965K28307o2695L52409l07354P02350l38416l39859K05319J67572
$$ 10871432 10402467 10630774 10568079 10920488 10613134 11315484 10977068 10637209 10842528 11010100
4525A1010100o45711M70456J78693O82326l31442j96487K83281j43510m72879
$$ 11010100 10364389 10834845 11013538 11695864 11364422 11167935 11451216 11307706 10834827
4516A0834827L50622K93710L68969k51580o50923J167867l91545K51582q8065
$$ 10834827 11185449 11479159 11848128 11596548 10945625 12113492 11721947 11973529 11885464
4507A1885464J54921r8034m50782R14524J00529q261J68811Q2850p2329R07076
$$ 11885464 12040385 11942351 11491569 12406093 12506622 12498361 12667172 12750022 12677693 13584769
4497A3584769R53589Q25638l86873l78842j48349J97393P96110l27515k12755
$$ 13584769 14538358 15363996 14977123 14598281 14449932 14647325 15443435 15115920 14903165
4488A4903165M38303l45662N74159O81607r814L91945J94033j42058N32213N75181
$$ 14903165 15341468 14995806 15569965 16251572 16241758 16633703 16827736 16685678 17217891 17793072
4478A7793072R1437L01153P68380P13537M00322Q5620M79953P71988R45052N95972
$$ 17793072 17884509 18185662 18954042 19667579 20067901 20153521 20633474 21405462 22350514 22946486
4468B2946486Q086N61443O05204P19349M67243q8784k1765L79932n9750k92363
$$ 22946486 22954572 23516015 24121219 24840568 25307811 25219027 25197262 25577194 25517444 25225081
4458B5225081M27933Q21431M53052J34906n13652l27500J042659J074644J06697
$$ 25225081 25653014 26474445 26927497 27062403 26548751 26221251 27263910 28338554 28445251
4449B8445251m24640j58491R30311m00942J44100o59375K67381n58586L58546
$$ 28445251 28020611 27862120 28792431 28391489 28535589 27876214 28143595 27585009 27943555
4440B7943555O4444J83642J02798R9537j03372Q3685K37292M14994k08900L75870
$$ 27943555 28007999 28191641 28294439 28393976 28290604 28374289 28611581 29026575 28817675 29193545
4430B9193545M77939L82630J94342m09207K96766Q48351L80912K66526L18125
$$ 29193545 29671484 30054114 30248456 29839249 30136015 30984366 31365278 31631804 31949929
4421C1949929m28890j20528n16484L45445O66264m69047J67014n36759p68983
$$ 31949929 31521039 31400511 30884027 31229472 31895736 31426689 31593703 31056944 30287961
4412C0287961j86611J11146q21077K28215j100109j10024r48002j433450q2841
$$ 30287961 30101350 30212496 29391419 29619634 28519525 28409501 27461499 26028049 25945208
4403B5945208p2089k95301l91142K14402m92890J68823k24980M38157k66484m89970
$$ 25945208 25873119 25577818 25186676 25401078 24908188 25077011 24852031 25290188 25023704 24533734
4393B4533734o79276M06237k50830k18257n68016L2566k61788J67954Q60851l033
$$ 24533734 23854458 24260695 24009865 23791608 23223592 23256158 22994370 23162324 24023175 24020142
4383B4020142j29837l9427O2908j3115o63961R26722j08877m8530n83739O59482
$$ 24020142 23890305 23850878 23913786 23900671 23236710 24163432 24054555 24006025 23422286 24081768
4373B4081768N08014K87458Q9110O1857k01350L91378j60810K03021J191324K50204
$$ 24081768 24589782 24877240 24966350 25028207 24826857 25218235 25057425 25260446 26451770 26701974
4363B6701974p74344L91929J11122n66402K58098k22617l35570k8130P73069O96736
$$ 26701974 25927630 26319559 26430681 25864279 26122377 25899760 25564190 25536060 26309129 27005865
4353B7005865l41954O57392R35938N66000k13686j83520M76867L51589P59283
$$ 27005865 26663911 27321303 28257241 28823241 28609555 28426035 28902902 29254491 30013774
4344C0013774L55172J139934N0668N76059J468905j71214P33031p1757M68516
$$ 30013774 30368946 31508880 31559548 32135607 33604512 33433298 34166329 34094572 34563088
4335C4563088J241922m30698N91746M65317K31008M00781j90150J000058Q6768
$$ 34563088 35805010 35374312 35966058 36431375 36662383 37063164 36873014 37873072 37959840
4326C7959840j87424N01045o55233K72421Q36077m07991k16886j73455j203396
$$ 37959840 37772416 38273461 37618228 37890649 38726726 38318735 38101849 37928394 36724998
4317C6724998K72161j21178N03843j00187K44584R0602K51657L48467L78066J206
$$ 36724998 36997159 36875981 37379824 37279637 37524221 37614823 37866480 38214947 38593013 38594219
4307C8594219j80512j004573J6841Q97429J72010O2948j82351R97589k10967p83237
$$ 38594219 38413707 37409134 37425975 38323404 38495414 38558362 38376011 39373600 39162633 38379396
4297C8379396K48429j48041n89059O890J07714N32958M37163j63887L55613m42535
$$ 38379396 38627825 38479784 37890725 37897615 38005329 38538287 38975450 38811563 39167176 38724641
4287C8724641j1339q02518q10865J70526N6876l53994l13529J49322N02600O35162
$$ 38724641 38713302 37910784 37099919 37270445 37327321 36973327 36659798 36809120 37311720 37946882
4277C7946882k82949p41949o63163p85946J6438N86951M46862k67779K56106l13098
$$ 37946882 37663933 36921984 36258821 35472875 35489313 36076264 36523126 36255347 36511453 36198355
4267C6198355L02197J97910K55821L77003M1161L51174l78238N42688K24352K66478
$$ 36198355 36500552 36698462 36954283 37331286 37372447 37723621 37345383 37888071 38112423 38378901
4257C8378901L2401R89701m5775L78730R18289k7491M58255L71382J429730J510859
$$ 38378901 38411302 39401003 39355228 39733958 40652247 40624756 41083011 41454393 42884123 44394982
4247D4394982K5962k19071K38727O83148O52357K13560J075717Q63953O8582k67110
$$ 44394982 44420944 44201873 44440600 45123748 45776105 45989665 47065382 47929335 47997917 47730807
4237D7730807J82729J59472P98381L12444p40647n06785J6810j155029o41962
$$ 47730807 47913536 48073008 48871389 49183833 48443186 47936401 47953211 46798182 46156220
4228D6156220n0597k88690L52308m48988l37480M28913j019853j86207M36596
$$ 46156220 46105623 45816933 46169241 45720253 45382773 45811686 44791833 44605626 45042222
4219D5042222K52592j88280L21034k28642k33624R10764M40223P01091J19087
$$ 45042222 45294814 45106534 45427568 45198926 44965302 45876066 46316289 47017380 47136467
4210D7136467O85198j12977J343567P53868J64017L63063M60328J228524M69761
$$ 47136467 47821665 47708688 49052255 49806123 49970140 50333203 50793531 52022055 52491816
4201E2491816N62710O28692k11827N79761J93308J085110P10390J021407J147136
$$ 52491816 53054526 53683218 53471391 54051152 54244460 55329570 56039960 57061367 58208503
4192E8208503J137177L56067N42096J235656J72176N85113J157982R73369K39542
$$ 58208503 59345680 59701747 60243843 61479499 61651675 62236788 63394770 64368139 64607681
4183F4607681O09992Q36964m47297Q26863J038098J84271N11257L99583m57751
$$ 64607681 65217673 66054637 65607340 66434203 67472301 67656572 68167829 68567412 68109661
4174F8109661k86954Q62748l67982o1741K5728L60667L2602r50009j76394K13578
$$ 68109661 67822707 68685455 68317473 68255732 68281460 68642127 68674729 67724720 67548326 67761904
4164F7761904K39133k67076o62706j10435K67505K32328o34917N74370q7959O22450
$$ 67761904 68001037 67733961 67071255 66960820 67228325 67460653 66825736 67400106 67312147 67934597
4154F7934597J102246N95892O19180o33973n91643J97603J045198K75115O19997
$$ 67934597 69036843 69632735 70251915 69617942 69026299 69223902 70269100 70544215 71164212
4145G1164212K13486k16695J090131n9954J29160R80508J329183P89678P33105
$$ 71164212 71377698 71161003 72251134 72191180 72320340 73300848 74630031 75419709 76152814
4136G6152814K093416Q70865N81613J00515J125826R43309M42760L94251P40725
$$ 76152814 78246230 79117095 79698708 79799223 80925049 81868358 82311118 82705369 83446094
4127H3446094J08334j5136m56595M06506M05755n9503J82241M20944M2127J033064
$$ 83446094 83554428 83539292 83082697 83489203 83894958 83835455 84017696 84438640 84480767 85513831
4117H5513831J579018n19958J063084J034775Q50084R49796Q20903R49754R76710
$$ 85513831 87092849 86572891 87635975 88670750 89520834 90470630 91291533 92241287 93217997
4108I3217997P76553O46122J504000O95488L88491J775732J748356J362418J776544
$$ 93217997 93994550 94640672 96144672 96840160 97228651 99004383 100752739 102115157 103891701
4099A03891701J252114J068732L481051J909280J701060K604435K012874K788848
$$ 103891701 105143815 106212547 109693598 111602878 113303938 115908373 117921247 120710095
4091A20710095L201003L571700L651821M611842M821122N671335P834194Q067072
$$ 120710095 123911098 127482798 131134619 135746461 140567583 146238918 154073112 162140184
4083A62140184R577571J1303555J2206549J3377680J5797486J6183800J7692098
$$ 162140184 171717755 183021310 195227859 208605539 224403025 240586825 258278923
4076B58278923J8038154J9436047K0087983J7722541J6376926J0733467l965106
$$ 258278923 276317077 295753124 315841107 333563648 349940574 360674041 356708935
4069C56708935k1247287l2123069l5732102l0748650k4389904j9725740j5376279
$$ 356708935 335461648 303338579 267606477 236857827 212467923 192742183 177365904
4062A77365904j2196543r846351q426205p389591n085759m927599l530553k846753
$$ 177365904 165169361 155323010 146896805 139507214 134421455 129493856 125963303 123116550
4054A23116550l454487k063351j264762j583806k323506q61777j040399m66415
$$ 123116550 119662063 117598712 116333950 114750144 112426638 111564861 110524462 110058047
4046A10058047J088423n21691r33985J136146p0043K257209J876855J491297K775121
$$ 110058047 111146470 110624779 109690794 110826940 110756897 113014106 114890961 116382258 119157379
4037A19157379K936062K822798L571748K665683P67114l76021q05959J6669m470
$$ 119157379 122093441 124916239 128487987 131153670 131920784 131544763 130738804 130755473 130751003
4028A30751003j830557l78041O38604J188836J488412J220025K078541J183157
$$ 130751003 128920446 128542405 129181009 130369845 131858257 133078282 135156823 136339980
4020A36339980J786985K595047K498770K411114L394714K586501K468178K084667
$$ 136339980 138126965 140722012 143220782 145631896 149026610 151613111 154081289 156165956
4012A56165956K598992K751158L573715K880239K338998J305653K408009K939060
$$ 156165956 158764948 161516106 165089821 167970060 170309058 171614711 174022720 176961780
4004A76961780K469715K345707K403204L334926K887167J471060K437859K120954
$$ 176961780 179431495 181777202 184180406 187515332 190402499 191873559 194311418 196432372
3996A96432372J820909N40652J396969J001716N11284J958497K650366Q97906
$$ 196432372 198253281 198793933 200190902 201192618 201703902 203662399 206312765 207210671
3988B07210671m78491N23061N55218R27166J563834J42366P54179P39005O13712
$$ 207210671 206732180 207255241 207810459 208737625 210301459 210443825 211198004 211937009 212550721
3979B12550721L64125o2501K9527K55081L46292m10507L04155p6245K24607J57181
$$ 212550721 212914846 212852345 212881872 213136953 213483245 213072738 213376893 213300648 213525255 213682436
3969B13682436n13772M69455N28004n69925Q94335p76325n6874r28679q57058
$$ 213682436 213168664 213638119 214166123 213596198 214490533 213714208 213657334 212728655 211871597
3960B11871597o66250j121710R98918L89565j15256M15556O49701J11181k8306
$$ 211871597 211205347 210083637 211082555 211472120 211356864 211772420 212422121 212533302 212504996
3951B12504996K08574O86494L74627r58318N46089Q9237J528348K591404Q17151
$$ 212504996 212713570 213400064 213774691 212816373 213362462 213451699 214980047 217571451 218388602
3942B18388602K144480J392840K299512L784968L026948M799454N476810P073176
$$ 218388602 220533082 221925922 224225434 228010402 231037350 235836804 241313614 248386790
3934B48386790Q194444Q131412J0152691J0546521J3086736J4757431J4711854
$$ 248386790 256581234 264712646 274865337 285411858 298498594 313256025 327967879
3927C27967879J5745257J6069509J4465652J3107749J1309118O175242K871209
$$ 327967879 343713136 359782645 374248297 387356046 398665164 404840406 407711615
3920D07711615L41392l098618l250676l498001m552019l947295l123649l314243
$$ 407711615 408053007 404954389 401703713 398205712 393653693 389706398 386582749 383268506
3912C83268506l027991m308895m654335o221944p814973p893319j0740559j2518219
$$ 383268506 380240515 375931620 371277285 365055341 357240368 349347049 338606490 326088271
3904C26088271j2326877j1734600j1357764j0575975r968778q491290q938850
$$ 326088271 313761394 302026794 290669030 280093055 270124277 261632987 252694137
3897B52694137p156554o061898n856914n612571n018454m450568m105663l346042
$$ 252694137 245537583 239475685 233618771 228006200 222987746 218537178 214431515 211085473
3889B11085473k177540k365431j284178o73858L69143M6745l54360J71277L44403
$$ 211085473 208907933 206542502 205258324 204584466 204953609 205000354 204645994 204817271 205161674
3880B05161674Q24296K38164Q17905j155804j748634j462189j988900k784732
$$ 205161674 205985970 206224134 207042039 205886235 204137601 202675412 200686512 197901780
3872A97901780j921249j823886j989036j683242k763807k823171k737163k354526
$$ 197901780 195980531 194156645 192167609 190484367 187720560 184897389 182160226 179805700
3864A79805700k135016k479796l501278m451442l992087k999301l977570l641611
$$ 179805700 177670684 175190888 171689610 167238168 163246081 160246780 156269210 152627599
3856A52627599k858643l424849l459524k373389j990318k999133j882690j076674
$$ 152627599 149768956 146344107 142884583 140511194 138520876 135521743 133639053 132562379
3848A32562379j70587o31295m64697J058616J170790J860771J875317J803759
$$ 132562379 132391792 131760497 131295800 132354416 133525206 135385977 137261294 139065053
3840A39065053J966310K143189K496170K093535K990310J182354K075797J132828
$$ 139065053 141031363 143174552 145670722 147764257 150754567 151936921 154012718 155145546
3832A55145546J99133j190086j87255r11733k456769k347319k05031j490272j686264
$$ 155145546 155344679 154154593 153967338 153055605 150598836 148251517 148046486 146556214 144869950
3823A44869950j273767k405308j513122j933436k909311k422576k735111l031350
$$ 144869950 143596183 141190875 139677753 137744317 134835006 132412430 129677319 126645969
3815A26645969m041399m601948l294821k892753k472431l917079l242503j979660
$$ 126645969 122604570 118002622 114707801 111815048 109342617 105425538 102183035 100203375
3807A00203375j926455j558562j375176j231918j076113r74504p24236j170688
$$ 100203375 98276920 96718358 95343182 94111264 93035151 92060647 91336411 90165723
3799I0165723l80619j074330J02488m29601m99044O08860m8628j591678R96899
$$ 90165723 89785104 88710774 88813262 88383661 87884617 88493477 88444849 86853171 87850070
3790H7850070J42427J79041l59483J89281J027125j83004q85150J39930q42953
$$ 87850070 87992497 88171538 87812055 88001336 89028461 88845457 87960307 88100237 87257284
3781H7257284O64625n60930Q24136P23883K3649p6077O703p28041j44547k04552
$$ 87257284 87921909 87360979 88185115 88908998 88932647 88856570 88863273 88135232 87990685 87786133
3771H7786133j322085o42975q53929j19337n23584O21231K5780j201459l30834
$$ 87786133 86464048 85821073 84967144 84847807 84324223 84945454 84971234 83769775 83438941
3762H3438941j99952R0551J75821l08222n0412r65782K87780l0041o19632n32609
$$ 83438941 83238989 83329540 83505361 83197139 83146727 82180945 82468725 82438684 81819052 81286443
3752H1286443o76811P8055L280j362783l79996o53787j74094J21131q65981j001958
$$ 81286443 80609632 80687687 80690967 79328184 78948188 78294401 78120307 78241438 77375457 76373499
3742G6373499k64300r17208m04441l67594L69322k52032k33603m54234q74210
$$ 76373499 76109199 75191991 74787550 74419956 74789278 74537246 74303643 73849409 72975199
3733G2975199p97829R90910n37713j008464k32049N70596j39081J6733M08466
$$ 72975199 72177370 73168280 72630567 71622103 71390054 71960650 71821569 71838302 72246768
3724G2246768l23067J86321J018943L73895n01082k98670o41798J038817N74985
$$ 72246768 71923701 72110022 73128965 73502860 73001778 72703108 72061310 73100127 73675112
3715G3675112k53233J18678O87676J05283J02164l89592N25567O32135P3023M03872
$$ 73675112 73421879 73540557 74228233 74333516 74435680 74046088 74571655 75203790 75276813 75680685
3705G5680685L18461j3472k87388l22274J93370M85568q37842P52224R59733O87894
$$ 75680685 75999146 75985674 75698286 75376012 75569382 76054950 75217108 75969332 76929065 77616959
3695G7616959k44843Q89949L22877J665940j4451L56415J533782J31212P75748
$$ 77616959 77372116 78262065 78584942 80250882 80236431 80592846 82126628 82257840 83033588
3686H3033588J166153K43507J436254J31955n4277J046793J93462J429143R2464
$$ 83033588 84199741 84443248 85879502 86011457 85957180 87003973 87197435 88626578 88719042
3677H8719042J241041J799137M43038R86283J193776J424462J754689J110397
$$ 88719042 89960083 91759220 92202258 93188541 94382317 95806779 97561468 98671865
3669I8671865J783274K095608J397903P52190J047167K112884K870458K251382
$$ 98671865 100455139 102550747 103948650 104700840 105748007 107860891 110731349 112982731
3661A12982731K215720J860181K250734L529396L592146L204009M179268M457546
$$ 112982731 115198451 117058632 119309366 122838762 126430908 129634917 133814185 138271731
3653A38271731N375996N445768N793537P003879P705462P971552R723820J0312609
$$ 138271731 143647727 149093495 154887032 161890911 169596373 177567925 187291745 197604354
3645A97604354J0627814J0427679J1587760J2418184J0918403Q630902R083534
$$ 197604354 208232168 218659847 230247607 242665791 253584194 262215096 271298630
3638B71298630O765402O740003P649951Q049791Q541199J0059936J0968592J1210399
$$ 271298630 278064032 284804035 292453986 300503777 309044976 319104912 330073504 341283903
3630C41283903R669796J0056978Q109472N022909M076761O55658j146626k795262
$$ 341283903 350953699 361010677 369120149 374143058 378219819 378875477 377728851 374933589
3622C74933589m348550l944768l288740k582131j629387l35108j87619L0149j148057
$$ 374933589 370585039 366640271 363351531 360769400 359140013 358804905 358617286 358647435 357499378
3613C57499378k471074l307088l535119n453172p029914o235232o857194n645397
$$ 357499378 355028304 351721216 348186097 342732925 335703011 329467779 322610585 316965188
3605C16965188m611142k560671k708700m064110m226274l838486l931118n392675
$$ 316965188 312354046 309793375 307084675 303020565 298794291 294955805 291024687 285632012
3597B85632012n503810m807263o171242m422405l689663m036013l933301m267842
$$ 285632012 280128202 275320939 269149697 264727292 261037629 257001616 253068315 248800473
3589B48800473m938797m632130n614517o087686p146101o987086o717709o702998
$$ 248800473 243861676 239229546 233615029 227527343 220381242 213394156 206676447 199973449
3581A99973449p054419o739943o172178n610389n393341n386310m542337m151432
$$ 199973449 192919030 186179087 180006909 174396520 169003179 163616869 159074532 154923100
3573A54923100m501707m541234m233314m180363m262565n189024l096180m137257
$$ 154923100 150421393 145880159 141646845 137466482 133203917 128014893 124918713 120781456
3565A20781456l425323k518489k140873k625055j657428k853936k386443j247027
$$ 120781456 117356133 114837644 112696771 110071716 108414288 105560352 103173909 101926882
3557A01926882j981719j683976j678144j743599j154585o27988j573644j239263
$$ 101926882 99945163 98261187 96583043 94839444 93684859 93056871 91483227 90243964
3549I0243964o32595j971303j600420m49122j356517j992787k206299j283880
$$ 90243964 89611369 87640066 86039646 85590524 84234007 82241220 80034921 78751041
3541G8751041j488374j337222j798057j837614j932841j500825j499463j331669
$$ 78751041 77262667 75925445 74127388 72289774 70356933 68856108 67356645 66024976
3533F6024976j485022j312142r84209r80990j767283k282624q20243k30613j362064
$$ 66024976 64539954 63227812 62243603 61262613 59495330 57212706 56392463 56161850 54799786
3524E4799786j279268j358373m42617j835592r82031o78239j282380o74854q91916
$$ 54799786 53520518 52162145 51719528 49883936 48901905 48223666 46941286 46266432 45374516
3515D5374516o23664r69399l87410m83174j391414m81711r35422o23547m08722
$$ 45374516 44750852 43781453 43394043 42910869 41519455 41037744 40102322 39478775 39070053
3506C9070053q3176J2725n34091j07329l01102o53376j57000n75541j197063j408102
$$ 39070053 38986877 38999602 38465511 38358182 38057080 37403704 37246704 36671163 35474100 34065998
3496C4065998Q47628K54250o59894p791l83048o57697k288l86057l83854n1019
$$ 34065998 34913626 35167876 34507982 34500191 34117143 33459446 33457158 33071101 32687247 32636228
3486C2636228k72062k07089n32407l55817J04310m35169o57482J28732O4117p92489
$$ 32636228 32364166 32157077 31624670 31268853 31373163 30937994 30280512 30409244 30473361 29680872
3476B9680872r29009L87419J50926l88158p11525L21149l58749L36348k06402
$$ 29680872 28751863 29139282 29290208 28902050 28190525 28511674 28152925 28489273 28282871
3467B8282871l74985q11001p97478n3649k90851q6855K22923l7867n77791r03358
$$ 28282871 27907886 27096885 26299407 26245758 25954907 25868052 26090975 26053108 25475317 24571959
3457B4571959Q7509M192k35782k78920O24221k04805r94006L3031K09882k20352
$$ 24571959 24659468 24663660 24427878 24148958 24773179 24568374 23574368 23607399 23817281 23596929
3447B3596929l24973n27409l63349L6889n5710m81260k15938k24795j74544k9855
$$ 23596929 23271956 22744547 22381198 22418087 22362377 21881117 21665179 21440384 21265840 21235985
3437B1235985r02289m68018O39689n36889j037484O24566j47045n28521l88857
$$ 21235985 20333696 19865678 20505367 19968478 18930994 19555560 19408515 18879994 18491137
3428A8491137j10818o94991N28954O06136l43742j62855n16675j56450N586r2791
$$ 18491137 18380319 17685328 18214282 18820418 18476676 18313821 17797146 17640696 17646282 17553491
3418A7553491q2707J50638n67305m65627N59743j24450K51404n06712l09692K22643
$$ 17553491 17470784 17621422 17054117 16588490 17148233 17023783 17275187 16768475 16458783 16681426
3408A6681426L86315j205857p56215O4346P42012j24920m95424J58784p60101
$$ 16681426 17067741 15861884 15105669 15170015 15912027 15787107 15291683 15450467 14690366
3399A4690366Q8814n27914L07304l36161K61954n46608K07720J89059n33620k47091
$$ 14690366 14779180 14251266 14558570 14222409 14484363 13937755 14145475 14334534 13800914 13553823
3389A3553823p09213M19254O52919j11993K1976o88943j64657K08744m5488r6364
$$ 13553823 12844610 13263864 13916783 13804790 13826766 13137823 12973166 13181910 13136422 13040058
3379A3040058k18975l3207J065425j240470j10785O35405m29538j64094L57927
$$ 13040058 12821083 12787876 13853301 12612831 12502046 13137451 12707913 12543819 12901746
3370A2901746j345340p83133M67215N56803L41918K3755K60420q91385k86147
$$ 12901746 11556406 10773273 11240488 11797291 12139209 12162964 12423384 11531999 11245852
3361A1245852O67839j81022k61783M83868j96018O35522n24798m63755K13084
$$ 11245852 11913691 11732669 11470886 11954754 11758736 12394258 11869460 11405705 11618789
3352A1618789J89955K74908J27934L5557m0283j19492j89353J28170m88302O99920
$$ 11618789 11808744 12083652 12211586 12247143 12206860 12087368 11898015 12026185 11537883 12237803
3342A2237803J24672m22607M82996P2333n93698P91850P82912k12809l42560o66554
$$ 12237803 12362475 11939868 12422864 12495197 11901499 12693349 13476261 13263452 12920892 12254338
3332A2254338J99407j82696j77750o3666N76257k75047o92735l4153M31357P08944
$$ 12254338 12453745 12271049 12093299 12029633 12605890 12330843 11638108 11603955 12035312 12744256
3322A2744256l5420K24496l80475J77690j66488m85735N48516m04037r6393N01531
$$ 12744256 12708836 12933332 12552857 12730547 12564059 12078324 12626840 12222803 12126410 12627941
3312A2627941L36288Q7184J99487m04958Q37505j187223k6133j0622P74904j90316
$$ 12627941 12964229 13051413 13250900 12845942 13683447 12496224 12470091 12459469 13234373 13044057
3302A3044057r01326K22430K77269N48804r996N06932J02239m26274n49751p70920
$$ 13044057 12142731 12365161 12642430 13191234 13181238 13688170 13790409 13364135 12814384 12043464
3292A2043464P74446j46817L54384L7675j10699o1736J090258J94002J69741J60908
$$ 12043464 12817910 12671093 13025477 13063152 12952453 12890717 13980975 14174977 14344718 14505626
3282A4505626K43466j003489j78721Q55360K91017L89263j52420P6765l59679
$$ 14505626 14749092 13745603 13566882 14422242 14713259 15102522 14950102 15026867 14667188
3273A4667188J96451L73525J148334K2350o06196R24828k17340J022411p063m32833
$$ 14667188 14863639 15237164 16385498 16407848 15801652 16726480 16509140 17531551 17524488 17091655
3263A7091655M98499Q83766N93162M12174J794711j8370L65818J50304K85586
$$ 17091655 17590154 18473920 19067082 19479256 21273967 21255597 21621415 21771719 22057305
3254B2057305K67122J333683P73463P22305J323260J605350Q55115J599080J130563
$$ 22057305 22324427 23658110 24431573 25153878 26477138 28082488 28937603 30536683 31667246
3245C1667246K536869P78298J103815L78961k53213n27941j599272j337901p24873
$$ 31667246 34204115 34982413 36086228 36465189 36211976 35684035 34084763 32746862 32021989
3236C2021989j276063j426575q03146k072915j866285r70170j083390j566171
$$ 32021989 30745926 29319351 28516205 26443290 24577005 23606835 22523445 20957274
3228B0957274q36027j30618o64905k024770j488717n42179l64602n99896o47363
$$ 20957274 20121247 19990629 19325724 17300954 15812237 15270058 14905456 14305560 13658197
3219A3658197q87953p54615m60964m6042k23084l32571j82444o17150l33081l62744
$$ 13658197 12770244 12015629 11554665 11508623 11285539 10952968 10770524 10153374 9820293 9457549
3209I457549L49691q20209j99216p59422O92840L10173o13009j31334n34275l4572
$$ 9457549 9807240 8987031 8787815 8028393 8721233 9031406 8418397 8287063 7752788 7718216
3199G718216K29585O82145k51866j024165k06600N82087k72934n95920k62585
$$ 7718216 7947801 8629946 8378080 7353915 7147315 7729402 7456468 6860548 6597963
3190F597963o97608k2535N73925p01883p2785M73240J33518L0275n57190M47479
$$ 6597963 5900355 5877820 6451745 5749862 5677077 6150317 6283835 6314110 5756920 6204399
3180F204399k32487q77704j53102K64352O26692l46651k11310M40437K38089l34008
$$ 6204399 5971912 5094208 4941106 5205458 5832150 5485499 5274189 5714626 5952715 5618707
3170E618707o82686N22392o46513j032678N86227j94719L96196J29853n5473o78813
$$ 5618707 4936021 5458413 4811900 3779222 4365449 4170730 4566926 4696779 4641306 3962493
3160C962493k63360P52319N08217m7015m46425j91266M30804J20700p29765p31538
$$ 3962493 3699133 4451452 4959669 4912654 4466229 4274963 4705767 4826467 4096702 3365164
3150C365164P37641k11242J8494J94084l18055j97457Q04515M92824j092848j79615
$$ 3365164 4102805 3891563 3910057 4104141 3786086 3588629 4393144 4885968 3793120 3613505
3140C613505j13509K93642L45012j78429n40153q6409p1344L81378M78157n08677
$$ 3613505 3499996 3793638 4138650 3960221 3420068 3333659 3262315 3643693 4121850 3613173
3130C613173m04377K27100m67814J1353L95593K81352k85562P46754q857q83558
$$ 3613173 3208796 3435896 2968082 2979435 3375028 3656380 3370818 4117572 4108715 3225157
3120C225157k33687m22793N79161j79450l0161J7615k99122P6780J93319p95797
$$ 3225157 2991470 2568677 3147838 2968388 2938227 2955842 2656720 2733500 2926819 2131022
3110B131022m0719O74100N2839J45042M6847n3068m05052N71960k6869r80861
$$ 2131022 2090303 2764403 2817242 2962284 3009131 2956063 2551011 3122971 3096102 2115241
3100B115241R16844L60082n26088r50512M48805n29766M34356Q04730n14968l62422
$$ 2115241 3032085 3392167 2866079 1915567 2364372 1834606 2268962 3073692 2558724 2196302
3090B196302j07725j4788L03288N1681k68119L85928M2347q2116l36915N6860
$$ 2196302 2088577 2073789 2377077 2428758 2160639 2546567 2588914 2506798 2169883 2226743
3080B226743J065038m87519l92922L9481M43164j88404l24779k23728M58746n15681
$$ 2226743 3291781 2804262 2411340 2450821 2893985 2705581 2380802 2157074 2615820 2100139
3070B100139j83444O57978l14685k18488o00354K83681M90676o29520Q64390O98758
$$ 2100139 1916695 2574673 2259988 2041500 1441146 1724827 2215503 1585983 2450373 3149131
3060C149131k30266n45866l65631L13844n49592j9987M52191k49496J35340j40590
$$ 3149131 2918865 2372999 2007368 2321212 1771620 1751633 2203824 1954328 2089668 1949078
3050A949078k98286j72217p4800O34347m93897j57210Q86885j8406n09522P73159
$$ 1949078 1650792 1478575 1403775 2038122 1544225 1387015 2273900 2255494 1745972 2519131
3040B519131j12498o8522q59640N1177K80328J04561j83343j058248L83542N37926
$$ 2519131 2406633 2338111 1478471 1529648 1809976 1914537 1731194 672946 1056488 1594414
3030A594414K40318K55043l26001K29463k04049l32760K34428o91817l62421Q4046
$$ 1594414 1834732 2089775 1763774 1993237 1789188 1456428 1690856 999039 636618 720664
3020G20664J016673N13867n74961n7007P26899n6516p55142Q4708r0925K15455
$$ 720664 1737337 2251204 1676243 1619236 2346135 2289619 1534477 1619185 1528260 1743715
3010A743715o17727j11236M11922M79003j52903Q52659M50693j2094j84710n43983
$$ 1743715 1125988 1014752 1426674 1905677 1752774 2605433 3056126 3044032 2859322 2315339
3000B315339r41646n07261P63447J033223m11697L27687k06644l08084k00323
$$ 2315339 1373693 866432 1629879 2663102 2251405 2579092 2372448 2064364 1864041
2991A864041j034302J04867J31004J45053J095709O02155j018842M0951L83057
$$ 1864041 829739 934606 1065610 1210663 2306372 2908527 1889685 1930636 2313693
2982B313693o19522L46799l80130M07830j6934j24088J03130q79174M92836N83541
$$ 2313693 1694171 2040970 1660840 2068670 2051736 1927648 2030778 1151604 1644440 2227981
2972B227981p16447K09906M37483q82830M46408M91189j64039m33839K13707O08658
$$ 2227981 1511534 1721440 2158923 1276093 1722501 2213690 2049651 1615812 1829519 2438177
2962B438177l19190l25198M99169M32706q51287p00857M78316q198k13651j45964
$$ 2438177 2118987 1793789 2292958 2725664 1874377 1173520 1651836 1643638 1429987 1284023
2952A284023J05875M18299P98402R0849j009692J9879P84907Q82356n1272n06262
$$ 1284023 1389898 1808197 2606599 2697448 1687756 1707635 2492542 3374898 3323626 2817364
2942B817364j63828J52502P01827k84474j35439K87332o7446K30761j56911K72463
$$ 2817364 2653536 2806038 3507865 3223391 3087952 3375284 3307838 3538599 3381688 3654151
2932C654151n13630M41601L38863q40097n6207R3726n24766J32351P69250J04701
$$ 3654151 3140521 3582122 3920985 3080888 3024681 3118407 2593641 2725992 3495242 3599943
2922C599943l19174k23866P61031M19829K75507p44088k26739j01051K78097l90131
$$ 3599943 3280769 3056903 3817934 4237763 4513270 3769182 3542443 3441392 3719489 3329358
2912C329358O73699M9366L66011J67160n99229K31799L56650K94728K71880j500
$$ 3329358 4003057 4052423 4418434 4585594 3986365 4218164 4574814 4869542 5141422 5139922
2902E139922p7732p6897q8919l41288l48147O97906n01984o73884k02600P74376
$$ 5139922 5062190 4985293 4896374 4555086 4206939 4904845 4402861 3728977 3526377 4300753
2892D300753j10554n76660n20238o1057N54187n83150q9061l5228R06246j93401
$$ 4300753 4190199 3613539 3093301 3032244 3586431 3003281 2914220 2878992 3785238 3591837
2882C591837j86031j80652K99247n61288M67751J03635j30835k85178K94576Q14234
$$ 3591837 3405806 3225154 3524401 2963113 3430864 3534499 3403664 3118486 3413062 4227296
2872D227296p66291q70518J229343k05086r64287M47292l92545m06822j96560
$$ 4227296 3461005 2590487 3819830 3614744 2650457 3097749 2705204 2298382 2101822
2863B101822N74909k63337k73224j80519j04101J45803l26854k01812L18696R76859
$$ 2101822 2676731 2413394 2140170 1959651 1855550 2001353 1674499 1472687 1791383 2768242
2853B768242p55703k5303k60942l95756M30350J96263j00155p38344M45840r14348
$$ 2768242 2012539 1987236 1726294 1330538 1760888 1957151 1856996 1118652 1564492 650144
2843F50144Q3534L52279m49215O17054L4259m35095m5457l7047k22664n6802P71859
$$ 650144 733678 1085957 636742 1253796 1288055 852960 807503 770456 547792 490990 1262849
2832A262849k01025Q84751l80702p60363l06476q5543J21886R81523j48176r11997
$$ 1262849 1061824 1946575 1565873 805510 499034 413491 535377 1516900 1368724 456727
2822D56727j82681M92470n40752l25702N39420j48691m28032L33287q8240J06029
$$ 456727 274046 766516 225764 -99938 439482 290791 -137241 196046 107806 213835
2812B13835N1357O31327k96267J27869L13335m41390j02588K61778K7916M52278
$$ 213835 265192 896519 600252 728121 1041456 600066 497478 759256 787172 1239450
2802A239450M07306k64057p63608p07615j06040L28887K16633K78311l6358K41013
$$ 1239450 1646756 1382699 619091 -88524 -194564 134323 350956 629267 592909 833922
2792H33922l98836p9400j3330k21441p83162P4737L02612Q1843O77340m54936
$$ 833922 435086 355686 342356 120915 -662247 -587510 -284898 -203055 474285 19349
2782A9349P95661j72668r4811m98992Q5193O99677J46017o19192q67052p6445
$$ 19349 815010 642342 547531 48539 133732 833409 979426 360234 -506818 -583263
2772e83263J144706O04697j44243J1156O6894p00464M93117J02089o74987l9195
$$ -583263 561443 1166140 1021897 1033053 1099947 399483 892600 994689 319702 280507
2762B80507L05136K85684k50853o88921M65862p55166M05353K4125r944n90420
$$ 280507 585643 871327 620474 -68447 397415 -357751 47602 71727 61783 -528637
2752e28637j54522K17610J21762j6275k41756M61855K40217m0359L0526J41276
$$ -528637 -683159 -465549 -343787 -360062 -601818 -139963 100254 59895 90421 231697
2742B31697j43468O35839o55189k77779M6402M9108j56896K30193J24642O51910
$$ 231697 88229 724068 68879 -208900 -162498 -113390 -270286 -40093 84549 736459
2732G36459L7794j61227L79052J25295K86004m84904o07506J11475L5664M91676
$$ 736459 774253 613026 992078 1117373 1403377 918473 310967 422442 458106 949782
2722I49782M42557o46027m03034m05692M69322O23909l47850l87343K42280k62562
$$ 949782 1392339 746312 343278 -62414 406908 1030817 682967 295624 537904 275342
2712B75342m69289q4490o31219J41943J64343M77009M35795k94846n65152P72781
$$ 275342 -193947 -278437 -909656 -767713 -603370 -126361 309434 14588 -550564 222217
2702B22217j30580l90789P70200k52387p21623O93191k33336Q066K27921m12070
$$ 222217 91637 -299152 471048 218661 -502962 190229 -43107 -35041 192880 -219190
2692b19190o99808P16255L81604o88808L75320j95444j9310j42193J019972J94263
$$ -219190 -918998 -202743 178861 -509947 -134627 -330071 -349381 -491574 528398 722661
2682G22661n54667k19707k93009k23626Q64072k28783r2559K89813n16600N00565
$$ 722661 167994 -51713 -344722 -568348 295724 66941 -25618 264195 -252405 248160
2672B48160k3201n30049J44695k14555J12256O62494j436577L11790N27658P716
$$ 248160 224959 -305090 -160395 -374950 -262694 399800 -1036777 -724987 -197329 -189613
2662a89613J02134m95704R49677q4721m602l16240O00282o4797o31390L4269P08240
$$ -189613 -87479 -583183 366494 281773 277171 -39069 561213 496416 -134974 -100705 607535
2651F07535o72784N15012J71965o0880Q476p70648J01292K13023K38245J76K22707
$$ 607535 -65249 449763 621728 560848 569324 -201324 -100032 112991 351236 351412 574119
2640E74119r21068j0502O91872R2328K16050N4471j99985m73026j155615Q6078
$$ 574119 -346949 -357451 334421 426749 642799 697270 497285 24259 -1131356 -1045278
2630a045278J020230J68438n76411N65779M22676o4480K92113l13526m82431M72321
$$ -1045278 -25048 143390 -433021 132758 555434 490954 783067 469541 -12890 459431
2620D59431m17657k76739j73786k85024r33737J82491J608478m16531j10977M35301
$$ 459431 41774 -234965 -408751 -693775 -1627512 -1445021 163457 -253074 -364051 71250
2610G1250o4062o12839p60593J198248M67157l53738q14887O75988O72622l03865
$$ 71250 7188 -605651 -1366244 -167996 299161 -54577 -869464 -193476 479146 175281
2600A75281k76770j56592R68147p59054l32605N62689O41650J48325p52791L26536
$$ 175281 -101489 -258081 710066 -48988 -381593 181096 822746 971071 218280 544816
2590E44816j002951p33183l02891O38779O31430J21424Q5041n3556K54434m60279
$$ 544816 -458135 -1191318 -1494209 -855430 -224000 -102576 -17535 -71091 183343 -276936
2580b76936j19696J01260R5043o37477O27043L37391m03798K21552K09888j37084
$$ -276936 -396632 -295372 -200329 -837806 -210763 126628 -277170 -55618 154270 17186
2570A7186n02279Q33122j29615l23771O14521m4480J50050p23650m7652o16705
$$ 17186 -485093 348029 218414 -105357 509164 464684 614734 -108916 -156568 -773273
2560g73273R86499R21736o11997l42870L0340p72390k21817R95902k32298J5969
$$ -773273 213226 1134962 522965 180095 210435 -561955 -783772 212130 -20168 -4199
2550d199J66421J55013m80150k89287J030408P13581k8205q50414q09339N47715
$$ -4199 162222 317235 -162915 -452202 578206 1291787 1263582 413168 -396171 151544
2540A51544k67522L9360J52395k01629K67948P17094k9538p14193j39537K83874
$$ 151544 -115978 -76618 75777 -125852 142096 859190 829652 115459 -24078 259796
2530B59796l94192L8462L32371J06899j65185L97589n20561p06822N30116J10960
$$ 259796 -134396 -95934 236437 343336 178151 575740 55179 -651643 -121527 -10567
2520a0567k38769j43700k74897j34301N23969L8667P27329q9607J14542j052655
$$ -10567 -249336 -393036 -667933 -802234 -278265 -239598 487731 398124 512666 -539989
2510e39989o06788R61094L21013m28629K99267J19980r2150m62824j47565L99586
$$ -539989 -1146777 -185683 135330 -293299 5968 125948 33798 -429026 -576591 -177005
2500a77005O3825J61703N55264l6746n29236K5507m35753l39286M22440J87721
$$ -177005 -113180 48523 603787 567041 37805 63312 -372441 -711727 -289287 -101566
2490a01566O22680N49269j182788k70762N68376K46148L78343k26538m32812p23746
$$ -101566 521114 1070383 -112405 -383167 185209 431357 809700 583162 150350 -573396
2480e73396k32640m23187K71536q4661K50681J491844n62158n86408o844M71468
$$ -573396 -806036 -1229223 -957687 -1042348 -791667 700177 138019 -448389 -455233 16235
2470A6235O25058p05051n73520L26607j43346k0570K8750M00185M02525o03579
$$ 16235 641293 -63758 -637278 -310671 -454017 -474587 -445837 -45652 356873 -246706
2460b46706j84830L85728k21490K94415J1258k07403k49736L89230M79873k73623
$$ -246706 -431536 -45808 -267298 27117 38375 -169028 -418764 -29534 450339 176716
2450A76716l09509L89991L10662k94831m3691L16381l24948j16855k15829j30066
$$ 176716 -132793 257198 567860 273029 229338 545719 220771 103916 -111913 -241979
2440b41979m06861n4705L02647k13299k57903J111408M3770n1979P53887m89683
$$ -241979 -648840 -703545 -400898 -614197 -872100 239308 283078 231099 984986 495303
2430D95303m03687j59706O3996m60752o31685P14978P32829M95148n67765l80785
$$ 495303 91616 -68090 -4094 -464846 -1096531 -381553 351276 846424 278659 -102126
2420a02126M53717O40659j01936j2608k32308j50765o5010K96701o10759j7382
$$ -102126 351591 992250 890314 877706 645398 494633 429623 726324 115565 98183
2410I8183L70198p50818J06130N77943n73037l21242P19437K24291Q1525m18536
$$ 98183 468381 -282437 -176307 401636 -171401 -492643 226794 451085 532610 114074
2400A14074m497L65256O70620m24589M01776n4906J64621n35056l26344N93175
$$ 114074 109577 474833 1145453 720864 1122640 1067734 1232355 697299 370955 964130
2390I64130P23802o85992n34332N3772M42561l47895k60087N14786J58370m69897
$$ 964130 1687932 1001940 467608 521380 963941 616046 355959 870745 1029115 559218
2380E59218J23847n3624r1079J55335M94648L34969l77223j6520m78294P06128
$$ 559218 683065 629441 538362 693697 1188345 1523314 1146091 1129571 651277 1357405
2370A357405O39231K19421n08393Q3978L60281p18000K80344k24195k57694p81255
$$ 1357405 1996636 2216057 1707664 1791642 2151923 1433923 1714267 1490072 1232378 451123
2360D51123r6840J35381M320m97411K6313m60793k87334N15195m73795P48001
$$ 451123 354283 489664 493984 -3427 22886 -437907 -725241 -210046 -683841 64160
2350F4160K63276j84981O4900j186757P21969J201346o56757r0480K3577p3843
$$ 64160 327436 142455 207355 -979402 -257433 943913 287156 196676 220253 146410
2340A46410Q9451L31298O40302K91179o54709L60311k72378p39757m08331m02407
$$ 146410 235861 567159 1207461 1498640 843931 1204242 931864 192107 -216224 -618631
2330f18631R32478M72130m83746j011696O24545P74483k61802O46298R7806K29408
$$ -618631 313847 785977 302231 -709465 -84920 689563 427761 1074059 1171865 1401273
2320A401273L5328r06189n02611M67841m17998M47083n8367j22782L92985M00380
$$ 1401273 1436601 530412 27801 495642 77644 524727 466360 343578 736563 1136943
2310A136943o00848P07414K04361j236646k92074Q27139O28138m88590j43842
$$ 1136943 536095 1243509 1447870 211224 -80850 746289 1374427 885837 741995
2301G41995L14067n80135o84867j52260R53612k70245r9197k23628l30761J71995
$$ 741995 1056062 475927 -208940 -361200 592412 322167 222970 -658 -331419 -159424
2291a59424M05398P1783K61707M09676m43814J59365m71165L96283O2506P15940
$$ -159424 245974 317757 579464 989140 545326 704691 233526 629809 692315 1408255
2281A408255N0869r12407L35766P59708j03158k57285k93536N7275k59748j94961
$$ 1408255 1459124 546717 882483 1642191 1539033 1281748 988212 1045487 785739 590778
2271E90778R97867k97672n56841L17450R69047r2313j067093K30665p61581j4631
$$ 590778 1588645 1290973 734132 1051582 2020629 1928316 861223 1091888 330307 315676
2261C15676J67371Q99050M48457l01477k28676M12222J23308q12065n6118P66856
$$ 315676 483047 1382097 1830554 1529077 1300401 1712623 1835931 1023866 967748 1734604
2251A734604k98358j24680L01678l92101l72338J192588L62793k85721L30752
$$ 1734604 1436246 1311566 1613244 1221143 848805 2041393 2404186 2118465 2449217
2242B449217l78480m2856j18258l49308N89762R43573j582951P6910P34039k11200
$$ 2449217 2070737 2027881 1909623 1560315 2150077 3093650 1510699 1587609 2321648 2110448
2232B110448p03881q7536M47326L58094j04253J83042j2600j34074j13582l53668
$$ 2110448 1406567 1319031 1766357 2124451 2020198 2203240 2190640 2056566 1942984 1589316
2222A589316N41357l17862K24912k02266J98962K46555M42813J082127j9287o42865
$$ 1589316 2130673 1812811 2037723 1835457 2034419 2280974 2723787 3805914 3786627 3143762
2212C143762J02596P49666p10406k38527K35558l11719M16850J129820M7431J92247
$$ 3143762 3246358 3996024 3285618 3047091 3282649 2970930 3387780 4517600 4565031 4757278
2202D757278r53850n25862J16138M01444m57233j85580R55669M17449q25630p88329
$$ 4757278 3803428 3277566 3393704 3795148 3337915 3152335 4108004 4525453 3699823 2911494
2192B911494L6710J265505O0721O7674j82404n87901M91382K52469K07981N25451
$$ 2911494 2948204 4213709 4274430 4342104 4159700 3571799 4063181 4315650 4523631 5049082
2182E049082K27906l37227p73198L39951R39601K2754l46914M8584J41121J6496
$$ 5049082 5276988 4939761 4166563 4506514 5446115 5468869 5121955 5170539 5311660 5328156
2172E328156J03251m3959N35648n33115P69887L35898m59435l83165N76566J55488
$$ 5328156 5431407 5387448 5923096 5389981 6159868 6495766 6036331 5653166 6229732 6385220
2162F385220j33312Q19049N31719L94657K61012k01217P79356N21128J011721
$$ 6385220 6251908 7070957 7602676 7997333 8258345 8057128 8836484 9357612 10369333
2153A0369333K55364n01734L92401j52086K63068J107164p34338M856M35653J038631
$$ 10369333 10624697 10122963 10515364 10363278 10626346 11733510 10999172 11004028 11439681 12478312
2143A2478312Q85491q7689o3640R98439P3494L84910M51357J05466J593085P06597
$$ 12478312 13363803 13276114 13212474 14210913 14284407 14669317 15120674 15226140 16819225 17525822
2133A7525822K26716O38195P14574J556062O60360J360395J459859O70697J181574
$$ 17525822 17752538 18390733 19105307 20661369 21321729 22682124 24141983 24812680 25994254
2124B5994254J231857J741966K776155J974695K106684L078550L305939J654449
$$ 25994254 27226111 28968077 31744232 33718927 35825611 38904161 42210100 43864549
2116D3864549K324160L487546N864933O829490Q676815R703698J2703932J6876485
$$ 43864549 46188709 49676255 55541188 62370678 71047493 80751191 93455123 110331608
2108A10331608K3480948K7845154L2289775L3341667L5436132P834244l8182838
$$ 110331608 133812556 161657710 193947485 227289152 262725284 270559528 232376690
2101B32376690m8472655m5046612k9974890k0213892j3838506j1618167p541320
$$ 232376690 183904035 138857423 108882533 88668641 74830135 63211968 55670648
2094E5670648o227448m552885l163523k653646k356279j326810j826077k350769
$$ 55670648 49443200 44890315 41726792 39073146 36716867 35390057 33563980 31213211
2086C1213211l438581k266391k059811j878539j151862j306699j781515q41322
$$ 31213211 27774630 25508239 23448428 21569889 20418027 19111328 17329813 16488491
2078A6488491j330403p66311m04801q89110n23504n80506P6986m02938k02900
$$ 16488491 15158088 14391777 13986976 13097866 12574362 11993856 12070842 11667904 11465004
2069A1465004p63523n27809p88012J17789m38184j80898l83155q69252o37362
$$ 11465004 10701481 10173672 9385660 9503449 9065265 8884367 8501212 7631960 6994598
2060F994598o7272N11290j03150j015112l9290m46398l8249l23754j29840l11332
$$ 6994598 6927326 7438616 7335466 6320354 6281064 5834666 5796417 5472663 5342823 5031491
2050E031491Q6113k32330L56648m18427n91801L0111j81791o33021n96639P57979
$$ 5031491 5117604 4885274 5241922 4823495 4231694 4261805 4080014 3446993 2850354 3608333
2040C608333M95480Q6079n09130l46244j28539J94770P05733n79101m04758J09575
$$ 3608333 4103813 4189892 3680762 3334518 3205979 3400749 4106482 3527381 3122623 3232198
2030C232198J4519k24955N9174k22883N75889j250424m66424N2333q14297N14615
$$ 3232198 3246717 3021762 3080936 2858053 3433942 2183518 1717094 1769427 955130 1469745
2020A469745N03502K31208n77927j79708k95861l08448P84656M49795m03057n34389
$$ 1469745 1973247 2204455 1626528 1446820 1150959 842511 1627167 2076962 1673905 1139516
2010A139516l17346M58081O79156p74087k10932J52918M11442p9153r14418l7379
$$ 1139516 822170 1280251 1959407 1185320 974388 1127306 1538748 1459595 545177 507798
2000E07798L89047k69077n90098J161793j051928l79543J230568j02769k3429
$$ 507798 896845 627768 37670 1199463 147535 -232008 998560 895791 872362
1991H72362k4859o35352m6236J97208M77262j53862q3479j94724O0485k05479
$$ 872362 847503 212151 165915 363123 840385 686523 603044 408320 468805 263326
1981B63326q094O66747L41598m47034M9853o4960L60890N9778n34355j98486o891
$$ 263326 255232 921979 1263577 816543 866396 801436 1162326 1222104 687749 489263 482372
1970D82372N60501N1364p17431K32829J165600l527k89214j31026n32499j13015
$$ 482372 1042873 1094237 376806 609635 1775235 1771708 1482494 1351468 818969 705954
1960G05954O5300m51427O76700n69250n4609M47954l16042k94168j77570K1472
$$ 705954 771254 319827 996527 427277 372668 820622 504580 210412 32842 54314
1950E4314J52422j11255j64032N6008n16965P10086p1736L6061J78408q8605J28887
$$ 54314 206736 95481 -68551 -12543 -529508 180578 108842 144903 323311 234706 363593
1939C63593K00369n06595L65340K15312q4619P76669j12228r0619o42883o88715
$$ 363593 563962 57367 422707 638019 553400 1330069 1217841 1127222 484339 -204376
1929b04376J55560O26103O77017N0765j272006j08681N11069O88333k79555M3862
$$ -204376 -48816 577287 1254304 1305069 33063 -75618 435451 1123784 844229 888091
1919H88091p3299k35667n10328N37976J5631o58245J61964l42078j10021P56989
$$ 888091 814792 579125 68797 606773 622404 -35841 126123 -215955 -325976 431013
1909D31013J37647l09353l53101j9526R15038j76042q71543O73075n15479R9771
$$ 431013 568660 259307 -93794 -113320 801718 625676 -245867 427208 -88271 11500
1899A1500N25453m2517l12107M37385K45236l7668J17292k13162m50067J3236
$$ 11500 536953 494436 182329 619714 864950 827282 944574 731412 281345 294581
1889B94581M26578O10184p4005j433049L51557P39202M09309k99580n47487m55209
$$ 294581 721159 1331343 1257338 -175711 175846 915048 1324357 1024777 477290 22081
1879B2081M89129M56524l63111M59837m42217p03045k31567o8089O71562L71401
$$ 22081 511210 967734 604623 1064460 622243 -80802 -312369 -380458 291104 662505
1869F62505j25019K79554l35419M72860l80174o45123l32173K74136N33866O39933
$$ 662505 537486 817040 481621 954481 574307 -70816 -402989 -128853 405013 1044946
1859A044946K78825j150734m9516p33133j57340n0650K62404N1439k60472M74698
$$ 1044946 1323771 173037 123521 -609612 -766952 -817602 -555198 -503759 -764231 -289533
1849b89533J158202r53864K75494J2039N65945o9124p6028o9786O9627N660k49763
$$ -289533 868669 -85195 190299 202338 768283 699159 623131 553345 622972 628632 378869
1838C78869L14865P2714O17741L71536m5916K62765p25447q2609m82417q25762
$$ 378869 693734 766448 1384189 1755725 1709809 1972574 1247127 1164518 682101 -143661
1828a43661q46104r4945P32336l96492J157335P10222n03009O76594r8630k97196
$$ -143661 -989765 -1084710 -352374 -748866 408469 1118691 615682 1292276 1193646 896450
1818H96450j07236m00145l73484M33198K15103N91659j18290q38200j37249M39661
$$ 896450 789214 389069 15585 448783 663886 1255545 1137255 299055 161806 601467
1808F01467L10304j09588n5454K32207o9993k7842j25005j134789q1667j21198
$$ 601467 911771 802183 746729 978936 908943 881101 756096 -378693 -460360 -581558
1798e81558M6264M83672J22251j07340O9064m41369r9480M81790K73562M06796
$$ -581558 -535294 -51622 70629 -36711 32353 -409016 -508496 -26706 246856 653652
1788F53652n17015p91385R48307n58403p9384l17010N60019L14737k55669l54210
$$ 653652 136637 -654748 293559 -264844 -344228 -661238 -101219 213518 -42151 -396361
1778c96361Q03209M43953n76050l27525l82259M40335J18111p36508P13469P9508
$$ -396361 406848 850801 274751 -52774 -435033 5302 123413 -613095 100374 179882
1768A79882N16050J11461q4620o36170p13890L31915L17287J53604m53677Q6025
$$ 179882 695932 807393 722773 86603 -627287 -295372 21915 175519 -278158 -192133
1758a92133K60164N28417k37473j312159n31668R68897J01897L73667L81588J61049
$$ -192133 68031 596448 358975 -953184 -1484852 -515955 -414058 -40391 341197 502246
1748E02246J82737p97661l53042N74513j97150n0577k43397R34736P28819q40206
$$ 502246 684983 -112678 -465720 108793 -88357 -138934 -382331 552405 1281224 441018
1738D41018n44409L13050J02108j30395K21764l65322j99883M4239N0961p38826
$$ 441018 -103391 209659 311767 181372 403136 37814 -162069 -117830 -66869 -805695
1728h05695m73719O97030K6311j53342O0517j81356P19457L25705O09103l40474
$$ -805695 -1279414 -582384 -556073 -709415 -648898 -830254 -110797 214908 824011 483537
1718D83537l10818k29937R6746K01952m51602l80922k05302R09231l94545o7995
$$ 483537 172719 -57218 39528 241480 -210122 -591044 -796346 112885 -281660 -349655
1708c49655L16057l61938K1233p13648M85843Q11798P090l37955q40040M46432
$$ -349655 -33598 -395536 -374303 -1087951 -602108 209690 216780 -121175 -961215 -514783
1698e14783J57291J9844M41324L70997m69887n34918M67157P05948m4309l85097
$$ -514783 -357492 -337648 103676 474673 4786 -530132 -62975 642973 598664 213567
1688B13567O7083M083n78501o33904R81593O19873k21531l86159k68332q0452
$$ 213567 280650 284733 -293768 -927672 53921 673794 452263 66104 -202228 -282680
1678b82680j06015o77494K13441K33606N45885J16298o6696R37793J35074l85759
$$ -282680 -388695 -1066189 -852748 -619142 -73257 43041 -23655 914138 1049212 663453
1668F63453n68680J62774p89258l28991J61850O94091P253j25246K37661K6770
$$ 663453 94773 257547 -531711 -860702 -698852 -4761 2492 -122754 114907 141677
1658A41677j17577j94177j89462l96334l14149R22375k38880p1540m82496K67094
$$ 141677 24100 -170077 -359539 -755873 -1070022 -147647 -386527 -458067 -940563 -673469
1648f73469J76746K05790R08360l67072J26209l20255k29012K84331l97355p28524
$$ -673469 -496723 -290933 617427 250355 376564 56309 -172703 111628 -285727 -1014251
1638a014251K7731P70075k39704L87190j27971m88688Q4432k13400p0394J243689
$$ -1014251 -986520 -216445 -456149 -68959 -196930 -685618 -601186 -814586 -884980 358709
1628C58709j12474m95747Q84327l66795M34105n01035j56608M37945m62903o90989
$$ 358709 246235 -249512 634815 268020 702125 201090 44482 482427 19524 -671465
1618f71465J81420o6782K94965L40425p89630K33932N39494R8260m050p0886m4496
$$ -671465 -490045 -556827 -261862 78563 -711067 -477135 62359 160619 156569 85683 41187
1607D1187n60606K17184k3697j4822l19332O97441N70030M9141j049360k97197
$$ 41187 -519419 -302235 -325932 -340754 -660086 37355 607385 656526 -392834 -690031
1597f90031j69137j97159O86169M36588L55708q25734L59518M42019N0665o03754
$$ -690031 -859168 -1056327 -370158 66430 422138 -403596 -44078 397941 448606 -155148
1587a55148J2812N69580q2684j20584P9934j109047N45167j94846L68890N6414
$$ -155148 -142336 427244 344560 223976 303910 -805137 -259970 -454816 -85926 -29512
1577b9512p20901O14777N54020M27458j074749j35703j06788k99331n12762Q43855
$$ -29512 -750413 -135636 418384 845842 -228907 -364610 -471398 -770729 -1283491 -439636
1567d39636j30205P62354P29343o12120j004158J3887Q97890K03697q9245l94041
$$ -439636 -569841 192513 921856 309736 -694422 -680535 217355 421052 331807 -62234
1557f2234N43391m91003r27158P8683O387j73382r3015j39527L18928N56784P53010
$$ -62234 481157 -9846 -937004 -858321 -851934 -1025316 -1118331 -1257858 -938930 -382146 370864
1546C70864P64061j410797j91496Q34169P3890j049381O18173K29889o5277J94707
$$ 370864 1134925 -275872 -467368 366801 440691 -608690 9483 239372 174095 368802
1536C68802m73229P72317p28124q09003K80693O59780l05947j9666l10157N8043
$$ 368802 -104427 667890 -60234 -869237 -588544 71236 -234711 -254377 -564534 -506491
1526e06491l14002M35772J95660j65459k53938K71498q0451N50044O26313j57582
$$ -506491 -820493 -384721 -189061 -354520 -608458 -336960 -417411 132633 758946 601364
1516F01364q46911K13469k81436j018035K63298Q50527P88939j85057P12986l00598
$$ 601364 -245547 -32078 -313514 -1331549 -1068251 -217724 571215 386158 1099144 798546
1506G98546j080358K8713m7252L38489n25354j014946K64067J116186J14492O1860
$$ 798546 -281812 -253099 -300351 38138 -487216 -1502162 -1238095 -121909 -7417 54443
1496E4443P12733p51408j028258J67423Q09406m66014M93568k99383k32809O86446
$$ 54443 767176 15768 -1012490 -845067 -35661 -501675 -8107 -307490 -540299 146147
1486A46147n67637K60393l30739j58951K06608m92895P21384K84719n12665o70963
$$ 146147 -421490 -161097 -491836 -650787 -444179 -937074 -215690 69029 -443636 -1114599
1476a114599r0970K8100R61534P02733J00037l87981M82475j97945l90621J92259
$$ -1114599 -1205569 -1177469 -215935 486798 586835 198854 681329 483384 92763 285022
1466B85022o37908k81025j37736M54977j7935j3079K68210N4333P40842l07801
$$ 285022 -352886 -633911 -771647 -316670 -334605 -347684 -79474 -25141 715701 407900
1456D07900q66364N00123r36764J32472O57057L25823L56144p47726k03607R3727
$$ 407900 -458464 41659 -895105 -762633 -105576 220247 576391 -171335 -374942 -281215
1446b81215J75955k95828L03198Q24584k4961l82320l96278J01923n24098O65
$$ -281215 -105260 -401088 -97890 726694 701733 319413 -76865 25058 -499040 -498375
1436d98375r6354P3698N38226l3530Q42596p36848J35226k72142N71166P1918
$$ -498375 -594729 -521031 17195 -16335 826261 89413 224639 -47503 523663 595581
1426E95581k92330j040933r980J014837m84261J39612k17960K62321M49714M98130
$$ 595581 303251 -737682 -747662 267175 -217086 -77474 -295434 -33113 416601 914731
1416I14731k68654o50526n56955K02521L4481N44674J39925L14853r73097k83414
$$ 914731 646077 -4449 -561404 -358883 -324402 220272 360197 675050 -298047 -581461
1406e81461J75667Q2660M58061J52314L0860n66423l435p6152j77252N79200j44153
$$ -581461 -405794 -323134 134927 287241 318101 -248322 -251757 -327909 -505161 74039 -70114
1395g0114N17856m69257N25214K31458j041908R11917n44711K82900L17071P9431
$$ -70114 447742 -21515 503699 735157 -306751 605166 60455 343355 660426 739857
1385G39857l10809k09324K87629j014232j91681N87391j9119K32082O33952N99508
$$ 739857 429048 219724 507353 -506879 -698560 -111169 -130288 101794 735746 1335254
1375A335254j07876M78135n27349r22466m78482k93813M05756J01459j09782M96528
$$ 1335254 1227378 1705513 1178164 255698 -222784 -516597 -110841 -9382 -119164 377364
1365C77364o58336o73723L48359M60206m7396l52968Q5797K35272J0351J53019
$$ 377364 -280972 -954695 -606336 -146130 -193526 -546494 -460697 -225425 -215074 -62055
1355f2055L76958m07353k25921Q0571k72772L51314m49016K3936J89036J14418
$$ -62055 314903 -92450 -318371 -237800 -510572 -159258 -608274 -584338 -395302 -280884
1345b80884P40400J33559L19881m17694n10879k25841p0713l58487J42888J1971
$$ -280884 459516 593075 912956 495262 -15617 -241458 -312171 -670658 -527770 -515799
1335e15799N98637J03094k8611M92836k84075k52365N45365M1174K08913j080249
$$ -515799 82838 185932 157321 650157 366082 113717 659082 700256 909169 -171080
1325a71080j85671k490j86558P94086k77572j91280M56281n43513N18824K39789
$$ -171080 -356751 -359241 -545799 248287 -29285 -220565 235716 -307797 211027 450816
1315D50816l37521q31591O4781P33780q4190j01209O09252m26280J63453K63162
$$ 450816 113295 -718296 -653515 80265 -3925 -105134 504118 77838 241291 504453
1305E04453J19430k12247j103503K23613J86652N87776p50155K80953N10189K37263
$$ 504453 623883 411636 -691867 -468254 -281602 306174 -443981 -163028 347161 584424
1295E84424l35591j74190j60371j15781q92L1943J52966N61768r2622j38813j32794
$$ 584424 248833 74643 -85728 -201509 -202401 -170458 -17492 544276 451654 312841 180047
1284A80047p96511K61329P23116L57215j62850o54822l06574k32631L44377k03572
$$ 180047 -616464 -355135 367981 725196 562346 -92476 -399050 -631681 -287304 -490876
1274d90876M25723J11536J83701q01180l87533K31709N44362O21820P8536N05988
$$ -490876 -65153 46383 230084 -571096 -958629 -726920 -182558 439262 517798 1023786
1264A023786j372836m30653J40358j66461O14648M532q93706o9877J22623Q86916
$$ 1023786 -349050 -779703 -639345 -805806 -191158 -186626 -1080332 -1150209 -1027586 -140670
1254a40670P49161L72209m40876n22596p78011L40392N04228j213400M56674J67826
$$ -140670 608491 980700 539824 17228 -760783 -420391 83837 -1129563 -672889 -505063
1244e05063M60153J71385k13527J19539L79578l94620l84172O4843k91091M13245
$$ -505063 -44910 126475 -87052 32487 412065 17445 -366727 -301884 -592975 -179730
1234a79730l55409L22968N24460L7865m6880j50971k70357o91522J13758P1003
$$ -179730 -535139 -212171 312289 350154 303274 152303 -118054 -809576 -695818 -624815
1224f24815L9502N31359k73622N87123j82733j003639M51744J50024N9099K95194
$$ -624815 -585313 -53954 -327576 259547 76814 -926825 -475081 -325057 -265958 29236
1214B9236k10952N82816o20104O80235j76210m09627P34742l78702O27885n71423
$$ 29236 -181716 401100 -219004 461231 285021 -124606 610136 231434 859319 287896
1204B87896p9292p69513j24017m08836P91242M55846q9955l96862j92449j97732
$$ 287896 208604 -560909 -684926 -1093762 -302520 153326 63371 -333491 -525940 -723672
1194g23672k17078p9481L55320J12297L28204M76990j61787j35736K3625n1944
$$ -723672 -940750 -1020231 -664911 -552614 -224410 252580 90793 -44943 -21318 -73262
1184g3262M77473K46245p25248J9850M65750M76927k84090j239652j018679R22887
$$ -73262 404211 650456 -74792 -54942 410808 887735 603645 -636007 -1654686 -731799
1174g31799M56373j96823L45893N90564p25142K7893K57788N99288L9463o61520
$$ -731799 -275426 -472249 -126356 464208 -260934 -233041 24747 624035 663498 1978
1164A978n50991K55113Q12158M19542o65163O3471L2964j33989J10661q80959
$$ 1978 -549013 -293900 518258 937800 272637 336108 369072 235083 345744 -535215
1154e35215M02957N80389n48150L93492M38894m9912p28031q05354m84851O22252
$$ -535215 -132258 448131 -100019 293473 732367 682455 -45576 -850930 -1335781 -713529
1144g13529N02678M77057n4763j49659P35087L27325p71715J00844l21607M008
$$ -713529 -210851 266206 211443 61784 796871 1124196 352481 453325 131718 135726
1134A35726n18766K87766P54905j210651j04979K38034p32654L16692P84475L45622
$$ 135726 -383040 -95274 659631 -551020 -655999 -417965 -1150619 -833927 -49452 296170
1124B96170K8017K5917j46106m76081k99936K68258m89201P95235L09900o38818
$$ 296170 324187 350104 203998 -272083 -572019 -303761 -792962 2273 312173 -326645
1114c26645L5750k71250N18253l8542M83592q21244o53583M70991M78720p8460
$$ -326645 -290895 -562145 -43892 -82434 401158 -420086 -1073669 -602678 -123958 -202418
$$ [...]
##END NTUPLES=NMR SPECTRUM
##END=
