##TITLE=1H_EC-3293(VII-34)
 CDCl3
 8 sc, 
 10.5.2023
##JCAMPDX= 6.0         $$ Bruker NMR JCAMP-DX V2.0
##DATA TYPE= NMR SPECTRUM
##DATA CLASS= NTUPLES
##ORIGIN= UXNMR, Bruker Analytische Messtechnik GmbH
##OWNER= root
$$ XWIN-NMR		Version 3.5
$$ Wed May 10 14:11:23 2023 Russian Standard Time (UT+4h)  she@DPX200
##.OBSERVE FREQUENCY= 200.13135
##.OBSERVE NUCLEUS= ^1H
##.ACQUISITION MODE= SIMULTANEOUS
##.ACQUISITION SCHEME= undefined
##.AVERAGES= 8
##.DIGITISER RES= 18
##SPECTROMETER/DATA SYSTEM= spect
##.PULSE SEQUENCE= zg30
##.SOLVENT NAME= CDCl3
##.SHIFT REFERENCE= (INTERNAL, CDCl3, 0, 15.7645)
##AUDIT TRAIL= $$ (NUMBER, WHEN, WHO, WHERE, WHAT)
$$ ##TITLE= Audit trail, XWIN-NMR		Version 3.5
$$ ##JCAMPDX= 5.01
$$ ##ORIGIN= Bruker BioSpin GmbH
$$ ##OWNER= she
$$ F:/spectra/data/she/nmr/H-F/1/pdata/1/auditp.txt
$$ ##AUDIT TRAIL=  $$ (NUMBER, WHEN, WHO, WHERE, WHAT)
(   1,<2023-05-10 14:09:40.12 +0400>,<she>,<DPX200>,
      <created by zg, POWCHK disabled, PULCHK disabled
       configuration hash MD5:
       00 E9 B6 7A A2 85 ED C7 34 08 36 98 17 FE 4E 26
       data hash MD5: 16K
       44 7B 6B 1D 36 B8 FE 14 A0 82 00 B1 D9 CD 26 72>)
(   2,<2023-05-10 14:09:43.84 +0400>,<she>,<DPX200>,
      <Start of raw data processing
       efp BC_mod = 2 LB = 0.24 FT_mod = 6 PKNL = 1 PHC0 = -19820.77 PHC1 = 14.6008 SI = 16K 
       data hash MD5: 16K
       4F 13 44 1B 55 DC 05 16 38 DF 18 BE CB 8C CF FF>)
(   3,<2023-05-10 14:10:04.23 +0400>,<she>,<DPX200>,
      <pk PHC0 = -157.9761 PHC1 = -0.3999998 
       data hash MD5: 16K
       60 5B 23 B8 8C F3 75 EB C6 D8 08 EC B3 17 24 C4>)
(   4,<2023-05-10 14:10:07.81 +0400>,<she>,<DPX200>,
      <abs ABSG = 5 
       data hash MD5: 16K
       FB 94 34 77 1C C0 F3 5C 73 43 01 50 A9 0B 46 1E>)
$$ ##END=
$$ 
$$ hash MD5
$$ 28 22 F2 0D 18 28 8F 0B FA BE 56 0F 2E 97 01 E6
##$RELAX= 
##$RELAX= 
##$RELAX= 
##$RELAX= 
##$RELAX= 
##$RELAX= 
$$ Bruker specific parameters
$$ --------------------------
##$DU= <F:/spectra>
##$EXPNO= 1
##$NAME= <H-F>
##$PROCNO= 1
##$TYPE= <nmr>
##$USER= <she>
##$AMP= (0..31)
100 100 100 100 100 100 100 100 100 100 100 100 100 100 100 100 100 100 
100 100 100 100 100 100 100 100 100 100 100 100 100 100 
##$AQSEQ= 0
##$AQ_mod= 1
##$AUNM= <au_zg>
##$AUTOPOS= <>
##$BF1= 200.13
##$BF2= 200.13
##$BF3= 200.13
##$BF4= 200.13
##$BF5= 200.13
##$BF6= 200.13
##$BF7= 200.13
##$BF8= 200.13
##$BYTORDA= 1
##$CFDGTYP= 0
##$CFRGTYP= 5
##$CHEMSTR= <none>
##$CNST= (0..31)
1 1 145 1 1 1 1 1 1 1 1 1 1 1 1 1 1 1 1 1 1 1 1 1 1 1 1 1 1 1 1 1 
##$CPDPRG= <>
##$CPDPRG1= <>
##$CPDPRG2= <>
##$CPDPRG3= <>
##$CPDPRG4= <mlev>
##$CPDPRG5= <mlev>
##$CPDPRG6= <mlev>
##$CPDPRG7= <mlev>
##$CPDPRG8= <mlev>
##$CPDPRGB= <>
##$CPDPRGT= <>
##$D= (0..31)
0 1.2 0 0 0 0 0 0 0 0.06 0 0.03 0 0 0 0 0.0002 0 0 0 0 0 0 0 0 0 0 0 0 
0 0 0 
##$DATE= 1683713379
##$DBL= (0..7)
120 120 120 120 120 120 120 120 
##$DBP= (0..7)
150 150 150 150 150 150 150 150 
##$DBP07= 0
##$DBPNAM0= <>
##$DBPNAM1= <>
##$DBPNAM2= <>
##$DBPNAM3= <>
##$DBPNAM4= <>
$$ [...]
##$SUBNAM3= <"">
##$SUBNAM4= <"">
##$SUBNAM5= <"">
##$SUBNAM6= <"">
##$SUBNAM7= <"">
##$SUBNAM8= <"">
##$SUBNAM9= <"">
##$SW= 18.05172834244
##$SWIBOX= (0..15)
0 0 2 0 0 0 0 0 0 0 0 0 0 0 0 0 
##$SW_h= 3612.71676300578
##$TD= 16384
##$TD0= 1
##$TE= 0
##$TE2= 300
##$TE3= 300
##$TEG= 300
##$TL= (0..7)
0 120 120 120 120 120 120 120 
##$TP= (0..7)
150 150 150 150 150 150 150 150 
##$TP07= 0
##$TPNAME0= <>
##$TPNAME1= <>
##$TPNAME2= <>
##$TPNAME3= <>
##$TPNAME4= <>
##$TPNAME5= <>
##$TPNAME6= <>
##$TPNAME7= <>
##$TPOAL= (0..7)
0.5 0.5 0.5 0.5 0.5 0.5 0.5 0.5 
##$TPOFFS= (0..7)
0 0 0 0 0 0 0 0 
##$TUNHIN= 0
##$TUNHOUT= 0
##$TUNXOUT= 0
##$USERA1= <user>
##$USERA2= <user>
##$USERA3= <user>
##$USERA4= <user>
##$USERA5= <user>
##$V9= 5
##$VALIST= <valist>
##$VCLIST= <CCCCCCCCCCCCCCC>
##$VD= 0
##$VDLIST= <DDDDDDDDDDDDDDD>
##$VPLIST= <PPPPPPPPPPPPPPP>
##$VTLIST= <TTTTTTTTTTTTTTT>
##$WBST= 1024
##$WBSW= 4
##$XGAIN= (0..3)
0 0 0 0 
##$XL= 0
##$YL= 0
##$YMAX_a= 528235
##$YMIN_a= -702045
##$ZGOPTNS= <>
##$ZL1= 120
##$ZL2= 120
##$ZL3= 120
##$ZL4= 120
##$ABSF1= 15.74579
##$ABSF2= -2.30606
##$ABSG= 5
##$ABSL= 3
##$ALPHA= 0
##$AQORDER= 0
##$ASSFAC= 0
##$ASSFACI= 0
##$ASSFACX= 0
##$ASSWID= 0
##$AUNMP= <proc_1d>
##$AZFE= 0.1
##$AZFW= 0.1
##$BCFW= 0
##$BC_mod= 2
##$BYTORDP= 0
##$COROFFS= 0
##$CY= -3
##$DATMOD= 1
##$DC= 0
##$DFILT= <>
##$DTYPP= 0
##$F1P= 0
##$F2P= 0
##$FCOR= 1
##$FTSIZE= 16384
##$FT_mod= 6
##$GAMMA= 0
##$GB= 0
##$INTBC= 1
##$INTSCL= 3.70164e-10
##$ISEN= 128
##$LB= 0.24
##$LEV0= 0
##$LPBIN= 0
##$MAXI= 10000
##$MC2= 0
##$MEAN= 0
##$ME_mod= 0
##$MI= 1.114404
##$NCOEF= 0
##$NC_proc= -7
##$NLEV= 6
##$NOISF1= 3.799351
##$NOISF2= 2.8
##$NSP= 0
##$NTH_PI= 0
##$NZP= 0
##$OFFSET= 15.76452
##$PC= 1
##$PHC0= -19978.75
##$PHC1= 14.2008
##$PH_mod= 1
##$PKNL= yes
##$PPARMOD= 0
##$PSCAL= 0
##$PSIGN= 0
##$REVERSE= no
##$SF= 200.130001405779
##$SI= 16384
##$SIGF1= 3
##$SIGF2= 2
##$SINO= 5.538805
##$SIOLD= 16384
##$SREGLST= <1H.CDCl3>
##$SSB= 0
##$STSI= 16384
##$STSR= 0
##$SW_p= 3612.71676300578
##$SYMM= 0
##$S_DEV= 0
##$TDeff= 16384
##$TDoff= 0
##$TI= <>
##$TILT= no
##$TM1= 0
##$TM2= 0
##$TOPLEV= 0
##$USERP1= <user>
##$USERP2= <user>
##$USERP3= <user>
##$USERP4= <user>
##$USERP5= <user>
##$WDW= 1
##$XDIM= 16384
##$YMAX_p= 467600345
##$YMIN_p= -650690
$$ End of Bruker specific parameters
$$ ---------------------------------
##NTUPLES= NMR SPECTRUM
##VAR_NAME=  FREQUENCY,     SPECTRUM/REAL,   SPECTRUM/IMAG
##SYMBOL=    X,             R,               I
##VAR_TYPE=  INDEPENDENT,   DEPENDENT,       DEPENDENT
##VAR_FORM=  AFFN,          ASDF,            ASDF
##VAR_DIM=   16384,         16384,           16384
##UNITS=     HZ,            ARBITRARY UNITS, ARBITRARY UNITS
##FACTOR=    0.220516191357247, 1,           1
##FIRST=     3154.95334801478, 0,            0
##LAST=      -457.763414991001, 0,           0
##MIN=       -457.763414991001, -650690,     0
##MAX=       3154.95334801478, 467600345,    0
$$ Real data points
##PAGE= N=1
##DATA TABLE= (X++(R..R)), XYDATA
$$ [...]
$$ plain form
6856 66171 46421 -7354 -20558 -69385 -131154 -88957 -27705 -19490 -63591 -61441 -43024 -49183
6844 -49183 -53127 -125583 -37047 6785 -30471 -12141 -103175 -89972 -55129 -106794 -50871 -150643
6832 -150643 -78180 -103729 -164471 -185145 -169960 -74010 -95633 -111340 -206850 -393050 -266560
6821 -266560 -331367 -295044 -252548 -220563 -211522 -141435 -215383 -318418 -270244 -212777 -93062
6810 -93062 -46035 -174594 -344147 -293271 -258524 -182757 -353061 -380220 -372356 -357586 -310072
6799 -310072 -422737 -269246 -232958 -354870 -355823 -376980 -357256 -274707 -340538 -356537 -316522
6788 -316522 -419748 -357943 -324259 -333709 -350999 -524651 -379630 -369824 -366712 -456293 -451503 -344938
6776 -344938 -368198 -267041 -259108 -208662 -363131 -411077 -375739 -526667 -558594 -365855 -303271
$$ packed form
6856F6171j9750n3775j3204m8827o1769M2197O1252Q215m4101K150J8417o159
6844d9183l944p2456Q8536M3832l7256J8330r1034J3203L4843n1665N5923r9772
6832a50643P2463k5549o0742k0674J5185R5950k1623j5707r5510j86200J26490
6821b66560o4807L6323M2496L1985R041P0087p3948j03035M8174N7467J19715
6810i3062M7027j28559j69553N0876L4747P5767j70304k7159P864J4770M7514
6799c10072j12665J53491L6288j21912r53k1157J9724Q2549o5831j5999M0015
6788c16522j03226O1805L3684r450j7290j73652J45021R806L112q9581M790J06565
6776c44938k3260J01157P933N0446j54469m7946L5338j50928l1927J92739O2584
$$ plain form
6765 -303271 -186202 -241315 -279338 -335757 -369051 -265763 -240292 -288454 -266745 -269376 -141505
6754 -141505 -161670 -274026 -180637 -67096 -215050 -174947 -242926 -168612 -169514 -312528 -320047
6743 -320047 -299209 -285028 -360540 -423866 -513323 -282143 -309352 -332141 -298794 -380665 -316794
6732 -316794 -239792 -375523 -333611 -303208 -352117 -412344 -264894 -335988 -526467 -407552 -462007
6721 -462007 -509106 -492198 -579939 -469705 -347176 -353664 -392689 -505253 -386627 -338235 -399523
6710 -399523 -322549 -376495 -388768 -428565 -541641 -506498 -507320 -462636 -414335 -506838 -459257 -412692
6698 -412692 -397981 -431755 -366513 -522975 -548594 -422574 -354165 -307490 -394595 -401353 -317461
6687 -317461 -310169 -334442 -347263 -437261 -514511 -429891 -454408 -329931 -430321 -474371 -470751 -513973
$$ packed form
6765c03271J17069n5113l8023n6419l3294J03288K5471m8162K1709k631J27871
6754a41505k0165j12356R3389J13541j47954M0103o7979P4314r02j43014p519
6743c20047K0838J4181p5512o3326q9457K31180k7209k2789L3347q1871O3871
6732c16794P7002j35731M1912L0403m8909o0227J47450p1094j90479J18915n4455
6721d62007m7099J6908q7741J10234J22529o488l9025j12564J18626M8392o1288
6710c99523P6974n3946j2273l9797j13076L5143q22M4684M8301r2503M7581M6565
6698d12692J4711l3774O5242j56462k5619J26020O8409M6675q7105o758Q3892
6687c17461P292k4273j2821q9998p7250Q4620k4517J24477j00390m4050L620m3222
$$ plain form
6675 -513973 -522689 -425017 -425349 -500172 -386190 -342985 -400400 -407697 -318069 -377082 -364095 -455670
6663 -455670 -464017 -457171 -452257 -516542 -527592 -502890 -426228 -468263 -439632 -421873 -386957 -347253
6651 -347253 -377191 -437281 -545491 -503097 -370101 -312914 -473477 -458459 -396183 -402536 -305154
6640 -305154 -471042 -530662 -435631 -331238 -389489 -406367 -408127 -371821 -359217 -315423 -398269
6629 -398269 -409120 -434710 -387551 -466572 -521498 -511368 -520706 -469292 -498444 -474390 -512155 -534699
6617 -534699 -615980 -561373 -467894 -453616 -444195 -504309 -548586 -576310 -618286 -522551 -448815 -441810
6605 -441810 -352961 -481831 -512216 -432384 -438783 -451591 -493119 -559735 -498288 -517458 -410450
6594 -410450 -354020 -432465 -430029 -510062 -503133 -376266 -464530 -446068 -450431 -580213 -530592 -650690
$$ packed form
6675e13973q716R7672l32p4823J13982M3205n7415p297Q9628n9013J2987r1575
6663d55670q347O846M914o4285j1050K4702P6662m2035K8631J7759L4916L9704
6651c47253k9938o0090j08210M2394J32996N7187j60563J5018O2276o353R7382
6640c05154j65888n9620R5031J04393n8251j6878j760L6306J2604M3794q2846
6629c98269j0851k5590M7159p9021n4926J0130r338N1414k9152K4054l7765k2544
6617e34699q1281N4607R3479J4278R421o0114m4277k7724m1976R5735P3736P005
6605d41810Q8849j28870l0385P9832o399j2808m1528o6616O1447j9170J07008
6594d10450N6430p8445K436q0033O929J26867q8264J8462m363j29782M9621j20098
$$ plain form
6582 -650690 -524458 -468595 -442362 -559456 -550059 -573519 -533621 -607194 -529746 -374685 -524821
6571 -524821 -427525 -327731 -437151 -448829 -295154 -342086 -371099 -384512 -549117 -569363 -441198
6560 -441198 -480419 -561601 -596077 -485924 -402813 -488140 -446018 -518063 -493266 -535597 -568514
6549 -568514 -430991 -313352 -418251 -441098 -508308 -480845 -499223 -470062 -434696 -382466 -506624
6538 -506624 -414476 -363427 -577857 -577010 -433590 -367074 -397487 -302423 -449588 -494246 -421660
6527 -421660 -453322 -503787 -578387 -536725 -450987 -440236 -458878 -482831 -523416 -423385 -331720
6516 -331720 -395131 -497694 -546297 -546049 -605122 -452958 -331556 -289814 -346458 -433142 -381355
6505 -381355 -404069 -527861 -470042 -431080 -409130 -377009 -397566 -493331 -358525 -404790 -518884
$$ packed form
6582f50690J26232N5863K6233j17094R397k3460L9898p3573P7448J55061j50136
6571e24821R7296R9794j09420j1678J53675m6932k9013j3413j64605k0246J28165
6560d41198l9221q1182l4476J10153Q3111q5327M2122p2045K4797m2331l2917
6549e68514J37523J17639j04899k2847o7210K7463j8378K9161L5366N2230j24158
6538e06624R2148N1049k14430Q47J43420O6516l0413R5064j47165m4658P2586
6527d21660l1662n0465p4600M1662Q5738J0751j8642k3953m0585J00031R1665
6516c31720o3411j02563m8603K48n9073J52164J21402M1742n6644q6684N1787
6505c81355k2714j23792N7819L8962K1950L2121k0557r5765J34806m6265j14094
$$ plain form
6494 -518884 -443711 -389884 -423422 -466173 -517974 -443483 -588746 -540036 -370395 -394808 -328103
6483 -328103 -434915 -452901 -376972 -426655 -359602 -304621 -419179 -464409 -373905 -336741 -275923
6472 -275923 -201689 -253390 -302155 -413957 -387716 -322807 -211570 -262058 -280185 -229534 -306825
6461 -306825 -292269 -340094 -301017 -184221 -163338 -295930 -242586 -232352 -332879 -354902 -444447
6450 -444447 -433664 -307046 -389757 -410071 -365615 -462091 -356246 -389154 -408222 -395098 -495293
6439 -495293 -453730 -432504 -406955 -313644 -310539 -425872 -394942 -289564 -311244 -279716 -334043
6428 -334043 -419156 -336651 -272651 -248563 -452224 -575861 -449794 -316125 -292732 -312341 -314778
6417 -314778 -355071 -506872 -410564 -404849 -380677 -395815 -472758 -330978 -403805 -428908 -365546
$$ packed form
6494e18884P5173N3827l3538m2751n1801P4491j45263M8710J69641k4413O6705
6483c28103j06812j7986P5929m9683O7053N4981j14558m5230R0504L7164O0818
6472b75923P4234n1701m8765j11802K6241O4909J11237n0488j8127N0651p7291
6461c06825J4556m7825L9077J16796K0883j32592N3344J0234j00527k2023q9545
6450d44447J0783J26618q2711k0314M4456r6476J05845l2908j9068J3124j00195
6439d95293M1563K1226K5549R3311L105j15333L0930J05378k1680L1528n4327
6428c34043q5113Q2505O4000K4088k03661j23637J26067J33669K3393j9609k437
6417c14778m0293j51801R6308N715K4172j5138p6943J41780p2827k5103O3362
$$ plain form
6406 -365546 -384442 -413950 -480171 -456806 -370185 -446976 -406614 -268431 -317763 -467687 -453079
6395 -453079 -433586 -426427 -419842 -299811 -325252 -303332 -315432 -280616 -274348 -321834 -404824 -441220
6383 -441220 -496138 -399957 -381634 -340440 -306189 -389859 -310215 -211556 -374151 -385563 -249824
6372 -249824 -208914 -347964 -403694 -311162 -384583 -286849 -291849 -216168 -301217 -385692 -298950 -423242
6360 -423242 -375226 -310123 -214653 -203775 -376543 -325489 -301614 -182792 -214695 -225028 -319094
6349 -319094 -365698 -340267 -370410 -345656 -200525 -194613 -286438 -238604 -250361 -381397 -279070
6338 -279070 -263839 -305758 -382870 -307160 -322032 -311074 -292655 -418249 -321539 -276786 -329580
6327 -329580 -284437 -253642 -246599 -347764 -336265 -454430 -509628 -442697 -562725 -445440 -454377
$$ packed form
6406c65546j8896k9508o6221K3365Q6621p6791M0362J38183m9332j49924J4608
6395d53079J9493P159O585J20031k5441K1920j2100L4816O268m7486q2990l6396
6383d41220n4918R6181J8323M1194L4251q3670P9644R8659j62595j1412J35739
6372b49824M0910j39050n5730R2532p3421R7734n000P5681q5049q4475Q6742j24292
6360d23242M8016O5103R5470J0878j72768N1054K3875J18822l1903j0333r4066
6349c19094m6604K5431l0143K4754J45131N912r1825M7834j1757j31036J02327
6338b79070J5231m1919p7112P5710j4872J0958J8419j25594R6710M4753n2794
6327c29580M5143L0795P043j01165J1499j18165n5198O6931j20028J17285q937
$$ plain form
6316 -454377 -381328 -300334 -284401 -365788 -304012 -187259 -142316 -145783 -157352 -241512 -226464 -292176
6304 -292176 -401405 -369880 -369496 -297114 -96879 -157802 -201988 -350138 -334496 -298675 -386251
6293 -386251 -298220 -288143 -335290 -358887 -362443 -320730 -281275 -146432 -215872 -260338 -343972 -405868
6281 -405868 -359461 -228903 -274137 -377833 -394017 -326819 -236837 -261939 -273850 -286032 -281523
6270 -281523 -347562 -213775 -307945 -289410 -273261 -306084 -333196 -316610 -353287 -314732 -266423
6259 -266423 -222220 -235345 -255309 -266101 -300954 -387691 -381538 -382031 -314415 -268944 -224947 -212816
6247 -212816 -315749 -278200 -134231 -322668 -275183 -296510 -390057 -307357 -259731 -184745 -308769
6236 -308769 -432752 -356410 -302124 -311736 -196586 -170997 -105508 -136015 -111699 -233173 -275795
$$ packed form
6316d54377P3049Q0994J5933q1387O1776J16753M4943l467j1569q4160J5048o5712
6304b92176j09229L1525L84P2382K00235o0923m4186j48150J5642L5821q7576
6293c86251Q8031J0077m7147k3597l556M1713L9455J34843o9440m4466q3634o1896
6281d05868M6407J30558m5234j03696j6184O7198Q9982k5102j1911j2182M509
6270b81523o6039J33787r4170J8535J6149l2823k7112J6586l6677L8555M8309
6259b66423M4203j3125j9964j0792l4853q6737O153m93O7616M5471M3997J2131
6247b12816j02933L7549J43969j88437M7485k1327r3547Q2700M7626P4986j24024
6236c08769j23983P6342N4286r612J15150K5589O5489l0507K4316j21474m2622
$$ plain form
6225 -275795 -407591 -260108 -318083 -341959 -279781 -334209 -309237 -307790 -256136 -200082 -225226
6214 -225226 -257598 -315899 -428195 -430721 -490007 -369596 -413916 -393897 -314359 -268524 -233187
6203 -233187 -237000 -140119 -97385 -200873 -163817 -223773 -209150 -150030 -208350 -186758 -122906 -170484
6191 -170484 -218548 -191726 -143818 -239084 -370715 -316342 -378519 -199722 -32868 -87851 -137557
6180 -137557 -119331 -17119 -103512 -171711 -65300 -93545 -170115 -233525 -237741 -198479 -126337
6169 -126337 12333 -114023 -220706 -144517 -151745 -91057 -45002 -61677 3895 -132641 -137767
6158 -137767 -76703 -68864 -11838 -142636 -98716 -57447 -33834 68108 81962 87109 145351 115045
6146 115045 92354 74090 -33495 -62391 32540 -54900 -120329 -129931 -77210 -24765 -73561 -109247
$$ packed form
6225b75795j31796J47483n7975k3876O2178n4428K4972J447N1654N6054k5144
6214b25226l2372n8301j12296k526n9286J20411m4320K0019P9538M5835L5337
6203b33187l813R6881M2734j03488L7056n9956J4623N9120n8320K1592O3852m7578
6191a70484m8064K6822M7908r5266j31631N4373o2177J78797J66854n4983m9706
6180a37557J8226J02212q6393o8199J06411k8245p6570o3410m216L9262P2142
6169a26337J38670j26356j06683P6189p228O0688M6055j6675O5572j36536n126
6158a37767O1064P839N7026j30798M3920M1269K3613J01942J3854N147N8242l0306
6146A15045k2691j8264j07585k8896R4931q7440o5429r602N2721N2445m8796l5686
$$ plain form
6134 -109247 -111694 -62141 -81983 -31551 -31246 -76590 -85722 -192477 -134228 18531 104008 31471
6122 31471 52394 33799 72175 127621 174728 132745 198143 400466 406001 274408 61629
6111 61629 93360 -85801 -55031 -45039 -64640 74180 43393 -60364 -57270 -99382 -18851 78248
6099 78248 56438 42735 33349 56138 48426 45102 108572 111857 84109 -67815 -21841 106724
6087 106724 93991 104124 98886 258076 281129 153216 161516 68952 172016 80978 -75987
6076 -75987 89685 27714 -17635 53874 67961 101619 266034 376107 333784 279637 62762
6065 62762 116737 146007 96094 148073 176589 191628 93722 55954 -110065 -746 191257
6054 191257 162346 123579 120390 186267 212475 172950 193443 177802 161482 172545 326761 453420
$$ packed form
6134a09247k447M9553j9842N0432L05m5344r132j06755N8249J52759Q5477p2537
6122C1471K0923j8595L8376N5446M7107m1983O5398K02323N535j31593k12779
6111F1629L1731j79161L0770R992j9601J38820l0787j03757L094m2112Q0531R7099
6099G8248k1810j3703r386K2789p712l324O3470L285k7748j51924M5974J28565
6087A06724j2733J0133n238J59190K3053j27913Q300r2564J03064r1038j56965
6076g5987J65672o1971m5349P1509J4087L3658J64415J10073m2323n4147k16875
6065F2762N3975K9270m9913N1979K8516J5039r7906l7768j66019J09319J92003
6054A91257k8911l8767l189O5877K6208l9525K0493j5641j6320J1063J54216J26659
$$ plain form
6042 453420 337338 261705 317576 273549 337686 329981 473636 240800 271176 340546 336740
6031 336740 415765 384108 396871 526239 607927 515395 505333 292279 326121 403987 378036
6020 378036 431776 450280 514112 457684 360583 429245 383055 512569 551692 525958 563149
6009 563149 461269 633269 570808 555668 555190 525320 481239 500048 672017 650701 649984 764252
5997 764252 648538 527094 661029 690402 690710 770191 696650 655434 606352 502213 589730
5986 589730 604155 711233 684150 540102 514989 589757 605234 683962 686880 842260 814231
5975 814231 817930 897671 743405 717310 823060 840559 927949 901442 940020 929966 843601
5964 843601 916595 913004 912505 1051515 951506 919133 942943 874125 830780 775745 849592 960950
$$ packed form
6042D53420j16082p5633N5871m4027O4137p705J43655k32836L0376O9370l806
6031C36740P9025l1657J2763J29368Q1688r2532j0062k13054L3842P7866k5951
6020C78036N3740J8504O3832n6428r7101O8662m6190J29514L9123k5734L7191
6009E63149j01880J72000o2461j5140m78k9870m4081J8809J71969k1316p17J14268
5997G64252j15714j21444J33935K9373L08P9481p3541m1216m9082j04139Q7517
5986E89730J4425J07078k7083j44048k5113P4768J5477P8728K918J55380k8029
5975H14231L699P9741j54266k6095J05750J7499Q7390k6507L8578j0054q6365
5964H43601P2994l591m99J39010j00009l2373K3810o8818m3345n5035P3847J11358
$$ plain form
5952 960950 991636 1053980 995269 1046950 1191130 1114978 1094222 1118125 1083852 1100095 1124032
5941 1124032 1109093 1168102 1162594 1142108 1151326 1125128 1145151 1154710 1230949 1070256 1186654 1329235
5929 1329235 1234074 1255513 1226789 1186405 1216102 1300162 1303345 1275332 1257775 1369583 1367791 1376351
5917 1376351 1404844 1492187 1438350 1502214 1642607 1622109 1625598 1747641 1785791 1863069 1837158
5906 1837158 1965964 1858349 1918073 2122966 2141777 2185708 2091744 2138159 2227548 2340427 2351888
5895 2351888 2359779 2324126 2419564 2660532 2677233 2706866 2695821 2743796 2914958 3060917 2994542
5884 2994542 3087365 3182687 3299254 3484619 3631777 3641014 3838684 4023390 4076831 4140430 4118211
5873 4118211 4261694 4431380 4724065 4827827 5078736 5460594 5674579 5944530 6350072 6672818
$$ packed form
5952I60950L0686O2344n8711N1681J44180p6152k0756K3903l4273J6243K3937
5941A124032j4939N9009n508k0486R218k6198K0023R559P6239j60693J16398J42581
5929A329235r5161K1439k8724m0384K9697Q4060L183k8013j7557J11808j792Q560
5917A376351K8493Q7343n3837O3864J40393k0498L489J22043L8150P7278k5911
5906A837158J28806j07615N9724K04893J8811M3931r3964M6415Q9389J12879J1461
5895B351888P891l5653R5438K40968J6701K9633j1045M7975J71162J45959o6375
5884B994542R2823R5322J16567J85365J47158R237J97670J84706N3441O3599k2219
5873D118211J43483J69686K92685J03762K50909L81858K13985K69951M05542L22746
$$ plain form
5863 6672818 6921172 7354133 7908485 8496034 8984738 9563792 10476485 11629903 12753130
5854 12753130 14051246 15700881 17349121 18736306 19612288 19754389 19004594 17890383 16505488
5845 16505488 15000301 13808530 12855340 12298474 11947906 11626750 11562335 11512247 11727607
5836 11727607 11870331 12305329 12809009 13460420 14077313 14906730 15871823 17068563 18338074
5827 18338074 19677407 21350474 23352236 25886033 28775660 32401996 36744482 41508961
5819 41508961 45982952 49406795 50338594 48176937 44235584 39539020 34591189 29917483
5811 29917483 25958382 23071006 20916589 19351109 18277097 17375889 16843372 16538068 16374801
5802 16374801 16414088 16618569 17061454 17554968 18172383 19083829 20107987 21285310 22770001
$$ packed form
5863F672818K48354M32961N54352N87549M88704N79054R12693J153418J123227
5854A2753130J298116J649635J648240J387185Q75982J42101p49795j114211j384895
5845A6505488j505187j191771r53190n56866l50568l21156o4415n0088K15360
5836A1727607J42724M34998N03680O51411O16893Q29417R65093J196740J269511
5827A8338074J339333J673067K001762K533797K889627L626336M342486M764479
5819D1508961M473991L423843R31799k161657l941353m696564m947831m673706
5811B9917483l959101k887376k154417j565480j074012r01208n32517l05304j63267
5802A6374801L9287K04481M42885M93514O17415R11446J024158J177323J484691
$$ plain form
5793 22770001 24558711 26519397 29036150 32409437 36311797 40860637 45287662 49137108
5785 49137108 50913891 49416610 45587860 40864442 35667315 30405822 25702312 22165218
5777 22165218 19552806 17586592 15964489 14628820 13513027 12866324 12308655 11857376 11568114
5768 11568114 11422970 11295020 11258545 11340198 11505377 11620117 11835481 12271448 12773696 13544161
5758 13544161 14374962 15311949 16613297 18092886 19363041 19947670 19734631 18744279 17052060
5749 17052060 15151396 13442862 11577672 9951256 8873060 8024669 7346679 6760465 6223444
5740 6223444 5744181 5534744 5298857 4997369 4937029 4779240 4571405 4344565 4151394 4001443
5730 4001443 3827784 3806411 3700573 3701366 3495263 3395098 3278382 3257120 3213777 3142844 3061918
$$ packed form
5793B2770001J788710J960686K516753L373287L902360M548840M427025L849446
5785D9137108J776783j497281l828750m723418n197127n261493m703510l537094
5777B2165218k612412j966214j622103j335669j115793o46703n57669m51279k89262
5768A1568114j45144j27950l6475Q1653J65179J14740K15364M35967N02248P70465
5758A3544161Q30801R36987J301348J479589J270155N84629k13039r90352j692219
5749A7052060j900664j708534j865190j626416j078196q48391o77990n86214n37021
5740F223444m79263k09437k35887l01488o0340j57789k07835k26840j93171j49951
5730D001443j73659k1373j05838P93k06103j00165j16716k1262m3343p0933q0926
$$ plain form
5719 3061918 2941675 2816343 2978408 2895240 2896725 2899790 2865474 2716496 2746882 2650837 2697977
5708 2697977 2576437 2421079 2352319 2357217 2409867 2368624 2265046 2227809 2218257 2193190 2173771
5697 2173771 2125007 2164320 2074573 2078307 2045097 2070378 2261075 2216672 2164421 2191659 2126452
5686 2126452 2297270 2327983 2288913 2220191 2112226 2155687 2201067 2151465 2125000 2157513 2163372
5675 2163372 2240509 2244825 2009179 1969492 1823187 2014178 2044659 1982113 1858868 1865915 2080323
5664 2080323 1949552 1830174 1921377 1841634 1908116 1985640 1842155 1796452 1801762 1820194 1984044
5653 1984044 2055679 1919010 1968873 2027505 1933123 1945211 1867710 1798858 1944448 1982441 1907025
5642 1907025 1990224 1895700 1872032 1816961 1752624 1838761 2031843 1980938 1766080 1791889 2002063
$$ packed form
5719C061918j20243j25332J62065q3168J485L065l4316j48978L0386r6045M7140
5708B697977j21540j55358o8760M898N2650m1243j03578l7237r552k5067j9419
5697B173771m8764L9313q9747L734l3210K5281J90697m4403n2251K7238o5207
5686B126452J70818L0713l9070o8722j07965M3461M5380m9602k6465L2513N859
5675B163372P7137M316k35646l9687j46305J90991L0481o2546j23245P047K14408
5664B080323j30771j19378R1203p9743O6482P7524j43485m5703N310J8432J63850
5653A984044P1635j36669M9863N8632r4382J2088p7501o8852J45590L7993p5416
5642A907025Q3199r4524k3668n5071o4337Q6137J93082n0905k14858K5809K10174
$$ plain form
5631 2002063 1978355 1947280 1934899 1859315 1968742 2012205 1917796 1855267 1938216 1952867 2016828
5620 2016828 2002057 2056752 2001887 1989726 1863771 1894424 2050576 2158770 2125435 2030633 2075120
5609 2075120 2052020 2068588 2003341 2026342 2123723 2219919 2220266 2123907 2136875 2139063 2158157 2178785
5597 2178785 2170825 2186112 2207037 2227255 2305030 2397753 2376316 2451806 2412985 2500012 2552719 2579719
5585 2579719 2543787 2574289 2673722 2569149 2564814 2637243 2698862 2738110 2762059 2808955 2861395
5574 2861395 2911688 2940330 2932320 3008732 3146181 3157464 3235066 3308577 3415436 3482872 3461114
5563 3461114 3522945 3517160 3510136 3562838 3734070 3796752 3765752 3709135 3747769 3943259 4077565
5552 4077565 4092319 3996209 4029788 4282731 4376097 4388335 4491837 4707077 4728025 4740048 4940558
$$ packed form
5631B002063k3708l1075j2381p5584J09427M3463r4409o2529Q2949J4651O3961
5620B016828j4771N4695n4865j2161j25955L0653J56152J08194l3335r4802M4487
5609B075120k3100J6568o5247K3001R7381R6196L47r6359J2968K188J9094K0628
5597B178785p960J5287K0925K0218P7775R2723k1437P5490l8821Q7027N2707K7000
5585B579719l5932L0502R9433j04573m335P2429O1619L9248K3949M6896N2440
5574B861395N0293K8642q010P6412J37449J1283P7602P3511J06859O7436k1758
5563C461114O1831n785p024N2702J71232O2682l1000n6617L8634J95490J34306
5552D077565J4754r6110L3579K52943R3366J2238J03502K15240K0948J2023K00510
$$ plain form
5541 4940558 4936065 4974202 5253899 5126847 5139868 5368732 5496192 5663948 5644390 5740273 5787171
5530 5787171 5876549 5973364 6186441 6404588 6520018 6599844 6723321 6993475 7005761 6974628
5520 6974628 7047608 7163972 7195296 7320738 7654108 7762097 7863380 8006979 7990573 8019775
5510 8019775 8113797 8171964 8277792 8499790 8438005 8512868 8639630 8797693 8835196 9112002
5500 9112002 9237992 9278408 9306146 9410910 9408936 9489675 9505271 9445197 9565613 9706504 9790853
5489 9790853 9809253 9889400 9742165 9769807 9695812 9775252 9855711 9862302 9811251 9977790 9999058
5478 9999058 9791838 9644052 9589565 9532399 9652357 9607751 9533798 9373242 9385750 9305224 9109520
5467 9109520 9048340 9061342 9154577 9180661 9150400 9170933 9235730 9114179 8985363 8977886 8952068
$$ packed form
5541D940558m493L8137K79697j27052J3021K28864J27460J67756j9558R5883M6898
5530E787171Q9378R6815K13077K18147J15430P9826J23477K70154J2286l1133
5520F974628P2980J16364L1324J25442L33370J07989J01283J43599j6406K9202
5510H019775R4022N8167J05828K21998o1785P4863J26762J58063L7503K76806
5500I112002J25990M0416K7738J04764j974Q0739J5596o0074J20416J40891Q4349
5489I790853J8400Q0147j47235K7642p3995P9440Q0459O591n1051J66539K1268
5478I999058k07220j47786n4487n7166J19958m4606p3953j60556J2508q0526j95704
5467I109520o1180J3002R3235K6084l0261K0533O4797j21551j28816p477k5818
$$ plain form
5456 8952068 8821065 8770861 8736193 8675477 8777552 8867879 8871712 8923012 8824365 8762877 8727690
5445 8727690 8607553 8483800 8465355 8332405 8234404 8282947 8303363 8154689 8111660 8057270 7968057
5434 7968057 7859934 7994176 7974645 7959919 7858802 7911955 7838026 7809424 7937609 7908890 7883912
5423 7883912 7960156 8097762 8179591 8148309 8165798 8053201 8028033 8160806 8217518 8294043 8281611
5412 8281611 8303776 8225326 8340787 8455781 8388775 8340313 8193081 8064660 8168018 8237633
5402 8237633 8287869 8127737 7948349 7960266 8149258 8040463 8023081 8199939 8246341 8257019
5392 8257019 8395094 8373456 8301731 8396925 8537010 8618513 8772160 8759029 8684561 8859762 9036641
5381 9036641 9118009 9142703 9140595 9159427 9131377 9125259 9101705 9156472 9153832 9302135 9087654 8995303
$$ packed form
5456H952068j31003n0204l4668o0716J02075R0327L833N1300r8647o1488l5187
5445H727690j20137j23753j8445j32950r8001M8543K0416j48674m3029n4390q9213
5434G968057j08123J34242j9531j4726j01117N3153p3929k8602J28185k8719k4978
5423G883912P6244J37606Q1829l1282J7489j12597k5168J32773N6712P6525j2432
5412H281611K2165p8450J15461J14994o7006m8462j47232j28421J03358O9615
5402H237633N0236j60132j79388J1917J88992j08795j7382J76858M6402J0678
5392H257019J38075k1638p1725R5194J40085Q1503J53647j3131p4468J75201J76879
5381I036641Q1368K4694k108J8832k8050o118k3554N4767k640J48303k14481r2351
$$ plain form
5369 8995303 8979221 9144077 9079014 8964017 8975661 8905987 8792032 8808796 8874475 8821191 8811278
5358 8811278 8721648 8626268 8612127 8719549 8607170 8487797 8526510 8566020 8558805 8467667 8427581
5347 8427581 8332588 8185739 8107341 8128122 8165349 7926815 7838651 7741836 7680988 7524812 7461855
5336 7461855 7309603 7214080 7109359 6983585 6792853 6852234 6664833 6536379 6365302 6319047
5326 6319047 6118843 6057220 5964171 5773056 5732530 5593076 5487938 5363683 5370882 5166663
5316 5166663 5004572 4963419 4924957 4783151 4799821 4841067 4724165 4463847 4343278 4282171
5306 4282171 4286737 4252152 4131094 4053707 3828382 3813545 3789850 3661383 3766311 3715714 3631400
5295 3631400 3592941 3614771 3600242 3670701 3491217 3397090 3311170 3246311 3239877 3063087 3076567
$$ packed form
5369H995303j6082J64856o5063j14997J1644o9674j13955J6764O5679n3284r913
5358H811278q9630r5380j4141J07422j12379j19373L8713L9510p215r1138m0086
5347H427581r4993j46849p8398K0781L7227k38534q8164r6815o0848j56176o2957
5336G461855j52252r5523j04721j25774j90732N9381j87401j28454j71077m6255
5326F319047k00204o1623r3049j91115m0526j39454j05138j24255P199k04219
5316E166663j62091m1153l8462j41806J6670M1246j16902k60318j20569o1107
5306D282171M566l4585j21058p7387k25325j4837k3695j28467J04928n0597q4314
5295C631400l8459K1830j4529P0459j79484r4127q5920o4859o434j76790J3480
$$ plain form
5284 3076567 3049105 3253888 3206341 3145221 2990959 2876693 2979275 2938196 2839914 2825111 2873161
5273 2873161 2849149 2767019 2876852 3009749 2987017 2960894 2788680 2821064 2796437 2720903 2738658
5262 2738658 2852406 2724087 2798835 2746386 2631982 2738006 2608063 2802035 2797071 2704407
5252 2704407 2690366 2615414 2588009 2657687 2676253 2580340 2694710 2835285 2698308 2597125 2570290
5241 2570290 2530753 2517900 2584938 2658964 2626023 2546642 2456627 2451381 2432215 2354146 2383457 2520863
5229 2520863 2569022 2469860 2447884 2414401 2432265 2363903 2418196 2501692 2373958 2536042 2357087
5218 2357087 2281283 2408498 2349056 2303407 2374058 2638111 2473542 2351288 2352256 2392845 2341026
5207 2341026 2340837 2354910 2292290 2200615 2143635 2119270 2148806 2047647 2000704 2117929 2095897
$$ packed form
5284C076567k7462K04783m7547o1120j54262j14266J02582m1079r8282j4803M8050
5273B873161k4012q2130J09833J32897k2732k6123j72214L2384k4627p5534J7755
5262B738658J13748j28319P4748n2449j14404J06024j29943J93972m964r2664
5252B704407j4041p4952k7405O9678J8566r5913J14370J40575j36977j01183k6835
5241B570290l9537j2853O7038P4026l2941p9381r0015n246j9166p8069K9311J37406
5229B520863M8159r9162k1976l3483J7864o8362N4293Q3496j27734J62084j78955
5218B357087p5804J27215n9442m5649P0651K64053j64569j22254R68M0589n1819
5207B341026j89J4073o2620r1675n6980k4365K9536j01159m6943J17225k2032
$$ plain form
5196 2095897 2090206 2106551 2103124 2032996 1912478 1976701 2018166 2034517 2080142 1995519 2024565 1946851
5184 1946851 1950363 1982440 1977114 1891184 1891165 1773305 1900523 1893032 1785889 1778240 1763664 1922184
5172 1922184 2013177 1931096 1892334 1998857 2155665 2020434 2021488 2076916 1952354 1995208 2125416
5161 2125416 2069900 1956191 1968593 2001279 1936561 2034291 1941059 1978019 2033112 1903248 1957428
5150 1957428 2052882 2088507 1929252 1859326 1956172 1986256 1947296 1949292 1933920 1823931 1783800
5139 1783800 1854783 1867043 1787208 1912903 1924606 1857383 1910613 1892961 1890212 1858134 1900015
5128 1900015 1874657 2003215 1986087 1928179 2052370 2002503 1839630 1848341 1909036 1978113 1988075
5117 1988075 1939537 1959265 1919920 2009956 2084324 2157275 2120960 2074615 2258707 2309263 2258129
$$ packed form
5196B095897n691J6345l427p0128j20518O4223M1465J6351M5625q4623K9046p7714
5184A946851L512L2077n326q5930j9j17860J27218p491j07143p649j4576J58520
5172A922184R0993q2081l8762J06523J56808j35231J054N5428j24562M2854J30208
5161B125416n5516j13709J2402L2686o4718R7730r3232L6960N5093j29864N4180
5150A957428R5454L5625j59255o9926R6846L0084l8960J996j5372j09989m0131
5139A783800P0983J2260p9835J25695J1703o7223N3230j7652k749l2078M1881
5128A900015k5358J28558j7128n7908J24191m9867j62873Q711O0695O9077R962
5117A988075m8538J9728l9345R0036P4368P2951l6315m6345J84092N0556n1134
$$ plain form
5106 2258129 2177273 2212600 2232717 2311089 2289252 2353137 2453821 2594758 2599648 2559926 2552997
5095 2552997 2621918 2694358 2715895 2769968 2866312 2896856 2873314 2937467 3086271 3175445 3227453
5084 3227453 3421339 3293870 3372508 3453974 3474933 3515136 3408340 3497313 3637598 3596522 3629317
5073 3629317 3723437 3686637 3753431 3771028 3602534 3691630 3700754 3738643 3845187 3697974 3801992
5062 3801992 3859553 3868463 3813404 3869444 4002363 4165209 4049026 3995732 4076785 3916870 3930411
5051 3930411 4070926 3983460 3989670 3905555 3898781 4093289 4081006 4046032 4003257 4133358 4160903
5040 4160903 4131145 4223379 4235934 4155539 4136311 4264802 4264504 4222974 4183343 4254534 4298815 4324341
5028 4324341 4460019 4408810 4185575 4207838 4220863 4092169 4112152 4270408 4220237 4224348 4134026
$$ packed form
5106B258129q0856L5327K0117P8372k1837O3885J00684J40937M890l9722o929
5095B552997O8921P2440K1537N4073R6344L0544k3542O4153J48804Q9174N2008
5084C227453J93886j27469P8638Q1466K0959M0203j06796Q8973J40285m1076L2795
5073C629317R4120l6800O6794J7597j68494Q9096R124L7889J06544j47213J04018
5062C801992N7561Q910n5059N6040J32919J62846j16183n3294Q1053j59915J3541
5051C930411J40515q7466O210q4115o774J94508j2283l4974m2775J30101K7545
5040D160903k9758R2234J2555q0395j9228J28491k98m1530l9631P1191M4281K5526
5028D324341J35678n1209k23235K2263J3025j28694J9983J58256n0171M111r0322
$$ plain form
5017 4134026 3926319 3830440 3717501 3529538 3408250 3354710 3252874 3092472 3210381 3280300
5007 3280300 3259254 3307289 3126802 3047170 3175824 3132567 3029178 3109394 3042217 3110286 3154247
4996 3154247 3275284 3068537 2953877 3041712 3047208 3112719 3088972 3098909 3105305 3034357 2960487
4985 2960487 2993279 3023146 2961602 2996833 3225507 3219683 3084939 2964117 3091078 3153679 3216377
4974 3216377 3227746 3251686 3470380 3401594 3545653 3484378 3579957 3625533 3634224 3643817 3647471 3789281
4962 3789281 3957466 3935289 3995021 4001199 3987674 4196820 4343031 4309896 4152690 4205367 4394091
4951 4394091 4499053 4596170 4527937 4564744 4663495 4589048 4519390 4527321 4666637 4810549 4873748
4940 4873748 5029039 5073675 5105236 5184812 5261515 5285494 5296483 5434869 5450586 5599013 5756366
$$ packed form
5017D134026k07707r5879j12939j87963j21288n3540j01836j60402J17909O9919
5007C280300k1046M8035j80487p9632J28654m3257j03389Q0216o7177O8069M3961
4996C154247J21037k06747j14660Q7835N496O5511k3747R937O396p0948p3870
4985B960487L2792K9867o1544L5231K28674n824j34744j20822J26961O2601O2698
4974C216377J1369K3940K18694o8786J44059o1275R5579M5576Q691R593L654J41810
4962C789281J68185k2177N9732O178j3525K09146J46211l3135j57206N2677J88724
4951D394091J04962R7117o8233L6807R8751p4447o9658P931J39316J43912O3199
4940D873748J55291M4636L1561P9576P6703K3979J0989J38386J5717J48427J57353
$$ plain form
4929 5756366 5636762 5666221 5689908 5736869 5789134 5951506 5858963 5768987 5696907 5685332 5685676
4918 5685676 5593055 5553374 5359128 5292181 5075911 5091657 5175723 5102112 5046476 5044979 5080878
4907 5080878 4968115 4765927 4693949 4641409 4631860 4673020 4618325 4567573 4595041 4461609 4383434
4896 4383434 4438112 4355769 4356248 4344746 4333027 4277082 4236462 4352001 4399766 4423643 4333331 4299695
4884 4299695 4242488 4269930 4207617 4241302 4243292 4366937 4367105 4288360 4275594 4325873 4387123 4494717
4872 4494717 4593308 4562839 4514552 4595620 4739642 4736225 4608344 4606603 4621647 4740155 4764398
4861 4764398 4863967 4922037 5082159 5096734 5090050 5125512 5203795 5313016 5393552 5528566 5394113
4850 5394113 5428207 5566527 5660509 5721253 5783649 5648075 5570581 5615878 5867527 6017097 6013314
$$ packed form
4929E756366j19604K9459K3687M6961N2265J62372r2543q9976p2080j1575L44
4918E685676r2621l9681j94246o6947k16270J5746Q4066p3611n5636j497L5899
4907E080878j12763k02188p1978n2540r549M1160n4695n0752K7468j33432p8175
4896D383434N4678q2343M79j1502j1719n5945m0620J15539M7765K3877r0312l3636
4884D299695n7207K7442o2313L3685J990J23645J68p8745j2766N0279O1250J07594
4872D494717R8591l0469m8287Q1068J44022l417j27881j741J5044J18508K4243
4861D764398R9569N8070J60122J4575o684L5462P8283J09221Q0536J35014j34453
4850E394113L4094J38320R3982O0744O2396j35574p7494M5297K51649J49570l783
$$ plain form
4839 6013314 6101639 6231443 6338534 6226392 6336231 6468827 6657667 6734229 6726250 6777483
4829 6777483 6880987 6976960 7046478 7102913 7337712 7509419 7569509 7703275 7691302 7790113 8086125
4818 8086125 8105689 8143915 8256412 8476193 8572546 8671053 8796344 8839164 9057686 9290443
4808 9290443 9501301 9692212 9991971 10239024 10354023 10553493 10880603 10957347 11219540 11455253
4798 11455253 11761554 11909228 12228951 12593893 12946297 13051377 13336921 13532628 13823835
4789 13823835 14166643 14439767 14763069 15058935 15403335 15694821 16149560 16660031 17008016
4780 17008016 17248107 17656850 18121820 18511527 19042596 19486766 19901477 20413007 20779716
4771 20779716 21226989 21701404 22102915 22666405 23105491 23452209 23910493 24594682 25271628
$$ packed form
4839F013314Q8325J29804J07091j12142J09839J32596J88840P6562p979N1233
4829F777483J03504R5973O9518N6435K34799J71707O0090J33766j1973R8811K96012
4818H086125J9564L8226J12497K19781R6353R8507J25291M2820K18522K32757
4808I290443K10858J90911K99759K47053J14999J99470L27110P6744K62193K35713
4798A1455253L06301J47674L19723L64942L52404J05080K85544J95707K91207
4789A3823835L42808K73124L23302K95866L44400K91486M54739N10471L47985
4780A7008016K40091M08743M64970L89707N31069M44170M14711N11530L66709
4771B0779716M47273M74415M01511N63490M39086L46718M58284O84189O76946
$$ plain form
4762 25271628 25651544 26141008 26656642 27089815 27569505 27872058 28357644 28921793 29262598
4753 29262598 29735028 30190823 30744162 31345905 31946239 32583675 33118100 33710867 34438082
4744 34438082 35193008 35723057 36502635 37235492 38059286 38968211 39892066 40924339 42068571
4735 42068571 43322182 44770505 46257746 48142981 50100716 52194560 54630323 57292385
4727 57292385 60356779 63653797 67421153 71681285 76324028 81355839 86909157 92864359
4719 92864359 99718883 106716716 113520442 120050698 125456617 128788960 129681400 127961793
4711 127961793 123800060 117595079 110415001 102662089 94823717 87510228 81132549 75491207
4703 75491207 70714336 66585740 62992305 59941944 57465266 55136511 53366121 51769608
$$ packed form
4762B5271628L79916M89464N15634M33173M79690L02553M85586N64149L40805
4753B9262598M72430M55795N53339O01743O00334O37436N34425N92767P27215
4744C4438082P54926N30049P79578P32857Q23794R08925R23855J032273J144232
4735D2068571J253611J448323J487241J885235J957735K093844K435763K662062
4727E7292385L064394L297018L767356M260132M642743N031811N553318N955202
4719I2864359O854524O997833O803726O530256N405919L332343Q92440j719607
4711A27961793m161733o204981p180078p752912p838372p313489o377679n641342
4703G5491207m776871m128596l593435l050361k476678k328755j770390j596513
$$ plain form
4695 51769608 50244714 49109010 48008807 46979749 45960519 45212646 44591000 44083547 43485470
4686 43485470 42752125 42214859 41906130 41698442 41377813 41106557 40924819 40891260 40968990 40974910
4676 40974910 41213821 41588111 41761014 41982884 42443326 42933928 43511879 44194558 45013193
4667 45013193 45811605 46733637 47938754 49165298 50616805 52085983 53866721 56034482
4659 56034482 58407106 60987688 63887169 67313231 71094943 75427533 80228602 85362195
4651 85362195 90826978 96562656 102587085 108310570 113082084 116404379 117890587 117300891
4643 117300891 114301295 109629957 103536709 96442304 89061575 81890829 75015438 68884921
4635 68884921 63459668 58617323 54443617 50731217 47597622 44638702 41940152 39907617
$$ packed form
4695E1769608j524894j135704j100203j029058j019230p47873o21646n07453n98077
4686D3485470p33345n37266l08729k07688l20629k71256j81738l3559P7730N920
4676D0974910K38911L74290J72903K21870M60442M90602N77951O82679Q18635
4667D5013193P98412R22032J205117J226544J451507J469178J780738K167761
4659E6034482K372624K580582K899481L426062L781712M332590M801069N133593
4651H5362195N464783N735678O024429N723485M771514L322295J486208n89696
4643A17300891k999596m671338o093248p094405p380729p170746o875391o130517
4635F8884921n425253m842345m173706l712400l133595k958920k698550k032535
$$ plain form
4627 39907617 37999706 36228612 34669272 33181618 31922797 30670788 29448101 28354889
4619 28354889 27409694 26291016 25354650 24729048 24022294 23276437 22630446 21823265 21162923
4610 21162923 20656419 20102780 19470495 18823536 18374297 17873648 17422490 16882566 16381911
4601 16381911 15860969 15400380 14963438 14680629 14374716 13989183 13512701 13156550 12881455
4592 12881455 12586608 12362806 12217609 12062832 11909920 11703546 11273713 11058660 11006981 10963966
4582 10963966 10867225 10756017 10528110 10153947 10135023 10022115 10095692 10008736 9845223 9801770
4572 9801770 9557744 9486589 9291659 9272198 9254274 9133958 9028643 8884140 8872186 8639533
4562 8639533 8560687 8513641 8585382 8727024 8607975 8481707 8502162 8488124 8360883 8380067 8329947
$$ packed form
4627C9907617j907911j771094j559340j487654j258821j252009j222687j093212
4619B8354889r45195j118678r36366o25602p06754p45857o45991q07181o60342
4610B1162923n06504n53639o32285o46959m49239n00649m51158n39924n00655
4601A6381911n20942m60589m36942k82809l05913l85533m76482l56151k75095
4592A2881455k94847k23802j45197j54777j52912k06374m29833k15053n1679m3015
4582A0963966r6741j11208k27907l74163j8924j12908P3577q6956j63513m3453
4572I801770k44026p1155j94930j9461j7924j20316j05315j44503j1954k32653
4562H639533p8846m7046P1741J41642j19049j26268K0455j4038j27241J9184n0120
$$ plain form
4551 8329947 8328938 8423617 8408314 8307036 8341689 8472087 8423278 8321891 8233800 8216298 8265853
4540 8265853 8263162 8155659 8197299 8268736 8209896 8182497 8200672 8254880 8218651 8217322 8330897
4529 8330897 8360509 8360785 8510377 8415912 8508706 8593172 8668566 8706928 8632454 8667923 8729482 8651770
4517 8651770 8670818 8714933 8549442 8474699 8518180 8387376 8306484 8209336 8193666 8198767 8047475
4506 8047475 8054913 7880740 7862653 7942415 7797914 7784910 7740120 7760425 7662989 7670434 7712439
4495 7712439 7759695 7671349 7694315 7686686 7620925 7581702 7553640 7716509 7759342 7704607 7631770
4484 7631770 7746098 7900545 7847114 7931373 7940916 7890098 8033223 8238006 8263442 8250472 8327911
4473 8327911 8308173 8297588 8387886 8411347 8384296 8532188 8575705 8678259 8768173 8755595 8738838
$$ packed form
4551H329947j009R4679j5303j01278L4653J30398m8809j01387q8091j7502M9555
4540H265853k691j07503M1640P1437n8840k7399J8175N4208l6229j329J13575
4529H330897K9612K76J49592r4465R2794Q4466P5394L8362p4474L5469O1559p7712
4517H651770J9048M4115j65491p4743M3481j30804q0892r7148j5670N101j51292
4506H047475P438j74173j8087P9762j44501j3004m4790K0305r7436P445M2005
4495G712439M7256q8346K2966p629o5761l9223k8062J62869M2833n4735p2837
4484G631770J14328J54447n3431Q4259R543n0818J43125K04783K5436j2970P7439
4473H327911j9738j0585R0298K3461k7051J47892M3517J02554Q9914j2578j6757
$$ plain form
4462 8738838 8894639 8964297 9085782 9311874 9318122 9318911 9394023 9622692 9915291 9950006 10058679
4451 10058679 10130605 10176669 10298779 10422593 10495409 10723199 10871724 10821484 10971938 11046291
4441 11046291 11225719 11345797 11371641 11710694 11799192 12046863 12286283 12314496 12473499 12469994
4431 12469994 12581521 12827320 13019619 13237757 13393468 13761906 13914958 14082409 14319447
4422 14319447 14484712 14690020 14970965 15237228 15514562 15805005 15987817 16289072 16565264
4413 16565264 16852637 17244826 17468072 17957019 18348442 18597318 19088481 19422583 19868315
4404 19868315 20299346 20559209 21090995 21522644 21881060 22225583 22383403 22772779 23212994
4395 23212994 23735516 24140125 24463674 24821739 25475501 25848584 26245705 26863086 27249291
$$ packed form
4462H738838J55801O9658J21485K26092O248P89P5112K28669K92599L4715J08673
4451A0058679P1926M6064J22110J23814P2816K27790J48525n0240J50454P4353
4441A1046291J79428J20078K5844L39053Q8498K47671K39420K8213J59003l505
4431A2469994J11527K45799J92299K18138J55711L68438J53052J67451K37038
4422A4319447J65265K05308K80945K66263K77334K90443J82812L01255K76192
4413A6565264K87373L92189K23246M88947L91423K48876M91163L34102M45732
4404A9868315M31031K59863N31786M31649L58416L44523J57820L89376M40215
4395B3212994N22522M04609L23549L58065O53762L73083L97121O17381L86205
$$ plain form
4386 27249291 27712377 28440375 28913541 29456917 30087230 30701202 31283872 31952499 32546274
4377 32546274 33115530 33821536 34591344 35305485 36049034 36690694 37361535 38045903 38698837
4368 38698837 39401801 40119213 40827162 41353123 42181263 42875250 43528745 44236140 44843358
4359 44843358 45495803 46092690 46684697 47439477 48164590 48756126 49177305 49795826 50278419
4350 50278419 50969725 51510397 51958677 52389291 52965171 53409723 53764261 54151484 54525685
4341 54525685 55045868 55224270 55549961 55865143 56112136 56325566 56485647 56759215 56911134
4332 56911134 57078407 57330996 57429325 57437235 57499275 57477451 57341386 57268948 57188335 56954243 56828777
4321 56828777 56641617 56370860 56239182 55837286 55420726 55004469 54574321 54227530 53708806
$$ packed form
4386B7249291M63086P27998M73166N43376O30313O13972N82670O68627N93775
4377C2546274N69256P06006P69808P14141P43549O41660O70841O84368O52934
4368C8698837P02964P17412P07949N25961Q28140O93987O53495P07395O07218
4359D4843358O52445N96887N92007P54780P25113N91536M21179O18521M82593
4350E0278419O91306N40672M48280M30614N75880M44552L54538L87223L74201
4341E4525685N20183J78402L25691L15182K46993K13430J60081K73568J51919
4332E6911134J67273K52589R8329P910O2040k1824j36065p2438q0613k34092j25466
4321E6828777j87160k70757j31678m01896m16560m16257m30148l46791n18724
$$ plain form
4312 53708806 53290127 52887436 52236697 51727443 51243791 50728041 50083673 49551047 48999497
4303 48999497 48456447 47959137 47563596 47118686 46616750 46163336 45737409 45184633 44825836
4294 44825836 44487910 44125743 43937879 43789574 43635786 43448101 43206487 43133754 43088577 43018732
4284 43018732 42946284 42741017 42875012 42849052 42736389 42919857 42997584 43088200 43042357 42992633
4274 42992633 43054847 43310909 43460365 43618909 43864933 44001564 44263134 44484689 44925549 45322399
4264 45322399 45579347 45939277 46459861 46794905 47110033 47406606 47816689 48264164 48700501
4255 48700501 49177391 49646734 50031823 50501634 50993623 51420719 51810310 52124279 52596032
4246 52596032 53003975 53498959 53711529 54080340 54437694 54671794 55041981 55326437 55886951
$$ packed form
4312E3708806m18679m02691o50739n09254m83652n15750o44368n32626n51550
4303D8999497n43050m97310l95541m44910n01936m53414m25927n52776l58797
4294D4825836l37926l62167j87864j48305j53788j87685k41614p2733m5177o9845
4284D3018732p2448k05267J33995k5960j12663J83468P7727R0616m5843m9724
4274D2992633O2214K56062J49456J58544K46024J36631K61570K21555M40860L96850
4264D5322399K56948L59930N20584L35044L15128K96573M10083M47475M36337
4255D8700501M76890M69343L85089M69811M91989M27096L89591L13969M71753
4246E2596032M07943M94984K12570L68811L57354K34100L70187K84456N60514
$$ plain form
4237 55886951 56194162 56459134 56760357 57184054 57416770 57641867 57764957 57977130 58084498
4228 58084498 58166471 58384916 58451577 58673665 58756413 58782470 58760390 58938288 58986582 59090247
4218 59090247 59262516 59186115 59161774 59164756 59283280 59162455 59071427 58880074 58512884 58157327
4208 58157327 57880452 57779561 57675758 57550144 57222387 57073583 57077141 57023267 56682025 56385973
4198 56385973 56263816 56063558 55854455 55600451 55353291 55113592 54956186 54869356 54698774 54505977
4188 54505977 54395174 54280099 54046927 53951669 53864050 53573497 53416704 53354789 53297761 53313446
4178 53313446 53279011 53156193 53239780 53194987 53109758 53143475 53236704 53271827 53190259 53292347 53334237
4167 53334237 53431753 53482590 53653071 53664083 53661202 53749233 53782325 53865838 53883136 54053076 54272716
$$ packed form
4237E5886951L07211K64972L01223M23697K32716K25097J23090K12173J07368
4228E8084498Q1973K18445O6661K22088Q2748K6057k2080J77898M8294J03665
4218E9090247J72269p6401k4341K982J18524j20825r1028j91353l67190l55557
4208E8157327k76875j00891j03803j25614l27757j48804L558n3874l41242k96052
4198E6385973j22157k00258k09103k54004k47160k39699j57406q6830j70582j92797
4188E4505977j10803j15075k33172r5258q7619k90553j56793o1915n7028J5685
4178E3313446l4435j22818Q3587m4793q5229L3717R3229L5123q1568J02088M1890
4167E3334237R7516N0837J70481J1012k881Q8031L3092Q3513J7298J69940K19640
$$ plain form
4156 54272716 54511929 54610896 54783668 55090483 55205936 55371674 55603832 55895547 56015577 56268836
4146 56268836 56611762 56857805 56967945 57220921 57414559 57635825 58027600 58283808 58581683
4137 58581683 58755483 59041811 59344870 59603987 59768959 59915082 59872203 59937215 60041512 60116855
4127 60116855 60138541 60232430 60313481 60214564 60123055 60096155 60091499 60137634 60065092 60074789 60028415 59987677
4115 59987677 60177190 60224974 60223715 60316472 60340835 60519994 60678046 60790091 61158597 61345566
4105 61345566 61385801 61453791 61625869 61720088 61924541 62206221 62361491 62435226 62756800 63112003
4095 63112003 63386681 63520596 63626302 63746020 64020085 64253847 64325270 64463074 64670092 64966380
4085 64966380 65246710 65482365 65805946 66036839 66293076 66699304 67262461 67849772 68420409
$$ packed form
4156E4272716K39213R8967J72772L06815J15453J65738K32158K91715J20030K53259
4146E6268836L42926K46043J10140K52976J93638K21266L91775K56208K97875
4137E8581683J73800K86328L03059K59117J64972J46123m2879O5012J04297P5343
4127F0116855K1686R3889Q1051r8917r1509k6900m656M6135p2542R697m6374m0738
4115E9987677J89513M7784j259R2757K4363J79159J58052J12045L68506J86969
4105F1345566M0235O7990J72078R4219K04453K81680J55270P3735L21574L55203
4095F3112003K74678J33915J05706J19718K74065K33762P1423J37804K07018K96288
4085F4966380K80330K35655L23581K30893K56237M06228N63157N87311N70637
$$ plain form
4076 68420409 68968838 69419545 69872777 70512855 71248984 71886697 72656052 73467497 74132452
4067 74132452 74956196 75742987 76375661 77068532 77830053 78642392 79275521 79846494 80461224
4058 80461224 81082813 81774906 82488880 83043994 83554778 84217023 84936466 85531732 86228817
4049 86228817 86810352 87585659 88359196 89163382 90015358 91014719 92155243 93397928 94709391
4040 94709391 96150018 97716401 99182593 100986694 103109910 105443859 107944260 110624836
4032 110624836 113542589 116282879 118106870 119541216 120960698 122420089 123836698 125413803
4024 125413803 127308945 129234773 130916128 132522126 133670960 134550651 135406299 136079704
4016 136079704 136877781 137777103 138805720 140227578 142185448 144424534 146890088 149761176
$$ packed form
4076F8420409N48429M50707M53232O40078P36129O37713P69355Q11445O64955
4067G4132452Q23744P86791O32674O92871P61521Q12339O33129N70973O14730
4058H0461224O21589O92093P13974N55114N10784O62245P19443N95266O97085
4049H6228817N81535P75307P73537Q04186Q51976R99361J140524J242685J311463
4040I4709391J440627J566383J466192J804101K123216K333949K500401K680576
4032A10624836K917753K740290J823991J434346J419482J459391J416609J577105
4024A25413803J895142J925828J681355J605998J148834Q79691Q55648O73405
4016A36079704P98077Q99322J028617J421858J957870K239086K465554K871088
$$ plain form
4008 149761176 153270483 157171913 161338392 166033471 171130446 176702921 182901627 189778623
4000 189778623 197283000 205458514 214363955 223712314 233944822 244535764 255465900 266337283
3992 266337283 276236711 284863261 291441747 295364858 296509577 294963443 291405745 285867477
3984 285867477 279030623 271688769 264201772 257244219 250950696 244995715 239722745 234930246
3976 234930246 230389443 226126538 221976248 218095610 214362898 210845083 207692851 204880987
3968 204880987 202328947 200092954 198038717 196443234 195103068 194174197 193648390 193343395
3960 193343395 193488954 193966650 194787573 195842302 197102542 198488291 200391121 202443824
3952 202443824 204929359 207616942 210260037 213454867 216782041 220440492 224089339 227904410
$$ packed form
4008A49761176L509307L901430M166479M695079N096975N572475O198706O876996
4000A89778623P504377Q175514Q905441R348359J0232508J0590942J0930136J0871383
3992B66337283R899428Q626550O578486L923111J144719j546134l557698n538268
3984B85867477o836854p341854p486997o957553o293523n954981n272970m792499
3976B34930246m540803m262905m150290l880638l732712l517815l152232k811864
3968B04880987k552040k235993k054237j595483j340166r28871n25807l04995
3960A93343395J45559M77696Q20923J054729J260240J385749J902830K052703
3952B02443824K485535K687583K643095L194830L327174L658451L648847L815071
$$ plain form
3944 227904410 231990144 236173495 240610704 245500765 250416258 255670469 261464278 267538357
3936 267538357 274041111 281100355 288748105 296694814 305120658 314464940 324992931 337103646
3928 337103646 351478645 369320122 390497822 413609062 437741444 459355493 467466344
3921 467466344 458567699 442293646 423237101 401358296 379559134 361717863 349048448
3914 349048448 340140439 333727170 328541000 324547475 321545449 319297596 317292276 315511644
3906 315511644 314000292 312340799 310708768 308976761 307264548 305541499 303895855 302313026
3898 302313026 300863450 299083977 297311722 295470010 293843339 292242886 290561537 288711719
3890 288711719 287087566 285681348 284375255 283033824 281821486 280820577 279926094 279132031
$$ packed form
3944B27904410M085734M183351M437209M890061M915493N254211N793809O074079
3936B67538357O502754P059244P647750P946709Q425844R344282J0527991J2110715
3928C37103646J4374999J7841477K1177700K3111240K4132382K1614049Q110851
3921D67466344q898645j6274053j9056545k1878805k1799162j7841271j2669415
3914C49048448q908009o413269n186170l993525l002026k247853k005320j780632
3906C15511644j511352j659493j632031j732007j712213j723049j645644j582829
3898C02313026j449576j779473j772255j841712j626671j600453j681349j849818
3890B88711719j624153j406218j306093j341431j212338j000909q94483p94063
$$ plain form
3882 279132031 278587978 278235539 277825728 277595287 277716102 278352233 279127771 280331312 282160584
3873 282160584 284401308 286958549 290243438 293788020 297899359 302551878 307633984 313353039
3865 313353039 319793797 326623317 334018082 341866519 350078792 358589381 367200203 375963511
3857 375963511 384670788 392667370 399997234 406338905 411631785 415807194 418739890 420390990
3849 420390990 421009852 420745239 419470355 417584345 414925867 411836020 408117105 404062343
3841 404062343 399646902 394626480 388971877 383007360 376561052 369615521 362521501 355359729
3833 355359729 348383883 341636793 335339241 329617444 324505226 319968444 316141035 312996345
3825 312996345 310519815 308690066 307479236 306876016 306888995 307413723 308240932 309391947 310900525
$$ packed form
3882B79132031n44053l52439m09811k30441J20815O36131P75538J203541J829272
3873B82160584K240724K557241L284889L544582M111339M652519N082106N719055
3865C13353039O440758O829520P394765P848437Q212273Q510589Q610822Q763308
3857C75963511Q707277P996582P329864O341671N292880M175409K932696J651100
3849D20390990O18862k64613j274884j886010k658478l089847l718915m054762
3841D04062343m415441n020422n654603n964517o446308o945531p094020p161772
3833C55359729o975846o747090o297552n721797n112218m536782l827409l144690
3825C12996345k476530j829749j210830o03220J2979N24728Q27209J151015J508578
$$ plain form
3816 310900525 312583997 314465074 316353480 318114907 319795005 321129015 322398647 323398626
3808 323398626 323843720 324121089 323806661 323150382 322183416 320942372 319211268 317173407 314959220
3799 314959220 312331931 309270809 305755038 301840784 297475400 292854213 287665515 282068939
3791 282068939 276051223 269891355 263354285 256599270 249823995 243209274 236518751 230008341
3783 230008341 223583279 217527873 211539187 205520700 199730434 194034179 188574642 183098642
3775 183098642 177723378 172422906 167205434 162473433 157954626 153663540 149592335 145692456
3767 145692456 142039403 138637359 135513137 132445313 129560079 127008455 124606520 122335491
3759 122335491 120024185 117627304 115502830 113537864 111408565 109638120 107817797 105966581
$$ packed form
3816C10900525J683472J881077J888406J761427J680098J334010J269632R99979
3808C23398626M45094K77369l14428o56279r66966j241044j731104k037861k214187
3799C14959220k627289l061122l515771l914254m365384m621187n188698n596576
3791B82068939o017716o159868o537070o755015o775275o614721o690523o510410
3783B30008341o425062o055406n988686o018487n790266n696255n459537n476000
3775A83098642n375264n300472n217472m732001m518807m291086m071205l899879
3767A45692456l653053l402044l124222l067824k885234k551624k401935k271029
3759A22335491k311306k396881k124474j964966k129299j770445j820323j851216
$$ plain form
3751 105966581 104123762 102340293 100615011 98853417 97259964 95708241 94371540 92817912
3743 92817912 91385422 90037703 88878622 87682782 86516048 85528643 84470687 83466417
3735 83466417 82608287 81797470 80918096 80128112 79395751 78745743 78202476 77596472 77057042
3726 77057042 76408254 75853894 75249271 74679856 74301276 73906001 73428441 72973969 72495564
3717 72495564 72052601 71687646 71342543 70779965 70533259 70087732 69714885 69352018 68846384
3708 68846384 68507849 68305357 68101459 67913934 67679121 67416454 67141906 66818243 66688506
3699 66688506 66463905 66186847 66013695 65943992 65854725 65658949 65400297 65232359 64989882 64701871
3689 64701871 64329423 64116382 63832160 63638485 63283508 63008346 62840555 62511912 62328133
$$ packed form
3751A05966581j842819j783469j725282j761594j593453j551723j336701j553628
3743I2817912j432490j347719j159081j195840j166734r87405j057956j004270
3735H3466417q58130q10817q79374p89984p32361o50008n43267o06004n39430
3726G7057042o48788n54360o04623n69415l78580l95275m77560m54472m78405
3717G2495564m42963l64955l45103n62578k46706m45527l72847l62867n05634
3708F8846384l38535k02492k03898j87525k34813k62667k74548l23663j29737
3699F6688506k24601k77058j73152o9703q9267j95776k58652j67938k42477k88011
3689F4701871l72448k13041k84222j93675l54977k75162j67791l28643j83779
$$ plain form
3680 62328133 62043587 62041415 61894351 61670944 61543630 61568163 61481866 61264155 61068493 61066747
3670 61066747 61112583 61091217 61232168 61153569 61284234 61211089 61338284 61408670 61515837 61694114
3660 61694114 61723359 61776470 62015974 62337050 62566720 62796649 63196923 63692633 64105291 64546866
3650 64546866 64897750 65390315 65966205 66500258 67089214 67678099 68384022 69080101 69830085
3641 69830085 70698541 71504457 72331179 73215447 74120488 75166101 76203278 77196499 78345876
3632 78345876 79492670 80576341 81901095 83207446 84440913 85641298 86826059 88108701
3624 88108701 89224661 90558979 91915390 93276467 94667085 96432713 98173125 99790232
3616 99790232 101652811 103604599 105458404 107609791 109899289 112249638 114807808 117380853
$$ packed form
3680F2328133k84546k172j47064k23407j27314K4533q6297k17711j95662j746
3670F1066747M5836k1366J40951p8599J30665p3145J27195P0386J07167J78277
3660F1694114K9245N3111K39504L21076K29670K29929M00274M95710M12658M41575
3650F4546866L50884M92565N75890N34053N88956N88885P05923O96079P49984
3641F9830085Q68456Q05916Q26722Q84268R05041J045613J037177R93221J149377
3632G8345876J146794J083671J324754J306351J233467J200385J184761J282642
3624H8108701J115960J334318J356411J361077J390618J765628J740412J617107
3616I9790232J862579J951788J853805K151387K289498K350349K558170K573045
$$ plain form
3608 117380853 120136194 123063712 126058136 129354944 133000376 136851491 141158484 145564895
3600 145564895 150290472 155377240 160795647 166604088 172945569 179649716 186834289 194711945
3592 194711945 203167875 212145665 221694160 232025350 242851077 254147181 265872491
3585 265872491 278048999 290383768 302560528 314526620 326146014 337438445 348517726
3578 348517726 359336174 370130792 380759128 391266511 401657912 411897033 421766393
3571 421766393 430691512 438926795 446266244 452475930 457470191 461164649 463837776 465569668
3563 465569668 466687222 467383965 467600345 467378222 467221962 466997624 466354688 465410486 464031930
3554 464031930 462140002 459749637 456901416 453633996 449978745 445758195 441345750 436754915
$$ packed form
3608A17380853K755341K927518K994424L296808L645432L851115M306993M406411
3600A45564895M725577N086768N418407N808441O341481O704147P184573P877656
3592A94711945Q455930Q977790R548495J0331190J0825727J1296104J1725310
3585B65872491J2176508J2334769J2176760J1966092J1619394J1292431J1079281
3578C48517726J0818448J0794618J0628336J0507383J0391401J0239121R869360
3571D21766393Q925119Q235283P339449O209686M994261L694458K673127J731892
3563D65569668J117554O96743K16380k22123j56260k24338o42936r44202j378556
3554D64031930j891928k390365k848221l267420l655251m220550m412445m590835
$$ plain form
3546 436754915 432072366 427227416 422092055 416901340 411480723 405628664 399567250 393137848
3538 393137848 386139029 378789371 371170335 362940396 354387856 345512180 336614258 327386840
3530 327386840 317934659 308396020 298918872 289390998 279847430 270339802 260903422 251452154
3522 251452154 242250803 233302598 224466544 216080367 207912359 200217738 192777193 185531154
3514 185531154 178695732 172548534 166812319 161255786 155993217 151090465 146560577 142235673
3506 142235673 138092457 134292262 130742306 127597353 124365090 121146975 118017389 115294766
3498 115294766 112813335 110219410 107681205 105227876 102860085 100452981 98071495 95908257
3490 95908257 93817622 91757858 89638224 87776801 85832194 83844268 81987081 80161267
$$ packed form
3546D36754915m682549m844950n135361n190715n420617n852059o061414o429402
3538C93137848o998819p349658p619036q229939q552540q875676q897922r227418
3530C27386840r452181r538639r477148r527874r543568r507628r436380r451268
3522B51452154r201351q948205q836054q386177q168008p694621p440545p246039
3514A85531154o835422o147198n736215n556533n262569m902752m529888m324904
3506A42235673m143216l800195l549956l144953l232263l218115l129586k722623
3498A15294766k481431k593925k538205k453329k367791k407104k381486k163238
3490I5908257k090635k059764k119634j861423j944607j987926j857187j825814
$$ plain form
3482 80161267 78335139 76695239 75057884 73411216 71739789 70170935 68658520 67377579
3474 67377579 66004712 64687050 63441613 61949645 60615841 59426689 58327602 57109613
3466 57109613 56143196 55149385 54098622 53176570 52167605 51182743 50241409 49268824 48455709
3457 48455709 47655812 46752291 45957714 45364807 44679425 43943634 43145071 42609708 41942494
3448 41942494 41300585 40620509 40093878 39596235 39095770 38533551 37871189 37452117 36971181
3439 36971181 36503388 35929420 35624777 35240947 34661183 34238014 33785144 33417531 32954890
3430 32954890 32661030 32373880 32033779 31622625 31053872 30794544 30526240 30043765 29701918
3421 29701918 29275966 28973655 28715688 28296070 28070905 27658373 27258363 27045560 26833365
$$ packed form
3482H0161267j826128j639900j637355j646668j671427j568854j512415j280941
3474F7377579j372867j317662j245437j491968j333804j189152j099087j217989
3466E7109613r66417r93811j050763r22052j008965r84862r41334r72585q13115
3457D8455709p99897r03521p94577n92907o85382p35791p98563n35363o67214
3448D1942494o41909o80076n26631m97643n00465n62219o62362m19072m80936
3439C6971181m67793n73968l04643l83830n79764m23169m52870l67613m62641
3430C2954890k93860k87150l40101m11154n68753k59328k68304m82475l41847
3421B9701918m25952l02311k57967m19618k25165m12532m00010k12803k12195
$$ plain form
3412 26833365 26564214 25979997 25653619 25456014 25160423 24936220 24676856 24320872 23988100
3403 23988100 23833876 23715313 23475165 23173575 22966622 22789297 22656087 22403729 22174901
3394 22174901 22014527 21758043 21689188 21524080 21364041 21161631 20890743 20614157 20404781 20372775
3384 20372775 20180204 19954021 19857997 19620862 19368877 19258006 19097466 19044510 18918674 18845401
3374 18845401 18610570 18419748 18333061 18352230 18185980 18033352 17935651 17853930 17833777 17775487
3364 17775487 17538257 17389641 17205733 16995581 16868084 16780123 16657978 16387972 16156597 16061814
3354 16061814 16042033 16004870 15945129 15755521 15556787 15577148 15494124 15370668 15254056 15044755
3344 15044755 14911451 14909830 14799873 14707688 14626760 14560022 14537423 14266325 14283413 14375615 14251674
$$ packed form
3412B6833365k69151n84217l26378j97605k95591k24203k59364l55984l32772
3403B3988100j54224j18563k40148l01590k06953j77325j33210k52358k28828
3394B2174901j60374k56484o8855j65108j60039k02410k70888k76586k09376l2006
3384B0372775j92571k26183r6024k37135k51985j10871j60540n2956j25836p3273
3374A8845401k34831j90822q6687J9169j66250j52628r7701q1721k0153n8290
3364A7775487k37230j48616j83908k10152j27497q7961j22145k70006k31375r4783
3354A6061814j9781l7163n9741j89608j98734K0361q3024j23456j16612k09301
3344A5044755j33304j621j09957r2185q0928o6738k2599k71098J7088R2202j23941
$$ plain form
3333 14251674 14262168 14281962 14299373 14328185 14343704 14502316 14342601 14339788 14382751 14272045 14235844
3322 14235844 14117934 14055492 14071855 14024796 14114561 14086022 14113592 14185482 14216582 14251539 14302315
3311 14302315 14360158 14384152 14361698 14445870 14632950 14666878 14746280 14829868 14958053 15172073 15414492
3300 15414492 15532193 15513042 15748172 16131340 16132724 16160383 16401795 16412681 16575039 16733943
3290 16733943 16979151 17184780 17376472 17657649 17709081 17833777 18089697 18146590 18333344 18628143
3280 18628143 18801337 19013137 19290108 19454732 19805955 20050300 20356760 20711051 20986744
3271 20986744 21268908 21652408 22027281 22297032 22674964 23157475 23563038 24003249 24376220
3262 24376220 24734435 25389965 25944952 26449965 27216715 28099168 29102686 30258207 31549437
$$ packed form
3333A4251674J0494J9794J7411K8812J5519J58612j59715k813M2963j10706l6201
3322A4235844j17910o2442J6363m7059Q9765k8539K7570P1890L1100L4957N0776
3311A4302315N7843K3994k2454Q4172J87080L3928P9402Q3588J28185K14020K42419
3300A5414492J17701j9151K35130L83168J384K7659K41412J0886J62358J58904
3290A6733943K45208K05629J91692K81177N1432J24696K55920N6893J86754K94799
3280A8628143J73194K11800K76971J64624L51223K44345L06460L54291K75693
3271B0986744K82164L83500L74873K69751L77932M82511M05563M40211L72971
3262B4376220L58215O55530N54987N05013P66750Q82453J003518J155521J291230
$$ plain form
3253 31549437 32930401 34371011 36071343 37948006 40030639 42768269 46055309 50215939
3245 50215939 55509603 61216742 67149761 72753773 75154835 73008880 69372006 64890545
3237 64890545 59804457 54872683 51133905 48818198 47377264 46600324 46299411 46563026 47238074
3228 47238074 47973894 49114553 50632843 52571338 54744289 57295704 60182639 63380936
3220 63380936 66913183 70637942 74614315 79153143 84282303 89775753 96425527 104720357
3212 104720357 113955699 123467933 133126207 138543895 133746927 123662658 112458276 99538327
3204 99538327 86307465 74930891 66401736 59897200 54993704 51232627 48260813 45788181
3196 45788181 43913099 42471985 41461266 40639573 40132556 39863137 39786864 39921190 40395351
$$ packed form
3253C1549437J380964J440610J700332J876663K082633K737630L287040M160630
3245E0215939N293664N707139N933019N604012K401062k145955l636874m481461
3237F4890545n086088m931774l738778k315707j440934p76940l00913K63615O75048
3228D7238074P35820J140659J518290J938495K172951K551415K886935L198297
3220F3380936L532247L724759L976373M538828N129160N493450O649774Q294830
3212A04720357R235342R512234R658274N417688m796968j0084269j1204382j2919949
3204I9538327j3230862j1376574q529155o504536m903496l761077k971814k472632
3196D5788181j875082j441114j010719q21693n07017k69419p6273J34326M74161
$$ plain form
3187 40395351 40904235 41518836 42507911 43882752 45461689 47573220 50515815 54420181 58871407
3178 58871407 63455292 67247071 67255302 63381915 58526318 53111772 47182671 41428586 37026980
3169 37026980 33971206 31681960 29843957 28279473 27100083 26173905 25371214 24894877 24477928
3160 24477928 24226751 24217665 23966887 23573467 23239817 22897062 22401476 21921706 21341526 20554695
3150 20554695 19987855 19351863 18608542 17953720 17387667 16937049 16546031 16185806 15828250
3141 15828250 15542086 15185550 14802614 14526868 14308634 14111684 13982944 13845044 13718489
3132 13718489 13580360 13214068 13032806 12891331 12806658 12702349 12576738 12404071 12169617 11961824
3122 11961824 11768442 11537074 11061792 10823879 10719580 10329246 9987832 9696754 9428201
$$ packed form
3187D0395351N08884O14601R89075J374841J578937K111531K942595L904366M451226
3178E8871407M583885L791779Q231l873387m855597n414546n929101n754085m401606
3169C7026980l055774k289246j838003j564484j179390r26178q02691m76337m16949
3160B4477928k51177r086k50778l93420l33650l42755m95586m79770n80180p86831
3150B0554695n66840o35992p43321o54822n66053m50618l91018l60225l57556
3141A5828250k86164l56536l82936k75746k18234j96950j28740j37900j26555
3132A3718489j38129l66292j81262j41475q4673j04309j25611j72667k34454k07793
3122A1961824j93382k31368m75282k37913j04299l90334l41414k91078k68553
$$ plain form
3113 9428201 9289470 9078709 8918383 8695487 8473412 8204932 7893850 7731308 7620331 7337846
3103 7337846 7110401 7143661 7053690 6912715 6868669 6521017 6316578 6186750 6176090 6079360
3093 6079360 6105439 6116946 6036260 5978170 5857952 5866728 5763441 5588956 5538223 5546124 5401533
3082 5401533 5365750 5426637 5379402 5221036 5129339 5106250 5011281 5024913 4929278 4893133 4875804
3071 4875804 4765421 4739134 4852634 4728826 4603480 4607517 4633460 4527183 4421789 4303373
3061 4303373 4204418 4124841 4055707 4174006 4141277 4193391 4160535 4056890 4046347 4093850 4073125
3050 4073125 3996300 3994464 3897730 3898969 4056042 3949684 3942307 3852539 3894243 4008064 3873010
3039 3873010 3771723 3796798 3719726 3628778 3411705 3446298 3448140 3409504 3436614 3505512 3498407
$$ packed form
3113I428201j38731k10761j60326k22896k22075k68480l11082j62542j10977k82485
3103G337846k27445L3260q9971j40975m4046l47652k04439j29828j0660r6730
3093F079360K6079J1507q0686n8090j20218Q776j03287j74485n0733P901j44591
3082E401533l5783O0887m7235j58366r1697k3089r4969J3632r5635l6145j7329
3071D875804j10383k6287J13500j23808j25346M037K5943j06277j05394j18416
3061D303373r8955p9577o9134J18299l2729N2114l2856j03645j0543M7503k0725
3050D073125p6825j836r6734J239J57073j06358p377q9768M1704J13821j35054
3039C873010j01287K5075p7072r0948k17073L4593J842l8636K7110O8898p105
$$ plain form
3028 3498407 3508847 3368326 3388709 3519611 3396808 3316273 3338836 3230572 3159317 3239807 3213702
3017 3213702 3230508 3355275 3359223 3219084 3014847 2865636 2997447 3073802 3136966 3139083 3204359
3006 3204359 3108452 3112347 3229780 3175169 3080897 3103538 2975805 2971762 2855269 2892463 2924870
2995 2924870 2896984 2806839 2819740 2767509 2794185 2768245 2760471 2826010 2705906 2591409 2718068
2984 2718068 2774946 2780850 2861904 2691242 2613343 2674474 2692443 2679825 2740549 2787612 2689532
2973 2689532 2723990 2751397 2679723 2593534 2618894 2612490 2679177 2776102 2680369 2675277 2768488 2871011
2961 2871011 2694214 2707662 2730804 2770290 2748796 2765612 2849512 2947955 2977792 2894680 2902771
2950 2902771 2882693 2823581 2897641 2699576 2663150 2751323 2742091 2517164 2633849 2837244 2751915
$$ packed form
3028C498407J0440j40521K0383J30902j22803q0535K2563j08264p1255Q0490k6105
3017C213702J6806J24767L948j40139k04237j49211J31811P6355O3164K117O5276
3006C204359r5907L895J17433n4611r4272K2641j27733m043j16493L7194L2407
2995B924870k7886r0145J2901n2231K6676k5940p774O5539j20104j14497J26659
2984B718068N6878N904Q1054j70662p7899O1131J7969j2618O0724M7063r8080
2973B689532L4458K7407p1674q6189K5360o404O6687R6925r5733n092R3211J02523
2961B871011j76797J3448K3142L9486k1494J6816Q3900R8443K9837q3112Q091
2950B902771k0078n9112P4060j98065l6426Q8173r232k24927J16685K03395q5329
$$ plain form
2939 2751915 2797982 2795949 2899396 2952406 3038322 3005740 2937686 3003495 3038446 3073269 3123306
2928 3123306 3136586 3094575 3165876 3157018 3195731 3253316 3346563 3567890 3743812 3835870 3733387
2917 3733387 3667083 3658819 3798592 3809536 3699393 3908402 3995079 3946613 4040748 4218938 4364009
2906 4364009 4414082 4513609 4635304 4740750 4834133 5023488 5105599 5183066 5144709 5134278 5174693
2895 5174693 5062000 5163929 5173311 5074771 5072784 5013068 4873963 5088289 5165476 5197330 5327590
2884 5327590 5386209 5291157 5378418 5339231 5360434 5606476 5883261 6177104 6411740 6500314 6590526
2873 6590526 6672526 6615177 6457788 6185481 5907613 5517946 5284303 5095051 4913073 4792962
2863 4792962 4639223 4367109 4285240 4315776 4250699 4168337 4127513 3998153 3962801 3989938 3959151
$$ packed form
2939B751915M6067k033J03447N3010Q5916l2582o8054O5809L4951L4823N0037
2928C123306J3280m2011P1301q858L8713N7585R3247K21327J75922R2058j02483
2917C733387o6304q264J39773J0944j10143K09009Q6677m8466R4135J78190J45071
2906D364009N0073R9527J21695J05446R3383J89355Q2111P7467l8357j0431M0415
2895E174693j12693J01929R382r8540j987n9716j39105K14326P7187L1854J30260
2884E327590N8619r5052Q7261l9187K1203K46042K76785K93843K34636Q8574R0212
2873F590526Q2000n7349j57389k72307k77868l89667k33643j89252j81978j20111
2863D792962j53739k72114q1869L0536o5077q2362m0824j29360l5352K7137l0787
$$ plain form
2852 3959151 3823588 3748114 3888267 4047604 3895320 3935418 3911075 4062222 4039490 3924935
2842 3924935 3921899 3763054 3632042 3629799 3582878 3465723 3271373 3045601 3010510 2861792 2600021
2831 2600021 2593359 2623816 2585082 2528421 2410515 2357463 2372252 2291638 2332341 2295321 2258720
2820 2258720 2230896 2144318 2071489 1967807 1945935 1872042 1828920 1874165 1805279 1642923 1660301
2809 1660301 1599002 1625737 1571857 1552205 1638110 1595142 1607533 1684719 1687918 1609178 1628998 1519807
2797 1519807 1499743 1499845 1479236 1462095 1485960 1391304 1366940 1345345 1342078 1403708 1425493 1526289
2785 1526289 1525957 1515900 1287627 1411746 1487813 1386016 1280780 1339952 1293903 1249141 1358815
2774 1358815 1463840 1246154 1025938 1081128 1074855 916363 1064357 1215684 1293482 1281853
$$ packed form
2852C959151j35563p5474J40153J59337j52284M0098k4343J51147k2732j14555
2842C924935l036j58845j31012k243m6921j17155j94350k25772l5091j48718k61771
2831B600021o662L0457l8734n6661j17906n3052J4789q0614M0703l7020l6601
2820B258720k7824q6578p2829j03682k1872p3893m3122M5245o8886j62356J7378
2809A660301o1299K6735n3880j9652Q5905m2968J2391P7186L199p8740J9820j09191
2797A519807k0064J02k0609j7141K3865r4656k4364k1595l267O1630K1785J00796
2785A526289l32j0057k28273J24119P6067j01797j05236N9172m6049m4762J09674
2774A358815J05025k17686k20216N5190o273j58492J47994J51327P7798j1629
$$ plain form
2764 1281853 1360446 1284134 1225010 1110627 1062880 1061546 1057329 1149811 1066585 1056141 1107592 1029403
2752 1029403 1057620 1089647 1132699 1214060 1055940 1001216 942540 981913 1099801 1086069 1050039
2741 1050039 1148747 1138708 1037996 974483 1058089 1108580 896972 880125 916926 852142 993056
2730 993056 925988 863225 845677 821245 919268 1034384 937134 865831 882506 891267 865690 901057
2718 901057 900659 943401 873949 891424 752707 704082 891941 925956 843173 856196 885045 858721
2706 858721 855382 874377 681491 674269 808081 882572 815016 694109 821402 886929 840681
2695 840681 828245 733966 829625 746019 760971 739326 742416 671340 589106 795560 675916
2684 675916 612949 718830 810439 733526 707695 687417 732473 890858 767694 670295 856351
$$ packed form
2764A281853P8593p6312n9124j14383m7747j334m217R2482q3226j0444N1451p8189
2752A029403K8217L2027M3052Q1361j58120n4724n8676L9373J17888j3732l6030
2741A050039R8708j0039j00712o3513Q3606N0491k11608j6847L6801o4784J40914
2730I93056o7068o2763j7548k4432R8023J15116r7250p1303J6675Q761k5577L5367
2718I01057l98M2742o9452J7475j38717m8625J87859L4015q2783J3023K8849k6324
2706H58721l339J8995j92886p222J33812P4491o7556j20907J27293O5527m6248
2695H40681j2436r4279R5659q3606J4952k1645L090p1076q2234K06454j19644
2684F75916o2967J05881R1609p6913k5831k0278M5056J58385j23164r7399J86056
$$ plain form
2673 856351 905817 744471 690523 805258 773521 784736 647803 730214 774797 641021 492281
2662 492281 648198 634990 687641 674175 640028 715969 696311 688463 764300 763190 752673 767644
2650 767644 633722 587778 605699 619569 618099 598402 678573 604509 612171 727501 662711 682456
2638 682456 614148 607361 667664 683945 642686 701627 611708 612278 707916 631396 628531 620471 580363
2625 580363 620405 627159 658198 582458 558651 461297 527077 542475 558284 646300 575295 547081
2613 547081 561479 496911 464323 488661 423240 423087 536053 646757 775900 695271 559733
2602 559733 485532 413891 478675 454526 555221 517125 477758 535523 432765 434687 497548
2591 497548 491790 518022 476369 493499 413651 427730 466079 431663 425758 537160 516546 435824
$$ packed form
2673H56351M9466j61346n3948J14735l1737J1215j36933Q2411M4583j33776j48740
2662D92281J55917j3208N2651j3466l4147P5941j9658p848P5837j110j0517J4971
2650G67644j33922m5944J7921J3870j470j9697Q0171p4064P662J15330o4790J9745
2638F82456o8308o787O0303J6281m1259N8941q9919N70R5638p6520k865q060m0108
2625E80363M0042O754L1039p5740k3807r7354O5780J5398J5809Q8016p1005k8214
2613E47081J4398o4568l2588K4338o5421j53J12966J10704J29143q0629j35538
2602E59733p4201p1641O4784k4149J00695l8096l9367N7765j02758J922O2861
2591D97548n758K6232m1653J7130p9848J4079L8349l4416n905J11402k0614q0722
$$ plain form
2579 435824 577683 577340 448817 525397 434681 414345 347079 487761 561770 495807 510926
2568 510926 399150 456068 462920 360142 197049 300292 363183 373163 420187 328669 354770
2557 354770 493657 558533 342061 251869 347851 326901 462329 368232 370454 357544 402640
2546 402640 568517 453965 387017 301486 224520 326499 342807 339549 165833 295757 338829
2535 338829 382076 295225 197460 236877 336547 297407 325328 242416 290630 345033 306972 343433
2523 343433 322058 377554 492181 492934 410700 519218 433030 446570 484636 464607 314984
2512 314984 140648 106231 287564 364172 253921 341264 445665 355084 401733 499123 468700
2501 468700 367497 318756 304924 307329 239996 228855 167941 167002 216703 367628 397353 377622
$$ packed form
2579D35824J41859l43j28523P6580r0716k0336o7266J40682P4009o5963J5119
2568E10926j11776N6918O852j02778j63093J03243O2891R980M7024r1518K6101
2557C54770J38887O4876k16472r0192R5982k0950J35428r4097K222j2910M5096
2546D02640J65877j14552o6948q5531p6966J01979J6308l258j73716J29924M3072
2535C38829M3247q6851r7765L9417R9670l9140K7921q2912M8214N4403l8061L6461
2523C43433k1375N5496J14627P53q2234J08518q6188J3540L8066k0029j49623
2512C14984j74336l4417J81333P6608j10251Q7343J04401r0581M6649R7390l0423
2501D68700j01203m8741j3832K405o7333j1141o0914r39M9701J50925K9725j9731
$$ plain form
2489 377622 317941 291348 320511 243403 202980 275569 287516 205193 227516 262048 312319 201701
2477 201701 235125 336518 165517 136875 148624 137189 281406 472731 309108 419539
2467 419539 331914 275353 304852 236783 206951 244363 175195 241008 340364 294812 274634 263117
2455 263117 305477 403166 368257 323837 381675 234162 185879 214740 200556 268426 216684
2444 216684 217047 248296 125218 299970 186371 183167 204160 293662 210994 208897 199846 248219
2432 248219 266705 270907 347872 321253 308924 404534 236417 240187 369527 290853 272253 257738
2420 257738 380447 393625 344471 276467 255295 263370 246350 252133 342166 268045 195949 178195
2408 178195 148892 244684 213149 214218 351560 319926 379330 302828 249480 215970 233195 164893
$$ packed form
2489C77622n9681k6593K9163p7108m0423P2589J1947q2323K2323L4532N0271j10618
2477B01701L3424J01393j71001k8642J1749j1435J44217J91325j63623J10431
2467D19539q7625n6561K9499o8069k9832L7412o9168O5813R9356m5552k0178j1517
2455B63117M2360R7689l4909m4420N7838j47513m8283K8861j4184O7870n1742
2444B16684L63L1249j23078J74752j13599l204K0993Q9502q2668k097r051M8373
2432B48219J8486M202P6965k6619j2329R5610j68117L770J29340p8674j8600j4515
2420B57738J22709J3178m9154o8004k1172Q075j7020N783R0033p4121p2096j7754
2408A78195k9303R5792l1535J069J37342l1634N9404p6502n3348l3510J7225o8302
$$ plain form
2396 164893 160869 83536 269224 221374 102088 161285 246616 265417 343968 353386 171789
2385 171789 150823 246947 295662 268056 425943 295279 246716 169775 188897 61032 65968
2374 65968 98280 154412 289789 361256 292699 300230 311141 354789 316616 401091 437195 455577
2362 455577 446842 321055 176478 210827 195955 241076 139074 88569 81505 226156 192572
2351 192572 14970 101111 252796 296897 242036 244120 154690 194474 295507 400948 364821
2340 364821 437557 327212 239405 215655 193952 264671 368007 278093 312774 291684 263529
2329 263529 165308 192746 142037 80781 128344 256598 308675 292176 154367 137059 -15528
2318 -15528 -40272 67640 168549 66508 52546 124500 47352 98703 103333 174629 209414
$$ packed form
2396A64893m024p7333J85688m7850j19286N9197Q5331J8801P8551R418j81597
2385A71789k0966R6124M8715k7606J57887j30664m8563p6941J9122j27865M936
2374F5968L2312N6132J35377P1467o8557P531J0911M3648l8173Q4475L6104J8382
2362D55577q735j25787j44577L4349j4872M5121j02002n0505p064J44651l3584
2351A92572j77602Q6141J51685M4101n4861K084q9430L9784J01033J05441l6127
2340C64821P2736j10345q7807k3750k1703P0719J03336q9914L4681k1090k8155
2329B63529r8221K7438n0709o1256M7563J28254N2077j6499j37809j7308j52587
2318a5528k4744J07912J00909j02041j3962P1954p7148N1351M630P1296L4785
$$ plain form
2307 209414 194793 160155 58401 61922 23151 97859 297118 340995 330528 208609 119219
2296 119219 127114 317443 246317 152158 223458 312648 387924 380851 249086 226004 179898 132686
2284 132686 112724 167899 267529 195514 116383 162025 225451 152202 37017 58390 241820
2273 241820 239263 132738 119776 27236 60505 103969 147717 222398 182172 200799 146396 68176
2261 68176 86185 223298 156750 138387 144155 170615 153339 133231 158712 38199 68187 94071
2249 94071 -123947 -33958 -40250 18802 18051 54812 221678 76613 126012 92867 71525 82051
2237 82051 153955 79295 30257 98062 214682 240825 247401 241021 181081 137933 275988 106213
2225 106213 85349 158833 19259 86444 274865 235027 269877 277671 56531 87584 210090
$$ packed form
2307B09414j4621l4638j01754L521l8771P4708J99259M3877j0467j21919q9390
2296A19219P895J90329p1126r4159P1300Q9190P5276p073j31765k3082m6106m7212
2284A32686j9962N5175R9630p2015p9131M5642O3426p3249j15185K1373J83430
2273B41820k557j06525j2962r2540L3269M3464M3748P4681m0226J8627n4403p8220
2261F8176J8009J37113o6548j8363N768K6460j7276k0108K5481j20513K9988K5884
2249I4071k18018Q9989o292N9052p51L6761J66866j45065M9399l3145k1342J0526
2237H2051P1904p4660m9038O7805J16620K6143O576o380n9940m3148J38055j69775
2225A06213k0864P3484j39574O7185J88421l9838L4850P794k21140L1053J22506
$$ plain form
2214 210090 306122 286008 289209 267212 305094 317393 209199 174271 159183 258176 135903
2203 135903 116477 109071 327855 320753 137216 135501 106999 106182 127409 274444 365407 383095
2191 383095 371891 361167 313068 300072 242225 288975 212084 160286 245967 270297 269474 159468
2179 159468 224723 357277 303179 210843 215476 292069 402633 331028 370906 408681 328351
2168 328351 356447 308170 375068 463215 422973 420364 596879 472204 547218 573753 464093
2157 464093 511944 446080 501347 545479 616817 643323 524058 600815 683907 737796 727534
2146 727534 631052 666618 862359 903449 866880 866505 866246 1003768 1093108 1071470 1030123 1052195
2134 1052195 947485 1009823 1252163 1078153 998107 1048730 1204976 1151021 1301080 1270440
$$ packed form
2214B10090R6032k0114L201k1997L7882J2299j08194l4928j5088R8993j22273
2203A35903j9426p406K18784p102j83537j715k8502q17K1227J47035R0963J7688
2191C83095j1204j0724m8099j2996n7847M6750p6891n1798Q5681K4330q23j10006
2179A59468O5255J32554n4098r2336M633P6593J10564p1605L9878L7775q0330
2168C28351K8096m8277O6898Q8147m0242k609J76515j24675P5014K6535j09660
2157D64093M7851o5864N5267M4132P1338K6506j19265P6757Q3092N3889j0262
2146G27534r6482L5566J95741M1090l6569l75k59J37522Q9340k1638m1347K2072
2134A052195j04710O2338K42340j74010q0046N0623J56246n3955J50059l0640
$$ plain form
2124 1270440 1239645 1316154 1467317 1525674 1418807 1504683 1641725 1792621 1803090 1846036 1972629
2113 1972629 2034076 2166423 2321160 2269864 2288080 2324872 2508908 2565385 2642537 2750655 2793272
2102 2793272 2964828 3188801 3250835 3446341 3879019 4140999 4330666 4639401 4891110 5280789
2092 5280789 5930486 6534868 6999424 7587076 8120895 8819369 9635248 10691246 11914990
2083 11914990 13523514 15565502 18203002 21690767 25748520 30005799 34600973 35290834
2075 35290834 31632162 28019922 24000475 19344853 15119639 12320527 10439650 9074849
2067 9074849 7954369 7106240 6485485 6103049 5798437 5645570 5284382 4888108 4637648
2058 4637648 4357633 4180084 3869431 3592355 3341457 3090800 2936150 2765658 2606979 2531298
$$ packed form
2124A270440l0795P6509J51163N8357j06867Q5876J37042J50896J0469M2946J26593
2113A972629O1447J32347J54737n1296J8216L6792J84036N6477P7152J08118M2617
2102B793272J71556K23973O2034J95506M32678K61980J89667L08735K51709L89679
2092E280789O49697O04382M64556N87652N33819O98474Q15879J055998J223744
2083A1914990J608524K041988K637500L487765M057753M257279M595174O89861
2075C5290834l658672l612240m019447m655622m225214k799112j880877j364801
2067I074849j120480q48129o20755l82436l04612j52867l61188l96274k50460
2058D637648k80015j77549l10653k77076k50898k50657j54650j70492j58679p5681
$$ plain form
2048 2531298 2462402 2389180 2334765 2163276 2034520 1882873 1877970 1769547 1789033 1773727 1626317
2037 1626317 1548205 1438921 1268370 1262728 1160642 1215851 1160367 1087862 1139852 1051996 1084800
2026 1084800 1100515 1093244 905795 1073670 957650 908522 766877 738384 583865 623693 620853
2015 620853 623938 710814 765651 602900 579713 609934 673844 615166 620291 689285 704998 603004
2003 603004 458276 485789 613444 444948 368776 531130 397432 395145 341451 309636 291038
1992 291038 304658 354444 339790 322105 265565 389508 438006 337798 351866 376004 371246
1981 371246 367047 443762 364173 424129 243161 215508 287377 385433 366030 234633 168032
1970 168032 226492 292801 321764 164422 145020 194562 214527 169340 261839 244407 220382
$$ packed form
2048B531298o8896p3222n4415j71489j28756j51647m903j08423J9486j5306j47410
2037A626317p8112j09284j70551n642j02086N5209n5484p2505N1990q7856L2804
2026A084800J5715p271j87449J67875j16020m9128j41645k8493j54519L9828k840
2015F20853L085Q6876N4837j62751k3187L0221O3910n8678N125O8994J5713j01994
2003F03004j44728K7513J27655j68496p6172J62354j33698k287n3694l1815j8598
1992B91038J3620M9786j4654j7685n6540J23943M8498j00208J4068K4138m758
1981C71246m199P6715p9589N9956j80968k7653P1869R8056j9403j31397o6601
1970A68032N8460O6309K8963j57342j9402M9542J9965m5187R2499j7432k4025
$$ plain form
1959 220382 87588 65868 162270 148284 215764 262173 236582 194352 322204 220857 107623
1948 107623 -25071 41181 131988 52672 -11620 19336 -82005 -28066 53477 71854 144814
1937 144814 140856 156856 128704 94670 28821 75003 -2767 115900 117677 -19942 51711 138319
1925 138319 127315 164376 158522 106494 88631 152704 275406 242739 142235 205428 231690
1914 231690 169151 157377 76400 92005 115199 35597 118638 70610 62851 102134 47376 -55162
1902 -55162 65461 -42532 -106885 -77982 -78084 -56833 -77985 -111900 -93873 -43631 -38563 -23283
1890 -23283 -47881 79170 40652 140577 54672 35694 -37160 8519 7425 26024 33262 28714
1878 28714 34466 -19383 19094 53984 64591 -62962 21117 42961 53662 74163 89369 -7259
$$ packed form
1959B20382j32794k1720R6402j3986O7480M6409k5591m2230J27852j01347j13234
1948A07623j32694O6252R0807p9316o4292L0956j01341N3939Q1543J8377P2960
1937A44814l958J6000k8152l4034o5849M6182p7770J18667J777j37619P1653Q6608
1925A38319j1004L7061n854n2028j7863O4073J22702l2667j00504O3193K6262
1914B31690o2539j1774q0977J5605K3194p9602Q3041m8028p759L9283n4758j02538
1902e5162J20623j07993o4353K8903j02K1251k1152l3915J8027N0242N068J5280
1890b3283k4598J27051l8518R9925q5905j8978p2854M5679j094J8599P238m548
1878B8714N752n3849L8477L4890J0607j27553Q4079K1844J0701K0501J5206r6628
$$ plain form
1866 -7259 -123222 41810 -36825 -14300 13446 34475 -32954 42220 151313 25395 -67765
1855 -67765 58109 121449 98668 43879 -26283 45315 51928 42543 99811 38494 64545 65084
1843 65084 69788 114440 -68326 -134259 -77239 -33593 53059 39346 -14665 72416 143797 -34361
1831 -34361 -80634 -173590 -173701 -46614 90350 31064 -740 -36026 14178 81211 80887 36529
1819 36529 52595 82700 41246 202903 84973 -4922 -818 -22355 -76767 121124 157497
1808 157497 208814 118015 139288 239937 246876 29838 93523 262230 94672 69080 -8118
1797 -8118 -44033 12666 -54980 -8604 57706 37736 -92785 -135408 -57342 -40354 -161423 -168655
1785 -168655 -126647 -36771 24337 11894 -34777 -64279 -150402 -135309 -93752 -63452 -35391 -85252
$$ packed form
1866g259j15963J65032p8635K2525K7746K1029o7429P5174J09093j25918r3160
1855f7765J25874O3340k2781n4789p0162P1598O613r385N7268o1317K6051N39
1843F5084M704M4652j82766o5933N7020M3646Q6652j3713n4011Q7081P1381j78158
1831c4361m6273r2956j11J27087J36964n9286l1804l5286N0204O7033l24m4358
1819C6529J6066L0105m1454J61657j17930q9895M104k1537n4412J97891L6373
1808A57497N1317r0799K1273J00649O939k17038O3685J68707j67558k5592p7198
1797h118l5915N6699o7646M6376O6310j9970j30521m2623P8066J6988j21069p232
1785a68655M2008Q9876O1108j2443m6671k9502q6123J5093M1557L0300K8061m9861
$$ plain form
1773 -85252 106721 16723 -48900 -24780 34488 6759 -90204 -152514 -107431 -67377 -137152 -117993
1761 -117993 -127579 -200368 -294769 -107907 58529 102765 -37394 18309 174889 99467 169590
1750 169590 114873 -113506 -134728 -69808 -42813 -20186 102416 107558 23687 -97355 -67184
1739 -67184 -40675 -19216 -39903 -29336 25325 -86634 -38418 -14160 62388 -13635 -158924
1728 -158924 -230353 -70616 11938 -9636 37554 46275 -96604 18613 -18833 -57849 -65749
1717 -65749 -55264 -30033 -33758 -36622 -5206 -51913 7081 -81237 -106745 -132868 -247313 -166122
1705 -166122 -2517 -9468 -20636 -105332 -147450 -215080 -63177 65798 -2155 -51502 -93022
1694 -93022 -47886 -238972 -94682 -100715 -104774 -84229 -13538 -61080 51262 -9096 66204 35940
$$ packed form
1773h5252J91973q9998o5623K4120N9268k7729r6963o2310M5083M0054o9775J9159
1761a17993r586p2789r4401J86862J66436M4236j40159N5703J56580p5422P0123
1750A69590n4717k28379k1222O4920K6995K2627J22602N142q3871j21042L0171
1739f7184K6509K1459k0687J0567N4661j11959M8216K4258P6548p6023j45289
1728a58924p1429J59737Q2554k1574M7190Q721j42879J15217l7446l9016p900
1717f5749J0485K5231l725k864L1416m6707N8994q8318k5508k6123j14445Q1191
1705a66122J63605o951j1168q4696m2118o7630J51903J28975o7953m9347m1520
1694i3022M5136j91086J44290o033m059K0545P0691m7542J12342o0358P5300l0264
$$ plain form
1682 35940 54134 -77002 -170823 -157259 -157971 -59498 -150193 -262190 -237363 -96836 51583
1671 51583 92483 3475 -105672 -173819 -25884 -68588 -84299 -160915 -52206 -14105 -138358
1660 -138358 -222274 -120428 -85651 -146536 -192931 -83185 -141890 -180834 -82541 10428 -31758
1649 -31758 -57103 60739 97997 71636 -6159 -87702 22352 -27534 -157563 -21609 -28088
1638 -28088 11684 -45018 -34326 -124308 -142448 -100822 -219712 -253129 -99242 -193420 -144513
1627 -144513 -94059 -65973 -55065 -18176 -101265 38032 82024 -151609 -210516 -206640 -292565
1616 -292565 -197257 91968 -19597 -54644 -106581 -45487 -11374 -51869 -29255 -61945 -145934
1605 -145934 -121610 -180814 -253354 -53264 -33661 -30628 26303 -43774 -22738 66390 87429 106870
$$ packed form
1682C5940J8194j31136r3821J3564p12R8473r0695j11997K4827J40527J48419
1671E1583M0900q9008j09147o8147J47935m2704j5711p6616J08709L8101j24253
1660a38358q3916J01846L4777o0885m6395J09746n8705l8944R8293R2969m2186
1649c1758k5345J17842L7258k6361p7795q1543J10054m9886j30029J35954o479
1638b8088L9772n6702J0692q9982j8140M1626j18890l3417J53887r4178M8907
1627a44513N0454K8086J0908L6889q3089J39297M3992k33633n8907L876q5925
1616b92565R5308K89225j11565l5047n1937O1094L4113m0495K2614l2690q3989
1605a45934K4324n9204p2540K00090J9603L033N6931p0077K1036Q9128K1039J9441
$$ plain form
1593 106870 11079 -18480 -83352 -180513 -99459 -54437 -70047 -105342 -121566 -40734 -33211 -147549
1581 -147549 -46035 33553 -73187 -161028 63258 59383 -26968 -72047 -123914 -77861 -30890
1570 -30890 -50042 -3604 47735 -48015 -40235 34107 -23748 -39628 -44634 -191348 -172524 -271713
1558 -271713 -176689 -240547 -262842 -158836 -207240 -136741 -156310 -236359 -235543 -173098 -121910 -177659
1546 -177659 -236406 -111714 -65224 48410 27111 -90139 -173779 -257842 -212410 -113500 -194180
1535 -194180 -145181 -288687 -187283 -54960 -70565 -126961 -67866 -47291 -79104 50904 -80700
1524 -80700 -173606 -93808 -146184 -237605 -132416 -43171 -20989 28236 -34424 -93620 -87810 -125415
1512 -125415 -99514 -216 -91421 -167171 -182035 -185424 -97823 -49698 -38689 -141236 -102454 3877
$$ packed form
1593A06870r5791k9559o4872r7161Q1054M5022j5610l5295j6224Q0832P523j14338
1581a47549J01514P9588j06740q7841K24286l875q6351m5079n1867M6053M6971
1570c0890j9152M6438N1339r5750P780P4342n7855j5880n006j46714J8824r9189
1558b71713R5024o3858k2295J04006m8404P0499j9569q0049Q16O2445N1188n5749
1546a77659n8747J24692M6490J13634k1299j17250q3640q4063M5432R8910q0680
1535a94180M8999j43506J01404J32323j5605n6396N9095K0575l1813J30008j31604
1524h0700r2906P9798n2376r1421J05189Q9245K2182M9225o2660n9196N810l7605
1512a25415K5901R9298r1205p5750j4864l389Q7601M8125J1009j02547L8782J06331
$$ plain form
1500 3877 -67057 -75056 -141048 -49179 80604 -76927 -77867 -111933 -151836 -233016 -267271 -189340
1488 -189340 -113301 -83162 -149957 -282125 -223528 -192735 -243954 -226702 -189719 -62564 -61547
1477 -61547 -146751 -47892 -89963 -152557 -38621 108609 40416 4956 10690 -5863 -86520 -186036
1465 -186036 -172539 -75690 30844 -93620 -165686 -80652 -72222 -70910 -22567 74924 -14034 -54960
1453 -54960 -14157 -50881 -126507 -131889 -193466 -107148 -172560 -129934 -46437 -101423 -181702 -243565
1441 -243565 -312195 -151349 -16072 -113858 -146970 -98786 2425 -57671 -34733 -41731 40329
1430 40329 175960 -39972 -74947 -12035 -134324 -161114 -163060 -72163 -169630 -171559 -170856 -128922
1418 -128922 -66044 -133502 -164152 -143191 -154598 -200141 -185797 -57701 -32705 -148885 -81526
$$ packed form
1500C877p0934p999o5992R1869J29783j57531r40l4066l9903q1180l4255P7931
1488a89340P6039L0139o6795j32168N8597L0793n1219J7252L6983J27155J017
1477f1547q5204R8859m2071o2594J13936J47230o8193l5460N734j6553q0657r9516
1465a86036J3497R6849J06534j24464p2066Q5034Q430J312M8343R7491q8958m0926
1453e4960M0803l6724p5626n382o1577Q6318o5412M2626Q3497n4986q0279o1863
1441b43565o8630J60846J35277r7786l3112M8184J01211o0096K2938o998Q2060
1430D0329J35631k15932l4975O2912j22289k6790j946R0897r7467j929P03M1934
1418a28922O2878o7458l0650K0961j1407m5543J4344J28096K4996j16180O7359
$$ plain form
1407 -81526 -96691 -221554 -210319 -266653 -112612 -119974 -164178 -240364 -240268 -95924 -106674 -42538
1395 -42538 -9459 -198223 -84935 17214 106321 125122 -34371 -34915 -44724 -238021 -178131
1384 -178131 -61071 -66226 163921 154660 35180 3511 3903 -78720 -231250 -153086 -165054 -311465
1372 -311465 -236485 -206338 -44778 -64526 -41863 -33268 -9627 -31091 -47039 486 -162148
1361 -162148 -151578 -164424 -243779 -95535 -133569 -184651 -148914 -126884 -86242 -26876 -108591
1350 -108591 -66971 -9506 -78087 62882 99959 77406 -47279 -134211 -159634 -19335 -6120
1339 -6120 -19723 39474 25747 -56800 -194171 -264410 -142897 -168651 -201782 -185689 -104825 -203437
1327 -203437 -214171 -205864 -133572 -70835 -125424 -142428 -152036 -196744 -91537 -173856 -276531 -209726
$$ packed form
1407h1526j5165j24863J1235n6334J54041p362m4204p6186R6J44344j0750O4136
1395d2538L3079j88764J13288J02149Q9107J8801j59493n44r809j93297N9890
1384a78131J17060n155K30147r261j19480l1669L92q2623j52530P8164j1968j46411
1372c11465P4980L0147J61560j9748K2663Q595K3641k1464j5948M7525j62634
1361a62148J0570j2846p9355J48244l8034n1082L5737K2030M0642N9366q1715
1350a08591M1620N7465o8581J40969L7077k2553j24685q6932k5423J40299J3215
1339f120j3603N9197j3727q2547j37371p0239J21513k5754l3131J6093Q0864r8612
1327b03437j0734Q307P2292O2737n4589j7004r608m4708J05207q2319j02675O6805
$$ plain form
1315 -209726 -201241 -189994 -207370 -103085 -15541 -8119 -61830 -159080 -307540 -128236 -215073
1304 -215073 -269004 -163932 -203390 -149962 -76685 -113444 -152906 -259854 -198741 -116813 -104500
1293 -104500 -75287 46075 147650 59107 96924 146183 27825 -218541 -273510 -128354 -119092
1282 -119092 -77858 -145766 -205104 -153228 -53576 -88653 54277 101075 65331 -56429 -124647
1271 -124647 -177553 -156713 -128321 -92559 -131937 -235081 -171991 -157016 -91179 53825 2630
1260 2630 -25057 -137781 -170149 -66209 -104404 19856 -57908 -66698 -84473 -167352 -218792 -32773
1248 -32773 19245 -37084 -117852 -156922 -83650 -101617 -193439 -204029 -117555 -73941 -34440 -53491
1236 -53491 -234432 -172488 -243936 -289867 -137966 -163226 -113631 -74449 -103464 -112222 -86360 -127031
$$ packed form
1315b09726Q485J1247j7376J04285Q7544P422n3711r7250j48460J79304q6837
1304b15073n3931J05072l9458N3428P3277l6759l9462j06948O1113Q1928J2313
1293a04500K9213J21362J01575q8543L7817M9259j18358k46366n4969J45156R262
1282a19092M1234o7908n9338N1876R9652l5077J42930M6798l5744j21760o8218
1271a24647n2906K0840K8392L5762l9378j03144O3090J4975O5837J45004n1195
1260B630k7687j12724l2368J03940l8195J24260p7764q790j7775q2879n1440J86019
1248c2773N2018n6329q0768l9070P3272j7967r1822j0590Q6474M3614L9501j9051
1236e3491j80941O1944p1448m5931J51901k5260M9595L9182k9015q758K5862m0671
$$ plain form
1224 -127031 -286830 -210547 -25757 -39062 -204349 -197060 -104621 -133287 -242439 -233007 -194209
1213 -194209 -225049 -164355 -49738 -47118 -66644 -141253 -148832 -165485 -259470 -158752 -170472 -207923
1201 -207923 -140564 -181010 -130062 -121262 -137568 -198404 -276441 -187557 -103900 -84508 -124899 11196
1189 11196 -196583 -184637 -31829 -49174 -64960 -76256 1959 -4562 -55712 -133761 -126468 -199767
1177 -199767 -199048 -210108 -208240 -68255 10707 -33998 -96742 31478 -37410 -103014 -9230 71309
1165 71309 -33285 -90947 -43867 -58034 -175356 -235797 -253410 -220601 -270117 -289505 -174493
1154 -174493 -89844 -31321 12700 60622 63442 37475 -21081 -37065 59954 93173 -73424 -124989
1142 -124989 -61111 47735 -45387 -147733 -14140 19673 -17663 27310 -76901 -212565 -178852
$$ packed form
1224a27031j59799P6283J84790j3305j65287P289R2439k8666j09152R432L8798
1213a94209l0840O0694J14617K620j9526p4609p579j6653r3985J00718j1720l7451
1201b07923O7359m0446N0948Q800j6306o0836p8037Q8884Q3657J9392m0391J36095
1189A1196k07779J1946J52808j7345j5786j1296P8215o521n1150p8049P293p3299
1177a99767P19j1060J868J39985P8962m4705o2744J28220o8888o5604R3784Q0539
1165G1309j04594n7662M7080j4167j17322o0441j7613L2809m9516j9388J15012
1154a74493Q4649N8523M4021M7922K820k5967n8556j5984R7019L3219j66597n1565
1142a24989O3878J08846r3122j02346J33593L3813l7336M4973j04211j35664L3713
$$ plain form
1131 -178852 -125967 -114251 -2407 57982 -213273 -254578 -90801 -185790 -200979 -97811 -121991
1120 -121991 -79439 -110984 -131049 -166705 -176955 -63037 -37488 32121 6876 -26810 27706
1109 27706 -6144 -29869 -50054 -64433 60598 23780 -43913 27369 -120828 -81377 -158081
1098 -158081 -206546 7374 -44512 -168688 -89049 23865 -110203 -99896 -65028 -122079 -95915
1087 -95915 8481 31865 63849 -108375 -35063 -60024 -156536 -30092 -95444 -107947 -51200
1076 -51200 -29802 50990 51302 80157 67019 -125179 -216219 -165877 -81952 55311 57668 -133331
1064 -133331 -101306 47030 -12687 -164931 -123301 -74037 -100959 -94850 -132822 -206595 -200634 -154264
1052 -154264 -146043 -172485 -74779 78556 104941 -18854 -220662 -167661 -149432 19606 -45027
$$ packed form
1131a78852N2885J1716J11844O0389k71255m1305J63777r4989j5189J03168k4180
1120a21991M2552l1545k0065l5656j0250J13918K5549O9609k5245l3686N4516
1109B7706l3850k3725k0185j4379J25031l6818o7693P1282j48197L9451p6704
1098a58081m8465K13920n1886j24176P9639J12914j34068J0307L4868n7051K6164
1087i5915J04396K3384L1984j72224P3312k4961r6512J26444o5352j2503N6747
1076e1200K1398Q0792L12K8855j3138j92198r1040N0342Q3925J37263K357j90999
1064a33331L2025J48336n9717j52244M1630M9264k6922O109l7972p3773N961M6370
1052a54264Q221k6442R7706J53335K6385j23795k01808N3001J8229J69038o4633
$$ plain form
1041 -45027 -63036 -94787 -86071 -57048 -111972 -237374 -126685 -23107 -19833 -35502 -106287 -61858
1029 -61858 -102194 -191440 -174532 -151771 -211808 -94751 5553 -80947 -109349 -47653 -74397
1018 -74397 -119141 -157377 -154083 -157854 -89406 -106307 -166571 -121917 26166 -86121 -147767 -70423
1006 -70423 -96371 -217570 -273230 -227122 -128052 -95474 -61298 -56924 -52302 -89591 -94276 -184156
994 -184156 -80061 -57959 -1710 -110616 -167956 -158748 -116674 -113383 -93065 92662 -74593
983 -74593 -208207 -80480 -97998 -102102 -27699 80189 -25391 9573 -39531 -107480 -163651
972 -163651 -154626 -38984 -64294 -27974 -20873 -144849 -181214 -137587 38103 -27316 -95656 -35185
$$ packed form
1041d5027j8009l1751Q716K9023n4924j25402J10689J03578L274j5669p0785M4429
1029f1858m0336q9246J6908K2761o0037J17057J00304q6500k8402O1696k6744
1018g4397m4744l8236L294l771O8448j6901o0264M4654J48083j12287o1646P7344
1006g0423k5948j21199n5660M6108R9070L2578L4176M374M622l7289m685q9880
994a84156J04095K2102N6249j08906n7340R208M2074L291K0318J85727j67255
983g4593j33614J27727j7518m104P4403J07888j05580L4964m9104o7949n6171
972a63651R025J15642k5310L6320P101j23976l6365M3627J75690o5419o8340O0471
$$ [...]
##END NTUPLES=NMR SPECTRUM
##END=
