##TITLE=1H_EC-3293(VII-33p)
 CDCl3
 8 sc, 
 18.5.2023
##JCAMPDX= 6.0         $$ Bruker NMR JCAMP-DX V2.0
##DATA TYPE= NMR SPECTRUM
##DATA CLASS= NTUPLES
##ORIGIN= UXNMR, Bruker Analytische Messtechnik GmbH
##OWNER= root
$$ XWIN-NMR		Version 3.5
$$ Thu May 18 13:57:39 2023 Russian Standard Time (UT+4h)  she@DPX200
##.OBSERVE FREQUENCY= 200.13135
##.OBSERVE NUCLEUS= ^1H
##.ACQUISITION MODE= SIMULTANEOUS
##.ACQUISITION SCHEME= undefined
##.AVERAGES= 8
##.DIGITISER RES= 18
##SPECTROMETER/DATA SYSTEM= spect
##.PULSE SEQUENCE= zg30
##.SOLVENT NAME= CDCl3
##.SHIFT REFERENCE= (INTERNAL, CDCl3, 0, 15.7491)
##AUDIT TRAIL= $$ (NUMBER, WHEN, WHO, WHERE, WHAT)
$$ ##TITLE= Audit trail, XWIN-NMR		Version 3.5
$$ ##JCAMPDX= 5.01
$$ ##ORIGIN= Bruker BioSpin GmbH
$$ ##OWNER= she
$$ F:/spectra/data/she/nmr/H-F/1/pdata/1/auditp.txt
$$ ##AUDIT TRAIL=  $$ (NUMBER, WHEN, WHO, WHERE, WHAT)
(   1,<2023-05-18 13:56:17.15 +0400>,<she>,<DPX200>,
      <created by zg, POWCHK disabled, PULCHK disabled
       configuration hash MD5:
       00 E9 B6 7A A2 85 ED C7 34 08 36 98 17 FE 4E 26
       data hash MD5: 16K
       51 63 C4 3C 3B 22 C2 79 EA 98 33 83 5C 44 C7 DA>)
(   2,<2023-05-18 13:56:19.51 +0400>,<she>,<DPX200>,
      <Start of raw data processing
       efp BC_mod = 2 LB = 0.24 FT_mod = 6 PKNL = 1 PHC0 = -19900.79 PHC1 = 8.45272 SI = 16K 
       data hash MD5: 16K
       E4 7A 05 2A 14 47 7C 4F 7F E1 09 CA 49 60 D0 E9>)
(   3,<2023-05-18 13:56:44.42 +0400>,<she>,<DPX200>,
      <pk PHC0 = -4.468465 PHC1 = 10.4 
       data hash MD5: 16K
       C3 99 CB F8 F7 6E 6B D8 34 F9 AC 2E BC DF FD 7A>)
(   4,<2023-05-18 13:56:47.64 +0400>,<she>,<DPX200>,
      <abs ABSG = 5 
       data hash MD5: 16K
       B2 0B B9 94 F6 3F 6F B6 A6 28 14 92 F4 D2 72 AF>)
$$ ##END=
$$ 
$$ hash MD5
$$ 75 22 B7 34 A1 4F BA C0 47 9A A1 94 00 39 1E 7E
##$RELAX= 
##$RELAX= 
##$RELAX= 
##$RELAX= 
##$RELAX= 
##$RELAX= 
$$ Bruker specific parameters
$$ --------------------------
##$DU= <F:/spectra>
##$EXPNO= 1
##$NAME= <H-F>
##$PROCNO= 1
##$TYPE= <nmr>
##$USER= <she>
##$AMP= (0..31)
100 100 100 100 100 100 100 100 100 100 100 100 100 100 100 100 100 100 
100 100 100 100 100 100 100 100 100 100 100 100 100 100 
##$AQSEQ= 0
##$AQ_mod= 1
##$AUNM= <au_zg>
##$AUTOPOS= <>
##$BF1= 200.13
##$BF2= 200.13
##$BF3= 200.13
##$BF4= 200.13
##$BF5= 200.13
##$BF6= 200.13
##$BF7= 200.13
##$BF8= 200.13
##$BYTORDA= 1
##$CFDGTYP= 0
##$CFRGTYP= 5
##$CHEMSTR= <none>
##$CNST= (0..31)
1 1 145 1 1 1 1 1 1 1 1 1 1 1 1 1 1 1 1 1 1 1 1 1 1 1 1 1 1 1 1 1 
##$CPDPRG= <>
##$CPDPRG1= <>
##$CPDPRG2= <>
##$CPDPRG3= <>
##$CPDPRG4= <mlev>
##$CPDPRG5= <mlev>
##$CPDPRG6= <mlev>
##$CPDPRG7= <mlev>
##$CPDPRG8= <mlev>
##$CPDPRGB= <>
##$CPDPRGT= <>
##$D= (0..31)
0 1.2 0 0 0 0 0 0 0 0.06 0 0.03 0 0 0 0 0.0002 0 0 0 0 0 0 0 0 0 0 0 0 
0 0 0 
##$DATE= 1684403776
##$DBL= (0..7)
120 120 120 120 120 120 120 120 
##$DBP= (0..7)
150 150 150 150 150 150 150 150 
##$DBP07= 0
##$DBPNAM0= <>
##$DBPNAM1= <>
##$DBPNAM2= <>
##$DBPNAM3= <>
##$DBPNAM4= <>
$$ [...]
##$SUBNAM3= <"">
##$SUBNAM4= <"">
##$SUBNAM5= <"">
##$SUBNAM6= <"">
##$SUBNAM7= <"">
##$SUBNAM8= <"">
##$SUBNAM9= <"">
##$SW= 18.05172834244
##$SWIBOX= (0..15)
0 0 2 0 0 0 0 0 0 0 0 0 0 0 0 0 
##$SW_h= 3612.71676300578
##$TD= 16384
##$TD0= 1
##$TE= 0
##$TE2= 300
##$TE3= 300
##$TEG= 300
##$TL= (0..7)
0 120 120 120 120 120 120 120 
##$TP= (0..7)
150 150 150 150 150 150 150 150 
##$TP07= 0
##$TPNAME0= <>
##$TPNAME1= <>
##$TPNAME2= <>
##$TPNAME3= <>
##$TPNAME4= <>
##$TPNAME5= <>
##$TPNAME6= <>
##$TPNAME7= <>
##$TPOAL= (0..7)
0.5 0.5 0.5 0.5 0.5 0.5 0.5 0.5 
##$TPOFFS= (0..7)
0 0 0 0 0 0 0 0 
##$TUNHIN= 0
##$TUNHOUT= 0
##$TUNXOUT= 0
##$USERA1= <user>
##$USERA2= <user>
##$USERA3= <user>
##$USERA4= <user>
##$USERA5= <user>
##$V9= 5
##$VALIST= <valist>
##$VCLIST= <CCCCCCCCCCCCCCC>
##$VD= 0
##$VDLIST= <DDDDDDDDDDDDDDD>
##$VPLIST= <PPPPPPPPPPPPPPP>
##$VTLIST= <TTTTTTTTTTTTTTT>
##$WBST= 1024
##$WBSW= 4
##$XGAIN= (0..3)
0 0 0 0 
##$XL= 0
##$YL= 0
##$YMAX_a= 518177
##$YMIN_a= -534038
##$ZGOPTNS= <>
##$ZL1= 120
##$ZL2= 120
##$ZL3= 120
##$ZL4= 120
##$ABSF1= 15.65985
##$ABSF2= -2.391997
##$ABSG= 5
##$ABSL= 3
##$ALPHA= 0
##$AQORDER= 0
##$ASSFAC= 0
##$ASSFACI= 0
##$ASSFACX= 0
##$ASSWID= 0
##$AUNMP= <proc_1d>
##$AZFE= 0.1
##$AZFW= 0.1
##$BCFW= 0
##$BC_mod= 2
##$BYTORDP= 0
##$COROFFS= 0
##$CY= -3
##$DATMOD= 1
##$DC= 0
##$DFILT= <>
##$DTYPP= 0
##$F1P= 0
##$F2P= 0
##$FCOR= 1
##$FTSIZE= 16384
##$FT_mod= 6
##$GAMMA= 0
##$GB= 0
##$INTBC= 1
##$INTSCL= 3.70164e-10
##$ISEN= 128
##$LB= 0.24
##$LEV0= 0
##$LPBIN= 0
##$MAXI= 10000
##$MC2= 0
##$MEAN= 0
##$ME_mod= 0
##$MI= 1.114404
##$NCOEF= 0
##$NC_proc= -6
##$NLEV= 6
##$NOISF1= 3.799351
##$NOISF2= 2.8
##$NSP= 0
##$NTH_PI= 0
##$NZP= 0
##$OFFSET= 15.74909
##$PC= 1
##$PHC0= -19905.26
##$PHC1= 18.85272
##$PH_mod= 1
##$PKNL= yes
##$PPARMOD= 0
##$PSCAL= 0
##$PSIGN= 0
##$REVERSE= no
##$SF= 200.130004493168
##$SI= 16384
##$SIGF1= 3
##$SIGF2= 2
##$SINO= 5.538805
##$SIOLD= 16384
##$SREGLST= <1H.CDCl3>
##$SSB= 0
##$STSI= 16384
##$STSR= 0
##$SW_p= 3612.71676300578
##$SYMM= 0
##$S_DEV= 0
##$TDeff= 16384
##$TDoff= 0
##$TI= <>
##$TILT= no
##$TM1= 0
##$TM2= 0
##$TOPLEV= 0
##$USERP1= <user>
##$USERP2= <user>
##$USERP3= <user>
##$USERP4= <user>
##$USERP5= <user>
##$WDW= 1
##$XDIM= 16384
##$YMAX_p= 303463007
##$YMIN_p= -377530
$$ End of Bruker specific parameters
$$ ---------------------------------
##NTUPLES= NMR SPECTRUM
##VAR_NAME=  FREQUENCY,     SPECTRUM/REAL,   SPECTRUM/IMAG
##SYMBOL=    X,             R,               I
##VAR_TYPE=  INDEPENDENT,   DEPENDENT,       DEPENDENT
##VAR_FORM=  AFFN,          ASDF,            ASDF
##VAR_DIM=   16384,         16384,           16384
##UNITS=     HZ,            ARBITRARY UNITS, ARBITRARY UNITS
##FACTOR=    0.220516191357247, 1,           1
##FIRST=     3151.86549142905, 0,            0
##LAST=      -460.851271576731, 0,           0
##MIN=       -460.851271576731, -377530,     0
##MAX=       3151.86549142905, 303463007,    0
$$ Real data points
##PAGE= N=1
##DATA TABLE= (X++(R..R)), XYDATA
$$ [...]
9188 5782724 5663187 5673323 5673119 5588779 5318763 5216997 5146035 5161111 5172530 5075259 4923091
9177 4923091 4835469 4736917 4692131 4708243 4684619 4722010 4635784 4611489 4680348 4632258 4621791
9166 4621791 4648398 4642887 4721943 4797633 4944930 4948517 5029666 5220283 5288826 5241782 5266595
9155 5266595 5435061 5551423 5617577 5710623 5818298 5879147 5826930 5843579 5700873 5736956 5634017
9144 5634017 5421105 5312977 5156893 5016159 4904621 4926820 4844303 4795950 4800939 4793342 4678762
9133 4678762 4685703 4673572 4681412 4686539 4680723 4832748 4836534 4868083 4879606 4855664 4895390 4953842
9121 4953842 5008248 5076319 5115930 5179742 5292247 5250391 5341544 5412511 5497938 5434251 5358156
9110 5358156 5241950 5007139 4797221 4559856 4255472 4026692 3855675 3707208 3617287 3481261
9100 3481261 3373895 3208681 3020561 2914555 2798008 2679899 2724316 2676212 2544055 2468674
9090 2468674 2464440 2307739 2400992 2469516 2267764 2216504 2149287 2168046 2123954 2013191 2014162
9079 2014162 1992554 1992486 2076472 2044467 1943451 1866436 1952324 1992374 1956860 1852819 1805268 1904677
9067 1904677 1981374 1969432 1912247 1926567 1875935 1798499 1809068 1751985 1858606 1817614 1766972
9056 1766972 1796877 1809380 1746537 1748253 1820443 1739306 1673906 1850494 1856871 1750403 1879945
9045 1879945 1853268 1788799 1829454 1899923 1878961 1844406 1896555 1894858 1814951 1802496 1758449 1836251
9033 1836251 1858570 1799165 1799415 1734525 1656671 1670760 1744975 1825718 1716825 1688839 1729588 1691261
9021 1691261 1704407 1668839 1685033 1710039 1765970 1834266 1884866 1856693 1775664 1822496 1899847
9010 1899847 1879951 1999052 1860542 1835816 1960213 1980554 1962424 2022964 2071327 2021767 1937888
8999 1937888 1957714 1926800 1817745 1859486 1868421 1799282 1811423 1923778 1870092 1789159 1847616
8988 1847616 1887206 2014746 1851086 1838182 1877469 1813020 1903289 1829755 1835277 1807191 2026434
8977 2026434 2014296 1883774 1865847 1906331 1887090 1828204 1821107 1901493 1973328 1920373 1932391
8966 1932391 2058434 2041201 2082439 2073284 2057660 2139320 2242085 2130951 2213709 2315844 2245147
8955 2245147 2276775 2369032 2361988 2324648 2322850 2469361 2477443 2454703 2426495 2477105 2563513 2658092
8943 2658092 2673444 2664857 2646984 2626139 2707402 2762308 2795309 2769461 2761242 2743532 2836606 2960224
8931 2960224 3001175 3222743 3284696 3303737 3263421 3257035 3316616 3302671 3436543 3475919 3585695
8920 3585695 3720564 3754094 3703120 3709774 3798962 3844880 3828500 3884197 3912625 4026277 4128828
8909 4128828 4270244 4374527 4468640 4450412 4500219 4517839 4639527 4726196 4755968 4803542 4872349
8898 4872349 5069486 5211860 5125838 5254178 5418654 5522072 5481578 5559779 5734399 5830180
8888 5830180 6067100 6164109 6245527 6402287 6583612 6702331 6781716 6961815 7146333 7239869
8878 7239869 7301678 7576488 7701231 7916486 8092205 8260663 8439110 8571649 8900838 9137409
8868 9137409 9428734 9702986 9974643 10292362 10563296 11025451 11597143 12077729 12718149 13490990
8858 13490990 14391356 15309860 16126513 16980653 18002075 19316574 20935679 22706125 24480828
8849 24480828 25972480 26893229 27022422 26405563 25241765 23810478 22523528 21622437 21134365
8840 21134365 20949739 20854486 20679337 20217801 19846083 19460076 19156510 19122777 19238834 19521625
8830 19521625 19882993 20487078 21293729 22286933 23355957 24692101 25997255 27406916 28942059
8821 28942059 30804833 33179228 35876429 38784886 41726430 44497804 46596514 47707825
8813 47707825 47694667 46865626 45333010 43218249 41004011 39085843 37426370 35456045 32910626
8804 32910626 30414526 28321445 26689512 25516844 24511041 23452998 22737851 22297609
8796 22297609 22000186 21911286 21911673 22147447 22503817 23049310 23835374 24726419 25897900 27200023
8786 27200023 28704013 30057051 31056608 31655502 32040324 32585306 33435037 34375069 35165429
8777 35165429 35716046 35596661 34292948 32015740 29065838 26016494 23517944 21792474
8769 21792474 20458776 19331088 18587603 17816485 17045506 16436471 15764106 15119831 14628999
8760 14628999 14314610 14080194 13856614 13809665 13830626 13697723 13581768 13457426 13531470 13641109
8750 13641109 13631510 13723706 13585201 13336731 13093382 12766146 12335873 11911548 11464612 10985060
8740 10985060 10533632 10164404 10015461 9965092 9843482 9715941 9483743 9267723 9221642 9171693
8730 9171693 9135784 9086541 9021941 8976699 8932494 9001354 9008389 9032838 9082270 9056061 9045559 8997215
8718 8997215 9041128 9121026 9269385 9416318 9585174 9705435 10027138 10314375 10833091 11407732
8708 11407732 12181842 12950424 13910941 15152862 16928113 19496071 23201055 27890672 33170340
8699 33170340 35244879 30898282 24449330 19119599 15852620 13793157 12347524 11257971
8691 11257971 10560481 9921434 9519201 9292095 9026261 8821681 8731989 8596800 8585387 8473221
8681 8473221 8323283 8295330 8276469 8224454 8296461 8437560 8581780 8654680 8761904 8940733
8671 8940733 9118942 9289046 9438567 9589951 9735179 9919270 10051609 10186954 10538447 11041612
8661 11041612 11566630 12109583 12747111 13649193 14711646 15590057 16122694 16685932 17287854
8652 17287854 18133221 18948597 19113396 18390437 17541724 16944191 16568471 16218997 15606873
8643 15606873 14791770 14027528 13545440 13132950 12971394 12856576 12900566 13090321 13260018 13338599
8633 13338599 13582684 13762866 13872954 14169433 14427586 14993810 15681163 16444077 17216246
8624 17216246 17747764 18292986 18938709 20053582 21517953 22909962 24097198 24481089 23833082
8615 23833082 22354203 20450752 18581600 17009509 15915877 15175262 14581189 14044184 13394677
8606 13394677 12623603 11960318 11534660 11282386 11099407 10921286 10792013 10559322 10358510
8597 10358510 10217311 10171726 9997928 9953557 10052269 10427449 10783106 11132010 11444728 11661212
8587 11661212 11804068 11969034 12182115 12557466 12418127 11661518 10875746 10130285 9573777
8578 9573777 9001422 8380423 7702242 7176629 6600511 6157627 5970195 5729098 5383942 5184604
8568 5184604 5097615 4909648 4759586 4536172 4327768 4269430 4198283 4043618 4069704 3947275
8558 3947275 3890535 3798884 3726132 3770251 3688735 3592420 3503787 3421459 3382525 3346640 3376820
8547 3376820 3302503 3155320 3032584 2835886 2818775 2695017 2616926 2504636 2412520 2343861
8537 2343861 2236426 2127584 2004988 2012899 2084949 1968718 1784160 1768063 1762487 1658380 1593606
8526 1593606 1592891 1537614 1434434 1518003 1443848 1444822 1381718 1374050 1377535 1290890 1296828 1296806 1262138
8513 1262138 1280572 1302045 1307983 1232682 1258964 1285873 1225936 1169514 1140749 1128194 1130658 1156613
8501 1156613 1023239 1004504 970053 1037772 1049182 962085 908830 942209 1047985 1056490 970538
8490 970538 873281 857802 856136 845084 847199 944620 951219 930534 913148 899301 807581 854312
8478 854312 838195 756504 832864 857010 790883 757404 823147 702245 611288 657047 652187 705963
8466 705963 748860 723117 771766 649130 560076 661168 656602 640209 745951 626577 587145
8455 587145 657843 622289 656822 683709 668063 624435 616124 648355 703897 661711 651676 664111
8443 664111 652428 626438 558348 571822 592449 616489 632113 589902 637348 570398 489424 464953
8431 464953 545720 440649 374842 444890 447720 486177 500429 500458 332088 400689 484242 401886
8419 401886 460906 471647 397266 430920 479189 525815 433306 464156 365801 311497 347895 350159
8407 350159 396363 389858 281992 258833 190566 138213 199807 220969 222222 332780 345485 289007
8395 289007 278123 267490 310639 318849 343576 251681 187091 144406 105884 75200 70857 56379
8383 56379 109021 127597 80468 152302 122489 152048 192484 184522 204935 238812 276960 208507
8371 208507 116697 105722 99590 163965 90108 95611 139268 195078 302872 254364 277134 247207
8359 247207 238067 148642 166747 162516 175871 170247 274459 188830 148931 133778 182142 240975
8347 240975 164737 40536 29918 84170 157730 152888 42481 57106 66082 62918 56794 133652
8335 133652 141101 130456 104410 155460 136766 117895 95069 -11819 79463 105868 90650 93291
8323 93291 438 76672 156592 141171 182209 151229 71264 115750 179028 196585 205627 183776
8311 183776 133353 161386 205468 227088 186812 152672 10044 86574 83900 170987 136508 57157
8299 57157 117551 132104 195646 163215 160670 43194 15528 7897 17928 100255 105484 86811
8287 86811 143525 107705 108578 102749 21464 12972 119990 191463 91355 72190 39530 44590
8275 44590 69199 -8347 -105727 78325 212628 109985 85167 146568 137917 127249 196718
8264 196718 163836 155861 120869 84248 59844 1394 -92763 12158 64456 55426 74080 7725
8252 7725 5797 52638 63733 -45641 -38967 -533 114718 198965 149114 673 -70296 102980
8240 102980 121470 80900 46341 29947 -47895 25611 161024 169882 124051 47599 -26911 -18604
8228 -18604 -7804 132193 148376 181446 304726 259721 138993 110548 214596 111037 107080
8217 107080 73138 25830 43331 159579 181171 203455 107842 88519 73673 21690 -55853
8206 -55853 -18558 86002 103379 27157 -66541 15495 -33085 -17133 -116220 -59843 -41339 27084
8194 27084 52396 201457 294083 -33213 63435 88600 -114832 9776 31166 35685 20253
8183 20253 -27028 41194 119978 188783 182302 177171 203551 196573 237288 245748 110920 168802
8171 168802 187537 145968 148554 135567 68582 3334 -3161 -16939 29226 -15171 -120856 -105681
8159 -105681 43663 81054 97263 43229 -48558 -87049 -33744 -39215 -48447 40067 63833 13275
8147 13275 37063 27280 5830 -26427 -144855 -39444 -50449 7495 95142 50784 3650 7550
8135 7550 202877 201079 103242 147435 182942 144693 127796 249867 239011 213218 157707 113264
8123 113264 162972 96379 100270 41501 45045 30209 -20682 9898 42015 18682 -17686 11376
8111 11376 52120 161979 128876 139274 149670 181513 43689 -56932 18114 178284 143488
8100 143488 142991 147041 200633 332979 238309 237987 204449 132216 183885 118400 42615 37602 71035
8087 71035 85236 30734 -64636 -59488 -47777 -34126 -98 -127825 83752 91392 20550 33282
8075 33282 -2527 -57416 -107896 18050 94932 22501 63028 10495 47655 39605 39869 4625
8063 4625 -13645 31700 18370 17965 38921 63439 -18900 -51829 -51960 92147 94633 106651 284268
8050 284268 354963 305679 336907 273727 150923 209279 109335 -29325 -58732 -21063 5542
8039 5542 -84225 -105962 12221 112509 52313 7295 -15687 -69853 -91220 -926 -35422 -71142
8027 -71142 32876 30716 -40405 -49853 -18678 92170 22050 10578 545 94204 61225 -42134
8015 -42134 28780 107625 55987 25433 54768 123305 26276 89104 148650 213560 275206 263698
8003 263698 192970 130206 265970 200284 116718 133234 140818 156368 242895 336068 327390 261844
7991 261844 230843 210912 229505 277136 257583 243090 415268 349905 290563 313820 527730
7980 527730 381367 333183 306189 399802 439351 392626 341723 418988 356755 312295 258113
7969 258113 247701 301467 261159 253390 243417 306798 310114 272364 210491 230081 163958 73349
7957 73349 22393 72213 74411 26219 59156 87593 96305 53315 38475 103756 161492 113819
7945 113819 55119 152586 197147 235803 52822 -28558 -21593 24459 70241 79541 -56613 -60109
7933 -60109 -15062 -22223 -74577 -43379 -23356 -117448 -133192 -118138 -33410 59719 128730 134519
7921 134519 26044 -35971 -2089 28497 18866 124456 26364 765 -43059 7692 6696 -33265
7909 -33265 13086 -27204 -10201 -2666 -60768 10459 8153 -114508 -27965 32934 6574 6396
7897 6396 32677 20423 68729 78043 32950 -28461 -45426 -89428 -78830 -58300 -54968 -85042
7885 -85042 -38561 -48699 -24769 -20484 -69259 -162209 -18624 -119888 -180880 -99133 -68010 34155
7873 34155 54660 57180 43745 36830 -15864 -90703 -68603 -82191 -129416 -136625 -171963 -45328
7861 -45328 -68321 -87911 -83436 -57383 -91898 -89883 -4796 -6506 9435 36790 41408 94306 41569
7848 41569 18498 -19231 41669 40071 27501 87964 19974 22201 32884 61031 117459 81150
7836 81150 -40690 -125843 -111718 -20146 35843 56778 68377 66689 56634 41206 57343 105506
7824 105506 129628 121203 127518 126908 117429 135500 208142 103310 77479 151755 191326 133583
7812 133583 206423 192201 2523 39259 137195 246251 324248 327618 364294 268798 178459
7801 178459 262778 337261 236657 203320 303852 292958 324193 273179 307605 314437 362677
7790 362677 404409 413083 383465 477634 433031 414228 518118 589281 693249 711236 739375
7779 739375 746130 825783 846510 818584 945889 1042817 1279029 1498682 1646608 1906833 2130234
7768 2130234 2296972 2225493 1990810 1956354 2002194 2160903 2259544 2385476 2571949 2442584
7758 2442584 2085730 1670978 1438504 1313189 1145800 1122485 1119260 1127170 1005302 934079 782042
7747 782042 778074 735470 718488 736420 665819 630241 580933 516862 556070 491297 468659 475692
7735 475692 482044 503416 392525 503584 464281 484254 554076 533819 555857 594332 518071
7724 518071 502921 573323 601946 596868 631160 546293 634317 651254 705111 654076 730054 746462
7712 746462 802481 957351 971569 951767 1004291 1104390 1135924 1252611 1260695 1287426 1429096
7701 1429096 1563272 1815161 1993203 2285915 2433462 2870439 3435852 4023734 4702468 5067365
7691 5067365 4891136 4327228 3872424 3664023 3759343 3988664 4366844 4852953 4762257 4141290
7681 4141290 3411613 2735545 2266158 1898954 1618689 1464854 1435631 1252553 1094963 1044230
7671 1044230 958646 843171 812444 816387 771297 679930 719768 575990 463396 485539 548857
7660 548857 568210 604388 523385 566095 505806 437072 487812 457207 449334 418473 458461 398123
7648 398123 411677 414964 449886 482296 405062 417623 493289 495259 495592 505057 388531 400921
7636 400921 277035 323750 421255 532694 527297 402759 265271 292320 371385 438568 415360
7625 415360 464066 420889 388696 531915 403415 432012 547162 499230 658583 548623 590243
7614 590243 722647 744062 914769 877496 968862 1133212 1164078 1225293 1349248 1377958 1578882
7603 1578882 1793020 2173625 2619226 3117993 3449692 3500975 3034676 2562946 2167380 1782087
7593 1782087 1467123 1345896 1228723 1064786 970659 875616 844345 791300 825079 773880 763844
7582 763844 783817 710117 696530 703976 699019 652185 683607 617352 592111 585078 697850 764151
7570 764151 864205 949115 889612 817920 929336 1060407 1189608 1271136 1328327 1519313 1740453
7559 1740453 1930606 2245200 2616748 3045132 3521513 3814073 3910226 3528654 2866378 2241783
7549 2241783 1869895 1537690 1400371 1185701 1085172 996986 910088 820558 753062 774969
7539 774969 784918 706587 663031 608777 634267 792375 680122 576412 652975 749112 832226
7528 832226 850398 906907 958808 1108738 1240350 1432655 1439426 1328679 1184886 1005443 796039
7517 796039 681646 621155 437558 518807 452617 412756 504651 416269 358640 353846 350958 420906
7505 420906 424529 395655 460600 425982 432990 255564 300220 465683 412284 346556 390792 440767
7493 440767 358629 422426 395505 476229 564841 597022 526027 585621 627579 663379 871606
7482 871606 1086349 1214809 1328483 1579757 1775184 1921465 1818382 1590669 1410226 1102992
7472 1102992 757304 717438 733164 605607 507626 513774 448074 416803 394405 319070 332941
7461 332941 343553 377357 374976 420504 357291 262605 220662 233927 170581 137020 171679 227741
7449 227741 287542 248649 319902 223201 44823 206066 162049 120711 126522 209295 256634
7438 256634 138306 117452 146838 147737 129591 145037 283627 258029 112929 59643 169530
7427 169530 231404 176580 65969 106168 128205 172921 193091 105013 245701 210739 126663
7416 126663 85488 55727 151239 179013 175183 191046 150176 254790 220237 210649 196190 176494
7404 176494 98238 111006 157087 147301 187900 166954 162934 240722 298010 280576 303855 241826
7392 241826 206808 288027 273287 287061 246244 256263 263343 174702 165733 250083 225171 219056
7380 219056 238156 264488 333186 257999 188650 173877 152178 212930 243778 228907 249334 212053
7368 212053 242192 183858 169464 193577 245139 250942 294509 210419 203783 358892 385775 313288
7356 313288 366126 403869 349885 320202 291648 283755 283975 312647 389087 283548 194511 198990
7344 198990 213854 253261 194649 252924 298600 305869 305259 335807 253820 227108 219270 187047
7332 187047 182340 186599 148396 152694 146589 180762 192344 312535 277180 266387 249852 233529
7320 233529 203580 256144 352452 320188 323439 288427 343829 433189 372055 328922 349192 423314
7308 423314 363864 270052 287171 342938 368617 310522 351640 349999 340747 324475 428368 495520
7296 495520 463287 360073 396266 349224 372247 436828 414755 347799 383953 406977 377085
7285 377085 469314 440539 380154 357997 381354 377094 453146 512179 401018 358231 422794 523461
7273 523461 554735 514764 541691 553955 532772 638935 666835 726823 766055 774830 591525
7262 591525 578164 684569 753076 720296 828829 854351 809664 751217 759743 830226 847322
7251 847322 1005646 989982 1007996 1007748 1007149 1041372 1103811 1081153 1102947 1152780 1131714 1103385
7239 1103385 1059550 1080019 1170627 1195321 1243503 1293850 1281858 1241760 1240297 1241630 1271791 1215309
7227 1215309 1326959 1366864 1279987 1417668 1490344 1514270 1606544 1535203 1583069 1607475 1708119
7216 1708119 1807270 1949918 2066943 2106607 2217127 2395293 2508329 2571094 2652320 2682036
7206 2682036 2767198 2851822 2855417 2820127 2779942 2819806 2759134 2733485 2580949 2458497 2427622
7195 2427622 2250703 2186552 2149279 2138401 2042315 1985305 2032446 2087426 2095015 2102212 2049455 2025544
7183 2025544 2017472 2099079 2059695 2094315 2047390 2022501 2011884 1989202 2010734 2061020 2174728
7172 2174728 2279143 2294146 2279711 2173424 2194369 2262606 2359062 2381436 2412615 2508637 2522766
7161 2522766 2499182 2687493 2787040 2907977 2988246 3097920 3398678 3502551 3856158 4182688
7151 4182688 4437278 4785525 5294681 5774593 5978836 5815417 5450370 5072406 4956101 4944219
7141 4944219 5190508 5454252 5645541 5583442 5101792 4576009 4107929 3788580 3548382 3306674
7131 3306674 2994035 2866422 2840288 2709111 2650026 2599231 2580481 2459161 2389914 2353627 2313218
7120 2313218 2320273 2243210 2118022 2132428 2212811 2287018 2306379 2269882 2338213 2451603 2635555
7109 2635555 2739325 2827624 3095914 3383565 3686511 4042697 4458400 4586306 4269958 3892003
7099 3892003 3560822 3523463 3622517 3793817 3934206 3958649 3710860 3168786 2768950 2392889
7089 2392889 2145005 1966696 1734032 1577058 1500051 1327851 1218000 1244414 1285378 1183712
7079 1183712 1224589 1175566 1116102 1242136 1189507 1233352 1286690 1209362 1113765 1110173 1100229 1176509
7067 1176509 1168013 1020508 943836 1031071 1062032 959542 938693 935521 865648 884804 840109
7056 840109 816069 855502 929790 939276 923889 899244 845773 863078 948656 869152 955150 982456
7044 982456 844663 895203 896466 804430 770595 794491 822952 858730 827974 824232 848476 973213
7032 973213 1037826 957913 918228 925193 957566 937765 971096 976727 923864 940634 1040219 1036614
7020 1036614 1103572 1083100 1028744 1083857 950699 997720 1043157 1120031 1126820 1070988 1107824
7009 1107824 1142860 1066221 1084175 1089628 1138023 1209751 1170929 1308681 1354305 1344789 1272822 1271751
6997 1271751 1361843 1442227 1477475 1538139 1565557 1490220 1521242 1571565 1649920 1637812 1716846
6986 1716846 1683246 1674755 1763276 1850238 1857362 1861361 1918423 2026690 2042725 2046893 2067434 2197071
6974 2197071 2256086 2317461 2393965 2466518 2584850 2654700 2669536 2627775 2758221 2901297 2927646
6963 2927646 3016494 3099580 3126549 3061928 3092940 3174143 3230995 3213260 3257512 3200047 3206148 3217348
6951 3217348 3169019 3168367 3325856 3434501 3240005 3225426 3116671 3048742 3050713 3048695 3064253
6940 3064253 2938105 2889823 2890378 2631174 2544435 2538748 2514549 2363839 2255943 2125885 2208346
6929 2208346 2156324 2071878 2054767 2096610 2060666 2025959 1971570 1895383 1832062 1927866 1830416
6918 1830416 1849166 1782265 1690473 1687202 1680113 1758401 1725010 1640169 1530064 1642789 1651351 1563456
6906 1563456 1468060 1447532 1572280 1556955 1488347 1496344 1472200 1426823 1464674 1546064 1574190
6895 1574190 1498818 1461553 1393740 1402478 1327807 1286276 1397854 1405560 1501760 1413712 1323136 1411220
6883 1411220 1398319 1327677 1275869 1264761 1332881 1416295 1443837 1388143 1386577 1403864 1450150 1438772
6871 1438772 1510343 1607251 1616017 1547094 1517233 1543477 1700226 1668302 1634443 1646268 1666523
6860 1666523 1647440 1719317 1684451 1724325 1656107 1683696 1728931 1754997 1750247 1763780 1912353
6849 1912353 1971076 1884680 1917287 2018530 2019456 2039975 2045372 2128015 2041506 2055915 2132489 2222296
6837 2222296 2341051 2248888 2333839 2298042 2412694 2547422 2578832 2526992 2469366 2645565 2715782
6826 2715782 2677864 2669217 2718709 2729976 2788585 2928429 2972725 3012120 3052419 3111434 3138882
6815 3138882 3177879 3241905 3245326 3215499 3354403 3408875 3500115 3591024 3589755 3699099 3744988
6804 3744988 3905091 3944149 4009843 4190787 4330397 4419469 4615292 4700371 4877896 4955425
6794 4955425 5009060 5185728 5472293 5676364 5840427 5985744 6048625 6235586 6389415 6640229
6784 6640229 6809601 7019376 7044724 7199699 7450012 7648043 8033125 8347958 8592971 8840462
6774 8840462 9196048 9516978 9887038 10192030 10682439 11097265 11699802 12132549 12588263 13186350
6764 13186350 13744325 14438768 15175272 16013314 16982560 18080332 19169635 20329389 21515181
6755 21515181 22849618 24391924 26036359 27759700 29638389 31675117 33656491 35750781
6747 35750781 37733846 39504059 41026814 42167598 42752882 42803041 42299755 41230369 39769077
6738 39769077 37822807 35612221 33322594 31071850 28918299 26753786 24800069 22976555
6730 22976555 21138843 19539624 18104005 16744832 15681104 14606405 13701138 12810192
6722 12810192 11957109 11270268 10601627 9913251 9411282 8919307 8473531 8135148 7834314
6713 7834314 7507120 7093755 6723284 6424537 6135858 5918252 5626610 5346507 5197574 4970076
6703 4970076 4726678 4492242 4431742 4276314 3979364 3884610 3807177 3669171 3566186 3365718
6693 3365718 3314650 3186865 3027192 2903464 2787066 2732783 2626846 2541533 2477590 2470769 2355356
6682 2355356 2156495 2137844 2067947 1977201 2000302 2040453 1909258 1704278 1652533 1791110 1676030
6671 1676030 1633227 1555549 1642592 1541377 1572331 1508376 1354437 1357415 1310850 1275392 1259576
6660 1259576 1275245 1212494 1157230 1126067 1094648 1009381 948224 1041942 1000373 873716 894580
6649 894580 949780 862819 811350 752019 783428 682383 729918 776806 682045 696295 727334
6638 727334 735224 699713 668565 662538 677350 555272 499795 561910 537469 437944 417626 459944
6626 459944 562678 468044 441564 454355 481533 485864 465518 450865 351171 346176 328138 382506
6614 382506 355728 262560 369966 357201 456781 461180 464716 550303 441921 308875 256942
6603 256942 250806 279662 190466 186298 206351 195335 242721 289631 308183 320710 273862 256814
6591 256814 266565 206564 192317 183284 243794 265400 261392 270766 192663 243543 222151 148688
6579 148688 149722 124814 117941 119807 141754 204534 188181 300467 303916 186769 101711 215432
6567 215432 212037 90101 121985 51771 18545 20344 58021 74113 83528 30870 77991 122868
6555 122868 149323 156718 154803 156486 120837 34243 60723 128878 152907 240328 197632 146787
6543 146787 116609 175137 148648 143383 142148 46744 1779 170848 132942 107867 -12506 -55581
6531 -55581 -17844 -38903 36621 -10253 -1808 23726 -16408 -95128 -55476 -40993 -19161 -112960
6519 -112960 -190292 -107658 -130703 -79125 -71604 -70600 -64142 -84593 -121502 -9066 -135983 -139009
6507 -139009 -83532 -71341 -48277 -84048 -25714 -78103 -80478 -109102 -191275 -90807 -31016 -107555
6495 -107555 -114328 -77782 -36620 36303 3416 -58341 -120153 -199572 -63553 -96607 -122137 -144202
6483 -144202 -107958 -50315 -52523 -107028 -159113 -240964 -270387 -197079 -238954 -183106 -179760 -160771
6471 -160771 -119662 -156456 -144631 1637 78691 -75491 -123235 -177865 -140803 -119176 -135777
6460 -135777 -230972 -111610 -154928 -90433 -36577 -110171 -134681 -95299 -112108 -205166 -196559 -143266
6448 -143266 -152111 -95906 -102809 -214209 -194930 -141556 -164061 -292705 -190202 -87617 -108068
6437 -108068 -125598 -156568 -100227 -103707 -151635 -39263 52947 -92159 -98158 -138373 -148071 -185766
6425 -185766 -176451 -206593 -339411 -229472 -111384 -142491 -207390 -218928 -121846 -96907 -153830
6414 -153830 -266648 -173468 -78380 -84852 -146844 -142072 -76126 -83571 -170878 -134673 -183307 -80416
6402 -80416 -33669 -90648 -108764 -63281 -67149 -133095 -138965 -130888 -91280 -215647 -199972 -252795
6390 -252795 -158473 -215101 -231117 -148145 -144747 -138588 -197471 -256956 -315438 -245985 -215884 -195050
6378 -195050 -107845 -142672 -120980 -125287 -110104 -173687 -125324 -132633 -111742 -168649 -125240 -45542
6366 -45542 -92388 -95278 -52941 -72520 -108744 -105989 -39154 -65031 -62708 -83906 -45349 11112
6354 11112 56676 -33660 -5914 14883 98222 154692 138563 93548 170450 227893 209091 275947
6342 275947 363318 421879 413557 306038 198034 159689 39722 56138 6769 -45869 -701
6331 -701 -44035 -51558 -132697 -77456 -125253 -103120 -56441 -66492 -147003 -101878 -66356 -41411
6319 -41411 -44610 -64318 -63184 -65078 -39721 -110403 -82295 -177002 -176751 -45876 -115827 -136607 -65585
6306 -65585 -129204 -163698 -158699 -67714 -114247 -154887 -184480 -284408 -377530 -268791 -129887 -74688
6294 -74688 -153940 -88732 -200741 -206641 -230091 -201585 -204859 -256307 -175759 -49357 -74603 -73925
6282 -73925 -152284 -127865 -200155 -244327 -115060 -56485 -67884 -127774 -159183 -163009 -142004 -149139
6270 -149139 -178531 -253649 -272940 -217851 -135953 -119907 -109820 -114833 -121127 -232770 -258570 -209152
6258 -209152 -259701 -188802 -208195 -179363 -118379 -208295 -277209 -330901 -280646 -276300 -191746 -190454
6246 -190454 -125850 -68091 -133578 -228489 -256018 -232946 -197657 -148958 -117416 -103618 -87584 -21631
6234 -21631 -89634 -96712 -13352 -35399 -42567 -80462 -149453 -229010 -289985 -253235 -250251 -187278
6222 -187278 -206296 -174749 -234671 -213265 -239614 -198789 -238044 -224957 -240687 -222256 -249267 -236454
6210 -236454 -180944 -175693 -230606 -276606 -181806 -84937 -101060 -215876 -243850 -223315 -153387 -153632
6198 -153632 -163946 -263515 -235896 -131459 -109175 -130901 -159661 -182328 -191433 -216283 -162987 -165602
6186 -165602 -96614 -202185 -202318 -208520 -185205 -95233 -153367 -220462 -176947 -160517 -120337 -132599
6174 -132599 -200952 -181223 -130241 -75891 -93126 -111649 -108889 -172989 -215963 -213964 -147811 -112452
6162 -112452 -141864 -105657 -146923 -197714 -258524 -282454 -226844 -291645 -338754 -320244 -154848
6151 -154848 -177527 -218726 -219201 -168984 -46512 -14081 -67153 -150878 -129716 -78671 -137380 -178424
6139 -178424 -195616 -211614 -202791 -248724 -139431 -137652 -144387 -161803 -215148 -124142 -135564 -56934
6127 -56934 -99733 -58866 -46790 -71539 -112497 -143663 -172061 -69562 -57059 -140635 -134596 -144148
6115 -144148 -92990 -9352 16078 -60643 -128912 -92304 -70593 -107090 -139999 -98689 32214
6104 32214 -2432 -105648 -144927 -29731 -16832 -66704 -13743 -6543 18827 6003 -22593 -51243
6092 -51243 -19212 -11255 -23186 82940 106278 142582 204184 238372 303834 394918 321366 352046
6080 352046 363158 312726 193642 282538 269765 226072 162200 176256 217816 224325 224345 211981
6068 211981 151498 100858 114284 171938 184343 221156 269343 261363 246794 245353 194313 320287
6056 320287 420067 323939 209013 191063 278411 242073 192339 158404 166163 225633 316497 211336
6044 211336 225802 305621 342104 401097 374931 264445 282446 306789 274714 237790 245815 271737
6032 271737 263220 254792 253186 362421 352214 344593 387517 406409 361709 353165 414327 271833
6020 271833 290540 271024 306632 322848 232029 292574 234195 262578 256337 266133 254236 177290
6008 177290 192679 149928 199241 245802 252491 239512 261720 184624 64580 118219 160941 123453
5996 123453 94053 103990 60847 12200 29038 31373 12328 -2716 108984 61761 2464 66257
5984 66257 112331 113764 37362 8099 -29463 2407 -45755 62892 20175 64945 48065 -39020
5972 -39020 -1757 -25135 8540 -42368 47591 -33579 50520 47356 3835 42699 9719 94610
5960 94610 79877 33687 60222 73137 18064 22900 -37496 -22680 -30840 -103388 -48029 71643
5948 71643 47839 -789 -33069 -31604 18518 15868 -42513 -42945 -56063 44852 -39155 -109083
5936 -109083 -48562 -84118 -98224 -14793 -86293 -56064 16710 -15830 5474 -70342 -8947 52190
5924 52190 130030 64591 38655 67867 -24852 -107392 -128042 -116041 -53754 -102806 -86552 -64174
5912 -64174 -21787 -51337 -77380 -120146 -95023 72031 90216 41238 -82554 -100329 21007
5901 21007 -18492 -65897 17074 -14715 43663 152338 115883 53818 34296 65244 -41379
5890 -41379 5014 -10773 -33522 -10118 45056 85515 33982 30874 -12378 -56797 -48619 -43281
5878 -43281 -49236 -66682 -107118 -76398 -43490 -108115 -28333 12200 -38592 27284 53642 34995
5866 34995 10620 -9092 -23822 -20483 18931 48361 83653 56256 147730 152423 143145 133279 131686
5853 131686 149989 59221 51256 194298 155057 80813 79323 63048 63326 153868 113868 71712
5841 71712 166279 166223 122264 -13498 -2667 191369 208765 141529 99801 189603 177383 165725
5829 165725 194399 169895 172893 106802 229374 140761 6157 122761 106431 87174 45437
5818 45437 80341 231150 174214 168465 65815 121168 116224 189194 172110 125540 109292 -22652
5806 -22652 -7225 112897 115990 131732 130697 152966 155796 154578 178919 80634 -14344 -6190 61867
5793 61867 145998 130759 92514 -28165 54345 38342 12176 88188 103450 -1018 36800
5782 36800 103095 123741 71949 120286 121120 110105 154016 236977 198730 171464 128843 26644
5770 26644 12559 118319 140621 54738 3729 -47380 35793 53656 -11298 -77371 -75053 69296
5758 69296 41432 -59958 -3695 35586 55452 -32008 -110449 76099 78799 46255 31591 40531
5746 40531 3239 -42614 118582 94082 87403 56081 89417 13388 76344 71981 48917 109198
5734 109198 117177 -18242 77267 130560 177779 87942 61437 130153 147678 63557 32666 -4737
5722 -4737 5957 37143 -97671 -119860 -7952 -10498 51003 13225 -33223 -32351 56278 10353
5710 10353 -18431 -14694 -92 -34847 -13947 65000 77987 67667 139234 157675 187109 148363
5698 148363 17764 28243 162028 132042 56385 135945 33320 49467 77891 48926 9603
5687 9603 31996 44557 77343 94595 120524 138368 68845 88323 111132 156954 130239 115531
5675 115531 149946 143838 105719 129531 153879 114476 149689 103236 156364 209024 251594 263197
5663 263197 293873 372009 309973 238928 167461 94120 144473 143441 67628 -14367 -55031 -43418
5651 -43418 100841 158822 99099 129428 147718 66469 81167 117872 223350 139447 150582
5640 150582 186923 189568 140131 88793 68099 112171 175694 133506 72643 -20514 -39261 -102801
5628 -102801 -16615 76545 70443 80318 92967 66650 95244 115930 110390 180408 143056 146600
5616 146600 143988 137421 161395 148469 170813 228931 255429 191534 190791 186909 143497 84316 111005
5603 111005 139895 76433 136606 144070 82786 58195 73607 85879 71772 102742 193510 285885
5591 285885 250000 207925 400860 485830 437445 389424 311774 276174 271106 271461 408302 569028
5579 569028 521794 410096 485355 348971 271569 268394 158457 287168 304684 267228 330555
5568 330555 295660 280538 250280 248015 319099 317772 283779 301373 250413 334250 397045 419545
5556 419545 418526 280292 261412 286160 290911 316718 273345 280247 280731 215301 304095 313802 275291
5543 275291 345800 334072 386628 388203 349542 373528 370284 295706 312798 395772 418082 418804
5531 418804 409804 322723 270651 278830 361687 414671 312161 356982 379207 462296 420477 415916
5519 415916 419745 369586 306656 298948 213971 229384 294791 272253 336452 394245 524232 611479
5507 611479 493279 532222 438277 405937 355390 415007 482161 511031 494369 481582 533957
5496 533957 558605 625388 595902 567815 639120 709471 795881 746511 636402 650970 638373
5485 638373 659083 678518 791626 751601 685090 760836 737243 748629 822419 876525 975670
5474 975670 966996 1020183 986801 958390 981755 1056440 1078352 1027541 1159193 1225716 1177415 1241319
5462 1241319 1310724 1277927 1176249 1179602 1217576 1181966 1213515 1188632 1194464 1222575 1296349 1302927
5450 1302927 1217219 1191166 1347760 1389022 1328039 1315253 1309637 1323402 1281866 1282899 1347423 1421905
5438 1421905 1385770 1302177 1274532 1464502 1487207 1435365 1610138 1681120 1739502 1837534 1800391
5427 1800391 1640314 1571167 1476538 1614017 1619424 1520388 1578906 1518791 1470849 1528816 1528786 1468499
5415 1468499 1472388 1471099 1428865 1417241 1419944 1408091 1414333 1415126 1491061 1487333 1546093 1552917 1541300
5402 1541300 1602856 1677537 1656769 1733002 1810040 1784896 1775101 1795220 1684294 1760930 1705179
5391 1705179 1643476 1657846 1660694 1698752 1647318 1574212 1537190 1606396 1577933 1419824 1447593
5380 1447593 1357479 1388799 1430818 1337535 1447485 1471333 1413486 1414902 1459622 1497677 1485212
5369 1485212 1425540 1393557 1464132 1355057 1480135 1561073 1585466 1709741 1674655 1683120 1579207
5358 1579207 1609492 1578784 1490404 1328093 1335778 1374406 1396311 1422075 1482211 1585640 1631782
5347 1631782 1565532 1505509 1470088 1490033 1433063 1435922 1376763 1385218 1407919 1232767 1165350 1263809
5335 1263809 1365799 1398196 1360669 1254965 1176404 1046237 1017209 1077930 1121483 1024332 928268
5324 928268 1000506 1175224 1107288 1091208 1065308 952693 965141 946548 929036 978478 988931
5313 988931 972661 936599 898293 988446 908298 868751 833124 883344 899863 796213 824100
5302 824100 805890 698697 688070 718592 676730 889425 975004 877022 945061 967067 903404
5291 903404 838270 863910 840546 801851 909566 864786 817625 808483 882870 899403 771933
5280 771933 805938 765416 694105 795831 780659 754465 739499 750235 815110 887495 916427
5269 916427 1030382 984190 918927 1082907 1028880 1001579 1045293 996918 972263 917673 930514
5258 930514 993906 1006903 1002378 905667 919455 906338 778452 819302 778600 703056 835285
5247 835285 910094 908911 776767 810020 833749 879806 956526 1077205 1236872 1251131 1234972
5236 1234972 1220930 1032377 927340 844920 809599 826304 869985 772339 758357 861763 864934
5225 864934 916817 911558 843726 784936 825034 737706 661852 668824 673768 649465 613145 619962
5213 619962 542377 612332 777202 756705 748965 797698 778818 802762 732694 777450 743272 688903
5201 688903 654117 533092 540933 602687 600605 542533 448946 494338 582910 540693 555796 525674
5189 525674 511474 527707 488157 594147 543079 446289 500382 463540 405572 445109 517499
5178 517499 527243 614928 657408 530385 468466 498194 505970 478840 413707 497136 467491 498137
5166 498137 452091 426707 434346 472579 482122 466844 495480 567768 564478 603995 622579 710462
5154 710462 745053 746288 678535 651383 746658 684191 644452 672297 636982 641919 647484 651721
5142 651721 662318 557822 501893 614857 703257 698871 809822 725316 615356 631489 578826
5131 578826 595110 579622 617474 645257 722937 674350 695289 651580 646871 722320 837262 793293
5119 793293 800564 812301 941407 904071 846868 844640 706101 734492 725359 762874 716921 692681
5107 692681 761296 837590 745241 764517 796906 830699 866177 850391 777625 835734 948967
5096 948967 945932 904764 932916 969025 902842 952052 1012595 1037536 1023819 992823 1051201 1064238
5084 1064238 1110565 1092535 1210510 1132273 1045063 1181271 1183790 1147921 1130553 1104276 1170461
5073 1170461 1268161 1409370 1454453 1579132 1660016 1690464 1701658 1684448 1620163 1592763 1588927
5062 1588927 1479443 1316277 1300692 1230409 1147633 1151465 1073835 1178107 1209746 1117484 1146450
5051 1146450 1037661 954617 1088775 1101406 1077442 992680 863065 848259 855957 909706 939011
5040 939011 923990 918163 1058305 1009329 1025687 1042556 1046700 1078407 1030663 961431 1007719 1005257
5028 1005257 1003555 925912 880658 942564 1012090 954977 987184 1031170 1051405 1134165 966127
5017 966127 957171 972423 1044415 1120928 1141996 1094839 1195601 1107949 1071237 1010169 965582 1105344
5005 1105344 1097068 1052970 1011278 1059259 1162468 1135615 1093386 1136905 1073115 1030876 1030868 1067093
4993 1067093 1169938 1102326 961898 952069 933635 903590 907692 949986 920498 984173 1080904
4982 1080904 1093343 1117169 1123035 1066872 1072294 1089216 997353 1073529 1127748 961990 981204 1117504
4970 1117504 1194315 1154522 1155052 1189980 1068414 1064786 1114690 1138699 1208261 1161656 1146843 1163088
4958 1163088 1139231 1193117 1196247 1171546 1113311 1168168 1252210 1391110 1334253 1365945 1333084
4947 1333084 1290080 1314211 1432212 1357743 1268554 1252951 1291320 1334617 1173778 1173360 1236893
4936 1236893 1379123 1416873 1431009 1367843 1395611 1487618 1483695 1509815 1514183 1547404 1535781 1508570
4924 1508570 1563261 1565270 1574780 1635779 1658591 1680629 1729058 1721174 1643992 1611124 1579976 1700827
4912 1700827 1723349 1743967 1800033 1797814 1831201 1882550 2035966 2116456 2211317 2246275 2266717
4901 2266717 2421049 2667579 2856625 2815892 2885209 2874161 2674900 2535288 2436745 2338126
4891 2338126 2399391 2359406 2331724 2454194 2521225 2519453 2588868 2549418 2468735 2470807 2556620 2555771
4879 2555771 2649126 2672672 2686705 2767785 2824136 2859834 2928064 3078162 3001731 3048198 3192278
4868 3192278 3214047 3126795 2895335 2758391 2859084 2963558 3089014 2991897 2946882 3084911
4858 3084911 3185060 3170423 3167284 3111336 3125800 3114886 3133103 3156545 3150752 3172537 3166529 3089424
4846 3089424 3039958 2987932 3007007 2938723 2886172 2928408 2866494 2839492 2909800 2948707 2957118 2987271
4834 2987271 3187144 3231526 3297289 3363425 3559957 3777092 3936154 4170470 4412577 4535779
4824 4535779 4317927 4104615 3934885 3780578 3760061 3656144 3599852 3508306 3400907 3509317
4814 3509317 3589375 3606524 3532863 3618967 3688148 3674843 3691648 3621189 3559006 3587060 3563119
4803 3563119 3426626 3467085 3386033 3289604 3248699 3204527 3186016 3084809 3044080 3119934 3159806
4792 3159806 3152871 3136863 3077373 3144709 3228646 3297706 3275836 3232879 3342963 3495703 3598633
4781 3598633 3625542 3719185 3722244 3749912 3920079 3893301 3832362 3962213 4023541 4182519 4318755
4770 4318755 4505571 4783059 4939336 5104029 5411768 5745923 6246481 6827161 7425276 8107008
4760 8107008 8972718 10036653 11484705 13521207 16055540 19084590 21722907 22773593
4752 22773593 22017505 19450881 15943466 12875184 10462965 8794509 7607311 6761677
4744 6761677 6202216 5673673 5291831 5043572 4769581 4539595 4261989 4127537 4018713 3964943
4734 3964943 3828943 3687909 3600344 3779995 3852197 3990538 4063682 4078797 3993965 3825051
4724 3825051 3688806 3712213 3662624 3539694 3537611 3538033 3480163 3534865 3675796 3751866 3641834
4713 3641834 3651542 3753249 3760242 3797795 3775755 3728382 3805108 3916971 4028482 4077106 4114588
4702 4114588 4259124 4483426 4630747 4861140 5155487 5596381 5951439 6380158 7004609 7796571
4692 7796571 8687656 9852965 11461529 13517775 16083204 18792182 20749396 21020069 20211109
4683 20211109 18441383 15578696 12534401 10273299 8636880 7523188 6696160 6040689
4675 6040689 5556476 5193342 4988870 4820724 4736337 4766641 4921792 5152704 5251972 5130866
4665 5130866 4632951 4232746 3733247 3452539 3211644 3009233 3016447 2992900 2903867 2748357
4655 2748357 2642692 2551013 2475289 2477430 2406158 2250289 2153352 2185016 2229370 2147014 2077851
4644 2077851 2038118 2080623 2072840 2085781 1912038 1884812 1983916 2004916 1955991 1866459 1889722
4633 1889722 1866333 1875741 1835778 1736216 1709070 1854625 1827881 1874422 1831736 1841147 1746403 1699969
4621 1699969 1633183 1731418 1784909 1846039 1798250 1852046 1863477 1824415 1791608 1753383 1789211
4610 1789211 1726799 1756396 1813732 1838192 1860977 1871640 1876866 1927159 1867190 2000424 1932676
4599 1932676 1839235 1803640 1861297 1973531 1980019 1965284 1979658 2102859 2033536 2095032 2105948
4588 2105948 2245343 2246584 2195937 2193943 2160203 2267956 2325352 2465818 2485292 2418521 2464079
4577 2464079 2442189 2493099 2576437 2565061 2593243 2640549 2783486 2824001 2825761 2856847 2942215
4566 2942215 2928792 3001431 3103895 3269555 3250921 3383688 3552290 3662334 3737092 3940774
4556 3940774 3912130 3981255 4174390 4422386 4607102 4802194 4812711 4942041 4991423 4850949
4546 4850949 4725615 4524995 4393255 4118527 3825348 3684853 3530428 3407433 3297743 3182682
4536 3182682 3080098 3001035 2992055 2868721 2803920 2748935 2750354 2761752 2832819 2773140 2646937
4525 2646937 2527174 2487079 2639235 2805683 2757965 2650549 2627945 2709781 2665339 2663216 2740522
4514 2740522 2689047 2726605 2745409 2795652 2750162 2808022 2831631 2735694 2769296 2790952 2865997
4503 2865997 2953490 3035626 3025319 3032824 3090542 3082930 3181786 3204353 3213892 3344560 3402491 3476205
4491 3476205 3302391 3430513 3579622 3567365 3684201 3768630 3814406 3801988 3919657 3979879
4481 3979879 4091552 4246466 4413252 4450125 4516653 4604411 4507615 4620068 4847701 4909265
4471 4909265 4897219 4919969 4933054 4971507 4975307 4883592 4821944 4730024 4592085 4585686 4639898 4712874
4459 4712874 4784084 4808879 4795169 4893935 4897189 4968015 5070367 5161783 5265300 5339446 5277092
4448 5277092 5239469 5369664 5413937 5473914 5441521 5448746 5484307 5462663 5623653 5904992 5960419
4437 5960419 6085158 6325445 6414621 6526216 6553956 6506743 6406148 6441307 6422955 6302811
4427 6302811 6258456 6182541 6104015 6065570 5957846 5992068 6017854 5968403 5866793 5709263 5743535
4416 5743535 5788732 5819492 5895139 6006279 6036866 6056500 6113215 6224033 6315864 6368356 6447689
4405 6447689 6446210 6473034 6456292 6510756 6688826 6822017 6976827 7005229 7075540 7263990 7338408
4394 7338408 7475571 7564946 7491477 7272145 6941316 6561862 6275133 6000374 5714289 5575452
4384 5575452 5503464 5421978 5311315 5179183 4996870 4865466 4860005 4830829 4849359 4936552 4973903
4373 4973903 4937598 4941322 4949168 5058952 5124531 4973795 4996098 5012349 5015571 4971894 5024960 5048886
4361 5048886 5173324 5243813 5234586 5270203 5510019 5608937 5564270 5631660 5685937 5677244 5617512
4350 5617512 5631669 5644782 5654679 5646062 5568777 5545780 5628780 5661658 5783344 5851336 5994049
4339 5994049 5996998 6030916 6183794 6463164 6684796 6677765 6543296 6669245 6841000 7015084
4329 7015084 7109021 7346353 7416929 7480847 7659026 7740216 7865999 7851914 7968815 8022408 8088998
4318 8088998 8052565 8036169 7988173 8012075 8079693 8162885 8271357 8247630 8270296 8377916 8311803
4307 8311803 8361139 8334005 8249228 8256490 8156205 8239298 8236499 8121793 8067222 8046978 8000748
4296 8000748 8014589 7986249 8001670 8188682 8257286 8320378 8353092 8409519 8464688 8652750 8669193
4285 8669193 8649072 8603576 8601254 8743742 8760290 8919960 9035816 8862697 8858155 8831219 8812213
4274 8812213 8892408 8882283 8748321 8669981 8634400 8601321 8648445 8516685 8354404 8257033 8248902
4263 8248902 8261714 8254098 8142422 8125082 8185838 8169057 8203845 8256768 8454939 8651167 8745286
4252 8745286 8828866 8946753 8936681 8855222 8746230 8742310 8801349 8929599 9052733 9030274 9008496
4241 9008496 9033759 9108977 9098752 9105407 9041646 9073136 9094614 8982785 8993879 9011413 8947134
4230 8947134 8849473 8984399 8965002 8930400 9051006 9176799 9310759 9319693 9366862 9458697 9532799
4219 9532799 9721194 9860691 9873934 10080936 10057774 9995875 10048576 9972307 9886831 9875869 9875130
4208 9875130 9932680 9892879 9903663 9951729 9938814 9899861 9985468 10008222 10015785 9955316 10027280 10311341
4196 10311341 10477458 10420831 10547751 10707160 10789407 10826650 10768331 10792451 10884344 10852878 10858295
4185 10858295 10890325 10947404 11021810 11141442 11275364 11333517 11397157 11369115 11415469 11482520 11590127
4174 11590127 11739226 11847822 11954821 12046576 12175713 12292985 12456997 12582218 12622414 12773934
4164 12773934 12781729 12848813 12968142 13057406 13251072 13375912 13350449 13498334 13696732 13859872
4154 13859872 14148594 14457383 14758280 15015195 15242704 15409023 15539853 15645933 15776736
4145 15776736 15938088 16082973 16219373 16107898 15949023 15896666 15920714 15902252 16029656 16259165
4135 16259165 16390747 16588405 16866355 17071267 17158434 17341358 17586612 17765795 17931783 18115515
4125 18115515 18377461 18641997 18904224 19160307 19427982 19622051 19943486 20274905 20714351
4116 20714351 21267211 21882292 22455818 22800923 23158682 23183578 23071362 22951996 23046076 23184587
4106 23184587 23479957 23821828 23947012 24407519 24930627 25426398 26067722 26638448 27227130
4097 27227130 27846810 28535051 29095258 29419978 29886663 30161635 30332623 30582442 30907188
4088 30907188 31327633 31556341 31776171 32207770 32515854 32700695 32874971 33105813 33471736
4079 33471736 33673455 33693909 33536270 33516229 33633723 33665254 33868242 34192229 34793391 35376108
4069 35376108 36130029 37072585 38240097 39716841 41500716 43636750 46436191 49745930
4061 49745930 53096615 55922479 57083646 56619897 55513366 54725261 54697116 55527136 56741195
4052 56741195 57513256 56796829 54848145 52972955 51449688 50602511 50226018 50248176 50571905
4043 50571905 51178092 51820614 52478706 53297901 54034042 54965334 55905677 57116379 58619742
4034 58619742 60478629 62535799 64877823 67227728 69806623 72823904 76147693 79573459
4026 79573459 83540872 88360728 94050922 100944262 109627066 120560625 134210903 150019405
4018 150019405 165203740 175121942 173076211 159712923 142524483 126885491 114794880
4011 114794880 105895587 99236196 94261475 90642388 88204699 86383130 85234561 84552868
4003 84552868 84112222 83862723 83775552 83879495 83954870 83896029 83715937 83370131 83204019 83290507
3993 83290507 83523551 84008109 84835665 85967892 87119552 88483860 89845568 91114526 92226349
3984 92226349 93113007 93944229 94816944 95731904 96693481 97732874 98879488 99783980 100477881
3975 100477881 100820451 101014687 101252314 101527036 102060119 102866778 103862238 105232042 106932768
3966 106932768 108964020 111155905 113775617 116667090 119682231 122963955 126154422 129236982
3958 129236982 132176986 134799701 137166565 139323713 141328034 143133852 144627481 146069504
3950 146069504 147372260 148721044 150310324 152009130 154028066 156510235 159168242 162157349
3942 162157349 165481193 169036706 172761120 176396532 179959632 182967565 185004524 185934274
3934 185934274 185688953 184429291 182431327 179920517 177224862 174511948 171934056 169456973
3926 169456973 167105802 165011534 163039891 160829445 158638434 156411953 153936352 151402863
3918 151402863 148736772 146149857 143711918 141498729 139479582 137886708 136564261 135518730
3910 135518730 134537090 133665136 132801844 131607426 130080289 128014415 125620476 122982538
3902 122982538 120480600 117979620 115522722 113321154 111053490 108849156 106618499 104433777
3894 104433777 102413465 100581692 98888768 97492885 96359569 95297446 94356464 93699785
3886 93699785 92944762 91975634 90730231 89329042 87874440 86653114 85653715 84849606 84357759
3877 84357759 83798609 83284825 82912082 82439804 82104692 81861860 81651438 81345557 81123323
3868 81123323 81028527 80943552 80904658 80896109 80949616 80902793 80921182 80929004 80898659 80892050 80950540 81139394
3856 81139394 81610357 82150148 82811803 83680696 84660726 85819213 87194602 88741730 90501253
3847 90501253 92444407 94462708 96418481 98394197 100150170 101560665 102871420 104191577
3839 104191577 105662339 107454236 109724223 112479245 115880651 119917788 124796698 130560116
3831 130560116 137273411 145041962 153911781 164027430 175628001 188826044 203441397
3824 203441397 219455075 236335301 253564978 269990154 284213334 295000586 301404941
3817 301404941 303463007 301956203 297974186 292533326 286953929 281666341 277213183 273535946
3809 273535946 270455151 267714654 264578058 260954995 255955777 249096607 240067595 228716013
3801 228716013 215506599 201035157 186108337 171563212 157892502 145469447 134509449
3794 134509449 124902746 116521268 109317608 103045774 97592419 92938638 89071173 85592098
3786 85592098 82622158 80244916 78366932 76903127 75815773 75024574 74382542 73777901 73058615
3777 73058615 72077541 70688734 68885989 66768541 64476892 62091311 59717737 57515326
3769 57515326 55434736 53495580 51706553 50070737 48724413 47565872 46429933 45540806
3761 45540806 44709591 43984132 43438247 42871643 42515029 42295246 42122088 41979501 42019908 42272963
3751 42272963 42604507 43028441 43418508 43806972 44214051 44479265 44603585 44596707 44303074 44095961
3741 44095961 44071227 43854351 43773147 43657913 43136751 42149569 40859605 39358804 37786328
3732 37786328 36227294 35010122 34011546 32993944 32318728 31840864 31395123 30911864 30742064
3723 30742064 30649903 30437430 30340851 30306270 30440992 30546067 30955310 31329526 31647372 31866396
3713 31866396 32053675 32122720 32188111 32227643 32266850 32412429 32667744 32879651 33021200 32898152
3703 32898152 32531528 32037399 31471696 30807508 30235193 29687837 29182838 28933427 28695369
3694 28695369 28638591 28638177 28674172 28783200 29019534 29216685 29450147 29797282 30191353 30605896
3684 30605896 31007606 31248347 31315408 31369346 31525895 31538128 31539139 31663278 32013406 32336463
3674 32336463 32864642 33339940 33943465 34653719 35205378 35435068 35463426 35336617 35109232 34847700
3664 34847700 34730849 34671955 34716564 34969092 35167450 35387833 35739618 36141650 36473128 36813156
3654 36813156 37299954 37853561 38378333 39018526 39659193 40366295 41207466 42099741 43101646
3645 43101646 44115705 45272283 46486841 47659066 48973639 50429048 51844970 53409876
3637 53409876 55084795 56751742 58641391 60724630 63056672 65457785 67836167 70052460
3629 70052460 72280685 74267994 76337494 78653658 81194473 83857523 86740816 89678155
3621 89678155 92739154 95954324 98941290 101831707 104508714 106864657 108851283 110574717
3613 110574717 112307568 114047524 115857003 117734626 119648901 121773532 124062674 126099367
3605 126099367 128306104 130659703 133036794 135362205 137816041 140492698 143534007 147099273
3597 147099273 151311907 156203574 161793019 168064061 175220406 183079885 191529573 200334659
3589 200334659 209328995 217671620 224756558 230353709 234396757 237283891 239642406 242044878
3581 242044878 244929629 248751702 253297198 258788032 264715803 270459896 275307968 278514253
3573 278514253 279372893 277455068 272627994 265423590 256390272 246294041 236014878 226199463
3565 226199463 217144990 209023984 201761034 195253699 189276399 183287197 176800390 169658483
3557 169658483 161323749 152038855 142112428 132041177 122308576 113244005 104954984 97715263
3549 97715263 91273122 85590844 80550143 76101733 72168995 68686127 65448075 62616703
3541 62616703 60191098 57846306 55688492 53612630 51773219 49973654 48304324 46773348
3533 46773348 45305373 44085680 42784021 41625235 40597204 39408586 38299084 37261481
3525 37261481 36346960 35372095 34444865 33599268 32776780 31823667 30932036 30136103 29298209
3516 29298209 28665915 27936196 27157311 26482506 25821957 25045347 24400321 23816452 23237575
3507 23237575 22677888 22064113 21663595 21176858 20677143 20195313 19741197 19306218 18900365
3498 18900365 18485228 18076183 17764236 17493629 17112574 16860465 16630309 16284236 15966753
3489 15966753 15612620 15314729 15185513 14921375 14677533 14531672 14365269 14116475 13812003
3480 13812003 13605775 13404366 13198427 13011764 12721177 12577757 12453664 12307767 12153437
3471 12153437 12048342 11899393 11744601 11603928 11483993 11471103 11375279 11195476 11098763 10985152
3461 10985152 10824371 10654859 10572545 10481058 10387555 10241338 10186428 10083963 9870777 9788236
3451 9788236 9552224 9553874 9566080 9401194 9311683 9295453 9167763 8939080 8874962 8761539 8602408
3440 8602408 8511904 8374069 8320443 8272783 8180242 8122938 8007537 7919002 7885947 7861373 7757422
3429 7757422 7623591 7577709 7522496 7520756 7354005 7237959 7279910 7205495 7162753 7178244 7199463
3418 7199463 7161654 7253448 7168737 7193083 7148661 7107074 7193104 7158486 7066571 7088308 7186696
3407 7186696 7171878 7245743 7206550 7180983 7253829 7331801 7292195 7485071 7571845 7599350 7626924
3396 7626924 7771969 7825829 7897245 8138652 8347920 8626092 8844566 9246223 9760768 10342945
3386 10342945 11167916 12353401 13800013 15403519 16576691 16069764 14381814 12591141
3378 12591141 11114786 9986373 9266894 8760761 8339277 7983527 7763940 7607092 7375065
3369 7375065 7231858 7212336 7175609 7007259 6848449 6855685 6842409 6716523 6722023 6765009 6737546
3358 6737546 6780018 6903240 6882577 6959282 6946983 7043057 7039385 7053681 7105113 7169813 7259924
3347 7259924 7248882 7401046 7534431 7660568 7739254 7927102 7976069 7980976 7986365 8118160 8284727
3336 8284727 8462851 8729436 8787951 8765704 8832376 9006179 9192830 9403688 9417698 9520095
3326 9520095 9783140 10010131 10228179 10414923 10567292 10680405 10939439 11171745 11447418 11638608
3316 11638608 11840389 11995693 12274513 12490159 12726492 12869809 12984754 13077089 13177735 13401412
3306 13401412 13487061 13711645 13860678 14070983 14239259 14451925 14623805 14923992 15137615 15443956
3296 15443956 15884651 16264298 16654763 17161627 17655073 18169785 18715921 19279963 19865139
3287 19865139 20340908 20831786 21241092 21627630 22125140 22596302 22976982 23429970 23996242
3278 23996242 24523961 24926702 25292829 25631704 26013347 26373786 26775696 27267744 27864186
3269 27864186 28579438 29197711 29846109 30715617 31714319 32679290 33719363 34807463 35691530
3260 35691530 36589168 37529042 38277589 39272887 40360121 41511073 42840579 44281599 45983831
3251 45983831 48010942 50375423 53005336 56086874 59559850 63074376 66576743 69983546
3243 69983546 73241848 76327275 78820208 80556110 81292770 81126144 80261983 78783108 76961071
3234 76961071 74920516 73050334 71399282 69955689 68547610 66989241 64956396 62138727
3226 62138727 58760248 55176504 51593044 48278318 45195278 42303785 39729321 37329941
3218 37329941 35117253 33123622 31281520 29499916 27969901 26436379 25036155 23751578
3210 23751578 22599005 21606281 20673803 19784049 19000765 18318130 17699671 17216845 16757045
3201 16757045 16227301 15578678 15075595 14598724 14061108 13513447 13107612 12749015 12417594
3192 12417594 12155455 11719243 11404619 11134176 10920158 10553219 10219176 9924396 9636712
3183 9636712 9316117 9076917 8758025 8450533 8320595 8112565 7941772 7712981 7499281 7351943
3173 7351943 7199468 7088184 6979073 6840188 6607871 6432744 6262781 6134029 6065912 5889903
3163 5889903 5734491 5566221 5487124 5354934 5298802 5203543 5085652 5047597 5047498 4974234 4704084
3152 4704084 4616022 4662451 4514222 4408770 4375993 4263854 4167232 4183855 4183105 4080684 3944446
3141 3944446 3949222 3831821 3791849 3799200 3714751 3719977 3731517 3558368 3615053 3576362 3586108 3495596
3129 3495596 3425945 3367080 3375157 3342878 3296088 3284989 3305424 3271887 3133975 3195394 3129347
3118 3129347 3174289 3048159 3014606 2956108 2938185 2979622 2991158 2954440 2891648 2897536 2921422
3107 2921422 2830504 2838766 2687093 2743383 2814073 2749506 2707144 2718168 2714573 2761823 2731189 2649176
3095 2649176 2647570 2664506 2662529 2627007 2612516 2677416 2613150 2610535 2682838 2616305 2589944 2607792
3083 2607792 2626920 2535819 2448981 2514587 2491884 2459679 2480612 2487365 2451758 2330442 2290894
3072 2290894 2333724 2363955 2266398 2270727 2305930 2284141 2144374 2137048 2222866 2227200 2234693 2334753
3060 2334753 2267549 2180754 2259874 2337638 2338801 2360876 2359246 2350926 2328768 2393008 2432882 2431025
3048 2431025 2417779 2323852 2216015 2245290 2443998 2527345 2372806 2271506 2306816 2321199 2294871
3037 2294871 2319094 2334781 2345148 2286999 2244192 2274749 2347005 2303247 2291504 2354439 2463539
3026 2463539 2395653 2325743 2414899 2336356 2308840 2416294 2512779 2554489 2550760 2545753 2642565 2674852
3014 2674852 2545636 2494288 2559180 2554330 2594965 2616378 2575685 2675901 2748712 2814851 2941025
3003 2941025 2962761 3017312 3026298 3047059 3183201 3150108 3149109 3200752 3340971 3426914 3396440 3457290
2991 3457290 3494291 3528983 3599695 3746688 3743087 3781875 3879782 3983127 4195227 4320393 4484545
2980 4484545 4678835 4688674 4662837 4655162 4637128 4670754 4630487 4764044 4910576 5011489 5059497
2969 5059497 5071029 5144735 5117349 5184664 5329735 5437767 5649729 5842444 5954983 6214752
2959 6214752 6271571 6502183 6840807 6960204 7066159 7239000 7436535 7611902 7755461 7874584
2949 7874584 7943706 7939467 8093173 8311224 8528505 8846937 9079114 9362048 9622217 9933110
2939 9933110 10417709 10911017 11242062 11639545 12126904 12682009 13431139 14038280 14769179 15569137
2929 15569137 16490488 17608172 18747666 20000064 21332815 22733581 24092533 25448482
2921 25448482 26638496 27519489 28048129 28119633 28061389 27934701 27760167 27776862 27683242 27650754
2911 27650754 27649060 27695508 27770486 27954803 28109035 28204571 28517618 28907222 29299185 29919304
2901 29919304 30650432 31462696 32457318 33743732 35384717 37623547 40537194 44344979 49068285
2892 49068285 53860600 57480420 57232082 53296057 48062458 43036022 38721500 35094654
2884 35094654 32107248 29729257 27966557 26534894 25417036 24570526 23806372 22976846 22269238
2875 22269238 21758085 21407270 21096145 21002998 21010747 21044469 21172698 21499963 21813579 22229629
2865 22229629 22739150 23351729 23979107 24453214 24793585 24645948 23807600 22615958 21273350
2856 21273350 19652785 18115767 16770358 15573032 14528712 13586476 12615010 11877299 11308978
2847 11308978 10792175 10238165 9764897 9322956 8963395 8588555 8292608 7942389 7550437
2838 7550437 7222006 6838051 6549411 6380455 6264099 6014627 5780111 5557545 5371437 5203640
2828 5203640 4981086 4770671 4535599 4429695 4246739 4043096 3941220 3857151 3694978 3649199
2818 3649199 3579926 3426432 3284120 3276768 3260259 3120940 3003514 2977682 2884152 2851398 2734372
2807 2734372 2747303 2666357 2643552 2505067 2375514 2412510 2400548 2274792 2186036 2091603 2024635
2796 2024635 2044856 2003385 2017605 1989770 1948593 1845288 1803424 1820247 1763128 1735718 1732519
2785 1732519 1637796 1683914 1663069 1662169 1596736 1609266 1583792 1583219 1541090 1511876 1485615 1474621
2773 1474621 1492734 1445239 1343496 1371308 1404939 1400730 1257956 1289164 1361623 1266771 1202097
2762 1202097 1217655 1146331 1150281 1140164 1209714 1120225 1092571 1149251 1113662 1057088 1121830 1068556
2750 1068556 949885 947909 933779 908649 996903 995723 973733 1023120 859167 896038 886520 997078
2738 997078 1001669 1012437 974661 917823 883925 897474 890509 973170 970601 881008 902113 919423
2726 919423 790375 804866 833292 751767 715608 721888 752206 768431 760046 730803 591356 628065
2714 628065 658941 604856 647866 636106 714646 722513 701893 597054 683057 673045 683776 677926
2702 677926 581430 582958 537309 511976 552852 598473 597517 526250 489410 423651 446559 449203
2690 449203 515328 496973 581398 510350 428729 395033 506893 553153 481592 571111 490010
2679 490010 537381 488499 405790 395984 398584 396826 465081 417245 408843 422648 418689 446011 408108
2666 408108 312681 300138 412195 395489 387568 425386 453991 438461 401037 343749 316354 317871
2654 317871 294460 345829 413305 483030 410801 350949 338845 461417 438462 370502 326444
2643 326444 267016 317702 410697 445188 438006 477702 453438 377156 459942 417805 407132 468175
2631 468175 440881 479093 438337 357010 351108 409500 423874 447368 404423 436095 400782 488863
2619 488863 522132 466062 503150 585906 597716 425527 417939 437970 387731 405314 458325 538214
2607 538214 609144 528953 470763 491658 400219 415621 306380 295636 359618 350734 390028 260018
2595 260018 323811 351481 260997 354652 437101 348823 304712 290678 285900 229751 307432 340315
2583 340315 411843 405089 418396 461340 451876 493535 471366 302395 281798 276473 307274 294491
2571 294491 231849 278836 247564 287264 227911 184954 240243 255000 259265 315092 351679 278732
2559 278732 341326 274291 229842 319999 312471 227910 279626 260555 224517 169413 141344 234247
2547 234247 285946 289046 227977 188124 167113 254401 226799 155414 188291 241412 178572 150074
2535 150074 106757 164521 195585 231452 152331 134379 162132 144388 198414 214209 235286 212680
2523 212680 198331 291595 318845 222334 122052 67963 61154 259953 332671 256051 153310
2512 153310 103316 180395 203722 142916 139034 144720 159703 194043 160164 100138 150665 207930
2500 207930 275055 108559 133951 204196 156642 152865 181869 134437 131896 254905 207295 207568
2488 207568 194476 166736 105123 113990 167525 152754 62202 101037 200854 24073 25490 77457
2476 77457 180594 243912 193769 122292 102187 43299 64282 110173 114989 125679 -31096 58855
2464 58855 131571 73099 54835 107730 53654 60031 80302 6362 123184 98975 134895 220341
2452 220341 120481 -26944 82384 108200 79394 80721 70717 127029 103549 118303 153362
2441 153362 126119 46637 130119 198232 142197 113409 159478 153761 263948 198347 159098 123947
2429 123947 66409 124807 46536 -17482 20 31871 92038 67246 74758 74654 109260 106399
2417 106399 71000 3857 41738 141893 156993 176226 171549 113384 100488 65831 14982 40569
2405 40569 74216 -21525 141222 85817 -27618 40640 96051 9874 30199 59433 79789
2394 79789 73984 46409 85962 -4465 13974 97043 104033 74267 64932 65925 87093 39883 74922
2381 74922 111832 218113 211283 38329 99208 159998 54421 99770 170000 64885 118209
2370 118209 192360 168413 150186 126970 174256 279785 207801 130407 149142 171319 227589
2359 227589 276106 276501 310124 198638 127691 176458 89261 88089 98340 210423 236021 174495
2347 174495 189819 71052 30552 142338 164064 195987 120292 49370 124198 123628 148422 201685
2335 201685 80176 36170 51947 29988 17635 79840 172184 232127 98137 89690 169024
2324 169024 186477 116022 45025 157818 13376 39203 67261 77123 -9788 -102234 -49416
2313 -49416 19853 41146 -1739 92054 111831 57988 81525 159876 86205 87245 72080 55766
2301 55766 55942 171384 55052 -3639 -19834 54401 44498 18751 18188 9719 -87671 -26262 123489
2288 123489 165702 76582 50696 46844 107243 219471 218738 89338 65446 185839 183935 208514
2276 208514 238142 178657 63392 30231 10575 86127 149405 106163 29940 122700 122366 108640
2264 108640 179690 235494 254662 150776 164877 141913 168550 216958 217404 212312 217547 143739
2252 143739 139522 222596 194135 194788 235392 214428 100847 99738 243898 152319 79068 187647
2240 187647 271021 281113 134672 134267 90743 62808 68542 74212 102248 124418 159859 107237
2228 107237 32213 127420 163461 112222 190788 224588 211735 215050 67104 130990 195058 260563
2216 260563 189257 253201 251811 293404 295577 260906 300199 202493 294453 399234 302492 268413
2204 268413 306651 301693 369215 301091 286608 280556 323396 372670 384627 282601 249015 306199
2192 306199 293270 323480 285547 375931 404009 412240 519846 437783 356812 383891 310764 400889
2180 400889 442351 616652 602021 548403 593624 605791 604585 549486 541406 603090 721622 647144
2168 647144 558807 525623 520656 600462 681454 649317 661572 707040 716076 709441 798494 836949
2156 836949 793245 756854 715411 758496 798407 880233 892370 844246 856000 845618 886838 966186
2144 966186 970150 977624 963113 1038899 976309 972468 986530 996396 1087610 1210450 1345439 1405624
2132 1405624 1499217 1499761 1565232 1554974 1659107 1721445 1697244 1758815 1915358 2056346 2163138
2121 2163138 2215692 2245161 2342037 2498366 2690723 2739289 2927477 3053735 3227771 3384289
2111 3384289 3631625 3796951 3938084 4220847 4584674 5006371 5350243 5661821 5868260 6152584
2101 6152584 6687195 7329469 8117825 9247543 10548595 12202055 14359984 17199056 21500112
2092 21500112 27361848 34124962 39106536 35984810 28099576 20966930 16101239 13111126
2084 13111126 10879862 9331153 7924072 6885344 6146628 5653769 5248695 4999935 4829577
2075 4829577 4651421 4365206 3951049 3546744 3179662 2868520 2639815 2503763 2358622 2225511
2065 2225511 2067089 2033961 2077395 2030823 1976268 1885347 1767924 1700481 1603841 1551965 1452580
2054 1452580 1421814 1474572 1393890 1245317 1152238 1042863 1022413 963742 936592 1024406 1032291
2043 1032291 990699 973488 948375 933261 835466 804660 870757 668976 648377 647544 725780 773485
2031 773485 705068 622150 451155 462260 510161 421544 459255 548359 535243 504306 553166
2020 553166 468314 525214 456289 427105 478535 587595 547389 430603 401956 398311 381988
2009 381988 330270 331538 362765 213698 216017 230634 244302 284057 184809 256075 299092 249073
1997 249073 316803 394267 315861 219089 215759 251666 277927 306879 307512 312574 270803 168481
1985 168481 145728 309055 264938 202342 165676 113844 64662 147874 254022 239476 287396
1974 287396 245639 195501 164075 189331 204114 200752 250227 218854 228692 259884 300677 292195
1962 292195 220832 207167 314230 346447 214762 127632 26337 137884 160425 120857 167010
1951 167010 157794 97167 115922 74521 164802 93239 33736 133338 158816 83911 150476 248496
1939 248496 154551 56708 167177 132100 130768 140021 119032 156824 129779 76038 11250 26333
1927 26333 125151 45610 -6445 -56 -54873 27613 91358 179074 114414 41887 29859 75467
1915 75467 121253 107398 93735 109211 136480 151282 124187 144759 169865 132304 111085 20908
1903 20908 23481 143660 103202 187317 115654 63262 138656 108960 147203 136483 93282 168389
1891 168389 114415 68623 67312 20597 -26780 73448 20203 62982 104327 54727 53532 -3832
1879 -3832 -21477 44804 120479 97498 502 -2720 37456 46096 26296 31553 33880 63937 91285
1866 91285 139792 171160 144065 36704 40324 68584 53173 36727 67246 49219 120577 48086
1854 48086 59293 41028 82791 94811 146897 10533 -6450 59825 5109 47981 81966 53581
1842 53581 60223 34327 74391 7071 36593 84383 -32919 16541 73583 84247 70048 69113
1830 69113 -8418 14161 97647 73833 88538 125376 88613 161503 242092 234639 194199 190055
1818 190055 229108 244692 145072 65870 -63012 -12326 21931 27203 -17089 156234 129619
1807 129619 75494 62330 100284 -31075 -9093 136291 134843 142067 -10462 -32928 28103
1796 28103 67111 102089 -39793 32586 14202 77580 27349 -14505 15565 11900 -170848 -128847
1784 -128847 7163 11582 -31323 -6138 26897 -55539 59259 157191 45269 160698 128665
1773 128665 57352 85455 80329 78638 20287 25965 -117612 -64130 31899 9592 -37821 -37838 22282
1760 22282 61639 115843 68201 -29190 44548 92853 58668 39307 118976 146710 134750 143553
1748 143553 88560 1789 -7528 18278 76344 82753 56873 37338 12182 45490 48486 -2079
1736 -2079 19575 -25395 -86699 -73347 8033 7781 -25927 -84006 -75048 -157811 -107779 -79620 8528
1723 8528 -42076 -144196 -77538 -42725 59451 65279 12561 -19449 -62241 -24172 -6039 -66011
1711 -66011 -66669 93192 123037 38508 -33590 -69909 -74364 -18052 51052 9757 59564 43530
1699 43530 -29475 -78770 -67252 54248 98216 52026 162843 239571 186330 102355 58301
1688 58301 29408 64914 59455 88381 81776 123323 144539 55449 82187 19958 33828 79825
1676 79825 90373 1149 -68314 -2765 19363 76658 217810 73509 90479 124631 -53227
1665 -53227 7104 124917 72496 48113 21235 -42960 27390 64282 -12452 13066 39094 46016
1653 46016 14255 -46226 11917 27377 -3514 -54935 -56841 -102537 -68485 -49000 -55709 -101100
1641 -101100 -96015 72244 32740 -52693 -113981 -68691 41849 -2885 -82554 -56928 -20589
1630 -20589 6927 -78582 -131236 -1894 27160 37198 3159 -36694 -15910 -125228 -14927
1619 -14927 -76716 -70741 -43776 -51099 1369 18563 110192 19912 -81893 75856 -27912 -48145
1607 -48145 -14776 -28535 -25848 -108573 -150213 -87136 -79071 22724 83472 59001 29560 -12813
1595 -12813 53900 -20100 -26619 -43267 -9834 -5475 71206 18358 -8809 -24440 -23060 -16825 93593
1582 93593 -25505 -18529 -51101 -91718 -40564 -43784 -67155 -25555 26628 -23897 -5395 37046
1570 37046 26810 -2038 -9189 34655 25411 43631 16110 -55723 21049 31414 -47779 14591
1558 14591 -9392 85649 73958 36850 -34751 -27810 -48855 -6219 2642 18339 83048 53864
1546 53864 -32796 -62408 -32263 -132321 -130727 -41037 -16132 82900 96508 -34053 -67090 -7451
1534 -7451 -17395 27070 36454 -23236 -23681 -16762 30151 -66571 -41711 45006 -2324 -129450 -132480
1521 -132480 -94178 -155184 -238641 -104500 -122367 -82152 94081 211447 76875 148603 103189
1510 103189 -6810 42279 42743 -41852 -72415 -162261 -104467 -82377 5646 -59848 -132306 -105318
1498 -105318 -79406 -35730 -44912 -18794 -59807 -68549 -42809 6522 -40933 -78827 -65780 -81491
1486 -81491 -28780 34917 -96300 -38132 28086 19429 -9325 13909 50660 31281 35525 17318
1474 17318 -53146 2073 -3780 -13739 -45427 -143575 -71876 57351 90878 -24409 -102536 -82503
1462 -82503 -36416 -10035 73206 76085 66507 36531 -39952 -11633 65682 -20649 -106221 -75248
1450 -75248 -6083 29348 -78438 59445 24773 14767 3742 -36883 1978 58213 47190
1439 47190 3570 57695 146832 121870 73906 8789 -75170 -31712 -19874 -57137 -74047 -78859
1427 -78859 -60264 -29031 -87641 -15505 25606 -113107 -111619 -68124 -102145 5225 -28154 -77891
1415 -77891 -68798 43079 105606 98742 65546 119743 36839 -24021 -27953 -83248 -73618 13947
1403 13947 38805 -34409 -257 55200 36654 59702 43664 16893 54861 103369 49672 -32027
1391 -32027 -67457 -79226 -92344 -92306 -56782 -45063 -9402 20958 -32439 -52453 -41942 36870
1379 36870 56933 33145 77716 13058 -52200 -76144 18684 -69686 -32373 20691 39776 -46822
1367 -46822 -27859 -45954 -59102 33792 -131517 -202274 -50773 -21358 -42327 45042 31175
1356 31175 31092 -19569 28707 108784 -6095 -21976 2316 -21207 -62570 -33788 -49582 -47368
1344 -47368 20587 26547 -98061 -56834 19014 12431 77854 33394 71683 80728 81376 15263 -56790
1331 -56790 -120653 -22261 34541 -12146 -18098 -42677 -55884 -34060 -21428 -69803 -32693 20195
1319 20195 26771 -13698 -28371 -522 27867 -5643 24460 -18104 -2637 47057 31394 45676
1307 45676 13910 -24562 -28013 -20788 -53238 -157523 -68417 13325 -53172 -18005 -45532 -76428
1295 -76428 -127732 -121828 -10776 41184 -30192 -115638 -184140 -75785 -65459 -50749 6680 -104577
1283 -104577 2933 20238 -68650 -53151 -49863 -129207 -28137 -92954 -99439 -61389 -38040 -12555
1271 -12555 48926 -152 -11291 -116075 -131703 -70510 -137704 -117657 -133008 -1429 68991
1260 68991 -26581 -81208 -68170 -58570 -58221 -135700 -146434 -113249 -61687 -63600 40610 97390
1248 97390 83923 -80729 -98176 -26340 -9640 -64502 -41393 -85132 -167916 -172736 -104371 -84598
1236 -84598 -103509 -90229 -134381 -45177 -107389 -89729 -80293 -37696 -29911 -42791 -681 -67745
1224 -67745 -113679 -153682 -111783 -45543 37925 -32726 -11999 14633 39547 33722 -60042 -40110
1212 -40110 -64455 -41051 29152 55496 -16289 -30711 -19168 8619 -5359 -98752 -20663 42106
1200 42106 59709 -6741 94397 70699 51636 -31669 -60465 27336 49965 49887 -54625 -77166
1188 -77166 -20819 -11828 25477 -8293 53119 70920 -1577 -20133 -41437 -6035 63699 38502
1176 38502 16095 -60666 -95295 -128182 -126586 -72287 -103895 -104667 -20202 2642 -42351 -75854
1164 -75854 -85626 -13800 -6831 1507 -67412 -68749 -60415 37595 15983 -55647 -24511 -30019 144799
1151 144799 16059 -108115 -59719 12271 -1745 5119 149599 48758 50360 48305 -10722
1140 -10722 -51327 6136 53063 76566 74954 132398 81576 20311 -8470 -24486 -58806 -114434
1128 -114434 -142202 -75710 -49917 29082 87555 97758 85235 33051 -23398 44368 -43011 9838
1116 9838 43083 -70304 -99580 -127412 -124736 -81911 9300 -14269 -36956 -9846 -105490 -3513
1104 -3513 -60330 -102103 -109211 -63261 -117771 -111372 -255 -70114 -151355 -143847 -74366 -59152
1092 -59152 -57450 -68890 -122146 -74510 -43334 -39111 -18835 -20607 80857 79139 -13037 -12108 1161
1079 1161 -30868 -50791 -34406 -20465 -14314 -2419 -113859 -11744 4325 25703 -4568 -61935
1067 -61935 -94725 -42263 -19793 -115604 -160509 -101530 -22043 10754 -28008 -81129 -50801 403
1055 403 -64501 -95608 -72570 46028 -4355 63561 64860 85677 79057 141988 55129 -44834
1043 -44834 15413 -921 -50366 -56358 26664 8496 -38347 -74963 -137043 -75132 -54386 174
1031 174 36370 60241 -42644 -125752 -152747 -159207 -15140 -28916 -26840 -51010 -26543 -77582
1019 -77582 829 -21440 -76849 -97615 -87367 -36752 -33604 -57194 -65313 19488 -8903 -295
1007 -295 40169 -10187 -48634 -67986 -63644 21605 104281 42678 -1958 -109893 -85793 34054
995 34054 9519 15915 -95652 -55159 9408 -28996 -3332 51858 7951 -59520 -23527 21349
983 21349 78604 598 -45659 -69251 -121413 -14494 6389 -77520 1901 -39087 35788 -21431
971 -21431 4793 20484 -109140 39115 70694 -36575 -90583 -61479 -116811 -108695 -115921 -11321
959 -11321 45717 16547 -59833 -77459 -37305 2108 30978 60512 45866 54950 94296 -99560
947 -99560 -6440 -24964 -115105 20770 -51273 -14542 26355 -75776 -69639 -108952 -12898 -4739
935 -4739 25091 16741 33434 16128 -26503 -68286 -16929 -9966 -9132 -43929 41092 88208 -23906
922 -23906 13298 -54945 -48595 1060 -56507 -120102 -70123 -101889 -123710 -61768 -33334 -57550
910 -57550 -61666 -98800 -98142 -96200 -8642 -51321 -41614 21178 1130 94618 116753 -31074 -4232
897 -4232 -60372 -147260 -69065 108898 61002 -71688 -62907 -31497 -4124 -67763 -5323 17369
885 17369 17391 -20166 7196 556 -39062 -106535 -74722 -123441 -133433 -63398 -128285 -19367 79382
872 79382 20030 -72978 -26014 -61381 -108754 -5650 89506 59125 85346 84155 37720 -77797
860 -77797 -167163 -32261 -16307 9106 -76694 -70512 -24988 49376 -37696 -51991 17201 2255
848 2255 -1268 -6781 33589 29650 43685 67373 48736 144 -13281 -45116 -41838 9968 52538
835 52538 13236 -20372 -56007 -48110 -10364 -203888 -59828 15356 -26359 -31525 -33006 18177
823 18177 -22852 -72138 -6287 57151 -39300 -98580 -84517 32191 -16329 -26572 -33687 89537
811 89537 68385 39845 -59311 24642 119237 142142 176692 141769 64461 4500 -55152 8181
799 8181 -18000 -34422 -26597 -12676 -55161 -28009 183 -70791 -50357 -18985 -69100 -48917
787 -48917 -38285 8065 79306 97630 47940 -9621 70215 43341 -29652 27507 117994 -27569
775 -27569 -67486 -74876 -36020 85100 27035 -47223 -122041 -137964 -39423 -96500 -48914 -17715
763 -17715 -58030 -103456 -10084 -23375 8069 -41356 -39626 -66075 25471 54856 -65058 2933
751 2933 5585 -34012 -14947 -52882 10704 64030 19632 -67035 -15459 -19730 -60306 -24226 -14388
738 -14388 -12343 -116008 -128761 -136012 -13594 -35217 -105757 -135886 -84501 -172078 -134380 -5078
726 -5078 -27095 -28790 -23719 -58201 -67118 -71159 18539 127666 20349 -79123 -95495 -22989 37536
713 37536 -85003 12495 56219 69647 50315 84464 29880 -46127 -10009 -65231 13934 -21571
701 -21571 67244 21245 -47172 -33104 8751 82960 53760 52957 -35089 -85544 -34162 22861
689 22861 3859 -146140 -77197 23383 85575 149519 5505 -7048 4396 -18035 -51381
678 -51381 -122215 20893 40515 15220 -58262 -83468 -43296 -81330 -67145 -20104 74136 49656
666 49656 45771 48083 1856 35222 -22824 -72648 -49063 -4512 36670 -37204 -55424 -19140
654 -19140 -33467 -57828 -64312 -4576 -69771 82217 43849 7161 -4193 -75897 3666 32263
642 32263 89104 96174 34238 894 1553 16548 132785 218556 170842 128124 126822 144368 131842
629 131842 104700 83728 54822 22929 -17787 -15552 -46563 -152536 176 61832 40435 -2546
617 -2546 -81176 -34464 -11435 1729 -11099 35496 67874 75029 -20213 52866 -40204 -103042
605 -103042 -68341 -110628 -69659 -44666 -114144 -32651 -71503 6033 14639 46531 31938 -43302
593 -43302 4349 -77686 17021 25724 -1034 60170 72443 -22627 -116513 -16407 68999 -32633
581 -32633 -112484 -40361 -53062 -67921 -5155 15894 -15429 -55466 -968 -113274 -63244 -21784
569 -21784 -10453 28632 22402 37685 120305 173707 69037 143208 103635 30210 -32766 -85341
557 -85341 -61908 -6388 -78651 -5328 36894 13474 5904 74967 -395 46197 3437 13822
545 13822 -11769 -101304 -114305 -13932 84234 16548 98326 -21119 -26731 -33576 -85695 -52895
533 -52895 62396 75468 129592 31198 -10268 56764 102418 83870 -46576 40107 24790 -32997
521 -32997 36620 -20090 48756 66198 21428 -17603 -10625 83154 107651 34089 19948 -13821
509 -13821 -28032 65902 18253 27102 86676 117151 98757 65901 83208 27823 17589 18464 -24594
496 -24594 -49166 32263 55123 89829 -33533 49426 80784 -30638 -14866 81604 77068 -6817
484 -6817 -48547 19190 13820 109191 107921 11934 -10161 14174 -34259 -58643 -45654 -87478 -77534
471 -77534 4141 27627 -36037 -68950 -142792 -6715 10437 -6802 -55208 -36834 -53292 -32556
459 -32556 -43802 63726 54666 32489 64419 -6435 -43141 -6486 -22432 10416 75305 -21065
447 -21065 -57944 -24313 -97094 -117809 -87559 -72303 -24248 -6087 22379 12811 -60728 -90295
435 -90295 30491 27442 70565 136424 114171 17274 83020 153872 125763 43029 -19023 6314
423 6314 -2939 11553 -28948 -8738 50595 71778 17181 23730 -61120 -33330 18843 -60916 -131551
410 -131551 -48100 21055 -1973 -22034 3814 147416 112009 83475 -32229 -90478 -102262
399 -102262 -53923 72008 -3715 -17470 -3259 -121493 -77406 -14483 52633 -16493 -80478
388 -80478 27904 -1869 -47011 -83954 -112685 -83838 86344 91196 28804 23259 39730 6975
376 6975 72049 73799 37830 -2843 2458 78481 14260 -33768 -32539 -72096 -66594 -61755 -49566
363 -49566 32878 77444 -10939 -19336 -70756 7296 29331 -7779 4621 39132 -31712 -125502
351 -125502 -67431 26489 1574 -62222 56782 -5454 -31673 -25863 -91686 -146488 -78540 -68515
339 -68515 -5351 68596 99801 123187 103624 51734 -8822 12201 -15005 7945 10805 23308
327 23308 -18244 -143306 -83141 -10072 49778 -26633 -24946 -14461 -63626 -98613 -62769 -97956
315 -97956 -10788 82148 -10077 7188 31358 -26103 -32058 38346 39274 46370 66533 104169 167298
302 167298 73833 -14361 8253 57387 38053 43529 133783 7959 2310 16497 14433 25691
290 25691 6906 355 -60083 36935 87168 26442 -12331 16834 -11545 -54345 -27684 54981
278 54981 15805 18826 91009 61896 37591 -39553 -17883 -80170 -83861 -44205 4607 25634
266 25634 -16456 81071 -6207 31523 38280 -14345 -28696 55970 29041 18546 37725 -38351
254 -38351 -98524 -61301 41621 58223 31424 77075 46713 -58027 52847 91122 126543
243 126543 91363 -4645 -21776 43466 44696 127026 113031 33634 -55747 -39238 -108001 -77634
231 -77634 -52365 -67926 -154837 -156533 -79692 -42723 -106072 -162555 -112630 -19092 48544 -85509
219 -85509 -73860 -77981 -30887 66033 111061 82799 67787 -161 73962 -4012 -21066 25440
207 25440 60540 113912 -47878 -41279 30906 56103 30494 103663 65173 21011 52443 16187
195 16187 35364 22418 -13881 -71369 15685 -64844 -26900 -74751 8369 -125332 -155608 -91643
183 -91643 -101753 15584 -89978 -100463 -22292 -4477 -20350 91912 36239 -39307 -55308
172 -55308 -11242 102213 150861 58256 44823 18972 30890 6289 57651 13897 49328 -13888
160 -13888 -80932 -40134 14742 -53299 -8064 56938 5910 -9568 -7504 28784 43113 -7281
148 -7281 -48712 -66794 -41703 64565 82743 959 -1809 85719 142056 48395 -16026 -4385
136 -4385 -36218 -62020 -9689 61743 115540 75052 55519 48963 38590 136226 136786 66750 8606
123 8606 -55014 -54136 40410 37744 66852 24698 10529 -33585 -12461 22011 16933 -17116 22191
110 22191 64576 52908 -8099 -12844 -12977 74933 76850 72480 37653 13755 122202 50432 19758
97 19758 6347 26201 37595 8690 -9855 -59119 -18041 65550 111486 31446 23628 -10661
85 -10661 -36348 18769 88826 67681 21068 74036 85685 57496 83732 38785 619 -26249
73 -26249 -38492 52714 26809 -120804 -127702 -36845 16256 35729 -9782 29694 107 -3789
61 -3789 19011 4321 -32394 -74334 -45326 -48629 -17520 -22155 42120 41102 54227 55094 17838
48 17838 16879 -8373 72653 32065 64727 86283 98358 55788 -16671 -47109 -24530 11714 -7417
35 -7417 -12220 -9787 -24945 -39642 -10103 -25018 1206 57368 11776 696 2789 -5399 -9140
22 -9140 37667 -30113 -78421 -54126 -35699 -53370 -26318 64096 76952 51816 82633 71936
10 71936 12751 18 -37619 -38417 59879 92671 76405 94390 86885 111374
0 111374
$$ Imaginary data points
##PAGE= N=2
##DATA TABLE= (X++(I..I)), XYDATA
16383 -1970000 -1920959 -1997464 -1923912 -1823152 -1742590 -1725086 -1709024 -1673298 -1676581 -1637643 -1647987
16372 -1647987 -1619233 -1538851 -1561331 -1611697 -1553457 -1464712 -1368402 -1361816 -1457223 -1381056 -1249804
16361 -1249804 -1273435 -1303721 -1345253 -1273392 -1173734 -1159846 -1127684 -1120401 -1107432 -1026931 -1016017
16350 -1016017 -1012193 -961000 -885607 -905631 -913853 -880648 -816618 -776019 -771751 -771651 -734332 -710321
16338 -710321 -720280 -657314 -676766 -608042 -593724 -565521 -483740 -445232 -494919 -435425 -424418 -479403
16326 -479403 -422603 -357198 -359136 -349426 -263327 -219115 -199715 -94286 -75255 -201967 -140718
16315 -140718 43828 11754 17035 85329 109759 101872 117512 189337 148005 39419 114572
16304 114572 233799 225526 159871 175920 286686 281650 333383 377782 362806 365177 445122 433613
16292 433613 422044 551873 564657 515210 533379 587784 565402 630125 597724 648221 703328
16281 703328 618507 672494 705162 664130 761044 881083 834897 861500 869129 923441 937761
16270 937761 947579 950665 980428 1020712 958689 939365 936193 927099 974907 987625 1080224 1137408
16258 1137408 1191917 1169381 1174550 1198576 1202702 1192291 1252569 1230003 1313660 1331195 1313214 1297739
16246 1297739 1232208 1336448 1361921 1384877 1408354 1428404 1314921 1312799 1363854 1466750 1519163
16235 1519163 1579123 1672034 1554576 1491041 1534822 1518688 1450204 1552300 1613256 1602195 1610679
16224 1610679 1663267 1637923 1599438 1615531 1618398 1653185 1649333 1675894 1666646 1697844 1615697 1626931
16212 1626931 1708148 1730874 1731131 1751346 1764559 1782846 1780272 1912770 2013436 2004315 1941423 1844210
16200 1844210 1863543 1893044 1927620 1849229 1757922 1876546 1926432 1937239 1884304 1905759 1939162
16189 1939162 2067413 2052968 2104606 2089400 1994269 2088313 2183516 2233960 2102096 2189790 2176036
16178 2176036 2164864 2177351 2192521 2176360 2173178 2232775 2264540 2210643 2235419 2277874 2226321
16167 2226321 2231694 2314781 2296525 2219381 2254552 2281398 2247604 2232272 2241903 2230682 2289964 2423768
16155 2423768 2441087 2403259 2309604 2318155 2360942 2271373 2318238 2280318 2346578 2346541 2359220 2371046
16143 2371046 2328634 2318609 2331332 2334218 2275258 2340830 2382228 2392610 2431644 2454407 2410430
16132 2410430 2469201 2367027 2307401 2301982 2342032 2429573 2384745 2333408 2384501 2400505 2340182
16121 2340182 2420487 2409746 2411110 2410927 2347779 2394778 2386443 2447735 2407212 2446206 2381986 2338294
16109 2338294 2413223 2381211 2449951 2398795 2465722 2563852 2500140 2471518 2454806 2472886 2506904
16098 2506904 2438217 2493008 2526946 2618112 2606537 2602432 2493260 2506091 2564290 2540703 2524822
16087 2524822 2484226 2482828 2458357 2554347 2483253 2506206 2471839 2527035 2606027 2548451 2571933
16076 2571933 2592498 2616347 2670745 2697099 2644855 2544397 2446035 2414546 2438192 2402134 2382934
16065 2382934 2475866 2494038 2481123 2535008 2570786 2582881 2558574 2596044 2581828 2476020 2499383
16054 2499383 2548380 2588121 2630191 2621298 2534649 2509819 2569916 2616165 2653527 2646919 2564925 2525111
16042 2525111 2559028 2631843 2626825 2556296 2586462 2529552 2497422 2459709 2532149 2625423 2560888
16031 2560888 2642778 2558057 2520851 2554473 2501993 2565349 2608977 2606363 2634010 2577382 2573116 2507971
16019 2507971 2530302 2585027 2624884 2653394 2560377 2548299 2577025 2564680 2443438 2511078 2526672
16008 2526672 2619074 2628321 2621565 2627556 2584132 2603301 2611064 2625292 2616640 2677927 2546644 2568299
15996 2568299 2555190 2566137 2677636 2736363 2661911 2670055 2650189 2571045 2572359 2647319 2740543
15985 2740543 2708335 2608500 2627600 2736410 2664261 2656144 2619668 2687928 2694399 2681568 2631218
15974 2631218 2640246 2525254 2558231 2574350 2565372 2666170 2675246 2684418 2718538 2586515 2612034
15963 2612034 2626356 2561510 2609384 2646679 2621383 2545640 2606343 2603509 2633132 2654245 2666727
15952 2666727 2640219 2632846 2658041 2674829 2617124 2571069 2618118 2681081 2672929 2670524 2617197 2501250
15940 2501250 2618233 2645432 2552670 2562888 2512083 2651644 2598609 2622553 2710942 2581220 2593218
15929 2593218 2579438 2655137 2666425 2591167 2529240 2512569 2545909 2657051 2718784 2630806 2685736
15918 2685736 2779976 2632577 2513433 2598405 2606576 2648701 2642732 2612880 2655286 2643892 2580727
15907 2580727 2556911 2532366 2541400 2500938 2584625 2621864 2624137 2591408 2640763 2617583 2656561 2690184
15895 2690184 2694014 2690401 2599721 2488849 2603303 2668566 2545453 2583373 2598770 2607687 2561611
15884 2561611 2560023 2547032 2473618 2522924 2650461 2618487 2644753 2687124 2619458 2591534 2569266
15873 2569266 2536404 2590885 2612041 2618009 2627718 2690908 2592128 2472313 2583692 2647604 2601294
15862 2601294 2567020 2576585 2574901 2522534 2504712 2610028 2620858 2542101 2508462 2570106 2559881
15851 2559881 2470900 2577476 2544095 2535677 2632589 2588328 2641147 2756076 2732296 2721649 2750290
15840 2750290 2765635 2697116 2576981 2661691 2646800 2687424 2790585 2756147 2638544 2626964 2589707
15829 2589707 2582063 2650605 2672312 2646228 2674367 2703117 2766436 2684207 2557814 2592379 2692394
15818 2692394 2706852 2626882 2610652 2555297 2598083 2623012 2640447 2648012 2684836 2601031 2506637
15807 2506637 2535233 2564365 2549870 2653976 2589058 2465573 2531748 2641567 2597577 2694717 2623998
15796 2623998 2630716 2672925 2659428 2729308 2779123 2706546 2660799 2626709 2702631 2703249 2603532 2517072
15784 2517072 2675785 2673704 2577690 2632405 2683471 2724447 2719199 2714527 2735901 2783204 2639959
15773 2639959 2560654 2553213 2603956 2559677 2641820 2649275 2595446 2555414 2571154 2620614 2636959 2765763
15761 2765763 2679381 2612368 2561637 2662584 2721459 2689834 2636303 2600797 2636427 2642648 2687193
15750 2687193 2614470 2592037 2599983 2643461 2630604 2627327 2675681 2599875 2550337 2636063 2475006
15739 2475006 2462367 2509558 2529442 2612144 2684463 2551008 2588176 2631936 2632425 2596835 2574142
15728 2574142 2635720 2693528 2639714 2522997 2536948 2571134 2641034 2685707 2546218 2544702 2591365
15717 2591365 2663470 2650210 2678085 2671717 2665372 2637561 2658018 2678760 2650595 2645652 2762560 2707942
15705 2707942 2603584 2569348 2655409 2674837 2665919 2672712 2579354 2593675 2581438 2646861 2700614
15694 2700614 2740655 2730052 2813574 2830225 2724458 2703816 2782217 2753155 2770533 2745769 2721000
15683 2721000 2747158 2745881 2677460 2663432 2684736 2697237 2641545 2684456 2638057 2688289 2686992 2638200
15671 2638200 2593784 2649184 2706148 2681327 2704537 2617909 2636209 2675384 2677430 2694677 2719244
15660 2719244 2654392 2641196 2643289 2626771 2655578 2719026 2817658 2757100 2704943 2646338 2631073
15649 2631073 2639934 2643212 2637495 2690812 2658894 2616201 2649823 2752324 2815077 2785604 2737579 2714827
15637 2714827 2709837 2656659 2720702 2697896 2693534 2692920 2639291 2744239 2705667 2670001 2661602 2628877
15625 2628877 2648661 2759028 2791218 2753798 2686328 2634440 2650017 2609578 2664634 2690294 2597720
15614 2597720 2638471 2683510 2652400 2668432 2713349 2812495 2829504 2769499 2658921 2712409 2649905
15603 2649905 2660414 2619902 2661837 2717219 2699175 2646654 2706020 2751653 2576967 2581968 2620007
15592 2620007 2724365 2743670 2698508 2712124 2694151 2646208 2789442 2929039 2869814 2735809
15582 2735809 2707550 2661912 2736097 2785800 2783553 2811595 2831189 2796888 2731183 2685815 2704614
15571 2704614 2783492 2769657 2648664 2609620 2605182 2656437 2716578 2781158 2755351 2689565 2719769
15560 2719769 2659901 2671783 2624147 2647233 2631073 2631707 2659667 2676565 2750673 2796987 2806137 2728823
15548 2728823 2678012 2720516 2811824 2848012 2804942 2796063 2711535 2738624 2832087 2753050 2668554
15537 2668554 2678235 2744150 2716572 2726913 2732168 2750201 2843891 2789720 2778642 2726591 2641735 2652179
15525 2652179 2652244 2710561 2754561 2847755 2764043 2621160 2591540 2636311 2713864 2665192 2646889 2653456
15513 2653456 2729520 2716100 2759283 2751957 2781759 2683642 2629687 2725156 2667130 2626914 2703631
15502 2703631 2739501 2616155 2715905 2710132 2667751 2692935 2655807 2700112 2716287 2627365 2676687
15491 2676687 2815738 2782574 2643120 2626132 2732331 2715194 2817883 2790808 2709644 2714019 2689712
15480 2689712 2619146 2544584 2693928 2834212 2812404 2801183 2685595 2734418 2751740 2675785 2802986
15469 2802986 2875447 2865447 2774255 2741647 2722815 2750991 2820330 2827987 2777543 2771336 2771852 2760588
15457 2760588 2773864 2743779 2787499 2720757 2727866 2672064 2641603 2729955 2679805 2679010 2663047 2716465
15445 2716465 2689403 2729910 2706423 2714500 2685801 2632940 2719641 2753014 2670316 2725161 2716533 2653760
15433 2653760 2621134 2714268 2789393 2762656 2774477 2684108 2725000 2855314 2872399 2791151 2775138
15422 2775138 2658393 2661502 2750572 2819988 2760421 2790093 2731014 2768079 2753290 2705524 2689848
15411 2689848 2831710 2835834 2703562 2652396 2557727 2606911 2746577 2731598 2708339 2748373 2695700
15400 2695700 2732992 2789668 2805944 2692499 2717109 2746609 2728552 2680422 2795636 2908683 2887788
15389 2887788 2825101 2805235 2809095 2878022 2892357 2872963 2821030 2828159 2762648 2779512 2735343 2879147
15377 2879147 2912134 2718840 2768522 2769547 2731968 2758035 2756231 2691422 2829533 2897014 2860119
15366 2860119 2786470 2776869 2841891 2745786 2792017 2862303 2853641 2705877 2657451 2713320 2813884
15355 2813884 2750654 2843071 2842543 2906565 2904427 2812706 2831861 2851880 2908914 2823455 2903418 2822012
15343 2822012 2824347 2753346 2680810 2698717 2706203 2694889 2727273 2829397 2828152 2775727 2764878 2771276
15331 2771276 2782229 2805594 2802503 2717530 2743859 2728833 2730086 2758413 2691883 2755128 2721463 2684677
15319 2684677 2728197 2751773 2686047 2747141 2894453 2838824 2829936 2794391 2764973 2824236 2749185
15308 2749185 2680198 2758141 2880887 2820438 2803734 2704907 2674272 2719258 2756360 2778644 2762006
15297 2762006 2855835 2804076 2801076 2703662 2752761 2787367 2865973 2774843 2647157 2669202 2824056
15286 2824056 2798972 2782543 2816389 2832110 2856063 2817210 2728718 2735237 2684764 2773379 2857539
15275 2857539 2786883 2756967 2734669 2756132 2839684 2748807 2670984 2739853 2819606 2800753 2818803
15264 2818803 2848948 2830596 2900920 2850801 2770890 2880493 2945494 2871069 2811399 2724597 2647212
15253 2647212 2670924 2716562 2634000 2631148 2683010 2785881 2764474 2737183 2622083 2650382 2790865
15242 2790865 2705889 2737511 2768580 2788211 2908229 2848464 2805090 2842768 2784277 2783927 2865195
15231 2865195 2850834 2804661 2737311 2790959 2911173 2865941 2815326 2757061 2759062 2792721 2761645
15220 2761645 2717135 2654790 2759316 2677589 2699717 2701006 2682378 2730446 2842499 2904922 2898776
15209 2898776 2798436 2803606 2795581 2862963 2760687 2795537 2847452 2783775 2800089 2773229 2763053
15198 2763053 2824876 2829871 2820488 2890150 2918554 2899589 2913430 2850009 2879343 2857078 2794345 2829866
15186 2829866 2845597 2873017 2751634 2764417 2766661 2811175 2788588 2665300 2691571 2712295 2741851
15175 2741851 2786897 2842653 2794815 2796577 2870192 2824903 2883963 2877833 2913146 2888402 2889164 2898760
15163 2898760 2859341 2760204 2730745 2772229 2819713 2746659 2816400 2811750 2868672 2749405 2660640
15152 2660640 2774076 2820105 2829591 2783535 2909757 2918147 2802257 2831027 2941187 2946005 2888005
15141 2888005 2828704 2826587 2916632 2832395 2795502 2755041 2780016 2811211 2803095 2848525 2919783 2926998
15129 2926998 2826205 2841651 2774061 2788605 2710825 2715410 2846199 2882663 2836170 2763218 2781321
15118 2781321 2779922 2816209 2783220 2800373 2783577 2845237 2748754 2808760 2943401 2960203 2877977
15107 2877977 2825168 2868756 2890464 2915602 2824365 2785343 2758754 2861224 2792968 2752363 2776220
15096 2776220 2851491 2859979 2849808 2748128 2774740 2860520 2813539 2810118 2807040 2758893 2744642 2824105
15084 2824105 2886270 2871785 2806929 2738617 2876871 2838677 2685562 2737341 2824898 2831689 2746458
15073 2746458 2774855 2823807 2746999 2759678 2755524 2872370 2851444 2850727 2868015 2849419 2816321 2830345
15061 2830345 2807958 2743248 2738210 2776029 2687013 2666434 2779947 2788399 2838319 2892861 2974814
15050 2974814 2987760 2977620 2857269 2807793 2780323 2664765 2745260 2878540 2802079 2886204 2830151
15039 2830151 2883989 2881291 2847614 2834522 2822338 2844093 2847018 2798535 2781017 2852355 2811608 2752782
15027 2752782 2757193 2775017 2813085 2822868 2889034 2842619 2876916 2840882 2865093 2901903 2814292 2727043
15015 2727043 2874361 2955081 2885174 2871637 2829922 2798953 2804911 2847183 2929996 2978613 2927089
15004 2927089 2872459 2811387 2880624 2946053 2887615 2878940 2859955 2836729 2838344 2892626 2932158 2889748
14992 2889748 2906157 2876761 2930805 2931780 2936725 2834650 2838035 2836039 2865998 2894509 2868770 2870947
14980 2870947 2889025 2868523 2826990 2872510 2900886 2811811 2855490 2880145 2845067 2836588 2793225
14969 2793225 2852122 2977509 2961196 2952179 2942805 2934995 2912658 2878145 2897875 2934678 2893307 2832059
14957 2832059 2863823 2916596 2952011 2912983 2822326 2886359 2904438 2917384 2943339 2837729 2836169
14946 2836169 2916104 2837772 2807462 2777414 2760998 2760608 2740830 2861217 2848732 2765278 2759752 2843718
14934 2843718 2881648 2837501 2905870 2962889 2850036 2781881 2872930 2933207 2953876 2885762 2848189
14923 2848189 2899204 2913253 2896676 2894279 2858549 2845924 2939121 2949125 2921729 2864063 2896118
14912 2896118 2828652 2777504 2818950 3001219 2945435 2871614 2855291 2897043 2949413 2921412 2908194
14901 2908194 2907919 3029848 2921533 2993466 3096092 3040169 3005761 3019220 2939668 2866557 2895652
14890 2895652 2841325 2854079 2865310 2870518 2863075 2911605 2965917 2865090 2829752 2851541 2931011
14879 2931011 2944354 2863677 2849796 2822403 2797464 2795782 2941667 2952337 2993365 3024038 3056890
14868 3056890 3019708 2984065 2979613 3002297 2972153 2955945 2943884 2804999 2881708 2837582 2822975
14857 2822975 2754064 2713582 2769467 2817167 2797103 2794479 2824654 2908141 2883518 2878358 2795992 2780760
14845 2780760 2855077 2835412 2794117 2762816 2856317 2775369 2793185 2936548 2943515 2945349 2942490 2903570
14833 2903570 2874092 2841775 2887747 2856896 2871070 2988810 2977197 2890213 2881454 2854459 2857366
14822 2857366 2856313 2934375 2889462 3021384 3002216 2932251 2965343 2905015 2882551 2894163 2889897
14811 2889897 2828579 2789468 2841815 2956032 2832004 2854654 2924426 2873848 2914199 2975637 2921863
14800 2921863 2892093 2954435 2925791 2933988 2922083 2850303 2821233 2814238 2843129 2827358 2861617 2919145
14788 2919145 2896263 2919128 2870969 2845658 2907370 2834581 2883451 2928075 2978491 2955597 2911041
14777 2911041 2882911 2892811 2882814 2982722 3001140 2879659 2909939 3035567 3106559 3044331 3100471
14766 3100471 3016557 2935244 2944186 2928355 3074060 3016894 3031943 2958360 2974314 2989422 2941243
$$ [...]
##END NTUPLES=NMR SPECTRUM
##END=
