##TITLE=1H_EC-3293(VII-33oc)
 DMSO
 8 sc, 
 18.5.2023
##JCAMPDX= 6.0         $$ Bruker NMR JCAMP-DX V2.0
##DATA TYPE= NMR SPECTRUM
##DATA CLASS= NTUPLES
##ORIGIN= UXNMR, Bruker Analytische Messtechnik GmbH
##OWNER= root
$$ XWIN-NMR		Version 3.5
$$ Thu May 18 13:50:38 2023 Russian Standard Time (UT+4h)  she@DPX200
##.OBSERVE FREQUENCY= 200.13135
##.OBSERVE NUCLEUS= ^1H
##.ACQUISITION MODE= SIMULTANEOUS
##.ACQUISITION SCHEME= undefined
##.AVERAGES= 8
##.DIGITISER RES= 18
##SPECTROMETER/DATA SYSTEM= spect
##.PULSE SEQUENCE= zg30
##.SOLVENT NAME= CDCl3
##.SHIFT REFERENCE= (INTERNAL, CDCl3, 0, 15.6599)
##AUDIT TRAIL= $$ (NUMBER, WHEN, WHO, WHERE, WHAT)
$$ ##TITLE= Audit trail, XWIN-NMR		Version 3.5
$$ ##JCAMPDX= 5.01
$$ ##ORIGIN= Bruker BioSpin GmbH
$$ ##OWNER= she
$$ F:/spectra/data/she/nmr/H-F/1/pdata/1/auditp.txt
$$ ##AUDIT TRAIL=  $$ (NUMBER, WHEN, WHO, WHERE, WHAT)
(   1,<2023-05-18 13:44:58.81 +0400>,<she>,<DPX200>,
      <created by zg, POWCHK disabled, PULCHK disabled
       configuration hash MD5:
       00 E9 B6 7A A2 85 ED C7 34 08 36 98 17 FE 4E 26
       data hash MD5: 16K
       53 97 74 4D 71 5C 01 4C CC 1B 05 93 93 36 25 76>)
(   2,<2023-05-18 13:49:09.62 +0400>,<she>,<DPX200>,
      <Start of raw data processing
       efp BC_mod = 2 LB = 0.24 FT_mod = 6 PKNL = 1 PHC0 = -19900.68 PHC1 = 11.45272 SI = 16K 
       data hash MD5: 16K
       CA 5E 6D 99 8C 47 21 88 3A 65 CC A0 B1 0D B9 DF>)
(   3,<2023-05-18 13:49:31.59 +0400>,<she>,<DPX200>,
      <pk PHC0 = -0.1067481 PHC1 = -3 
       data hash MD5: 16K
       77 FF AD B4 2B A6 6E C8 59 B6 5C 22 D6 A9 50 BB>)
(   4,<2023-05-18 13:49:34.87 +0400>,<she>,<DPX200>,
      <abs ABSG = 5 
       data hash MD5: 16K
       5A D8 6F 2E 58 73 5A B5 0D 77 F9 D6 8C 8C 4B A0>)
$$ ##END=
$$ 
$$ hash MD5
$$ DE FE 7C D4 36 75 81 9C 43 D3 76 86 C5 BE 0F 93
##$RELAX= 
##$RELAX= 
##$RELAX= 
##$RELAX= 
##$RELAX= 
##$RELAX= 
$$ Bruker specific parameters
$$ --------------------------
##$DU= <F:/spectra>
##$EXPNO= 1
##$NAME= <H-F>
##$PROCNO= 1
##$TYPE= <nmr>
##$USER= <she>
##$AMP= (0..31)
100 100 100 100 100 100 100 100 100 100 100 100 100 100 100 100 100 100 
100 100 100 100 100 100 100 100 100 100 100 100 100 100 
##$AQSEQ= 0
##$AQ_mod= 1
##$AUNM= <au_zg>
##$AUTOPOS= <>
##$BF1= 200.13
##$BF2= 200.13
##$BF3= 200.13
##$BF4= 200.13
##$BF5= 200.13
##$BF6= 200.13
##$BF7= 200.13
##$BF8= 200.13
##$BYTORDA= 1
##$CFDGTYP= 0
##$CFRGTYP= 5
##$CHEMSTR= <none>
##$CNST= (0..31)
1 1 145 1 1 1 1 1 1 1 1 1 1 1 1 1 1 1 1 1 1 1 1 1 1 1 1 1 1 1 1 1 
##$CPDPRG= <>
##$CPDPRG1= <>
##$CPDPRG2= <>
##$CPDPRG3= <>
##$CPDPRG4= <mlev>
##$CPDPRG5= <mlev>
##$CPDPRG6= <mlev>
##$CPDPRG7= <mlev>
##$CPDPRG8= <mlev>
##$CPDPRGB= <>
##$CPDPRGT= <>
##$D= (0..31)
0 1.2 0 0 0 0 0 0 0 0.06 0 0.03 0 0 0 0 0.0002 0 0 0 0 0 0 0 0 0 0 0 0 
0 0 0 
##$DATE= 1684403098
##$DBL= (0..7)
120 120 120 120 120 120 120 120 
##$DBP= (0..7)
150 150 150 150 150 150 150 150 
##$DBP07= 0
##$DBPNAM0= <>
##$DBPNAM1= <>
##$DBPNAM2= <>
##$DBPNAM3= <>
##$DBPNAM4= <>
$$ [...]
##$SUBNAM3= <"">
##$SUBNAM4= <"">
##$SUBNAM5= <"">
##$SUBNAM6= <"">
##$SUBNAM7= <"">
##$SUBNAM8= <"">
##$SUBNAM9= <"">
##$SW= 18.05172834244
##$SWIBOX= (0..15)
0 0 2 0 0 0 0 0 0 0 0 0 0 0 0 0 
##$SW_h= 3612.71676300578
##$TD= 16384
##$TD0= 1
##$TE= 0
##$TE2= 300
##$TE3= 300
##$TEG= 300
##$TL= (0..7)
0 120 120 120 120 120 120 120 
##$TP= (0..7)
150 150 150 150 150 150 150 150 
##$TP07= 0
##$TPNAME0= <>
##$TPNAME1= <>
##$TPNAME2= <>
##$TPNAME3= <>
##$TPNAME4= <>
##$TPNAME5= <>
##$TPNAME6= <>
##$TPNAME7= <>
##$TPOAL= (0..7)
0.5 0.5 0.5 0.5 0.5 0.5 0.5 0.5 
##$TPOFFS= (0..7)
0 0 0 0 0 0 0 0 
##$TUNHIN= 0
##$TUNHOUT= 0
##$TUNXOUT= 0
##$USERA1= <user>
##$USERA2= <user>
##$USERA3= <user>
##$USERA4= <user>
##$USERA5= <user>
##$V9= 5
##$VALIST= <valist>
##$VCLIST= <CCCCCCCCCCCCCCC>
##$VD= 0
##$VDLIST= <DDDDDDDDDDDDDDD>
##$VPLIST= <PPPPPPPPPPPPPPP>
##$VTLIST= <TTTTTTTTTTTTTTT>
##$WBST= 1024
##$WBSW= 4
##$XGAIN= (0..3)
0 0 0 0 
##$XL= 0
##$YL= 0
##$YMAX_a= 172825
##$YMIN_a= -208561
##$ZGOPTNS= <>
##$ZL1= 120
##$ZL2= 120
##$ZL3= 120
##$ZL4= 120
##$ABSF1= 15.65985
##$ABSF2= -2.391997
##$ABSG= 5
##$ABSL= 3
##$ALPHA= 0
##$AQORDER= 0
##$ASSFAC= 0
##$ASSFACI= 0
##$ASSFACX= 0
##$ASSWID= 0
##$AUNMP= <proc_1d>
##$AZFE= 0.1
##$AZFW= 0.1
##$BCFW= 0
##$BC_mod= 2
##$BYTORDP= 0
##$COROFFS= 0
##$CY= -3
##$DATMOD= 1
##$DC= 0
##$DFILT= <>
##$DTYPP= 0
##$F1P= 0
##$F2P= 0
##$FCOR= 1
##$FTSIZE= 16384
##$FT_mod= 6
##$GAMMA= 0
##$GB= 0
##$INTBC= 1
##$INTSCL= 3.70164e-10
##$ISEN= 128
##$LB= 0.24
##$LEV0= 0
##$LPBIN= 0
##$MAXI= 10000
##$MC2= 0
##$MEAN= 0
##$ME_mod= 0
##$MI= 1.114404
##$NCOEF= 0
##$NC_proc= -5
##$NLEV= 6
##$NOISF1= 3.799351
##$NOISF2= 2.8
##$NSP= 0
##$NTH_PI= 0
##$NZP= 0
##$OFFSET= 15.65985
##$PC= 1
##$PHC0= -19900.79
##$PHC1= 8.45272
##$PH_mod= 1
##$PKNL= yes
##$PPARMOD= 0
##$PSCAL= 0
##$PSIGN= 0
##$REVERSE= no
##$SF= 200.130022353066
##$SI= 16384
##$SIGF1= 3
##$SIGF2= 2
##$SINO= 5.538805
##$SIOLD= 16384
##$SREGLST= <1H.CDCl3>
##$SSB= 0
##$STSI= 16384
##$STSR= 0
##$SW_p= 3612.71676300578
##$SYMM= 0
##$S_DEV= 0
##$TDeff= 16384
##$TDoff= 0
##$TI= <>
##$TILT= no
##$TM1= 0
##$TM2= 0
##$TOPLEV= 0
##$USERP1= <user>
##$USERP2= <user>
##$USERP3= <user>
##$USERP4= <user>
##$USERP5= <user>
##$WDW= 1
##$XDIM= 16384
##$YMAX_p= 333922994
##$YMIN_p= -352037
$$ End of Bruker specific parameters
$$ ---------------------------------
##NTUPLES= NMR SPECTRUM
##VAR_NAME=  FREQUENCY,     SPECTRUM/REAL,   SPECTRUM/IMAG
##SYMBOL=    X,             R,               I
##VAR_TYPE=  INDEPENDENT,   DEPENDENT,       DEPENDENT
##VAR_FORM=  AFFN,          ASDF,            ASDF
##VAR_DIM=   16384,         16384,           16384
##UNITS=     HZ,            ARBITRARY UNITS, ARBITRARY UNITS
##FACTOR=    0.220516191357247, 1,           1
##FIRST=     3134.00615467022, 0,            0
##LAST=      -478.710608335559, 0,           0
##MIN=       -478.710608335559, -352037,     0
##MAX=       3134.00615467022, 333922994,    0
$$ Real data points
##PAGE= N=1
##DATA TABLE= (X++(R..R)), XYDATA
$$ [...]
$$ plain form
8708 1006460 973110 960729 916991 875914 867605 856007 842278 823041 783520 757599 733389 703131
8696 703131 692538 693080 691116 678480 663517 721096 710958 739832 795533 782756 737198 770876
8684 770876 782407 771669 817978 777454 804259 852180 880838 871903 909975 960993 926385 903651
8672 903651 946331 1010102 1053046 1070496 1043141 1123127 1155911 1193418 1331760 1406340 1445594
8661 1445594 1537175 1685055 1799303 1899836 1979762 2060421 2182139 2237539 2259847 2263366 2241399
8650 2241399 2198073 2120952 2058237 1941517 1884553 1771689 1694111 1635081 1593261 1513316 1445492
8639 1445492 1431237 1464374 1498267 1512951 1446348 1471485 1562935 1625148 1792784 1842032 1958187
8628 1958187 2041514 2105849 2277770 2402138 2540965 2620109 2766891 2891947 2897750 2922044 2862243
$$ packed form
8708A006460l3350j2381m3738m1077q309j1598j3729j9237l9521k5921k4210l0258
8696G03131j0593N42j964j2636j4963N7579j0138K8874N5701j2777m5558L3678
8684G70876J1531j0738M6309m0524K6805M7921K8658q935L8072N1018l4608k2734
8672I03651M2680O3771M2944J7450k7355P9986L2784L7507J38342P4580L9254
8661A445594R1581J47880J14248J00533P9926Q0659J21718N5400K2308L519k1967
8650B241399m3326p7121o2715j16720n6964j12864p7578n9030m1820p9945o7824
8639A445492j4255L3137L3893J4684o6603K5137R1450O2213J67636M9248J16155
8628A958187Q3327O4335J71921J24368J38827P9144J46782J25056N803K4294n9801
$$ plain form
8617 2862243 2705852 2515683 2421919 2254269 2121441 1991340 1872109 1749493 1613600 1519100
8607 1519100 1403266 1293510 1224441 1205896 1203689 1161969 1152481 1187885 1124271 1045559 1064334
8596 1064334 1073910 1124091 1219694 1251525 1258880 1293604 1327168 1358882 1314306 1312289 1347393 1321794
8584 1321794 1243277 1178829 1177728 1113932 1018079 929854 889867 746063 602535 540639 413560
8573 413560 534293 529481 541099 518353 559445 533163 452886 463987 407478 384889 337039 405405
8561 405405 414028 382807 318937 301513 325664 296311 313557 327530 279431 303059 338646 283092
8549 283092 234493 283306 226805 198412 219908 268855 243966 211984 200932 169951 183182 150125
8537 150125 167513 184530 154742 170757 177948 205250 156220 131857 149175 216571 204469 180505
$$ packed form
8617B862243j56391j90169r3764j67650j32828j30101j19231j22616j35893r4500
8607A519100j15834j09756o9069j8545k207m1720r488L5404o3614p8712J8775
8596A064334R576N0181R5603L1831P355L4724L3564L1714m4576k017L5104k5599
8584A321794p8517o4448j101o3796r5853q8225l9987j43804j43528o1896j27079
8573D13560J20733m812J1618k2746M1092k6282q0277J1101n6509k2589m7850O8366
8561D05405Q623l1221o3870j7424K4151k9353J7246J3973m8099K3628L5587n5554
8549B83092m8599M8813n6501k8393K1496M8947k4889l1982j1052l0981J3231l3057
8537A50125J7388J7017k9788J6015P191K7302m9030k4363J7318O7396j2102k3964
$$ plain form
8525 180505 183085 168187 155934 157042 166278 202350 206089 225982 169934 132594 174030 154020
8513 154020 163042 133323 89089 90907 125437 132576 131314 148805 140919 131261 140451 88126 93048
8500 93048 89467 156522 66195 8287 59498 77510 113751 95065 127670 136334 89612 80011
8488 80011 83847 164063 155192 98462 66143 96685 128708 72010 42275 39888 93002 100191 153480
8475 153480 104434 81544 109910 76186 65960 80234 33957 -167 60913 80338 61053 50973
8463 50973 62543 33884 4561 32326 14223 51174 23759 42359 56870 21098 69287 84752
8451 84752 85928 48858 53947 70925 49377 26832 39516 55301 76344 34840 37410 96126
8439 96126 79450 59628 87515 87279 55708 75061 62351 7983 29609 5410 2106 -13457
$$ packed form
8525A80505K580j4898j2253J108R236L6072L739J9893n6048l7340M1436k0010
8513A54020R022k9719m4234J818L4530P139j262J7491p886r658R190n2325M922
8500I3048l581O7055r0327n7908N1211J8012L6241j8686L2605Q664m6722r601
8488H0011L836Q0216q871n6730l2319L0542L2023n6698k9735k387N3114P189N3289
8475A53480m9046k2890K8366l3724j0226J4274m6277l4124O1080J9425j9285j0080
8463E0973J1570k8659k9323K7765j8103L6951k7415J8600J4511l5772M8189J5465
8451H4752J176l7070N089J6978k1548k2545J2684J5785K1043m1504K570N8716
8439I6126j6676j9822K7887k36l1571J9353j2710n4368K1626k4199l304j5563
$$ plain form
8427 -13457 -20239 25130 26036 46341 3296 25933 63223 37786 37461 25533 28776 1012 31271
8414 31271 38424 13259 68565 64728 70917 34996 10372 -12950 -14639 -4027 -10017 -241 -15145
8401 -15145 17503 21778 17262 25275 14112 -22481 53424 62029 48891 60278 42782 36734 39476
8388 39476 25938 18165 1832 -4442 7994 -27234 -33986 -18190 12601 37265 -19390 -69187
8376 -69187 -53626 -124 -8496 15520 -5160 38178 54088 22265 38389 16129 13277 8368
8364 8368 -23195 -3779 27362 -35548 6953 1186 -21614 15243 27538 46935 50996 31845
8352 31845 2713 25027 36886 730 257 5920 -2977 -17060 -15174 14530 8128 3639 33008
8339 33008 31096 71178 33300 -8543 32927 41107 -899 37264 27855 33576 21471 39270 31808
$$ packed form
8427a3457o782M5369R06K0305m3045K2637L7290k5437l25j1928L243k7764L0259
8414C1271P153k5165N5306l837O189l5921k4624k3322j689J0612n990R776j4904
8401a5145L2648M275m516Q013j1163l6593P5905Q605j3138J1387j7496o048K742
8388C9476j3538p773j6333o274J2436l5228o752J5796L0791K4664n6655m9797
8376f9187J5561N3502q372K4016k0680M3338J5910l1823J6124k2260k852m909
8364H368l1563J9416L1141o2910M2501n767k2800L6857J2295J9397M061j9151
8352C1845k9132K2314J1859l6156m73N663q897j4083J886K9704o402m489K9369
8339C3008j912M0082l7878m1843M1470Q180m2006L8163r409N721j2105J7799p462
$$ plain form
8326 31808 -341 12232 7469 -10213 12 2225 -27348 10753 50202 88053 77063 60965
8314 60965 49811 20182 -5219 23004 8236 5255 55719 15430 -3216 54623 38608 -14346
8302 -14346 -37705 -35087 18804 12541 -5494 -5514 -2411 28034 55148 90189 111250 67541 56143
8289 56143 47528 36206 671 1834 20735 22156 28751 -9080 24602 43962 19437 37787 56392
8276 56392 39988 2505 6157 16502 32228 34192 6961 23021 10436 -27335 -17389 -3751
8264 -3751 4291 15139 -6622 -32884 -26865 -7891 23186 12702 40316 35658 6567 -6957 -5384
8251 -5384 56863 39711 25794 -5597 59491 51300 28006 59853 24672 -47553 -46489 -13236
8239 -13236 768 29305 115146 82377 53261 133966 93032 21992 -25473 -7207 37528 16437
$$ packed form
8326C1808l2149J2573m763j7682J0225K213k9573L8101L9449L7851j0990j6098
8314F0965j1154k9629k5401K8223j4768k981N0464m0289j8646N7839j6015n2954
8302a4346k3359K618N3891o263j8035k0L103L0445K7114L5041K1061m3709j1398
8289E6143q615j1322l5535J163J8901J421O595l7831L3682J9360k4525J8350J8605
8276E6392j6404l7483L652J0345J5726J964k7231J6060j2585l7771R946J3638
8264c751Q042J0848k1761k6262O019J8974L1077j0484K7614m658k9091j3524J573
8251e384O2247j7152j3917l1391O5088q191k3294L1847l5181p2225J064L3253
8239a3236J4004K8537Q5841l2769k9116Q0705m0934p1040m7465J8266M4735k1091
$$ plain form
8227 16437 48702 82118 76879 71460 47953 28507 -2481 13447 59653 8567 8870 13280 23404
8214 23404 34947 59390 40485 22872 114732 69047 8589 27752 30615 -6730 26429 2206
8202 2206 73686 63927 24126 27337 39621 -31141 -50135 -72580 -25150 -352037 -145771 364458
8190 364458 258825 236317 132514 74279 103525 224005 136998 112849 110635 129741 109109
8179 109109 103205 118452 110507 134782 169575 193765 164753 114488 161762 148107 169263 187354
8167 187354 166919 152122 154390 171182 181537 155320 112076 150996 181211 167706 160547 173129
8155 173129 146215 155347 185691 203648 192079 204092 194682 186771 176088 235096 245845 265046
8143 265046 275500 245421 277685 285138 298348 295268 306260 378937 397016 375408 394292 371968
$$ packed form
8227A6437L2265L3416n239n419k3507j9446l0988J5928M6206n1086L03M410J0124
8214B3404J1543K4443j8905j7613R1860m5685o0458J9163K863l7345L3159k4223
8202B206P1480r759l9801L211J2284p0762j8994k2445M7430l26887K06266N10229
8190C64458j05633k2508j03803n8235K9246J20480q7007k4149k214J9106k0632
8179A09109n904J5247p945K4275L4793K4190k9012n0265M7274j3655K1156J8091
8167A87354k0435j4797K268J6792J0355k6217m3244L8920L0215j3505p159J2582
8155A73129k6914R132L0344J7957j1569J2013r410p911j0683N9008J0749J9201
8143B65046J0454l0079L2264P453J3210l080J0992P2677J8079k1608J8884k2324
$$ plain form
8131 371968 377214 419372 449868 451986 441126 525920 555580 525616 543119 573240 619019 624814
8119 624814 625603 691182 736289 750816 733766 752846 827213 898758 929012 936227 1009272 1087225
8107 1087225 1168899 1251371 1281597 1361350 1500667 1622070 1718235 1890257 2121238 2352819
8097 2352819 2558626 2821088 3245162 3777938 4328855 4942452 5496176 5778475 5815217 5504926
8087 5504926 5042998 4586545 4075514 3574934 3101514 2710278 2454401 2185168 1920960 1771734
8077 1771734 1584703 1488005 1378473 1210835 1092336 1036999 1007780 949947 827069 820375 806687
8066 806687 786756 711426 661677 656535 634061 567458 512168 502562 500654 510548 474295 480116 456788
8053 456788 440752 444564 408332 367406 363012 326809 275390 270040 296877 255539 226514 242675
$$ packed form
8131C71968N246M2158L0496K118j0860Q4794K9660k9964J7503L0121M5779N795
8119F24814P89O5579M5107J4527j7050J9080P4367P1545L0254P215P3045P7953
8107A087225Q1674Q2472L0226P9753J39317J21403R6165J72022K30981K31581
8097B352819K05807K62462M24074N32776N50917O13597N53724K82299L6742l10291
8087E504926m61928m56453n11031n00580m73420l91236k55877k69233k64208j49226
8077A771734j87031r6698j09532j67638j18499n5337k9219n7833j22878o694j3688
8066H06687j9931p5330m9749n142k2474o6603n5290r606j908R894l6253N821k3328
8053D56788j6036L812l6232m0926m394l6203n1419n350K6837m1338k9025J6161
$$ plain form
8041 242675 246954 237734 257647 268351 289314 281583 216871 211853 179359 199853 221168 171208
8029 171208 161734 166374 158997 155785 176819 159193 133157 118972 84678 91178 118510 141345 150053
8016 150053 159595 134228 104355 105182 56539 22693 18814 38914 116165 126371 35396 74538
8004 74538 84329 56596 65446 79009 103291 78878 66362 49145 35500 63623 51278 15151
7992 15151 -21698 1452 75689 90128 69617 24164 -8702 32915 4111 49729 110666 42134
7980 42134 19102 70810 22891 45060 58189 43458 22570 -4927 54967 70411 30547 29368
7968 29368 -11538 -32354 -42213 15464 71560 31335 14565 16174 19907 1103 33650 36156 22533
7955 22533 19280 -9699 19443 100093 102514 71989 78061 20661 -11917 -24313 28113 11989
$$ packed form
8041B42675M279r220J9913J0704K0963p731o4712n018l2494K0494K1315m9960
8029A71208r474M640p377l212K1034j7626k6036j4185l4294O500K7332K2835Q708
8016A50053R542k5367k9873Q27m8643l3846l879K0100P7251J0206r0975L9142
8004G4538R791k7733Q850J3563K4282k4413j2516j7217j3645K8123j2345l6127
7992A5151l6849K3150P4237J4439k0511m5453l2866M1617k8804M5618O0937o8532
7980D2134k3032N1708m7919K2169J3129j4731k0888k7497N9894J5444l9864j179
7968B9368m0906k0816r859N7677N6096m0225j6770J609L733j8804L2547K506j3623
7955B2533l253k8979K9142Q0650K421l0525O072n7400l2578j2396N2426j6124
$$ plain form
7943 11989 33765 22578 12216 15599 25073 9414 -10040 -31767 -27624 -44190 -60350 -21774
7931 -21774 -6647 9854 49559 59334 12632 -1190 11158 20373 11390 8459 -15444 6109 -2129
7918 -2129 5389 -22121 11872 -1791 31477 7087 16747 -20336 -47111 -24021 23664 24797 30900
7905 30900 -1491 -20470 5824 28664 31149 -339 8443 15828 -12168 4772 36405 48074
7893 48074 -16476 12739 -7204 -26633 -12401 -3604 33404 -16687 -15736 -571 24495 1189
7881 1189 19738 -20126 -51407 -52107 -32292 -60149 -45296 32004 6368 63656 56997 32208 16310
7868 16310 515 -13238 -14959 -5315 11401 -9337 1993 -32061 -27859 -24763 -31707 -28689 -92534
7855 -92534 -93054 -41816 -13591 -4720 -3762 -33488 5952 -35881 -24752 -38304 -70532 -54670 -10864
$$ packed form
7943A1989K1776j1187j0362L383R474j5659j9454k1727M143j6566j6160L8576
7931b1774J5127J6501L9705R775m6702j3822J2348R215q983k931k3903K1553q238
7918b129P518k7510L3993j3663L3268k4390R660l7083k6775K3090M7685J133O103
7905C0900l2391j8979K6294K2840K485l1488Q782P385k7996J6940L1633J1669
7893D8074o4550K9215j9943j9429J4232Q797L7008n0091R51J5165K5066k3306
7881A189J8549l9864l1281p00J9815k7857J4853P7300k5636N7288o659k4789j5898
7868A6310j5795j3753j721R644J6716k0738J1330l4054M202L096o944L018o3845
7855i2534n20N1238K8225Q871R58k9726L9440m1833J1129j3552l2228J5862M3806
$$ plain form
7842 -10864 25457 84894 96174 64015 40962 -21997 26861 40757 -11446 -18409 39860 72019
7830 72019 32585 -9439 -78130 -40259 -25245 6916 -16800 -14682 -15321 -19776 -4126 -17932 -51530
7817 -51530 -32643 -25535 -17221 47276 5953 61990 119110 -16758 -48887 -15746 5860 -34125
7805 -34125 -77613 -25134 -7238 -40999 -67494 -12437 17918 16893 59724 43865 -16191 -28229
7793 -28229 12200 -4214 -3493 11686 -11870 -13761 -27227 -12235 -18762 -5414 9909 13122 -11946
7780 -11946 -39473 10004 -2125 -1363 15017 -40714 -13071 -7814 28055 37027 37445 26220 -18732
7767 -18732 -8925 -37758 19958 -46497 -45596 -48772 -36852 -23940 -16734 -26197 -36756 -1911 -27943
7754 -27943 5157 -4858 21113 14885 19539 45577 79961 49349 1183 13083 81632 38636
$$ packed form
7842a0864L6321N9437J1280l2159k3053o2959M8858J3896n2203o963N8269L2159
7830G2019l9434m2024o8691L7871J5014L2161k3716K118o39m455J5650j3806l3598
7817e1530J8887P108Q314O4497m1323N6037N7120j35868l2129L3141K1606l9985
7805c4125m3488N2479J7896l3761k6495N5057L0355j025M2831j5859o0056j2038
7793b8229M0429j6414P21J5179k3556j891j3466J4992o527J3348J5323L213k5068
7780a1946k7527M9477j2129P62J6380n5731K7643N257L5869Q972M18j1225m4952
7767a8732R807k8833N7716o6455R01l176J1920J2912P206r463j0559L4845k6032
7754b7943L3100j0015K5971o228M654K6038L4384l0612m8166J1900O8549m2996
$$ plain form
7742 38636 16696 -1353 -40296 18661 -1357 -5010 -43586 -31129 -2443 -41851 -34252 -15649
7730 -15649 -14415 11180 -3192 -42113 -29266 -9264 56440 19433 -84558 -56125 -23117 -36404
7718 -36404 -18156 -4192 -32055 27875 59793 13783 -16429 -48174 -26079 45571 74097 92698
7706 92698 73147 18219 -10882 -55345 -4514 61843 63175 3389 -31536 -44067 -22076 33590
7694 33590 54874 54933 77597 99103 8809 -8451 -854 -33088 -51309 -58900 -48152 -20191 12251
7681 12251 -2259 -2003 15728 37382 -2925 -21554 -39021 -57302 -21064 -35576 -64811 -15536
7669 -15536 -47511 -72583 -26396 10559 -16254 -18675 8082 55530 59234 70829 43398 22746
7657 22746 4602 -24666 -55332 -15967 -34115 -44982 -27855 -1313 9419 12021 -18075 -20181
$$ packed form
7742C8636k1940j8049l8943N8957k0018l653l8576J2457K8686l9408P599J8603
7730a5649J234K5595j4372l8921J2847K0002O5704l7007j03991K8433L3008j3287
7718c6404J8248J3964k7863N9930L1918m6010l0212l1745K2095P1650K8526J8601
7706I2698j9551n4928k9101m4463N0831O6357J332n9786l4925j2531K1991N5666
7694C3590K1284N9K2664K1506r0294j7260P597l2234j8221p591J0748K7961L2442
7681A2251j4510K56J7731K1654m0307j8629j7467j8281L6238j4512k9235M9275
7669a5536l1975k5072M6187L6955k6813k421K6757M7448L704J1595k7431k0652
7657B2746j8144k9268l0666L9365j8148j0867J7127K6542J0732K602l0096k106
$$ plain form
7645 -20181 13057 7746 6886 -978 8514 -5317 -17718 -2992 -1499 -60135 -103252 -56975 -58945
7632 -58945 -66238 -63811 -51132 -18055 6960 -29896 -60477 -407 -22071 -44711 -67873 -75357
7620 -75357 -71268 -31420 -52145 8793 48951 -9338 -3937 18048 -8266 -40847 758 19012
7608 19012 19862 18411 -12240 13549 -13522 -9835 -18868 12348 -16757 -9852 -5048 -1810 -45334
7595 -45334 -20627 16078 4698 -41191 1590 16612 64673 52812 34435 9105 -14952 8083
7583 8083 48417 74121 13400 -19677 23134 21101 -8057 -28856 -55390 -27926 4651 56005
7571 56005 27589 1641 -25645 -7943 -3519 22277 2624 13954 17194 45154 4749 -18613
7559 -18613 39373 83846 26405 -15856 -20226 5696 29237 13482 23951 10874 8722 -24147
$$ packed form
7645b0181L3238n311q60p864R492j3831j2401J4726J493n8636m3117M6277j970
7632e8945p293K427J2679L3077K5015l6856l0581O0070k1664k2640k3162p484
7620g5357M089L9848k0725O0938M0158n8289N401K1985k6314l2581M1605J8254
7608A9012Q50j451l0651K5789k7071L687r033L1216k9105O905M804L238m3524
7595d5334K4707L6705j1380m5889M2781J5022M8061j1861j8377k5330k4057K3035
7583H083M0334K5704o0721l3077M2811k033k9158k0799k6534K7464L2577N1354
7571E6005k8416k5948k7286J7702M424K5796j9653J1330L240K7960m0405k3362
7559a8613N7986M4473n7441m2261m370K5922K3541j5755J0469j3077k152l2869
$$ plain form
7547 -24147 21188 24989 53805 28075 -47360 -33002 -21623 -35020 -22095 -44687 -74140 -21326
7535 -21326 53808 -1486 -18297 -11356 -289 36262 -1914 -3449 -47099 -9706 -19774 -18081
7523 -18081 -6926 -30625 -78575 -83028 -19880 -38783 -17831 -7559 -14904 1065 -59077 -26144
7511 -26144 645 -42822 -25820 -7113 -46824 -46728 -35503 5466 -31903 -11949 -11780 -58757 -81881
7498 -81881 -28341 7151 -26524 -37494 -12674 -74118 20321 19084 17822 38650 50682 42076
7486 42076 -16697 -15599 9102 -4461 19457 29864 7594 73759 19863 -33 -45619 -5566
7474 -5566 19050 -23806 -40406 -26637 -56529 -14412 -20795 -54824 -51155 23806 39373 -30163
7462 -30163 -31235 -23427 -36024 -40025 -10482 9446 -19045 -97340 -97986 -74643 -39583 2101 -57553
$$ packed form
7547b4147M5335L801K8816k5730p5435J4358J1379j3397J2925k2592k9453N2814
7535b1326P5134n5294j6811O941J1067L6551l8176j535m3650L7393j0068J693
7523a8081J1155k3699m7950m453O3148j8903K0952J0272p345J5969o0142L2933
7511b6144K6789m3467J7002J8707l9711R6J1225M0969l7369J9954J69m6977k3124
7498h1881N3540L5492l3675j0970K4820o1444R4439j237j262K0828J2032q606
7486D2076n8773J098K4701j3563K3918J0407k2270O6165n3896j9896m5586M0053
7474e566K4616m2856j6600J3769k9892M2117o383l4029L669P4961J5567o9536
7462c0163j072P808j2597m001K9543J9928k8491p8295o46K3343L5060M1684n9654
$$ plain form
7449 -57553 -61535 -36570 -7503 701 4851 -30620 -19621 -5580 -18494 -19156 24993 36406 43648
7436 43648 -54288 -74403 6250 2333 -6091 8785 22403 27240 35489 -10742 -51297 -23063 -10341
7423 -10341 30490 35136 47052 6531 -13898 -23774 -12405 -7319 9388 13308 -2126 3312 -16441
7410 -16441 -27487 190 19862 -7811 -16063 -39341 -29821 -35074 -51392 519 22875 6161
7398 6161 33518 24469 2435 -52097 -24792 -49144 -69081 -22200 4483 -17150 -21404 16861
7386 16861 -24717 -18926 19354 34343 36782 2614 45063 12198 28538 -29817 -58713 -39152
7374 -39152 15860 -156 -12830 -19749 -12899 -1438 -27183 -9914 38899 22132 -7187 -20263
7362 -20263 6371 -19016 -309 30646 45205 29428 19961 12061 -35515 -59222 -65839 -51984
$$ packed form
7449e7553l982K4965K9067Q204M150l5471J0999J4041j2914o62M4149J1413P242
7436D3648r7936k0115Q0653l917q424J4876J3618M837Q249m6231m0555K8234J2722
7423a0341M0831M646J1916m0521k0429r876J1369N086J6707L920j5434N438j9753
7410a6441j1046K7677J9672k7673q252k3278R520n253j6318N1911K2356j6714
7398F161K7357r049k2034n4532K7305k4352j9937M6881K6683k1633m254L8265
7386A6861m1578N791L8280J4989K439l4168M2449l2865J6340n8355k8896J9561
7374c9152N5012j6016j2674o919O850J1461k5745J7269M8813j6767k9319j3076
7362b0263K6634k5387J8707L0955J4559j5777r467p900m7576k3707o617J3855
$$ plain form
7350 -51984 -72313 -37165 -22230 4786 -33729 -39952 -58226 -53250 -100382 -75681 -81492 -44039
7338 -44039 2718 -9398 -77786 -58300 -4956 -26796 -23159 -8718 -5063 -18574 -11098 33070
7326 33070 54771 35644 9322 -40320 -25159 -71227 -59001 -22101 -7791 -16664 -51901 -26239
7314 -26239 -22275 -35162 10708 8891 3516 37424 -15394 -14762 -8380 69990 71649 36374 1110
7301 1110 -21626 11400 -26926 -10281 3071 -15229 -36045 -29506 4088 19070 -36032 -57447
7289 -57447 27942 -8822 12284 20795 8285 24111 -16967 6453 29468 -10770 11763 44824
7277 44824 9358 33074 -14835 -49552 -59611 -50190 -6144 3830 1935 13190 29804 27610 8427
7264 8427 35450 41100 37432 14206 11706 13595 18654 -19424 -16464 -3286 -10882 51816 52249 41365
$$ packed form
7350e1984k0329L5148J4935K7016l8515o223j8274M976m7132K4701n811L7453
7338d4039M6757j2116o8388J9486N3344k1840L637J4441L655j3511P476M4168
7326C3070K1701j9127k6322m9642J5161m6068J2226L6900J4310q873l5237K5662
7314b6239L964j2887M5870j817n375L3908n2818O32O382P8370J659l5275l5264
7301A110k2736L3026l8326J6645J3352j8300k0816O539L3594J4982n5102k1415
7289e7447Q5389l6764K1106Q511j2510J5826m1078K3420K3015m0238K2533L3061
7277D4824l5466K3716m7909l4717j0059R421M4046R974j895J1255J6614k194j9183
7264H427K7023N650l668k3226k500J889N059l8078K960J3178p596O2698M33j0884
$$ plain form
7250 41365 104958 47905 17202 22841 -9414 -25177 -9048 -12089 -17709 -33710 5019 -32532
7238 -32532 -40647 20284 -2810 8122 -31436 12179 395 12811 10636 41181 42211 3867
7226 3867 -32272 -9146 -9674 -17117 930 -31285 3309 6061 -26393 14018 1853 -16151 -46719
7213 -46719 -75456 -33369 14075 -31427 -38148 17287 -18778 -43004 -29950 15370 -18814 -26844
7201 -26844 -44139 -45182 9791 -21305 -1989 -20965 -29393 50739 37145 20407 5051 -25935
7189 -25935 -48795 -24524 40202 14673 -8986 -13287 -9343 -39234 -20413 2099 -32160 -2533
7177 -2533 -1157 -48427 -17101 11374 -35537 -3178 14976 43148 -5535 -25670 -24425 -10504
7165 -10504 -52247 -94217 -45649 -51726 6915 57496 41231 43549 58718 33895 10798 -23508
$$ packed form
7250D1365O3593n7053l0703N639l2255j5763J6129l041n620j6001L8729l7551
7238c2532q115O0931k3094J0932l9558M3615j1784J2416k175L0545J030l8344
7226C867l6139K3126n28p443J8047l2215L4594K752l2454M0411j2165j8004l0568
7213d6719k8737M2087M7444m5502o721N5435l6065k4226J3054M5320l4184q030
7201b6844j7295j043N4973l1096J9316j8976q428Q0132j3594j6738j5356l0986
7189b5935k2860K4271O4726k5529k3659m301L944k9891J8821K2512l4259K9627
7177b533J376m7270L1326K8475m6911L2359J8154K8172m8683k0135J245J3921
7165a0504m1743m1970M8568o077N8641N0581j6265K318J5169k4823k3097l4306
$$ plain form
7153 -23508 -38605 -42356 -73481 -27388 -57344 -48635 -18548 41267 25086 -771 466 5254 32968
7140 32968 -22781 -51417 -8474 28104 30277 33041 46074 30417 -14890 29006 45910 22484
7128 22484 7180 -5078 1976 18257 1838 -33319 -24032 -24292 10050 60668 51107 70463 5884
7115 5884 -38952 -29882 -42814 -57132 -13717 -30463 -29570 -28320 -28853 15514 24637 20319 -47811 -15792
7101 -15792 -1593 -11126 8936 58729 102863 79003 6093 1960 36715 32395 18500 37275
7089 37275 31437 17388 40225 -19305 -6080 -30551 -30869 -36850 17854 3411 14860 -8187 -195
7076 -195 53822 28491 47268 8199 -47902 -40953 -36401 -14787 -17347 -4040 -35703 -81694 -69434
7063 -69434 -36665 15601 11278 47342 19889 55653 7421 -24268 -805 37036 563 -4917
$$ packed form
7153b3508j5097l751l1125M6093k9956Q709L0087N9815j6181k5857J237M788K7714
7140C2968n5749k8636M2943L6578K173K764J3033j5657m5307M3896J6904k3426
7128B2484j5304j2258P054J6281j6419l5157R287k60L4342N0618r561J9356o4579
7115E884m4836R070j2932j4318M3415j6746Q93J250n33M4367R123m318o8130L2019
7101a5792J4199r533K0062M9793M4134k3860p2910m133L4755m320j3895J8775
7089C7275n838j4049K2837n9530J3225k4471l18n981N4704j4443J1449k3047P992
7076a95N4017k5331J8777l9069n6101O949M552K1614k560J3307l1663m5991J2260
7063f9434L2769N2266m323L6064k7453L5764m8232l1689K3463L7841l6473n480
$$ plain form
7051 -4917 73374 59501 23559 64592 70614 57134 37695 -10845 -9696 -24112 -19013 12355 61762
7038 61762 2071 13652 4457 -12838 -2791 25491 1071 -42917 17728 38500 -11589 -12480
7026 -12480 -49818 -75953 -58499 -53065 -1293 -23774 -43202 -5992 5819 -33284 -29784 -38479
7014 -38479 -12063 -65935 -55778 -26528 -38684 -30465 -32890 -35674 -11450 7170 -16671 12423
7002 12423 2310 4088 12336 8902 -3375 15895 30246 -1141 12282 5218 -7640 16394 -12814
6989 -12814 -18387 -55546 -37575 50687 50147 -27329 -35082 12660 8438 -1036 -28085 -69055 -9059
6976 -9059 31502 23102 3533 26108 40954 44258 8193 -40290 -35453 -63044 -41316 -39915 -16507
6963 -16507 51834 43982 -31053 -59036 -36168 10723 -8090 -15771 -41282 -22443 -75204 -6573
$$ packed form
7051d917P8291j3873l5942M1033O022j3480j9439m8540J149j4416N099L1368M9407
7038F1762n9691J1581r195j7295J0047K8282k4420m3988O0645K0772n0089q91
7026a2480l7338k6135J7454N434N1772k2481j9428L7210J1811l9103L500q695
7014c8479K6416n3872J0157K9250j2156Q219k425k784K4224J8620k3841K9094
7002A2423j0113J778Q248l434j2277J9270J4351l1387J3423p064j2858K4034k9208
6989a2814n573l7159J7971Q8262n40p7476p753M7742m222r474k7049m0970N9996
6976i059M0561q400j9569K2575J4846L304l6065m8483M837k7591K1728J401K3408
6963a6507O8341p852p5035k7983K2868M6891j8813p681k5511J8839n2761O8631
$$ plain form
6951 -6573 3452 -37067 -20014 -25788 -2520 -44382 -78773 -42624 4709 15061 8292 48408
6939 48408 59680 73370 29502 41368 22799 6477 -6369 -23894 -28974 -1576 38164 -2289
6927 -2289 -33766 -52627 11249 9640 14527 20864 13588 -17829 -33808 -16018 -2575 -36578 -12018
6914 -12018 6055 -9144 1399 14938 54513 23922 7685 26172 3133 -21636 -21872 -7183
6902 -7183 -21428 -36040 -48347 -44921 4600 33444 -6577 -25956 -66289 -45252 -6708 -25598
6890 -25598 -73634 -34728 17053 43337 5712 22451 52366 33772 11933 47790 35644 8528
6878 8528 -3822 -23231 -50527 -6837 -26536 -13633 -15219 -21200 -45144 -55968 -72684 -36001
6866 -36001 8114 -9512 -18339 -49101 1471 12516 10889 29173 -16826 -40243 -6967 -6036 -9356
$$ packed form
6951f573J0025m0519J7053n774K3268m1862l4391L6149M7333J0352o769M0116
6939D8408J1272J3690m3868J1866j8569j6322j2846j7525n080K7398L9740m0453
6927b289l1477j8861O3876j609M887O337p276l1417j5979J7790J3443l4003K4560
6914a2018J8073j5199J0543J3539L9575l0591j6237J8487k3039k4769k36J4689
6902g183j4245j4612j2307L426M9521K8844m0021j9379m0333K1037L8544j8890
6890b5598m8036L8906N1781K6284l7625J6739K9915j8594k1839L5857j2146k7116
6878H528j2350j9409k7296M3690j9699J2903j586n981k3944j0824j6716L6683
6866c6001M4115j7626q827l0762N0572J1045j627J8284m5999k3417L3276R31l320
$$ plain form
6853 -9356 6054 -3479 -5789 -12148 41043 23896 -27963 -3768 35148 82510 18558 -39702 -45642
6840 -45642 -10160 -8960 -8205 -21691 21861 -33783 -75475 -99262 -50937 -4871 7258 9455 -1755
6827 -1755 9434 -23093 -12800 -13654 3211 8223 9490 -17940 1265 -11066 6124 76713 9245
6814 9245 -6574 -48822 -35530 15886 42818 13523 27175 19498 5709 -19441 3410 3230 -9917
6801 -9917 1134 -55582 -69073 -37393 -20545 8611 -7915 17979 16166 -11235 -25711 -44259
6789 -44259 -58960 -51964 -22281 28393 30636 -1992 1523 -11947 28329 -4411 -23085 -11379
6777 -11379 -35886 -32940 -5390 -35915 -42925 13504 -65913 -41547 -7512 -23161 -13138 -45659
6765 -45659 -66012 -90522 -43593 -62231 -11106 13242 -63145 -8174 -36229 11754 52331 14122
$$ packed form
6853i356J5410r533k310o359N3191j7147n1859K4195L8916M7362o3952n8260n940
6840d5642L5482J200P55j3486M3552n5644m1692k3787M8325M6066J2129K197j1210
6827a755J1189l2527J0293q54J6865N012J267k7430J9205j2331J7190P0589o7468
6814I245j5819m2248J3292N1416K6932k9295J3652p677j3789k5150K2851j80j3147
6801i917J1051n6716j3491L1680J6848K9156j6526K5894j813k7401j4476j8548
6789d4259j4701O996K9683N0674K243l2628L515j3470M0276l2740j8674J1706
6777a1379k4507K946K7550l0525p010N6429p9417K4366L4035j5649J0023l2521
6765d5659k0353k4510M6929j8638N1125K4348p6387N4971k8055M7983M0577l8209
$$ plain form
6753 14122 6614 -33741 -35156 -36675 -39312 -59856 -43015 -11045 5935 40677 28911 29370 -4755
6740 -4755 8332 70564 33641 20080 -3280 44540 54914 43082 25650 6593 -47223 -24559
6728 -24559 -19513 -23069 -24238 13557 23217 788 -31535 -3747 -4435 -10606 -52151 -365 25452
6715 25452 8395 24754 16330 36063 46523 65053 49007 57012 24895 -16715 -12460 -7682 44520
6702 44520 44900 33360 -9689 4886 8305 1571 27881 18262 29559 22808 21164 11400 10184 55530
6688 55530 48835 30650 41631 -9553 -10073 33239 32592 32836 33796 31786 32708 48040 56537 6905
6674 6905 26088 9053 22739 4636 37146 21972 19922 43466 65218 -8480 -14278 -30419
6662 -30419 -62390 -56185 -32712 -39726 -4694 57135 15210 -21953 4957 62762 41791 -11751
$$ packed form
6753A4122p508m0355j415j519k637k0544J6841L1970J6980L4742j1766M59l4125
6740d755J3087O2232l6923j3561k3360M7820J0374j1832j7432j9057n3816K2664
6728b4559N046l556j169L7795R660k2429l2323K7788o88o171m1545N1786K5817
6715B5452j7057J6359q424J9733J0460J8530j6046Q005l2117m1610M255M778N2202
6702D4520L80j1540m3049J4575L419o734K6310r619J1297o751j644r764j216M5346
6688E5530o695j8185J0981n1184n20M3312o47K44R60k010R22J5332Q497m9632
6674F905J9183j7035J3686j8103L2510j5174k050K3544K1752p3698n798j6141
6662c0419l1971O205K3473p014L5032O1829m1925l7163K6910N7805k0971n3542
$$ plain form
6650 -11751 -36921 -23008 -10169 -14864 -41914 -13040 8101 -5838 7083 11187 46387 3043
6638 3043 -2101 52264 -12527 -15981 10703 -5156 17019 -7345 -32517 -23173 2822 76431 30322
6625 30322 -54298 -22992 -32623 -66148 -4092 46120 -5462 11433 10313 29778 33239 36944 41306
6612 41306 -2182 44934 63951 32417 -21724 -17271 -22012 -17621 8806 32066 9283 4975 30531
6599 30531 55013 30307 48504 22977 -16302 -2706 -6328 -48097 -39055 -4422 2995 -15176
6587 -15176 -74007 -26830 40080 55978 55361 -2077 -14564 -48023 -43145 1066 28290 -28410
6575 -28410 -75602 -79129 16009 50576 23068 15751 32758 32388 19069 33640 16685 43371 45318
6562 45318 -13841 -65399 -30170 -37036 -50544 52596 80732 25992 19868 25626 44111 3640
$$ packed form
6650a1751k5170J3913J2839m695k7050K8874K1141j3939J2921M104L5200m3344
6638C043n144N4365o4791l454K6684j5859K2175k4364k5172R344K5995P3609m6109
6625C0322q4620L1306r631l3525O2056N0212n1582J6895j120J9465L461L705M362
6612D1306m3488M7116J9017l1534n4141M453m741M391K6427K3260k2783m308K5556
6599C0531K4482k4706J8197k5527l9279J3596l622m1769R042L4633P417j8171
6587a5176n8831M7177O6910J5898o17n7438j2487l3459M878M4211K7224n6700
6575b8410m7192l527R5138L4567k7508p317J7007l70j3319J4571j6955K6686J947
6562D5318n9159n1558L5229o866j3508J03140K8136n4740o124N758J8485m0471
$$ plain form
6550 3640 -44060 -35871 -48051 -16052 17354 56944 63994 391 36693 18539 7312 -13181
6538 -13181 -25785 -63002 -26317 -41660 -16419 19309 36323 35382 -24341 -39813 23220 53912
6526 53912 44162 36260 15875 5675 -9016 -36251 -22042 -12987 13411 7536 6234 -11828 19983
6513 19983 14056 -12237 375 -3041 10418 1872 -7189 -30626 -33164 -15405 41856 29092 -19634
6500 -19634 -51330 36003 17211 39612 14189 15160 22939 30500 15017 53 17346 -11995 -62181
6487 -62181 -109020 -47216 11182 21871 59832 43702 8894 4552 -8992 -30643 35702 74755
6475 74755 5087 -16906 -53718 -73601 -55727 10939 -8242 -11890 -9550 -15830 24742 35697
6463 35697 29455 33231 10298 -12894 37797 51852 19414 2954 -256 6653 48774 56336 11246
$$ packed form
6550C640m7700Q189j2180L1999L3406L9590P050o3603L6302j8154j1227k0493
6538a3181j2604l7217L6685j5343K5241L5728J7014r41n9723j5472O3033L0692
6526E3912r750p902k0385j0200j4691k7235J4209R055K6398n875j302j8062L1811
6513A9983n927k6293J2612l416J3459q546r061k3437k538J7759N7261j2764m8726
6500a9634l1696Q7333j8792K2401k5423R71P779P561j5483j4964J7293k9341n0186
6487f2181m6839O1804N8398J0689L7961j6130l4808m342j3544k1651O6345L9053
6475G4755o9668k1993l6812j9883J7874O6666j9181l648K340o280M0572J0955
6463C5697o242L776k2933k3192N0691J4055l2438j6460l210O909M2121P562m5090
$$ plain form
6450 11246 19572 32414 1026 -14071 39938 85001 15613 -11485 -23297 7802 41266 17645
6438 17645 -33930 20517 6930 -21136 -34997 -5687 -11414 -35792 -40879 -67821 5493 31855
6426 31855 6980 -74654 -21817 15856 8927 2491 -13543 22360 53241 45611 38425 51755 -26709
6413 -26709 15214 83590 64185 37791 57415 64182 8168 26779 43464 3481 7635 41541
6401 41541 -1021 -69998 -58779 -4242 4949 -884 -13326 -6491 -8780 -2186 -27038 1056 -81170
6388 -81170 -69473 36492 15414 -11148 9394 31799 86399 98577 105038 44955 64665 73306
6376 73306 65849 76171 66446 12615 23134 377 -17240 36328 7782 13511 35915 14092
6364 14092 19031 26007 41115 8394 -10884 24257 25556 40588 38326 8541 -967 -11169 -34503
$$ packed form
6450A1246Q326J2842l1388j5097N4009M5063o9388k7098j1812L1099L3464k3621
6438A7645n1575N4447j3587k8066j3861K9310n727k4378n087k6942P3314K6362
6426C1855k4875q1634N2837L7673o929o436j6034L5903L0881p630p186J3330p8464
6413b6709M1923O8376j9405k6394J9624O767n6014J8611J6685l9983M154L3906
6401D1541m2562o8977J1219N4537R191n833j2442O835k289O594k4852K8094q2226
6388h1170J1697J05965k1078k6562K0542K2405N4600J2178O461o0083J9710Q641
6376G3306p457J0322r725n3831J0519k2757j7617N3568k8546N729K2404k1823
6364A4092M939O976J5108l2721j9278L5141J299J5032k262k9785r508j0202k3334
$$ plain form
6351 -34503 -37968 15662 20342 -14812 -21907 2528 14652 -20191 -945 35920 46846 15053
6339 15053 3002 5957 18627 -6658 30922 40911 21681 -16466 29212 75793 54554 28534
6327 28534 85300 55639 17562 -39493 4920 48155 90501 96987 58447 -10271 27639 81389
6315 81389 22795 15751 61100 97165 58559 64507 81947 30143 19895 86070 111642 83818
6303 83818 50033 4508 -3075 -17807 9757 -10946 13708 26772 284 511 1175 44857 -9664
6290 -9664 -3864 -14745 -11338 88944 96567 48219 -2644 -19398 29192 47868 26422 36669
6278 36669 38044 39127 22807 37687 26704 25805 53401 4576 13238 3860 68835 67034 30126
6265 30126 25653 19711 27804 66250 47651 86753 92818 50815 46185 29084 45442 56109 51797
$$ packed form
6351c4503l465N3630M680l5154p095K4435J2124l4843J9246L6865J0926l1793
6339A5053j2051K955J2670k5285L7580R989j9230l8147M5678M6581k1239k6020
6327B8534N6766k9661l8077n7055M4413M3235M2346O486l8540o8718L7910N3750
6315H1389n8594p044M5349L6065l8606N948J7440n1804j0248O6175K5572k7824
6303H3818l3785m5525p583j4732K7564k0703K4654J3064k6488K27O64M3682n4521
6290i664N800j0881L407J00282P623m8348n0863j6754M8590J8676k1446J0247
6278C6669J375J083j6320J4880j0983q99K7596m8825Q662r378O4975j801l6908
6265C0126m473n942Q093L8446j8599L9102O065m2003m630j7101J6358J0667m312
$$ plain form
6252 51797 57600 14386 73741 47480 11460 40511 9189 16537 49490 33231 11666 52869
6240 52869 76878 93276 36566 48198 70320 -4728 45105 82310 73024 105011 158172 102330
6228 102330 -5468 -20690 66299 57788 52958 -61 -30016 19654 39823 33665 45691 -13675
6216 -13675 -10293 27204 49191 48405 22972 64687 21748 64317 15298 13992 42972 54758 65555
6203 65555 67178 2484 7794 31553 14297 14021 7704 -35129 -15190 -20073 45756 91935 63879
6190 63879 74100 21325 -7132 13291 6322 35438 3050 -15646 -10158 6179 37053 2159
6178 2159 -7319 11680 60188 22859 29748 25910 38579 37052 55139 28959 59770 61441 46975
6165 46975 62580 38397 29929 37941 63553 10474 2684 2208 -18155 -21234 -35909 -8376 32635
$$ packed form
6252E1797N803m3214N9355k6261l6020K9051l1322P348L2953j6259k1565M1203
6240E2869K4009J6398n6710J1632K2122p5048M9833L7205r286L1987N3161n5842
6228A02330j07798j5222Q6989q511m830n3019k9955M9670K0169o158J2026n9366
6216a3675L382L7497K1987p86k5433M1715m2939M2569m9019j306K8980J1786J0797
6203F5555J623o4694N310K3759j7256k76o317m2833J9939m883O5829M6179k8056
6190F3879J0221n2775k8457K0423o969K9116l2388j8696N488J6337L0874l4894
6178B159r478J8999M8508l7329O889l838J2669j527J8087k6180L0811J671j4466
6165D6975J5605k4183q468Q012K5612n3079p790m76k0363l079j4675K7533M1011
$$ plain form
6152 32635 -11701 24766 30484 12116 56415 87453 48601 28047 12150 1364 17624 25572
6140 25572 39786 38706 20824 8049 30811 65139 4027 -10744 -16061 -9829 7242 -34901
6128 -34901 -8282 57688 93300 65557 32924 32821 31281 20913 7901 43134 34733 -27305 -16261
6115 -16261 -22487 22085 70699 60169 55995 25428 24012 39750 -15140 -19339 -33869 8659 4452
6102 4452 26196 46250 -11327 33272 65056 4309 32213 57060 31595 -3861 4064 48377
6090 48377 14024 -10670 24904 15509 -6674 1815 87133 62767 49352 63326 50618 51070 50302
6077 50302 76141 44629 51247 9963 39478 61435 35116 25103 -36945 -21511 25729 69424
6065 69424 81638 47945 95673 86359 47731 37857 30282 30648 44512 19860 -20062 7914 34274
$$ packed form
6152C2635m4336L6467N718j8368M4299L1038l8852k0554j5897j0786J6260P948
6140B5572J4214j080j7882j2775K2762L4328o1112j4771n317O232J7071m2143
6128c4901K6619O5970L5612k7743l2633j03j540j0368j3012L5233q401o2038J1044
6115a6261o226M4572M8614j0530m174l0567j416J5738n4890m199j4530M2528m207
6102D452K1744K0054n7577M4599L1784o0747K7904K4847k5465l5456P925M4313
6090D8377l4353k4694L5574r395k2183Q489Q5318k4366j3415J3974j2708M52p68
6077E0302K5839l1512O618m1284K9515K1957k6319j0013o2048J5434M7240M3695
6065F9424J2214l3693M7728r314l8628r874p575L66J3864k4652l9922K7976K6360
$$ plain form
6052 34274 49232 8140 26401 47921 47341 52863 39248 38538 -7560 39430 35977 86202 76373
6039 76373 72501 46766 42276 64751 60072 32829 -6320 4304 68825 86877 42153 10732
6027 10732 -7739 38502 71308 51624 10492 -37 -33646 14431 77205 19089 36133 55823
6015 55823 70924 103586 75192 47235 39563 57095 34652 68918 55867 34806 63244 94309
6003 94309 97998 60961 86159 81033 75070 39406 15658 33403 54558 51059 56929 91597 82454
5990 82454 52473 15626 60744 73176 83261 71716 71632 83295 50147 25647 53312 42889
5978 42889 -2607 59809 77132 44923 12473 57402 42883 -3701 -13107 28694 100707 57612
5966 57612 45950 53430 53625 57080 34702 75830 90240 32557 60020 38912 44152 55947 85028
$$ packed form
6052C4274J4958m1092J8261K1520n80N522j3615p10m6098M6990l453N0225r829
6039G6373l872k5735m490K2475m679k7243l9149J0624O4521J8052m4724l1421
6027A0732j8471M6241L2806j9684m1132j0529l3609M8077O2774n8116J7044J9690
6015E5823J5101L2662k8394k7957p672J7532k2443L4266j3051k1061K8438L1065
6003I4309L689l7037K5198n126n963l5664k3748J7745K1155l499N870L4668r143
5990H2454k9981l6847M5118J2432J0085j1545q4J1663l3148k4500K7665j0423
5978D2889m5496O2416J7323l2209l2450M4929j4519m6584r406M1801P2013m3095
5966E7612j1662P480J95L455k2378M1128J4410n7683K7463k1108N240J1795K9081
$$ plain form
5953 85028 56959 53783 50165 101403 76887 52946 25871 -17177 -12617 71543 95240 47406
5941 47406 61594 89277 127543 39255 27392 61389 51421 25845 5029 14130 12806 16516 107802
5928 107802 83803 36790 46062 72634 60699 19257 27680 36527 88172 89774 53641 53276 29431
5915 29431 80129 107005 56305 44461 73565 108168 85167 79308 99337 77446 115315 102733
5903 102733 49808 46782 -2858 8294 56055 26541 44701 93381 107633 74565 108220 126533
5891 126533 111884 151176 137398 134080 125298 141579 141404 93870 71987 75783 58524 77404 68572
5878 68572 92158 135039 115666 68748 59758 101378 135155 102489 59828 76105 66616 122582
5866 122582 140180 89317 118963 112508 71987 61478 73028 69764 80642 81776 94422 74139
$$ packed form
5953H5028k8069l176l618N1238k4516k3941k7075m3048M560Q4160K3697m7834
5941D7406J4188K7683L8266q8288j1863L3997r968k5576k0816R101j324L710R1286
5928A07802k3999m7013R272K6572j1935m1442Q423Q847N1645J602l6133l65k3845
5915B9431N0698K6876n0700j1844K9104L4603k3001n859K0029k1891L7869j2582
5903A02733n2925l026m9640J1152M7761k9514J8160M8680J4252l3068L3655J8313
5891A26533j4649L9292j3778l318q782J6281j75m7534k1883L796j7259J8880q832
5878F8572K3586M2881j9373m6918q990M1620L3777l2666m2661J6277r489N5966
5866A22582J7598n0863K9646o455m0521j0509J1550l264J0878J134J2646k0283
$$ plain form
5854 74139 108928 125825 103573 95147 111766 130147 117165 159811 116572 116729 82750 87191 92634
5841 92634 97301 80984 96679 97865 72403 104482 119946 113993 150827 118956 97678 102878 88712
5828 88712 75033 102421 119657 141300 112482 121939 115278 133889 166348 185273 147029 95934
5816 95934 107486 96877 54925 67859 71082 75450 130069 126227 121943 66009 81982 129551 145337
5803 145337 94028 61264 57246 60960 121947 163443 139148 83573 66606 41682 74229 96131
5791 96131 106105 92947 93637 143413 148662 132162 117544 148737 170666 125858 129943 135713 113275
5778 113275 113737 116445 145664 134435 112007 150945 154362 88830 127092 175793 176533 171102 137329
5765 137329 94139 82034 79828 97446 92782 177516 197894 148024 80119 75878 128609 145410
$$ packed form
5854G4139L4789J6897k2252q426J6619J8381j2982M2646m3239J57l3979M441N443
5841I2634M667j6317J5695J186k5462L2079J5464n953L6834l1871k1278N200j4166
5828H8712j3679K7388J7236K1643k8818R457o661J8611L2459J8925l8244n1095
5816I5934J1552j0609m1952J2934L223M368N4619l842m284n5934J5973M7569J5786
5803A45337n1309l2764m018L714O0987M1496k4295n5575j6967k4924L2547K1902
5791I6131R974j3158O90M9776N249j6500j4618L1193K1929m4808M085N770k2438
5778A13275M62K708K9219j1229k2428L8938L417o5532L8262M8701P40n431l3773
5765A37329m3190j2105k206J7618m664Q4734K0378m9870o7905m241N2731J6801
$$ plain form
5753 145410 107261 76066 57225 78754 83810 139441 127777 134095 109232 112045 74868 54358
5741 54358 81977 128985 143076 178806 161358 163395 219000 167885 118796 128020 142761 156567
5729 156567 183714 179154 154865 186200 140190 146341 162578 75521 101091 164516 162440 113039
5717 113039 97488 149739 107294 69119 72484 90595 105463 57802 74016 87065 141369 140961
5705 140961 121661 131031 156896 189124 198041 180295 166880 133162 97098 127439 158600 106403
5693 106403 122632 122764 120996 130856 90109 87753 132928 116584 113532 165284 168538 97792 135504
5680 135504 132404 116014 102363 135204 104420 147383 104747 102840 111784 86938 107049 99615
5668 99615 88646 62787 85075 95797 112989 126313 146481 125939 160386 201627 147948 123245
$$ packed form
5753A45410l8149l1195j8841K1529N056N5631j1664O318k4863K813l7177k0510
5741E4358K7619M7008J4091L5730j7448K037N5605n1115m9089R224J4741J3806
5729A56567K7147m560k4289L1335m6010O151J6237q7057K5570O3425k076m9401
5717A13039j5551N2251m2445l8175L365J8111J4868m7661J6214J3049N4304m08
5705A40961j9300R370K5865L2228Q917j7746j3415l3718l6064L0341L1161n2197
5693A06403J6229J32j768R860m0747k356M5175j6344l052N1752L254p0746L7712
5680A35504l100j6390j3651L2841l0784M2963m2636j907Q944k4846K0111p434
5668I9615j0969k5859K2288J0722J7192J3324K0168k0542L4447M1241n3679k4703
$$ plain form
5656 123245 142389 135330 116976 167729 174831 128038 132893 95140 50278 68190 91607 113099
5644 113099 93618 116984 145180 163765 214589 163611 143674 139402 177439 225379 175399 132278
5632 132278 185885 266180 230377 239487 218233 209040 203008 172573 181967 195209 162541 166516 168537
5619 168537 154197 173475 164752 197971 224647 171788 160835 154778 212901 238278 234127 247333
5607 247333 235411 260025 239518 262440 234771 251976 215533 196117 214550 192156 207247 155032
5595 155032 166892 201661 255046 305386 299442 255343 207639 272695 288512 249183 264074 285412
5583 285412 217009 207568 213029 249220 258168 294787 244617 209836 239783 244693 281990 367321
5571 367321 303531 269295 278731 312764 310766 355461 380031 361251 309401 281751 291888 291259
$$ packed form
5656A23245J9144p059j8354N0753P102m6793M855l7753m4862J7912K3417K1492
5644A13099j9481K3366K8196J8585N0824n0978j9937m272L8037M7940m9980m3121
5632A32278N3607Q0295l5803R110k1254r193o032l0435R394J3242l2668L975K021
5619A68537j4340J9278q723L3219K6676n2859j0953o057N8123K5377m151J3206
5607B47333j1922K4614k0507K2922k7669J7205l6443j9416J8433k2394J5091n2215
5595A55032J1860L4769N3385N0340n944m4099m7704O5056J5817l9329J4891K1338
5583B85412o8403r441N461L6191Q948L6619n0170l4781K9947M910L7297Q5331
5571C67321o3790l4236R436L4033j998M4695K4570j8780n1850k7650J0137o29
$$ plain form
5559 291259 283586 244408 243352 258246 287488 301931 312845 303967 277119 316588 333593 311178
5547 311178 363809 301798 313095 337494 371135 382077 364508 300506 309512 325075 356585 338446
5535 338446 361605 410163 391438 336895 335464 346047 353250 384500 405523 396893 406693 407412 374500
5522 374500 408174 365764 425205 394988 410499 401253 378444 424852 407603 404286 417528 409408
5510 409408 422134 439435 410756 420250 394219 352760 394226 438976 462140 486119 504111 514533
5498 514533 457306 466985 456503 438463 442785 398536 408034 392358 450272 441516 439653 429022 380366
5485 380366 413607 443291 412611 404959 443109 460977 462608 452952 506684 503580 481052 512235
5473 512235 502661 484570 480617 498500 539067 501680 497676 491506 463081 499728 529578 526009 559111
$$ packed form
5559B91259p673l9178j056J4894K9242J4443J0914q878k6848L9469J7005k2415
5547C11178N2631o2011J1297K4399L3641J0942j7569o4002R006J5563L1510j8139
5535C38446K3159M8558j8725n4543j431J0583P203L1250K1023q630R800P19l2912
5522C74500L3674m2410N9441l0217J5511r246k2809M6408j7249l317J3242q120
5510D09408J2726J7301k8679R494k6031m1459M1466M4750K3164K3979J7992J0422
5498E14533n7227R679j0482j8040M322m4249R498j5676N7914q756j863j0631m8656
5485C80366L3241K9684l0680p652L8150J7868J631r656N3732l104k2528L1183
5473E12235r574j8091l953J7883M0567l7387m004o170k8425L6647K9850l569L3102
$$ plain form
5460 559111 583564 575590 590386 602118 613186 657367 658850 666079 648053 672780 643627 648849
5448 648849 677983 674308 657273 670452 721782 716888 706927 728817 752928 740304 769903 745203
5436 745203 715105 701417 741681 700164 659168 745901 824670 812433 769332 714472 756005 859366
5424 859366 869076 840054 820887 800709 855212 861592 844101 890374 901214 909926 910081 928755 998653
5411 998653 1036373 998458 1000162 963062 985729 962983 951055 1014128 1000504 998576 981211 1018479
5399 1018479 1037065 1003394 1038609 998346 1010821 1039638 1059187 1061134 1076505 1049870 1077233 1044258
5387 1044258 1091354 1108796 1120888 1117709 1119821 1170594 1199098 1252913 1278213 1249600 1251266 1278064
5375 1278064 1313518 1357363 1373963 1394309 1402645 1417680 1435380 1482491 1459949 1391717 1407153 1430596
$$ packed form
5460E59111K4453p974J4796J1732J1068M4181J483P229j8026K4727k9153N222
5448F48849K9134l675j7035J3179N1330m894r961K1890K4111j2624K9599k4700
5436G45203l0098j3688M0264m1517m0996Q6733P8769j2237m3101n4860M1533J03361
5424H59366R710k9022j9167k0178N4503O380j7491M6273J0840Q712J55J8674O9898
5411I98653L7720l7915J704l7100K2667k2746j1928O3073j3624j928j7365L7268
5399A018479J8586l3671L5215m0263J2475K8817J9549J947J5371k6635K7363l2975
5387A044258M7096J7442J2092l179K112N0773K8504N3815K5300k8613J666K6798
5375A278064L5454M3845J6600K0346Q336J5035J7700M7111k2542o8232J5436K3443
$$ plain form
5363 1430596 1470862 1471720 1465813 1486086 1488319 1516669 1507598 1512133 1575308 1620249 1704187 1809970
5351 1809970 1862804 1884812 1884932 1829854 1848527 1926941 1990711 2000769 1983250 2027527 2057652 2102259
5339 2102259 2100428 2155655 2144237 2182726 2192538 2234997 2237424 2292200 2299742 2277410 2300868 2358003
5327 2358003 2369895 2396116 2452662 2547281 2576877 2670592 2689702 2672012 2738453 2757059 2827942
5316 2827942 2902246 2914077 2985305 2998631 3019778 3108256 3132258 3179294 3280117 3341974 3374832
5305 3374832 3401941 3464099 3531567 3538759 3565848 3651827 3646352 3705620 3771353 3799781 3921303 4020366
5293 4020366 4111278 4181092 4239405 4357363 4517048 4613804 4708527 4846079 5037645 5178836
5283 5178836 5337257 5502967 5693288 5876551 6034474 6203598 6354014 6504069 6696390 6950774
$$ packed form
5363A430596M0266Q58n907K0273K233K8350r071M535O3175M4941Q3938J05783
5351A809970N2834K2008J20n5078J8673P8414O3770J0058j7519M4277L0125M4607
5339B102259j831N5227j1418L8489R812M2459K427N4776P542k2332K3458N7135
5327B358003J1892K6221N6546R4619K9596R3715J9110j7690O6441J8606P0883
5316B827942P4304J1831P1228J3326K1147Q8478K4002M7036J00823O1857L2858
5305C374832K7109O2158O7468P192K7089Q5979n475N9268O5733K8428J21522R9063
5293D020366R0912O9814N8313J17958J59685R6756R4723J37552J91566J41191
5283E178836J58421J65710J90321J83263J57923J69124J50416J50055J92321K54384
$$ plain form
5273 6950774 7096680 7272096 7432965 7674314 7926396 8188327 8384083 8529784 8716093 8907545
5263 8907545 9095977 9325267 9581909 9836487 10100138 10369131 10664775 10929307 11268731 11659634
5253 11659634 11960429 12245189 12651073 13044190 13432021 13843741 14235792 14675640 15183335
5244 15183335 15628518 16178605 16739673 17306678 17968444 18668285 19436796 20209951 20867663
5235 20867663 21515685 22239374 22989916 23756853 24504768 25282564 26120504 26999229 27939973
5226 27939973 28914798 30026375 31173841 32376622 33601634 34954177 36426242 38011004
5218 38011004 39685263 41631049 43615596 45701920 47846030 50048005 52568269 55390311
5210 55390311 58467174 61760729 65320415 69080616 72966693 77333933 82186110 87854613
$$ packed form
5273F950774J45906J75416J60869K41349K52082K61931J95756J45701J86309J91452
5263H907545J88432K29290K56642K54578K63651K68993K95644K64532L39424L90903
5253A1659634L00795K84760M05884L93117L87831M11720L92051M39848N07695
5244A5183335M45183N50087N61068N67005O61766O99841P68511P73155O57712
5235B0867663O48022P23689P50542P66937P47915P77796Q37940Q78725R40744
5226B7939973R74825J111577J147466J202781J225012J352543J472065J584762
5218C8011004J674259J945786J984547K086324K144110K201975K520264K822042
5210E5390311L076863L293555L559686L760201L886077M367240M852177N668503
$$ plain form
5202 87854613 94474744 102377730 111691596 122635034 135349070 150353744 168166996 190046844
5194 190046844 216671151 247609315 281237088 313119289 331920266 333922994 320970150
5187 320970150 297619607 271403758 242046377 212340011 185977962 163648523 144892930
5180 144892930 129140319 115666998 104370742 94804763 86753649 79789521 73624128 68229738
5172 68229738 63397054 58934462 54842834 51338541 48219186 45370770 42811252 40490589
5164 40490589 38478241 36562735 34838111 33248204 31733220 30361416 29040161 27685251
5156 27685251 26416807 25267464 24215582 23186583 22280380 21364402 20537923 19737351 19038760
5147 19038760 18358649 17737278 17161382 16636556 16096210 15614578 15168603 14740415 14340176
$$ packed form
5202H7854613O620131P902986R313866J0943438J2714036J5004674J7813252K1879848
5194A90046844K6624307L0938164L3627773L1882201J8800977K002728j2952844
5187C20970150k3350543k6215849k9357381k9706366k6362049k2329439j8755593
5180A44892930j5752611j3473321j1296256r565979q051114o964128o165393n394390
5172F8229738m832684m462592m091628l504293l119355k848416k559518k320663
5164D0490589k012348j915506j724624j589907j514984j371804j321255j354910
5156B7685251j268444j149343j051882j028999r06203r15978q26479q00572o98591
5147A9038760o80111o21371n75896n24826n40346m81632m45975m28188m00239
$$ plain form
5138 14340176 13921781 13556865 13270621 12993337 12658485 12318739 11995886 11752162 11502997
5129 11502997 11179221 10854750 10481840 10158632 9826818 9467770 9145821 8848382 8578846
5120 8578846 8286565 8016778 7772671 7570954 7349164 7169886 6959561 6789027 6633312 6476208
5110 6476208 6320345 6126275 5968080 5829305 5714317 5567480 5441251 5292301 5152055 5001299
5100 5001299 4866998 4771741 4695973 4635870 4596490 4575498 4418694 4330966 4244502 4193817 4097735
5089 4097735 4032445 3950097 3866547 3816560 3764021 3666759 3585396 3560247 3492511 3427338 3344127
5078 3344127 3283195 3141636 3068892 3013611 2967571 2885888 2877242 2873407 2787782 2748720 2686086 2642251
5066 2642251 2579893 2513371 2465190 2431083 2373328 2288961 2271689 2187482 2175399 2153738 2120226
$$ packed form
5138A4340176m18395l64916k86244k77284l34852l39746l22853k43724k49165
5129A1502997l23776l24471l72910l23208l31814l59048l21949k97439k69536
5120H578846k92281k69787k44107k01717k21790j79278k10325j70534j55715j57104
5110F476208j55863j94070j58195j38775j14988j46837j26229j48950j40246j50756
5100E001299j34301r5257p5768o0103l9380k0992j56804q7728q6464n0685r6082
5089D097735o5290q2348q3550m9987n2539r7262q1363k5149o7736o5173q3211
5078C344127o0932j41559p2744n5281m6040q1683q646l835q5625l9062o2634m3835
5066B642251o2358o6522m8181l4107n7755q4367j7272q4207j2083k1661l3512
$$ plain form
5055 2120226 2095467 1963901 1980209 1943921 1935710 1933968 1973683 1871161 1818212 1835014 1826086 1731335
5043 1731335 1698224 1725662 1749335 1746348 1667436 1603302 1543902 1533856 1524074 1493901 1448743 1482372
5031 1482372 1461717 1385630 1403987 1394762 1380002 1427458 1394493 1354544 1355032 1372291 1338236 1365457
5019 1365457 1401419 1338184 1345108 1291364 1238054 1192989 1158364 1083720 1059799 1040186 1040616 1016048
5007 1016048 991140 948059 981198 984919 980050 1014686 986592 939939 954005 973266 925155 924651
4995 924651 938774 887704 875522 881308 859121 860216 858513 886262 849205 863394 854000 847538 825159
4982 825159 760936 716572 756972 733437 718150 717379 670129 643171 663747 651416 649154 666942
4970 666942 650974 634340 599208 578568 584552 553230 585366 591857 599125 598099 617750 579043
$$ packed form
5055B120226k4759j31566J6308l6288q211j742L9715j02522n2949J6802q928r4751
5043A731335l3111K7438K3673k987p8912o4134n9400j0046r782l0173m5158L3629
5031A482372k0655p6087J8357r225j4760M7456l2965l9949M88J7259l4055K7221
5019A365457L5962o3235O924n3744n3310m5065l4625p4644k3921j9613M30k4568
5007A016048k4908m3081L3139L721m869L4636k8094m6653J4066J9261m8111n04
4995I24651J4123n1070j2182N786k2187J095j703K7749l7057J4189r394o462k2379
4982H25159o4223m4364M0400k3535j5287p71m7250k6958K0576j2331k262J7788
4970F66942j5968j6634l5132k0640N984l1322L2136O491P268j026J9651l8707
$$ plain form
4958 579043 567303 548077 505602 563739 571935 601130 632975 642501 609819 554647 503341 550968
4946 550968 580533 576187 585253 566827 501250 475458 495331 457142 441349 519769 498194 485924
4934 485924 468803 443281 463784 497797 467275 486438 476320 436742 501706 519678 470235 408833
4922 408833 417695 485512 489148 449344 482918 463387 447026 421877 420573 452995 466392 414806
4910 414806 390537 402482 413130 359169 375780 406580 436640 414736 401062 359116 388172 400859
4898 400859 401245 386808 387388 402184 399856 368040 319633 374420 372853 330425 324291 320533 339334
4885 339334 299011 286412 293944 272576 290447 255927 249087 306991 285961 258583 295576 269631
4873 269631 264633 267000 254232 277212 299371 290332 319067 272766 225734 252717 273199 231901
$$ packed form
4958E79043j1740j9226m2475N8137Q196K9195L1845R526l2682n5172n1306M7627
4946E50968K9565m346R066j8426o5577k5792J9873l8189j5793P8420k1575j2270
4934D85924j7121k5522K0503L4013l0522J9163j0118l9578O4964J7972m9443o1402
4922D08833Q862O7817L636l9804L3574j9531j6361k5149j304L2422J3397n1586
4910D14806k4269J1945J0648n3961J6611L0800L0060k1904j3674m1946K9056J2687
4898D00859L86j4437N80J4796k328l1816m8407N4787j567m2428o134l758J8801
4885C39334m0323j2599P532k1368J7871l4520o840N7904k1030k7378L6993k5945
4873B69631m998K367j2768K2980K2159r039K8735m6301m7032K6983K0482m1298
$$ plain form
4861 231901 242047 238506 278327 285756 291175 309921 313165 302082 220474 278870 309046 269662
4849 269662 239881 256610 201879 225438 245756 207071 200558 197658 258430 264384 267886 269141 287171
4836 287171 242851 243500 265957 240354 194549 160489 165301 222431 251195 217984 210906 210692 199464
4823 199464 183195 206245 210322 221005 213019 197744 198151 211808 238261 219663 188045 171706
4811 171706 126303 177576 197653 193928 185395 199126 213426 194384 200089 196168 220182 236333
4799 236333 210954 173326 156588 133286 174144 183310 186728 239315 288695 248807 254482 178981
4787 178981 176461 194964 194613 195057 227854 219232 186654 189347 231381 231899 247748 199521 183878
4774 183878 212676 144077 134045 162814 184019 159187 111633 152938 219451 203728 144429 135547
$$ packed form
4861B31901J0146l541L9821P429N419J8746L244j1083q1608N8396L0176l9384
4849B69662k9781J6729n4731K3559K0318l8685o513k900O0772N954L502J255J8030
4836B87171m4320O49K2457k5603m5805l4060M812N7130K8764l3211p078k14j1228
4823A99464j6269K3050M077J0683p986j5275M07J3657K6453j8598l1618j6339
4811A71706m5403N1273K0077l725q533J3731J4300j9042N705l921K4014J6151
4799B36333k5379l7628j6738k3302M0858R166L418N2587M9380l9888N675p5501
4787A78981k520J8503l51M44L2797q622l2578K693M2034N18J5849m8227j5643
4774A83878K8798o8599j0032K8769K1205k4832m7554M1305O6513j5723n9299q882
$$ plain form
4762 135547 167786 146423 172343 204876 184981 222777 217717 168317 121954 118105 148336 158234
4750 158234 188699 191946 192003 191159 143801 126359 170932 231070 229682 182599 195381 158414 183968
4737 183968 207770 228782 221529 207695 211143 179550 184566 214197 230899 242875 265229 235939
4725 235939 185886 132528 136533 189829 160306 140746 178071 178329 202673 208237 209096 272795 257686
4712 257686 240334 233950 213528 219032 170530 206632 173955 121924 126230 96354 138159 188645
4700 188645 215178 154135 173267 124818 156047 149808 149000 126174 134485 132818 183346 209332 195188
4687 195188 192932 207946 232776 214455 180152 174638 175529 193247 181682 161918 146630 188550
4675 188550 241355 218699 238118 211512 225892 240002 253178 170876 202788 208297 150462 163071
$$ packed form
4762A35547L2239k1363K5920L2533j9895L7796n060m9400m6363l849L0231R898
4750A58234L0465L247N7q44m7358j7442M4573O0138j388m7083J2782l6967K5554
4737A83968K3802K1012p253j3834L448l1593N016K9631J6702J1976K2354k9290
4725B35939n0053n3358M005N3296k9523j9560L7325K58K4344N564Q59O3699j5109
4712B57686j7352o384k0422N504m8502L6102l2677n2031M306k9876M1805N0486
4700A88645K6533o1043J9132m8449L1229o239q08k2826Q311j667N0528K5986j4144
4687A95188k256J5014K4830j8321l4303n514Q91J7718j1565j9764j5288M1920
4675A88550N2805k2656J9419k6606J4380J4110J3176q2302L1912N509n7835J2609
$$ plain form
4663 163071 172097 132259 162276 190443 201165 157731 150400 130993 131972 142602 148842 169541 175892
4650 175892 172938 162485 152538 131547 193979 188833 167818 150838 116187 148849 150713 126256
4638 126256 138531 93734 84948 158052 137022 113907 195602 153463 110943 125950 137331 128586
4626 128586 173130 121788 102395 167741 186696 133686 129328 171197 187568 173602 131563 160442
4614 160442 194218 157729 144492 167768 112552 112776 141639 155938 147676 120217 121460 118629 95375
4601 95375 91739 53472 26594 111415 118563 126517 139819 128967 153426 111344 129418 168870
4589 168870 150564 163134 150242 164219 200941 195417 164171 186325 209017 228642 199260 177263
4577 177263 215964 209312 176201 137261 192488 197345 177368 187931 190677 138906 168510 184231
$$ packed form
4663A63071R026l9838L0017K8167J0722m3434p331j9407R79J0630O240K0699O351
4650A75892k954j0453r947k0991O2432n146k1015j6980l4651L2662J864k4457
4638A26256J2275m4797q786P3104k1030k3115Q1695m2139m2520J5007J1381q745
4626A28586M4544n1342j9393O5346J8955n3010m358M1869J6371j3966m2039K8879
4614A60442L3776l6489j3237K3276n5216K24K8863J4299q262k7459J243k831k3254
4601I5375l636l8267k6878Q4821P148P954J3302j0852K4459m2082J8074L9452
4589A68870j8306J2570j2892J3977L6722n524l1246K2154K2692J9625k9382k1997
4577A77263L8701o652l3111l8940N5227M857j9977J0563K746n1771K9604J5721
$$ plain form
4565 184231 199205 182430 132589 137896 171368 179845 156581 138749 145427 148477 179260 128591
4553 128591 108136 67517 100256 81816 140309 115431 131918 147408 132557 137736 133064 163279
4541 163279 147665 160154 199761 216394 193977 222910 201043 176726 158393 190593 147890 131805
4529 131805 171194 157004 151264 182007 151271 156195 154982 172934 203728 217630 230407 196997
4517 196997 209898 216236 214771 193215 189160 212589 225876 203743 214005 224764 184612 210599
4505 210599 231299 236221 236201 267744 257333 265019 272380 272609 262873 251080 229470 245635 263284
4492 263284 226643 169656 182568 153310 217142 186738 198378 245163 267260 292260 289903 249645
4480 249645 223846 254295 261099 274097 309136 318911 298917 291610 292229 349466 331392 355868 342890
$$ packed form
4565A84231J4974j6775m9841N307L3472Q477k3264j7832O678L050L0783n0669
4553A28591k0455m0619L2739j8440N8493k4878J6487J5490j4851N179m672L0215
4541A63279j5614J2489L9607J6633k2417K8933k1867k4317j8333L2200m2703j6085
4529A31805L9389j4190n740L0743l0736M924j213J7952L0794J3902J2777l3410
4517A96997J2901O338j465k1556m055K3429J3287k2133J0262J0759m0152K5987
4505B10599K0700M922k0L1543j0411P686P361K29r736j1793k1610J6165J7649
4492B63284l6641n6987J2912k9258O3832l0404J1640M6785K2097K5000k357m0258
4480B49645k5799L0449O804J2998L5039R775j9994p307O19N7237j8074K4476j2978
$$ plain form
4467 342890 323799 345216 330414 321018 392210 380987 397749 425340 453524 435258 412396 424194
4455 424194 393098 437751 468228 467258 519086 507051 514775 517066 548208 560915 537875 583573
4443 583573 607031 662652 656703 689926 701470 701366 734501 724555 735138 752039 741144 784775
4431 784775 804817 848112 899742 921885 906771 992434 1036609 1066097 1056534 1079130 1103775 1101469
4419 1101469 1186701 1282077 1273071 1302558 1282319 1283333 1351033 1438394 1450856 1469093 1567413 1630381
4407 1630381 1685526 1770190 1872115 1954255 1961249 2010682 2132102 2228777 2284612 2337382 2468514
4396 2468514 2565051 2715881 2893588 3027443 3170098 3330904 3513438 3772911 4039641 4352431
4386 4352431 4715015 5147070 5520624 5881087 6338746 6758880 7108819 7510034 7893265 8312349
$$ packed form
4467C42890j9091K1417j4802r396P1192j1223J6762K7591K8184j8266k2862J1798
4455D24194l1096M4653L0477r70N1828j2035P724K291L1142J2707k3040M5698
4443E83573K3458N5621n949L3223J1544j04L3135r946J0583J6901j0895M3631
4431G84775K0042M3295N1630K2143j5114Q5663M4175K9488r563K2596K4645k306
4419A101469Q5232R5376r006K9487k0239J014O7700Q7361J2462J8237R8320O2968
4407A630381N5145Q4664J01925Q2140O994M9433J21420R6675N5835N2770J31132
4396B468514R6537J50830J77707J33855J42655J60806J82534K59473K66730L12790
4386D352431L62584M32055L73554L60463M57659M20134L49939M01215L83231M19084
$$ plain form
4376 8312349 8804385 9348412 9800558 10205262 10528350 10758390 10969927 11258577 11553648 11825539
4366 11825539 12083983 12288836 12356208 12237783 11985770 11629707 11282174 11035683 10843907 10644921
4356 10644921 10309964 9865966 9389101 8891352 8364189 7879235 7499204 7096403 6696701
4347 6696701 6273480 5851368 5420068 4964496 4589958 4221417 3898948 3516101 3305774 3053961
4337 3053961 2859019 2732027 2578238 2413736 2338433 2216695 2073400 1944506 1874644 1813128
4327 1813128 1739948 1693466 1620043 1561839 1497933 1415491 1394324 1339870 1266586 1263098 1201964 1165331
4315 1165331 1113871 1094726 1078409 1065450 1080362 1046864 970406 934322 913811 890645 873156
4304 873156 858465 857455 895555 879996 870490 815010 793689 777116 784764 776172 750683 734775
$$ packed form
4376H312349M92036N44027M52146M04704L23088K30040K11537K88650K95071K71891
4366A1825539K58444K04853O7372j18425k52013l56063l47533k46491j91776j98986
4356A0644921l34957m43998m76865m97749n27163m84954l80031m02801l99702
4347F696701m23221m22112m31300m55572l74538l68541l22469l82847k10327k51813
4337C053961j94942j26992j53789j64502p5303j21738j43295j28894o9862o1516
4327A813128p3180m6482p3423n8204o3906q2442k1167n4454p3284l488o1134l6633
4315A165331n1460j9145j6317j2959J4912l3498p6458l6084k0511k3166j7489
4304H73156j4691j010L8100j5559r506n5480k1321j6573P648q592k5489j5908
$$ plain form
4292 734775 686816 660563 690536 632635 604844 619315 575593 605194 611937 603471 592149 548057
4280 548057 533875 446676 479914 499817 522249 533104 505073 466355 499349 478508 492718 509053
4268 509053 497843 521476 507675 488033 497302 474159 449370 466856 449232 463496 458580 435378
4256 435378 486306 493881 470232 461001 490388 449515 440550 455365 447483 424413 405430 407143 403029
4243 403029 428224 428028 366446 354874 313549 301032 377829 401714 425923 407144 382232 355920
4231 355920 335537 370688 384458 352575 369110 342892 377944 348111 389838 411089 366136 364068
4219 364068 361896 384105 387725 393127 354861 360280 392969 370442 370952 360807 367986 392178 328224
4206 328224 306489 312346 269939 313542 301287 357388 427820 437088 440620 377139 345602 380397
$$ packed form
4292G34775m7959k6253K9973n7901k7791J4471m3722K9601O743q466j1322m4092
4280E48057j4182q7199L3238J9903K2432J0855k8031l8718L2994k0841J4210J6335
4268E09053j1210K3633j3801j9642R269k3143k4789J7486j7624J4264m916k3202
4256D35378N0928P575k3649r231K9387m0873q965J4815p882k3070j8983J713m114
4243D03029K5195j96o1582j1572m1325j2517P6797K3885K4209j8779k4912k6312
4231C55920k0383L5151J3770l1883J6535k6218L5052k9833M1727K1251m4953k068
4219C64068k172K2209L620N402l8266N419L2689k2527N10j0145P179K4192o3954
4206C28224k1735N857m2407M3603j2255N6101P0432R268L532o3481l1537L4795
$$ plain form
4194 380397 389205 349886 364650 350664 364844 401781 402866 345365 308780 375931 437452 394234
4182 394234 400898 383199 364965 372311 382350 356727 354258 358531 320099 298778 351683 361340 388228
4169 388228 426216 423503 441839 380788 388183 421208 372494 365241 387376 365971 408555 421461
4157 421461 420688 449823 473863 428861 442320 403936 440136 437198 430862 450692 401061 416291
4145 416291 416351 414800 426416 388133 402152 434083 430076 416159 408347 382747 434186 422800 419593
4132 419593 452223 454940 448164 477552 495609 497872 445467 456746 500360 486069 489580 489481 504655
4119 504655 504438 515488 484577 477148 547188 518940 479633 456593 469198 531969 557614 551472
4107 551472 539533 585275 554949 536871 521042 495967 506917 535400 584848 604970 614431 636205
$$ packed form
4194C80397Q808l9319J4764j3986J4180L6937J085n7501l6585O7151O1521m3218
4182C94234O664j7699j8234P346J0039k5623k469M273l8432k1321N2905R657K6888
4169C88228L7988k713J8336o1051P395L3025m8714p253K2135k1405M2584J2906
4157D21461p73K9135K4040m5002J3459l8384L6200k938o336J9830m9631J5230
4145D16291O0j551J1616l8283J4019L1931m007j3917p812k5600N1439j1386l207
4132D19593L2630K717o776K9388J8057K263n2405J1279M3614j4291L511r9J5174
4119E04655k17J1050l0911p429P0040k8248l9307k3040J2605O2771K5645o142
4107E51472j1939M5742l0326j8078j5829k5075J0950K8483M9448K0122R461K1774
$$ plain form
4095 636205 630013 608265 526823 560217 608339 637244 628277 663626 691461 712152 683278 678831
4083 678831 675216 694613 713659 735128 735759 768004 781841 750290 740346 705606 741285 798166
4071 798166 863318 913363 900696 893494 914238 933585 919175 888577 919382 920495 960455 992623
4059 992623 920139 889757 960238 1019323 1068055 1087839 1058122 1050337 1125162 1171870 1134817 1113948
4047 1113948 1149461 1100838 1138009 1092896 1146598 1160484 1152099 1203704 1217113 1257415 1310447 1347830
4035 1347830 1319948 1316347 1356051 1327547 1337185 1419173 1431401 1388571 1401201 1483754 1527689 1581065
4023 1581065 1546151 1622464 1686353 1700537 1725774 1733082 1750391 1836354 1853011 1886214 1926921 1945010
4011 1945010 1988382 2086237 2117777 2176345 2222768 2319319 2373285 2391334 2445857 2516684 2540662
$$ packed form
4095F36205o192k1748q1442L3394M8122K8905q967L5349K7835K0691k8874m447
4083F78831l615J9397J9046K1469O31L2245J3837l1551r944l4740L5679N6881
4071G98166O5152N0045j2667p202K0744J9347j4410l0598L0805J113L9960L2168
4059I92623p2484l0382P0481N9085M8732J9784k9717p785P4825M6708l7053k0869
4047A113948L5513m8623L7171m5113N3702J3886q385N1605J3409M0302N3032L7383
4035A347830k7882l601L9704k8504R638Q1988J2228m2830J2630Q2553M3935N3376
4023A581065l4914P6313O3889J4184K5237P308J7309Q5963J6657L3203M0707J8089
4011A945010M3372R7855L1540N8568M6423R6551N3966J8049N4523P0827K3978
$$ plain form
4000 2540662 2628742 2724088 2782278 2866842 2958655 3065173 3130843 3262663 3441258 3581914 3697015
3989 3697015 3868693 4015319 4238203 4429821 4610558 4852610 5083249 5350422 5570347 5865824
3979 5865824 6190519 6548248 6934570 7387494 7943046 8509322 9180441 9888094 10673838 11557850
3969 11557850 12497055 13568319 14734215 15836293 16784148 17208462 17112673 16482863 15501800
3960 15501800 14379537 13126010 11938480 10886510 9911351 9088287 8361437 7710618 7172571
3951 7172571 6802839 6402076 6028758 5711405 5397718 5148916 4973178 4798986 4611010 4458906
3941 4458906 4340120 4265300 4159709 4072922 3993057 3924369 3900553 3857206 3832440 3827624 3763886
3930 3763886 3790019 3764003 3750907 3713229 3681614 3705071 3706007 3791636 3826397 3886775 3945312 4014160
$$ packed form
4000B540662Q8080R5346N8190Q4564R1813J06518O5670J31820J78595J40656J15101
3989C697015J71678J46626K22884J91618J80737K42052K30639K67173K19925K95477
3979E865824L24695L57729L86322M52924N55552N66276O71119P07653P85744Q84012
3969A1557850R39205J071264J165896J102078R47855M24314r5789o29810r81063
3960A5501800j122263j253527j187530j051970r75159q23064p26850o50819n38047
3951G172571l69732m00763l73318l17353l13687k48802j75738j74192j87976j52104
3941D458906j18786p4820j05591q6787p9865o8688k3816m3347k4766m816o3738
3930C763886K6133k6016j3096l7678l1615K3457R36Q5629L4761O0378N8537O8848
$$ plain form
3918 4014160 4031346 4104247 4192492 4265902 4349207 4431726 4504393 4586119 4740143 4899301 4992869
3907 4992869 5115170 5270769 5391075 5519668 5705973 5856416 6006848 6166742 6370604 6599065
3897 6599065 6798334 6947824 7125387 7376139 7553273 7814258 8042996 8207241 8452372 8686919
3887 8686919 8922869 9169373 9399248 9623051 9801328 9984837 10223126 10460392 10646481 10860497
3877 10860497 10981776 11176511 11378060 11532156 11702322 11829064 11956780 12113220 12231682
3868 12231682 12334028 12427199 12502741 12569844 12635891 12674892 12727454 12718054 12729610 12777452 12788164
3857 12788164 12835127 12886564 12915424 12949770 12974532 12983381 12993377 13007014 13123055 13243532 13325244
3846 13325244 13440498 13602225 13721709 13889756 14160029 14493639 14913886 15378574 15902467
$$ packed form
3918D014160J7186P2901Q8245P3410Q3305Q2519P2667Q1726J54024J59158R3568
3907D992869J22301J55599J20306J28593J86305J50443J50432J59894K03862K28461
3897F599065J99269J49490J77563K50752J77134K60985K28738J64245K45131K34547
3887H686919K35950K46504K29875K23803J78277J83509K38289K37266J86089K14016
3877A0860497J21279J94735K01549J54096J70166J26742J27716J56440J18462
3868A2231682J02346R3171P5542O7103O6047L9001N2562r400J1556M7842J0712
3857A2788164M6963N1437K8860L4346K4762Q849R996J3637J16041J20477Q1712
3846A3325244J15254J61727J19484J68047K70273L33610M20247M64688N23893
$$ plain form
3837 15902467 16470879 17123966 17905985 18666638 19341183 19924289 20266263 20445044 20374295 20066544
3827 20066544 19547032 18781627 17925609 17078367 16209720 15317277 14588718 13859129 13199345
3818 13199345 12666925 12130879 11714769 11358220 11035199 10718499 10487321 10279349 10012700
3809 10012700 9848902 9719948 9598311 9524863 9459095 9359739 9293089 9311414 9314093 9311552 9358936
3798 9358936 9447496 9583552 9701595 9881874 10000521 10180858 10486412 10771771 11043993 11395294
3788 11395294 11763402 12225189 12797354 13318168 13868254 14560381 15316672 16095955 16994274
3779 16994274 17922382 18850307 19749203 20534576 21278133 21877985 22360647 22737059 23000137
3770 23000137 23195915 23310327 23357735 23323439 23285766 23217144 23099814 22942727 22752941 22456298
$$ packed form
3837A5902467N68412O53087P82019P60653O74545N83106L41974J78781p0749l07751
3827B0066544n19512p65405q56018q47242q68647q92443p28559p29589o59784
3818A3199345n32420n36046m16110l56549l23021l16700k31178k07972k66649
3809A0012700j63798j28954j21637p3448o5768r9356o6650J8325K679k541M7384
3798I358936Q8560J36056J18043J80279J18647J80337L05554K85359K72222L51301
3788A1395294L68108M61787N72165N20814N50086O92127P56291P79283Q98319
3779A6994274R28108R27925Q98896P85373P43557N99852M82662L76412K63078
3770B3000137J95778J14412M7408l4296l7673o8622j17330j57087j89786k96643
$$ plain form
3760 22456298 22061952 21556712 21015114 20316587 19596787 18804448 17906764 17046256 16233490
3751 16233490 15451952 14730746 13979404 13289217 12644433 11969312 11400188 10822931 10282494
3742 10282494 9774055 9252007 8780184 8330611 7919792 7568908 7214788 6878482 6550405
3733 6550405 6265504 6011773 5829208 5616558 5373353 5196671 5009054 4919653 4811201 4674355
3723 4674355 4548799 4424781 4338307 4250588 4207547 4096208 4017007 3977664 3905569 3900989 3849922
3712 3849922 3804490 3758509 3725726 3699305 3696429 3698786 3676280 3629681 3605421 3614576 3496787 3451277
3700 3451277 3411038 3331864 3264937 3240498 3183007 3112430 3009929 2901722 2896887 2811275 2714897
3689 2714897 2684264 2670086 2595185 2545882 2478147 2409209 2375373 2378371 2394236 2323164 2295017 2253722
$$ packed form
3760B2456298l94346n05240n41598o98527p19800p92339q97684q60508q12766
3751A6233490p81538p21206p51342o90187o44784o75121n69124n77257n40437
3742A0282494n08439n22048m71823m49573m10819l50884l54120l36306l28077
3733F550405k84901k53731j82565k12650k43205j76682j87617q9401j08452j36846
3723D674355j25556j24018q6474q7719m3041j11339p9201l9343p2095m580n1067
3712C849922m5432m5981l2783k6421k876K357k2506m6599k4260R155j17789m5510
3700C451277m0239p9174o6927k4439n7491p0577j02501j08207m835q5612r6378
3689B714897l0633j4178p4901m9303o7735o8938l3836K998J5865p1072k8147m1295
$$ plain form
3677 2253722 2242787 2178340 2117334 2101016 2060028 2024479 2040792 2028110 2003703 1994508 1959987 1981734
3665 1981734 1923277 1877215 1894911 1845458 1807056 1792563 1782900 1773447 1734463 1693891 1691904 1705517
3653 1705517 1716820 1667767 1649483 1595853 1613438 1638778 1556451 1564366 1551500 1547300 1563640 1558296
3641 1558296 1554550 1538056 1554866 1504409 1500208 1494448 1488426 1489493 1521746 1525313 1470792 1488294 1458592
3628 1458592 1462076 1485328 1437227 1459203 1479096 1496776 1517973 1443451 1458648 1474171 1506070 1549714
3616 1549714 1530013 1531990 1595061 1609204 1608767 1579483 1605749 1640643 1640370 1709084 1787273 1870707
3604 1870707 1879131 1915575 1939045 1990016 2005247 2017827 2078286 2096716 2128507 2188618 2287837 2316092
3592 2316092 2384879 2418798 2423696 2510514 2561489 2644578 2720177 2807771 2843664 2858262 2970045
$$ packed form
3677B253722j0935o4447o1006j6318m0988l5549J6313j2682k4407r195l4521K1747
3665A981734n8457m6062J7696m9453l8402j4493r663r453l8984m0572j987J3613
3653A705517J1303m9053j8284n3630J7585K5340q2327P915j2866m200J6340n344
3641A558296l746j6494J6810n0457m201n760o022J067L2253L567n4521J7502k9702
3628A458592L484K3252m8101K1976J9893J7680K1197p4522J5197J5523L1899M3644
3616A549714j9701J977O3071J4143m37k9284K6266L4894k73O8714P8189Q3434
3604A870707Q424L6444K3470N0971J5231J2580O0459J8430L1791O0111R9219K8255
3592B316092O8787L3919M898Q6818N0975Q3089P5599Q7594L5893J4598J11783
$$ plain form
3581 2970045 3028489 3101075 3145624 3268684 3356727 3410106 3576114 3612803 3698760 3762166 3876218
3570 3876218 3966091 4056415 4212226 4303481 4450540 4543120 4732454 4845614 4941706 5031671 5181086
3559 5181086 5336453 5554303 5695806 5908062 6144101 6314277 6584519 6829411 7089034 7405825
3549 7405825 7730148 8038236 8448475 8838966 9211566 9671133 10150035 10706354 11293371 11860027
3539 11860027 12457688 13063950 13681459 14331066 14947696 15541150 16098842 16559007 17020392
3530 17020392 17484516 17950266 18351979 18773177 19122991 19512244 19837664 20069566 20305099
3521 20305099 20446374 20467820 20344306 20196548 19958284 19634913 19275608 18840680 18369771 17871080
3511 17871080 17370381 16860553 16338114 15740871 15181734 14542045 13949787 13360362 12749029
$$ packed form
3581B970045N8444P2586M4549J23060Q8043N3379J66008L6689Q5957O3406J14052
3570C876218Q9873R0324J55811R1255J47059R2580J89334J13160R6092Q9965J49415
3559E181086J55367K17850J41503K12256K36039J70176K70242K44892K59623L16791
3549G405825L24323L08088M10239L90491L72600M59567M78902N56319N87017N66656
3539A1860027N97661O06262O17509O49607O16630N93454N57692M60165M61385
3530A7020392M64124M65750M01713M21198L49814L89253L25420K31902K35533
3521B0305099J41275K1446j23514j47758k38264l23371l59305m34928m70909m98691
3511A7871080n00699n09828n22439n97243n59137o39689n92258n89425o11333
$$ plain form
3502 12749029 12099681 11488892 10856403 10259332 9724573 9194303 8638587 8146477 7737965
3493 7737965 7303390 6911206 6471490 6107232 5790710 5556265 5275372 5018426 4776344 4590159
3483 4590159 4407051 4231287 4093156 3964560 3839219 3714217 3524274 3430829 3324664 3169235
3473 3169235 3119161 3068518 2981545 2892983 2798668 2721505 2670102 2636456 2609037 2546225 2491528
3462 2491528 2371487 2309737 2205551 2129485 2110168 2091393 2069181 1999800 1938272 1881280 1823510
3451 1823510 1780653 1690986 1657656 1590280 1504799 1489590 1473508 1433719 1425676 1361845 1308537 1286489
3439 1286489 1193203 1178866 1111306 1121093 1079588 1109438 1129241 1059205 999835 1000198 993740 966565
3427 966565 950153 942214 922494 852476 830121 834383 804686 775150 806786 839419 808163 801805
$$ packed form
3502A2749029o49348o10789o32489n97071n34759n30270n55716m92110m08512
3493G737965m34575l92184m39716l64258l16522k34445k80893k56946k42082j86185
3483D590159j83108j75764j38131j28596j25341j25002j89943r3445j06165j55429
3473C169235n0074n0643q6973q8562r4315p7163n1403l3646k7419o2812n4697
3462B491528j20041o1750j04186p6066j9317j8775k2212o9381o1528n6992n7770
3451A823510m2857q9667l3330o7376q5481j5209j6082l9789q043o3831n3308k2048
3439A286489r3286j4337o7560R787m1505K9850J9803p0036n9370L63o458k7175
3427I66565j6412p939j9720p0018k2355M262k9697k9536L1636L2633l1256o358
$$ plain form
3415 801805 770627 741936 728453 702328 656464 577496 593691 596658 616329 570814 553016 578765
3403 578765 592874 562970 557776 552778 575406 557535 527709 469987 448621 470357 516337 555015
3391 555015 531416 479725 499973 446965 394004 398150 343498 367007 409063 416483 413325 415209
3379 415209 405446 408897 409544 392248 349842 359697 349112 297535 275474 315779 347215 330692 316413
3366 316413 316004 354740 363767 370831 377001 334236 298033 298621 314446 304372 217697 247138 292051
3353 292051 327286 300597 286160 227317 238130 253522 243935 237452 186054 249420 266194 219443
3341 219443 196311 227100 186357 207005 231062 226381 236421 212988 222898 269217 256296 247287
3329 247287 262462 265617 202279 190857 201142 211823 242872 216836 171525 208206 197280 201641
$$ packed form
3415H01805l1178k8691j3483k6125m5864p8968J6195K967J9671m5515j7798K5749
3403E78765J4109k9904n194m998K2628j7871k9826n7722k1366K1736M5980L8678
3391E55015k3599n1691K0248n3008n2961M146n4652K3509M2056P420l158J884
3379D15209r763L451O47j7296m2406R855j0585n1577k2061M0305L1436j6523j4279
3366C16413m09L8736R027P064O170m2765l6203N88J5825j0074q6675K9441M4913
3353B92051L5235k6689j4437n8843J0813J5392r587o483n1398O3366J6774m6751
3341B19443k3132L0789m0743K0648K4057m681J0040k3433R910M6319j2921r009
3329B47287J5175L155o3338j1422J0285J0681L1049k6036m5311L6681j0926M361
$$ plain form
3317 201641 231011 259670 256740 264546 217113 228009 182764 139544 130239 154798 168510 170375
3305 170375 191821 212254 198665 155942 145680 135577 115019 109856 140875 135140 131266 153551
3293 153551 191309 154108 133265 145660 143465 163997 205866 182493 166977 140521 134076 179609
3281 179609 163075 174067 204939 225667 185225 199356 194566 156196 119291 87498 105057 151988
3269 151988 148023 142383 118935 119264 170305 206791 198632 228384 218761 175450 215442 215541 198821
3256 198821 217530 176353 186987 224029 217271 268101 214604 155049 174573 246361 257863 250188
3244 250188 223136 202476 265293 220404 184957 268423 231863 228537 194416 227215 237182 222744
3232 222744 207995 201951 196867 189471 249162 284974 226601 234758 233248 289579 299955 264290 199460
$$ packed form
3317B01641K9370K8659k930P806m7433J0896m5245m3220r305K4559J3712J865
3305A70375K1446K0433j3589m2723j0262j0103k0558n163L1019n735l874K2285
3293A53551L7758l7201k0843J2395k195K0532M1869k3373j5516k6456o445M5533
3281A79609j6534J0992L0872K0728m0442J4131m790l8370l6905l1793J7559M6931
3269A51988l965n640k3448L29N1041L6486q159K9752r623m3311L9992R9j6720
3256A98821J8709m1177J0634L7042o758N0830n3497n9555J9524P1788J1502p675
3244B50188k7052k0660O2817m4889l5447Q3466l6560l326l4121L2799R967j4438
3232B22744j4749o044n084p396N9691L5812n8373Q157j510N6331J0376l5665o4830
$$ plain form
3219 199460 228628 269635 307997 287273 286023 291768 312805 302730 315003 326819 370153 362310
3207 362310 302969 281917 271958 278988 239918 336939 256687 227980 234029 195567 182828 208740
3195 208740 266418 221154 189354 245209 221484 189902 189055 235990 227139 173553 150578 150728 143198
3182 143198 134323 122276 119238 124851 128912 118890 122795 107574 85477 152689 173648 150434 101362
3169 101362 138813 148204 77754 46723 46057 74623 61680 106918 125227 146947 115274 71214
3157 71214 72238 52530 -6202 76325 169855 119145 87423 86815 107638 121303 112193 140820 150963
3144 150963 114140 104499 115016 148354 126219 142366 140758 86799 92066 82853 118970 166437
3132 166437 192641 169208 141061 108929 131757 97387 101885 130365 114502 113091 121272 90448
$$ packed form
3219A99460K9168M1007L8362k0724j250N745K1037j0075J2273J1816M3334p843
3207C62310n9341k1052r959P030l9070R7021q0252k8707O049l8462j2739K5912
3195B08740N7678m5264l1800N5855k3725l1582q47M6935q851n3586k2975J50p530
3182A43198q875j2047l038N613M061j0022L905j5221k2097O7212K0959k3214m9072
3169A01362L7451R391p0450l1031o66K8566j2943M5238J8309K1720l1673m4060
3157G1214J024j9708n8732Q2527R3530n0710l1722o08K0823J3665r110K8627J0143
3144A50963l6823r641J0517L3338k2135J6147j608n3959N267r213L6117M7467
3132A66437K6204k3433k8147l2132K2828l4370M498K8480j5863j411Q181l0824
$$ plain form
3120 90448 49729 36461 39818 75008 108677 88865 110222 92120 97251 107400 116239 136247
3108 136247 77328 58492 46566 70731 80033 38415 49185 51795 5015 73269 64715 32543
3096 32543 55285 75323 96854 76426 41416 27908 40464 24787 2807 69606 41870 57592
3084 57592 70712 59127 44265 51827 25273 17994 37444 33157 62862 29004 4400 -9596
3072 -9596 68606 113210 89340 82413 73865 46716 77320 77897 79773 107598 78314 69812 64301
3059 64301 42932 47386 79973 52742 26366 21575 1589 -3745 14518 -30486 -20286 23562
3047 23562 25990 52343 59231 12971 11641 56084 57477 36561 -6363 31536 36939 57881 89733
3034 89733 70104 37241 -191 21009 48711 14780 25109 74608 62568 68174 80496 31053
$$ packed form
3120I0448m0719j3268L357L5190L3669j9812K1357j8102N131J0149Q839K0008
3108A36247n8919j8836j1926K4165R302m1618J0770K610m6780O8254q554l2172
3096C2543K2742K0038K1531k0428l5010j3508J2556j5677k1980O6799k7736J5722
3084E7592J3120j1585j4862P562k6554p279J9450m287K9705l3858k4604j3996
3072i596P8202M4604k3870o927q548k7149L0604N77J876K7825k9284q502n511
3059F4301k1369M454L2587k7231k6376m791j9986n334J8263m5004J0200M3848
3047B3562K428K6353O888m6260j330M4443J393k0916m2924L7899N403K0942L1852
3034H9733j9629l2863l7432K1200K7702l3931J0329M9499j2040N606J2322m9443
$$ plain form
3022 31053 39875 64417 66650 92950 70990 52733 32641 38623 31715 19783 46026 62796 25367
3009 25367 9335 -41591 -34098 10262 -2857 -11942 -26997 30385 43723 62652 24599 -23651
2997 -23651 20515 -12867 -3066 31852 24141 32899 51872 61652 50883 79636 95067 85788 39715
2984 39715 19618 21612 28290 35499 -44167 48088 61555 21115 24754 23187 -18026 5586 49044
2971 49044 -6011 57351 42199 50503 5231 25373 47760 38838 60868 45021 25899 16113
2959 16113 17365 -27717 -15261 -2084 25067 45159 354 5127 5885 -19215 20942 36042 22436
2946 22436 31029 39080 18313 -16709 9935 75503 53727 66147 82124 45450 7805 17747
2934 17747 30324 16046 29111 19130 8012 13395 3274 -653 29249 -14827 -51814 8245
$$ packed form
3022C1053Q822K4542K233K6300k1960j8257k0092N982o908j1932K6243J6770l7429
3009B5367j6032n0926P493M4360j3119r085j5055N7382J3338J8929l8053m8250
2997b3651M4166l3382R801L4918p711Q758J8973R780j0769K8753J5431r279m6073
2984C9715k0097J994O678P209p9666R2255J3467m0440L639j567m1213K3612M3458
2971D9044n5055O3362j5152Q304m5272K0142K2387q922K2030j5847j9122r786
2959A6113J252m5082J2456J3177K7151K0092m4805M773P58k5100M0157J5100j3606
2946B2436Q593Q051k0767l5022K6644O5568k1776J2420J5977l6674l7645R942
2934A7747J2577j4278J3065r981j1118N383j0121l927K9902m4076l6987O0059
$$ plain form
2922 8245 42874 45386 17568 3806 40006 58911 26880 22221 7827 6118 -12564 10975 55187
2909 55187 15617 14174 -5949 -36420 22168 10121 -9156 7507 49889 34259 60118 81993
2897 81993 89308 71923 42924 54946 29928 1280 45450 44503 28214 6838 -5387 68471
2885 68471 59161 61018 68082 115562 122440 98484 63333 17568 13874 84565 75123 66322 58165
2872 58165 5134 35499 48067 -16201 33871 24910 -25205 -74942 6691 36648 -3830 18594
2860 18594 46749 72738 48571 34315 49951 43137 83730 54507 -9285 21568 14824 21276
2848 21276 56663 60860 39823 29682 26023 5111 342 72772 44605 -35108 -7559 23955
2836 23955 40505 71787 72736 90966 39694 -16830 -7310 19444 16798 37866 36679 4089 -1825
$$ packed form
2922H245L4629K512k7818j3762L6200J8905l2031m659j4394j709j8682K3539M4212
2909E5187l9570j443k0123l0471N8588j2047j9277J6663M2382j5630K5859K1875
2897H1993P315j7385k8999J2022k5018k8648M4170r47j6289k1376j2225P3858
2885F8471r310J857P064M7480O878k3956l5151m5765l694P0691r442q801q157
2872E8165n3031L0365J2568o4268N0072q961n0115m9737Q1633K9957m0478K2424
2860A8594K8155K5989k4167j4256J5636o814M0593k9223o3792L0853o744O452
2848B1276L5387M197k1037j0141l659k0912m769P2430k8167p9713K7549L1514
2836B3955J6550L1282R49J8230n1272n6524R520K6754k646K1068j187l2590n914
$$ plain form
2823 -1825 -29057 5444 21349 7208 25835 2479 -12581 41106 11303 5071 77032 84639
2811 84639 19713 -15438 10343 3460 -38647 -24603 -15966 5722 -13378 10364 3815 -34791
2799 -34791 19453 48443 29228 15933 22706 23003 27208 60553 24222 -12457 -8328 898 14
2786 14 -24558 27579 70053 102751 62865 53055 22162 38127 6847 -49216 -35244 -26214 646
2773 646 26983 6492 -52835 -66730 -22188 39690 19153 3453 -27771 -55263 8385 12516
2761 12516 -24037 -35523 2676 27872 -11548 -10836 9588 -45837 -23453 -10263 12739 18054
2749 18054 23770 8619 32989 2117 -57446 -15858 75925 14998 -35736 -658 -16987 -1765
2737 -1765 46697 -18675 -45173 -1164 4790 12104 -9731 -35536 -24196 -32320 -53400 -13508 17530
$$ packed form
2823a825k7232L4501J5905j4141J8627k3356j5060N3687k9803o232P1961P607
2811H4639o4926l5151K5781o883m2107J4044Q637K1688j9100K3742o549l8606
2799c4791N4244K8990j9215j3295O773K97M205L3345l6331l6679M129R226q84
2786A4k4572N2137M2474L2698l9886r810l0893J5965l1280n6063J3972R030K6860
2773F46K6337k0491n9327j3895M4542O1878k0537j5700l1224k7492O3648M131
2761A2516l6553j1486L8199K5196l9420P12K0424n5425K2384J3190K3002N315
2749A8054N716j5151K4370l0872n9563M1588R1783o0927n0734L5078j6329J5222
2737a765M8462o5372k6498M4009N954P314k1835k5805J1340q124k1080L9892L1038
$$ plain form
2724 17530 35584 -16868 17372 30207 10777 -29665 -6809 34798 4992 50718 62128 18295
2712 18295 14203 11134 19456 31162 15230 17801 -33898 56879 33409 -37603 -7178 6210 14024
2699 14024 18662 4421 -6265 -5292 5936 -17646 -41310 -3047 8873 34263 53056 47924 -6321
2686 -6321 -14862 -26879 12613 -10639 -4908 3919 -11515 -28596 -44181 -17243 43586 41878 -19768
2673 -19768 -29931 12689 56305 57126 8487 22606 -32762 -15475 -22925 -23312 8059 -48446 -68237
2660 -68237 -29776 5120 3687 -2526 18565 32457 33274 -16261 -2237 7083 -13291 28285 12035
2647 12035 40047 25734 -22239 -18923 -32968 -49658 -44125 -57053 -16326 10814 16642 57992
2635 57992 54304 -8669 -32459 -6795 -1473 6688 -20597 -34223 5226 -29777 2132 46738
$$ packed form
2724A7530J8054n2452L4240J2835j9430m0442K2856M1607k9806M5726J1410m3833
2712A8295m092l069Q322J1706j5932K571n1699R0777k3470p1012L0425J3388P814
2699A4024M638j4241j0686R73J1228k3582k3664L8263J1920K5390J8793n132n4245
2686f321q541j2017L9492k3252N731Q827j5434j7081j5585K6938O0829j708o1646
2673a9768j0163M2620M3616Q21m8639J4119n5368J7287p450l87L1371n6505j9791
2660f8237L8461L4896j433o213K1091J3892Q17m9535J4024R320k0374M1576j6250
2647A2035K8012j4313m7973L316j4045j6690N533j2928M0727K7140N828M1350
2635E7992l688o2973k3790K5664N322Q161k7285j3626L9449l5003L1909M4606
$$ plain form
2623 46738 27945 72625 65773 49963 -18662 -6710 -45110 -49159 -21074 -17673 -34152 -35493 13972
2610 13972 30826 -23293 -60931 -33277 15638 14941 -62748 -7088 60217 13795 -32540 4062
2598 4062 3837 -26055 -17615 -6369 9712 57296 61230 42998 59978 31325 -46533 -45115 -2809
2585 -2809 -11296 18908 2988 -5218 -52666 -2816 41518 13879 -10475 7764 6019 -68467 -41026
2572 -41026 -47398 -52665 -89650 -52965 -62617 -8609 -8624 -48676 -88276 -52814 575 -12826 -47837
2559 -47837 -59415 -66903 -24434 -16001 28712 33757 6971 -4568 -47308 -45852 -12833 -15843 -9411
2546 -9411 -13434 -10674 -34144 -68983 -25609 2016 -15877 -33945 -12349 12902 -8803 7634
2534 7634 -24815 3341 -38109 -35574 -40074 -19858 35516 49422 54593 24393 44880 50513 716
$$ packed form
2623D6738j8793M4680o852j5810o8625J1952l8400m049K8085L401j6479j341M9465
2610A3972J6854n4119l7638K7654M8915o97p7689N5660O7305m6422m6335L6602
2598D062k25k9892Q440J1246J6081M7584L934j8232J6980k8653p7858J418M2306
2585b809q487L0204j5920q206m7448M9850M4334k7639k4354J8239j745p4486K7441
2572d1026o372n267l6985L6685r652N4008j5m0052l9600L5462N3389j3401l5011
2559d7837j1578p488M2469Q433M4713N045k6786j1539m2740J456L3019l010O432
2546i411m023K760k3470l4839M3374K7625j7893j8068K1596K5251k1705J6437
2534G634l2449K8156m1450K535m500K0216N5374J3906N171l0200K0487N633m9797
$$ plain form
2521 716 -23026 -28887 11154 55169 16866 16890 12257 3554 -15355 -7245 -7654 1965 -34997 4039
2507 4039 20728 -26432 -52964 -70814 -71963 -47721 -20085 -32427 -55777 -42400 -20219 -16521
2495 -16521 -10393 33808 -9809 -3919 6010 53007 -14685 -45913 -10013 -31867 4285 40307
2483 40307 -4042 -10530 36080 26434 49520 20317 8609 -3150 27307 36725 -3009 477 20755
2470 20755 53232 -7127 -13794 -35792 -31130 -47357 -2420 16011 -16562 -49348 -11330 -26451
2458 -26451 -44815 -30047 -11030 33219 -26688 -45311 -27646 -20472 28663 -445 -13462 38688
2446 38688 60502 56747 8046 -703 26120 30678 13752 34907 28166 -11387 13770 -6192 -53007
2433 -53007 9492 31403 42120 17580 6883 -39371 -63492 -31464 -48598 -31540 -26263 -91312
$$ packed form
2521G16k3742n861M0041M4015l8303K4m633q703j8909Q110m09R619l6962L9036
2507D039J6689m7160k6532j7850j149K4242K7636j2342k3350J3377K2181L698
2495a6521O128M4201m3617N890R929M6997o7692l1228L5900k1854L6152L6022
2483D0307m4349o488M6610r646K3086k9203j1708j1759L0457R418l9734L486K0278
2470B0755L2477o0359o667k1998M662j6227M4937J8431l2573l2786L8018j5121
2458b6451j8364J4768J9017M4249n9907j8623J7665P174M9135k9108j3017N2150
2446C8688K1814l755m8701q749K6823M558j6926K1155o741l9553K5157j9962m6815
2433e3007O2499K1911J0717k4540j0697m6254k4121L2028j7134J7058N277o5049
$$ plain form
2421 -91312 -75446 -41758 -21784 48760 5319 -35740 -21539 -24686 -1620 6664 -39599 -20273
2409 -20273 -51304 -29889 -11699 -27935 -55008 -57532 -47262 -61805 -47296 -17680 -3512 -21392
2397 -21392 24264 -22784 -15173 10649 -40038 -16375 -18136 -16435 -4592 -8198 33383 20188 46669
2384 46669 -3565 -4549 21096 42280 6709 -24644 -11664 3259 11080 -3651 -30743 8342
2372 8342 57076 67089 16492 -24571 11286 6718 -5912 21715 -1807 -16029 -8597 -21595
2360 -21595 -18414 35663 -13020 -70559 -8632 -38942 -12815 9226 12463 15201 81483 72636 1260
2347 1260 11942 -20924 4329 -48165 -15286 28238 36001 37133 43711 80520 17022 6945 -46565
2334 -46565 -3531 13602 -1231 3945 -11264 19181 19390 -33691 -16444 -7500 -17511 -50988 -39082
$$ packed form
2421i1312J5866L3688J9974P0544m3441m1059J4201l147K3066Q284m6263J9326
2409b0273l1031K1415J8190j6236k7073k524J0270j4543J4509K9616J4168j7880
2397b1392M5656m7048P611K5822n0687K3663j761J701J1843l606M1581j3195K6481
2384D6669n0234r84K5645K1184l5571l1353J2980J4923P821j4731k7092L9085
2372H342M8734J0013n0597m1063L5857m568j2630K7627k3522j4222P432j2998
2360b1595L181N4077m8683n7539O1927l0310K6127K2041L237K738O6282q847p1376
2347A260J0682l2866K5253n2494L2879M3524P763J132O578L6809o3498j0077n3510
2334d6565M3034J7133j4833N176j5209L0445K09n3081J7247Q944j0011l3477J1906
$$ plain form
2321 -39082 -23467 -36123 -22227 5585 -1517 -26617 9458 -11334 -67031 -45717 26734 45133
2309 45133 17982 -15405 -4293 14019 8497 -21930 -27174 -12634 -14009 -9981 -8337 -25174 5313
2296 5313 -2015 -11229 -33087 -9827 27371 4052 -27190 -25964 -41076 -56326 -29689 -19674 52946
2283 52946 49094 49803 60357 -767 19749 43429 26518 7130 38652 50746 22502 -2365
2271 -2365 37116 55494 53207 -10221 14972 -2704 15806 27421 3833 9305 -1926 -25035
2259 -25035 -27374 -48477 -43372 6567 10587 6343 -24888 -45876 -42395 -26518 -16553 -26377 -58302
2246 -58302 -85 -25867 -20719 -7710 -9922 -29519 -15121 -1440 515 12186 32771 41729 40968
2233 40968 -1897 -42205 -51640 -50499 -23447 -49567 -22370 20532 -57361 -30757 -71417 -81584
$$ packed form
2321c9082J5615j2656J3896K7812p102k5100L6075k0792n5697K1314P2451J8399
2309D5133k7151l3387J1112J8312n522l0427n244J4540j375M028J644j6837L0487
2296E313p328r214k1858K3260L7198k3319l1242J226j5112j5250K6637J0015P2620
2283E2946l852P09J0554o1124K0516K3680j6911j9388L1522J2094k8244k4867
2271b365L9481J8378k287o3428K5193j7676J8510J1615k3588N472j1231k3109
2259b5035k339k1103N105M9939M020m244l1231k0988L481J5877R965r824l1925
2246e8302N8217k5782N148J3009k212j9597J4398J3681J955J1671K0585Q958p61
2233D0968m2865m0308r435J141K7052k6120K7197M2902p7893K6604m0660j0167
$$ plain form
2221 -81584 -67258 -38993 -11991 26510 15856 8911 20598 -27810 -29672 -29874 29491 91605 72330
2208 72330 100211 35232 -12095 -65264 -60000 -6485 -10051 4998 -7706 -38081 -52895 -3592
2196 -3592 -83608 -67518 -12638 -55359 -42903 -20414 24256 26477 45108 15377 -5857 -14660
2184 -14660 -14655 5513 -46476 -39874 -60400 -32576 -30396 9399 27670 1913 -7865 2114 -22807
2171 -22807 -23793 29441 25975 17153 41631 40242 19563 53733 67968 27995 6485 -39108 -49504
2158 -49504 -38351 -38489 -21397 -609 -7960 29264 -34014 -46125 30028 -5167 -24435 -5513
2146 -5513 -3641 -61839 -63944 14920 652 -8098 -352 -21099 5531 23116 -31962 -29606 19650
2133 19650 -39985 -18373 31683 -10358 -18612 -35837 -43791 -45930 -29582 3946 21847 64610
$$ packed form
2221h1584J4326K8265K7002L8501j0654o945J1687m8408j862k02N9365O2114j9275
2208G2330K7881o4979m7327n3169N264N3515l566J5049j2704l0375j4814M9303
2196c592q0016J6090N4880m2721J2456K2489M4670K221J8631k9731k1234q803
2184a4660NK0168n1989O602k0526K7824K180L9795J8271k5757r778R979k4921
2171b2807r86N3234l466q822K4478j389k0679L4170J4235l9973k1510m5593j0396
2158d9504J1153j38J7092K0788p351L7224o3278j2111P6153l5195j9268J8922
2146e513J872n8198k105P8864j4268q750P746k0747K6630J7585n5078K356M9256
2133A9650n9635K1612N0056m2041q254j7225p954k139J6348L3528J7901M2763
$$ plain form
2121 64610 58234 6420 11338 -22282 -29370 26138 59463 34826 5603 -5044 5256 -584 5281
2108 5281 31920 8163 -9482 29453 43166 15283 44 26889 17458 19787 10148 38934 14346
2095 14346 26952 67722 7502 -10998 5938 57438 44898 24894 -10963 -92 25920 -3767
2083 -3767 -23297 -28733 -12707 -18308 -16336 2606 -39678 -1745 2991 33534 -6389 -6359 -6178 11500
2069 11500 35374 38522 44984 3376 -42116 -42927 -27955 -11994 -25592 -86846 -65575 36944
2057 36944 69717 -15379 -37197 -6838 21832 41528 1232 -10136 -1179 -17670 26182 27646
2045 27646 16064 -406 19656 15104 26345 1836 1562 -31542 -23288 -7257 -25821 -80083 -75933
2032 -75933 -32593 -34949 -9568 -20988 -47382 -43575 18708 -24356 -1656 8939 -10153 13595
$$ packed form
2121F4610o376n1814M918l3620p088N5508L3325k4637k9223j0647J0300n840N865
2108E281K6639k3757j7645L8935J3713k7883j5239K6845r431K329r639K8786k4588
2095A4346J2606M0770o0220j8500J6936N1500j2540k0004l5857J0871K6012k9687
2083c767j9530n436J6026n601J972J8942m2284L7933M736L0543l9923L0J81J7678
2069A1500K3874L148O462m1608m5492q11J4972J5961j3598o1254K1271J02519
2057C6944L2773q5096k1818L0359K8670J9696m0296j1368Q957j6491M3852J464
2045B7646j1582j6470K0062m552J1241k4509k74l3104Q254J6031j8564n4262M150
2032g5933M3340k356K5381j1420k6394L807O2283m3064K2700J0595j9092K3748
$$ plain form
2020 13595 35914 13593 37816 19060 -11805 -4999 -35643 11358 13755 -6859 -11869 14731
2008 14731 5131 42701 43646 -7245 -12957 -10500 35740 15449 -22029 12421 -28205 -20930 10676
1995 10676 36255 44619 56107 44896 6987 31826 61396 36282 -7513 -6022 -3498 -7376 12516
1982 12516 33010 11283 36153 8532 2007 -5598 8127 11133 22808 31071 20955 21491 22856
1969 22856 12455 9967 16054 28375 46544 37935 -26473 -31518 9100 22544 7610 -10093 -39598
1956 -39598 -53143 -12406 15194 44600 30131 34293 39119 6656 24177 39854 -25533 -43626
1944 -43626 -9261 -18520 37568 63811 17407 -4638 50517 42417 -14011 -1683 30613 -12589
1932 -12589 -27900 -9867 -25709 -25636 -33787 -46395 -6880 8788 3944 -15683 -9243 12581 -501
$$ packed form
2020A3595K2319k2321K4223j8756l0865O806l0644M7001K397k0614n010K6600
2008A4731r600L7570R45n0891n712K457M6240k0291l7478L4450m0626P275L1606
1995A0676K5579Q364J1488j1211l7909K4839K9570k5114m3795J491K524l878J9892
1982A2516K0494k1727K4870k7621o525p605J3725L006J1675Q263j0116N36J365
1969B2856j0401k488O087J2321J8169q609o4408n045M0618J3444j4934j7703k9505
1956c9598j3545M0737K7600K9406j4469M162M826l2463J7521J5677o5387j8093
1944d3626L4365r259N6088K6243m6404k2045N5155q100n6428J2328L2296m3202
1932a2589j5311J8033j5842P3q151j2608L9515J5668m844j9627O440K1824j3082
$$ plain form
1919 -501 -16039 -52824 -29711 5418 -4319 -29076 -37473 -4595 -22478 -32471 2349 -34337 1182
1906 1182 40534 37985 13415 41268 53325 51339 14941 12249 -47923 -40008 -44161 -74404 -62561
1893 -62561 -75095 -25583 10525 36471 77267 47312 8825 22316 23036 33735 63616 62962 10950
1880 10950 28544 14725 10590 23249 35342 21009 25531 46949 60121 37549 7143 -28858
1868 -28858 6163 41843 23349 52009 16766 -22021 -26400 -32935 -2641 -6073 18752 44873
1856 44873 9533 -3281 -32384 -34724 -18155 -36488 -37596 13084 6144 -376 -13995 -34402 -33107
1843 -33107 -16766 -13596 3278 -32190 -5530 -5250 372 -15467 -2874 17896 -29985 -27778 -22988
1830 -22988 -16283 43013 19442 35236 -13056 -62139 -7963 50090 77773 74197 54495 25533
$$ packed form
1919e01j5538l6785K3113L5129r737k4757q397L2878j7883r993L4820l6686L5519
1906A182L9352k549k4570K7853J2057j986l6398k692o0172P915m153l0243J1843
1893f2561j2534M9512L6108K5946M0796k9955l8487J3491P20J0699K9881o54n2012
1880A0950J7594j3819m135J2659J2093j4333M522K1418J3172k2572l0406l6001
1868b8858L5021L5680j8494K8660l5243l8787m379o535L0294l432K4825K6121
1856D4873l5340j2814k9103k340J6569j8333j108N0680o940o520j3619k0407J295
1843c3107J6341L170J6874l5468K6660K80N622j5839J2593K0770m7881K207M790
1830b2988O705N9296k3571J5794m8292m9083N4176N8053K7683l576j9702k8962
$$ plain form
1818 25533 -1538 -31569 14605 32012 51189 34533 -3117 -44693 -46090 1995 -31436 -50438
1806 -50438 -77628 -49138 -48006 -83211 -77546 -103088 -60035 -10708 -12943 -23309 -13067 -47007
1794 -47007 -59441 -34635 3413 -14256 -839 -18737 -26903 -60328 -40498 -17354 11779 -10289
1782 -10289 -66097 -31533 36680 49059 -4142 -49092 -69746 -106313 -19544 1041 -19850 30075
1770 30075 -17108 -40350 22429 -12543 -36195 4613 -40681 -61713 -17106 -15473 2767 10456
$$ packed form
1818B5533k7071l0031M6174J7407J9177j6656l7650m1576j397M8085l3431j9002
1806e0438k7190K8490J132l5205N665k5542M3053M9327k235j0366J0242l3940
1794d7007j2434K4806L8048j7669J3417j7898q166l3425J9830K3144K9133k2068
1782a0289n5808L4564O8213J2379n3201m4950k0654l6567Q6769K0585k0891M9925
1770C0075m7183k3242O2779l4972k3652M0808m5294k1032M4607J633J8240P689
$$ [...]
##END NTUPLES=NMR SPECTRUM
##END=
