##TITLE=1H_EC-3293(VII-34)
 CDCl3
 8 sc, 
 10.5.2023
##JCAMPDX= 6.0         $$ Bruker NMR JCAMP-DX V2.0
##DATA TYPE= NMR SPECTRUM
##DATA CLASS= NTUPLES
##ORIGIN= UXNMR, Bruker Analytische Messtechnik GmbH
##OWNER= root
$$ XWIN-NMR		Version 3.5
$$ Wed May 10 14:03:40 2023 Russian Standard Time (UT+4h)  she@DPX200
##.OBSERVE FREQUENCY= 200.13135
##.OBSERVE NUCLEUS= ^1H
##.ACQUISITION MODE= SIMULTANEOUS
##.ACQUISITION SCHEME= undefined
##.AVERAGES= 8
##.DIGITISER RES= 18
##SPECTROMETER/DATA SYSTEM= spect
##.PULSE SEQUENCE= zg30
##.SOLVENT NAME= CDCl3
##.SHIFT REFERENCE= (INTERNAL, CDCl3, 0, 15.7458)
##AUDIT TRAIL= $$ (NUMBER, WHEN, WHO, WHERE, WHAT)
$$ ##TITLE= Audit trail, XWIN-NMR		Version 3.5
$$ ##JCAMPDX= 5.01
$$ ##ORIGIN= Bruker BioSpin GmbH
$$ ##OWNER= she
$$ F:/spectra/data/she/nmr/H-F/1/pdata/1/auditp.txt
$$ ##AUDIT TRAIL=  $$ (NUMBER, WHEN, WHO, WHERE, WHAT)
(   1,<2023-05-10 13:59:46.10 +0400>,<she>,<DPX200>,
      <created by zg, POWCHK disabled, PULCHK disabled
       configuration hash MD5:
       00 E9 B6 7A A2 85 ED C7 34 08 36 98 17 FE 4E 26
       data hash MD5: 16K
       F6 1B D6 A5 1C B3 70 B6 96 D5 99 9D 62 AA F3 14>)
(   2,<2023-05-10 13:59:48.73 +0400>,<she>,<DPX200>,
      <Start of raw data processing
       efp BC_mod = 2 LB = 0.24 FT_mod = 6 PKNL = 1 PHC0 = -19821.21 PHC1 = 18.8008 SI = 16K 
       data hash MD5: 16K
       9D 03 D4 E3 9F 14 2D ED 29 7B BF BC F9 C8 4F D6>)
(   3,<2023-05-10 14:00:07.17 +0400>,<she>,<DPX200>,
      <pk PHC0 = 0.4457306 PHC1 = -4.2 
       data hash MD5: 16K
       22 79 DC A0 7A FE 34 BA C2 36 3C D3 1B A3 46 C8>)
(   4,<2023-05-10 14:00:11.04 +0400>,<she>,<DPX200>,
      <abs ABSG = 5 
       data hash MD5: 16K
       69 9E 56 21 40 C0 42 0F 16 8E E0 CE 81 61 60 79>)
$$ ##END=
$$ 
$$ hash MD5
$$ 01 F8 6B DD F6 AA A6 71 7A EE 0D CF F2 E1 39 05
##$RELAX= 
##$RELAX= 
##$RELAX= 
##$RELAX= 
##$RELAX= 
##$RELAX= 
$$ Bruker specific parameters
$$ --------------------------
##$DU= <F:/spectra>
##$EXPNO= 1
##$NAME= <H-F>
##$PROCNO= 1
##$TYPE= <nmr>
##$USER= <she>
##$AMP= (0..31)
100 100 100 100 100 100 100 100 100 100 100 100 100 100 100 100 100 100 
100 100 100 100 100 100 100 100 100 100 100 100 100 100 
##$AQSEQ= 0
##$AQ_mod= 1
##$AUNM= <au_zg>
##$AUTOPOS= <>
##$BF1= 200.13
##$BF2= 200.13
##$BF3= 200.13
##$BF4= 200.13
##$BF5= 200.13
##$BF6= 200.13
##$BF7= 200.13
##$BF8= 200.13
##$BYTORDA= 1
##$CFDGTYP= 0
##$CFRGTYP= 5
##$CHEMSTR= <none>
##$CNST= (0..31)
1 1 145 1 1 1 1 1 1 1 1 1 1 1 1 1 1 1 1 1 1 1 1 1 1 1 1 1 1 1 1 1 
##$CPDPRG= <>
##$CPDPRG1= <>
##$CPDPRG2= <>
##$CPDPRG3= <>
##$CPDPRG4= <mlev>
##$CPDPRG5= <mlev>
##$CPDPRG6= <mlev>
##$CPDPRG7= <mlev>
##$CPDPRG8= <mlev>
##$CPDPRGB= <>
##$CPDPRGT= <>
##$D= (0..31)
0 1.2 0 0 0 0 0 0 0 0.06 0 0.03 0 0 0 0 0.0002 0 0 0 0 0 0 0 0 0 0 0 0 
0 0 0 
##$DATE= 1683712785
##$DBL= (0..7)
120 120 120 120 120 120 120 120 
##$DBP= (0..7)
150 150 150 150 150 150 150 150 
##$DBP07= 0
##$DBPNAM0= <>
##$DBPNAM1= <>
##$DBPNAM2= <>
##$DBPNAM3= <>
##$DBPNAM4= <>
$$ [...]
##$SUBNAM3= <"">
##$SUBNAM4= <"">
##$SUBNAM5= <"">
##$SUBNAM6= <"">
##$SUBNAM7= <"">
##$SUBNAM8= <"">
##$SUBNAM9= <"">
##$SW= 18.05172834244
##$SWIBOX= (0..15)
0 0 2 0 0 0 0 0 0 0 0 0 0 0 0 0 
##$SW_h= 3612.71676300578
##$TD= 16384
##$TD0= 1
##$TE= 0
##$TE2= 300
##$TE3= 300
##$TEG= 300
##$TL= (0..7)
0 120 120 120 120 120 120 120 
##$TP= (0..7)
150 150 150 150 150 150 150 150 
##$TP07= 0
##$TPNAME0= <>
##$TPNAME1= <>
##$TPNAME2= <>
##$TPNAME3= <>
##$TPNAME4= <>
##$TPNAME5= <>
##$TPNAME6= <>
##$TPNAME7= <>
##$TPOAL= (0..7)
0.5 0.5 0.5 0.5 0.5 0.5 0.5 0.5 
##$TPOFFS= (0..7)
0 0 0 0 0 0 0 0 
##$TUNHIN= 0
##$TUNHOUT= 0
##$TUNXOUT= 0
##$USERA1= <user>
##$USERA2= <user>
##$USERA3= <user>
##$USERA4= <user>
##$USERA5= <user>
##$V9= 5
##$VALIST= <valist>
##$VCLIST= <CCCCCCCCCCCCCCC>
##$VD= 0
##$VDLIST= <DDDDDDDDDDDDDDD>
##$VPLIST= <PPPPPPPPPPPPPPP>
##$VTLIST= <TTTTTTTTTTTTTTT>
##$WBST= 1024
##$WBSW= 4
##$XGAIN= (0..3)
0 0 0 0 
##$XL= 0
##$YL= 0
##$YMAX_a= 485290
##$YMIN_a= -560240
##$ZGOPTNS= <>
##$ZL1= 120
##$ZL2= 120
##$ZL3= 120
##$ZL4= 120
##$ABSF1= 15.73257
##$ABSF2= -2.31928
##$ABSG= 5
##$ABSL= 3
##$ALPHA= 0
##$AQORDER= 0
##$ASSFAC= 0
##$ASSFACI= 0
##$ASSFACX= 0
##$ASSWID= 0
##$AUNMP= <proc_1d>
##$AZFE= 0.1
##$AZFW= 0.1
##$BCFW= 0
##$BC_mod= 2
##$BYTORDP= 0
##$COROFFS= 0
##$CY= -3
##$DATMOD= 1
##$DC= 0
##$DFILT= <>
##$DTYPP= 0
##$F1P= 0
##$F2P= 0
##$FCOR= 1
##$FTSIZE= 16384
##$FT_mod= 6
##$GAMMA= 0
##$GB= 0
##$INTBC= 1
##$INTSCL= 3.70164e-10
##$ISEN= 128
##$LB= 0.24
##$LEV0= 0
##$LPBIN= 0
##$MAXI= 10000
##$MC2= 0
##$MEAN= 0
##$ME_mod= 0
##$MI= 1.114404
##$NCOEF= 0
##$NC_proc= -6
##$NLEV= 6
##$NOISF1= 3.799351
##$NOISF2= 2.8
##$NSP= 0
##$NTH_PI= 0
##$NZP= 0
##$OFFSET= 15.74579
##$PC= 1
##$PHC0= -19820.77
##$PHC1= 14.6008
##$PH_mod= 1
##$PKNL= yes
##$PPARMOD= 0
##$PSCAL= 0
##$PSIGN= 0
##$REVERSE= no
##$SF= 200.130005153931
##$SI= 16384
##$SIGF1= 3
##$SIGF2= 2
##$SINO= 5.538805
##$SIOLD= 16384
##$SREGLST= <1H.CDCl3>
##$SSB= 0
##$STSI= 16384
##$STSR= 0
##$SW_p= 3612.71676300578
##$SYMM= 0
##$S_DEV= 0
##$TDeff= 16384
##$TDoff= 0
##$TI= <>
##$TILT= no
##$TM1= 0
##$TM2= 0
##$TOPLEV= 0
##$USERP1= <user>
##$USERP2= <user>
##$USERP3= <user>
##$USERP4= <user>
##$USERP5= <user>
##$WDW= 1
##$XDIM= 16384
##$YMAX_p= 312674576
##$YMIN_p= -600997
$$ End of Bruker specific parameters
$$ ---------------------------------
##NTUPLES= NMR SPECTRUM
##VAR_NAME=  FREQUENCY,     SPECTRUM/REAL,   SPECTRUM/IMAG
##SYMBOL=    X,             R,               I
##VAR_TYPE=  INDEPENDENT,   DEPENDENT,       DEPENDENT
##VAR_FORM=  AFFN,          ASDF,            ASDF
##VAR_DIM=   16384,         16384,           16384
##UNITS=     HZ,            ARBITRARY UNITS, ARBITRARY UNITS
##FACTOR=    0.220516191357247, 1,           1
##FIRST=     3151.20493936995, 0,            0
##LAST=      -461.511823635828, 0,           0
##MIN=       -461.511823635828, -600997,     0
##MAX=       3151.20493936995, 312674576,    0
$$ Real data points
##PAGE= N=1
##DATA TABLE= (X++(R..R)), XYDATA
$$ [...]
7069I24466j17912n3481j0684L802k125p7677J16502O3344j6441q5128K6787J5414
7057G86867M8200l3292m4763P346q5335j31767J57399q0272k4461o345j09618
7046D83959R0321J82625L7829o0641m1886r3270j03160J60168J43031m7234J64610
7035I16352l8793j30874o9012J40637k1655j03682n0765L4455N7447K7473m9320
7024G12263P523O8962N8733m2220J12712j73954k0902Q4432p7813N7066l2957
7013G53845N3789q7052j3981J53305p0658m3878N2838Q7205Q9597J9327J41344
7002A135681j50947o1562J53797j9694j11124J34391L7839k04998j50207N1277
6992H14453K52121L3304p1549o2376k3044J49407J95996K870l0997Q257j019l1279
$$ y = [924466, 806554, 753073, 742389, 746191, 744066, 666389, 782891, 846235, 829794, 744666, 771453, 786867, 835067, 801775, 757012, 764358, 679023, 547256, 704655, 624383, 599922, 593577, 483959, 574280, 756905, 794734, 734093, 692207, 598937, 495777, 655945, 798976, 751742, 916352, 877559, 746685, 677673, 818310, 796655, 692973, 642208, 676663, 734110, 761583, 712263, 719786, 788748, 847481, 805261, 917973, 744019, 723117, 807549, 729736, 786802, 753845, 807634, 720582, 706601, 859906, 789248, 745370, 798208, 885413, 975010, 994337, 1135681, 984734, 923172, 1076969, 1057275, 946151, 1080542, 1118381, 913383, 763176, 814453, 1066574, 1099878, 1028329, 965953, 942909, 1092316, 1288312, 1291182, 1260185, 1268442, 1267423, 1236144]
6980A236144o8345Q774J25783r930L6516J15758J0295q3038N8850n869k3027J79475
6968A581386L8484Q3365j9147K3704L6292N865R6770l1586K770J11205L6054q1457
6956A883705j12580J15632N5944J32988Q8714J589o0222L4584J02126j5889q183
6945B218408j7955l4477J1038J03300N655r861j93364l2627M7671K9523N8020
6934B185331Q175j53193P2762k2631j70918j795J9193p3528k507j09583p6872
6923A674434j575o9050K1038l4760O1796o8960j01431J51215n9876j05236R8512
6912A566107n3354Q8843j522p256n9775m7625j0600n8977K0900j0316p918P3479
6900A491986j4291n8261j18234n2436O3250J10301l7945j20501J3762J49109P5919
$$ y = [1236144, 1167799, 1176573, 1302356, 1292426, 1328942, 1444700, 1454995, 1371957, 1430807, 1424938, 1401911, 1581386, 1619870, 1703235, 1684088, 1707792, 1744084, 1749949, 1846719, 1815133, 1817903, 1929108, 1965162, 1883705, 1771125, 1886757, 1942701, 2075689, 2164403, 2165992, 2105770, 2140354, 2242480, 2226591, 2218408, 2200453, 2165976, 2177014, 2280314, 2285969, 2276108, 2082744, 2050117, 2097788, 2127311, 2185331, 2193506, 2040313, 2113075, 2090444, 1919526, 1917731, 1936924, 1863396, 1860889, 1751306, 1674434, 1672859, 1603809, 1624847, 1590087, 1651883, 1582923, 1481492, 1632707, 1572831, 1467595, 1566107, 1512753, 1601596, 1600074, 1592818, 1533043, 1485418, 1474818, 1415841, 1436741, 1426425, 1418507, 1491986, 1477695, 1419434, 1301200, 1248764, 1312014, 1422315, 1384370, 1263869, 1277631, 1426740, 1502659]
6889A502659J11488K3268K254o6655J2859N3566Q0340j495j27034o2027l0273
6878A498950l3710j3946J4993K9302L5770O0438k1318j24230M5174K7373j3852
6867A504944L2114N3458O330j01791K9897L8528n9587P0546n9126L6230L8927
6856A590470j3609j6942R8573O7137r3927N4839R5991n485N0942K8127J45042
6845B001158J59134j27652O8591o620m2237O4439Q8956J41410n908p527j16426
6834B217318J38686Q0316q3081O7538q298O8271K3976l7948Q5461n7433K67106
6823B761912L7539N1527j5477J0814J01215M4330J63162K4887j3802Q6672P4603
6812C327382k3507R0613N0156K44836J85636P371N4605J36938O012K0637J07678
$$ y = [1502659, 1614147, 1637415, 1639669, 1573014, 1585873, 1639439, 1719779, 1718284, 1591250, 1529223, 1498950, 1465240, 1451294, 1466287, 1495589, 1531359, 1591797, 1570479, 1446249, 1491423, 1518796, 1504944, 1537058, 1590516, 1596846, 1495055, 1524952, 1563480, 1503893, 1574439, 1515313, 1551543, 1590470, 1576861, 1559919, 1658492, 1725629, 1631702, 1686541, 1782532, 1777047, 1827989, 1856116, 2001158, 2160292, 2032640, 2101231, 2094611, 2052374, 2116813, 2205769, 2347179, 2341271, 2333744, 2217318, 2356004, 2436320, 2353239, 2420777, 2412479, 2480750, 2504726, 2466778, 2552239, 2494806, 2761912, 2799451, 2850978, 2835501, 2846315, 2947530, 2991860, 3155022, 3179909, 3166107, 3252779, 3327382, 3303875, 3394488, 3444644, 3689480, 3875116, 3882487, 3937092, 4074030, 4080042, 4100679, 4208357]
6801D208357J42834Q5219J72372O6162L7299K67057K08862J52639J66798Q2136
6791E589735K11152J34549P4295K06566K74028Q7530J22682K17899K39868J62471
6781G320775K04277K80312J45890K92812L86229K83227K13824M08612L72836L37075
6771A0245869L56268M73519L13717M86506N20334M78133N61921N72523O00879
6762A4609669P55042Q86992O53508P27571Q81852J041771R97552R46884J044378
6753B2545219J156406R93041R87965J123484R44828R57901R23342N17204M60654
6744C0610044J80226p5577k17473m65933p94032q82786j039470j255154j300851
6735B4758994j267381j133335j385110j272822j068198j103371j011082r47292
$$ y = [4208357, 4351191, 4436410, 4608782, 4674944, 4712243, 4979300, 5188162, 5340801, 5507599, 5589735, 5800887, 5935436, 6009731, 6216297, 6490325, 6577855, 6700537, 6918436, 7158304, 7320775, 7525052, 7805364, 7951254, 8244066, 8630295, 8913522, 9127346, 9535958, 9908794, 10245869, 10602137, 11075656, 11389373, 11875879, 12396213, 12874346, 13436267, 14008790, 14609669, 15364711, 16251703, 16905211, 17632782, 18514634, 19556405, 20553957, 21500841, 22545219, 23701625, 24694666, 25682631, 26806115, 27750943, 28708844, 29632186, 30149390, 30610044, 30790270, 30714693, 30497220, 30031287, 29237255, 28354469, 27314999, 26059845, 24758994, 23491613, 22358278, 20973168, 19700346, 18632148, 17528777, 16517695, 15570403]
6727A5570403r23552p14915q40964q94803p17773n54018n75464m38682m55518
6718I454714n79557m83607m95038l96949l55155k58784j47681l38327k41536k41457
6708E916623k56525l07355k87173k39804j48523j31109j04363k35436k86044q7374
6698C832917j54179k9310p9806p9031j67115j42807j37533j51924j44282l8804
6688B708126l4201J7914j43227l9702R3737j56430k7185r1667j1131q4825p7649
6677B153760j03364j05045k560n6687M5358r4039O662j20552j72482n6342j7643
6666A477066p4912k1516j34123K457K5667p7528k2596M7400r0128j19833R9630
6655A111584R0300N3122J258j65172r5493l3473J39451l965p5892j54177j06303
$$ y = [15570403, 14646851, 13931936, 13090972, 12196169, 11478396, 10924378, 10348914, 9910232, 9454714, 8875157, 8391550, 7896512, 7499563, 7144408, 6885624, 6737943, 6399616, 6158080, 5916623, 5660098, 5352743, 5065570, 4825766, 4677243, 4546134, 4441771, 4206335, 3920291, 3832917, 3678738, 3649428, 3569622, 3490591, 3323476, 3180669, 3043136, 2891212, 2746930, 2708126, 2673925, 2691839, 2548612, 2508910, 2602647, 2446217, 2419032, 2327365, 2316234, 2231409, 2153760, 2050396, 1945351, 1942791, 1886104, 1931462, 1837423, 1844085, 1723533, 1551051, 1494709, 1477066, 1402154, 1380638, 1246515, 1248972, 1274639, 1197111, 1174515, 1221915, 1131787, 1011954, 1111584, 1201884, 1255006, 1256264, 1091092, 995599, 962126, 1101577, 1097612, 1021720, 867543, 761240]
6644G61240M2332K8230o48r0057J14522j38902k6483j474q4303o6690N4941m0423
6632E52285L3207j7566L978K9150P228m3242M9668j08483O3663O234j00154J1860
6620D87828l4235J4756l4736Q227k0498p4538J60638L5362j37385k4045N437J41857
6608E28668o1672o4968q238q4059J00103Q074l3045P2396P2486j23403j44539
6597B61803q2790J29710J34775k5168p568m4975l9853r0427J03452O7042n319
6586D00682j21112j7366K6648J65343k8813j11108q5757M2945K2214p3238M097
6575B24535l4782k0205j791P2860O4619n3460O3571p6987K6906j7237O0114R4690
6563D02833n6101O1537q5308q5253j420k7403l7044n5535O6485k4013n2442Q9181
$$ y = [761240, 803572, 831802, 831154, 741097, 855619, 716717, 690234, 688760, 604457, 537767, 592708, 552285, 585492, 567926, 571904, 601054, 608282, 565040, 614708, 506225, 569888, 576122, 475968, 487828, 453593, 468349, 433613, 441840, 421342, 346804, 507442, 542804, 405419, 381374, 386811, 528668, 466996, 402028, 393790, 309731, 409834, 417908, 384863, 457259, 529745, 406342, 261803, 179013, 308723, 443498, 418330, 410762, 365787, 325934, 235507, 338959, 406001, 400682, 279570, 262204, 288852, 454195, 425382, 314274, 228517, 271462, 293676, 220438, 224535, 189753, 169548, 167757, 240617, 305236, 251776, 315347, 238360, 265266, 248029, 308143, 402833, 346732, 408269, 322961, 237708, 236288, 208885, 171841, 116306, 182791, 158778, 106336, 195517]
6551A95517K0535N2461k5451l3072J02705l2701n8629J21277k7155j28839J8309
6540B04957J02768j7613k3715n1795r1279R9933m3570j57517k3182L5108P336
6529D1431N9321P2R051J61832l3465m9425Q1628o4948r3348n8542K510L3802r088
6516H0831L8455P3034j38083j06995K29505r7401o8565J2997Q4397r6073j3672
6505a570J29473K8538j57768K3732M1685L719M4485j06065k7354J4744Q7593N5270
6493A36482K203k4765k8243K3927p0892p3101R2359L3296K6334k0839K056j27498
6481b8681J168J20661n1845M1568K344l2628r5757R8163n4948J5768Q9662L39
6469A05814M955p8446q4699j9866l9319K3127O5556j09759k7839N4180J03328
$$ y = [195517, 216052, 268513, 243062, 209990, 312695, 279994, 221365, 342642, 315487, 186648, 204957, 307725, 290112, 266397, 214602, 123323, 223256, 179686, 22169, -1013, 34095, 41431, 100752, 100824, 109875, 271707, 238242, 188817, 270445, 205497, 112149, 53607, 56117, 89919, 80831, 119286, 192320, 54237, -52758, 176747, 79346, 10781, 23778, 108175, 12102, -1570, 127903, 156441, -1327, 22405, 64090, 67809, 112294, 6229, -21125, -6381, 81212, 136482, 138685, 113920, 85677, 109604, 38712, -34389, 57970, 91266, 117600, 96761, 98817, -28681, -27513, 93148, 41303, 82871, 85215, 52587, -43170, 54993, 45, 15813, 105475, 105814, 110769, 32323, -52376, -72242, -111561, -88434, -22878, -132637, -160476, -106296, -2968]
6458b968n4003j7608k773K6356J12561P7338m6241n893r1775o1163J56779o4950
6446B5660P521l1548L8314J1971O2498m5455j3621N7862n1235K0645m4603l3813
6434D196r7040J64585j1684O0632m5781p8365p3000o1659P4045J4734K5041N7430
6422C3134P59L3096m5931R233L7150q4201Q0811J3399p3197l69Q0106j583M9134
6409A31541j2219j22060J10376J0289q9166l7323O9625n1855Q3550q4887K8955
6398C6826q9281l8529l9380L8209J39394r52P4007n0879p2127R3938N1920O4973
6386B08119l2101l8236J7761m8421l6589p3066J22420K061K1180j71974L1010
6375B164R4875K5720m1884l9138j9144m1223R0447Q1053k6446n3769J26234k8654
$$ y = [-2968, -56971, -74579, -77352, -50996, 61565, 138903, 92662, 86769, -5006, -66169, 90610, 25660, 33181, 1633, 39947, 51918, 114416, 68961, 55340, 113202, 61967, 82612, 38009, 4196, -92844, 71741, 60057, 120689, 74908, -3457, -76457, -138116, -64071, -49337, -24296, 33134, 33893, 66989, 21058, 30291, 67441, -16760, 64051, 77450, 4253, 3884, 83990, 82407, 131541, 119322, -2738, 107638, 117927, 28761, -8562, 61063, 9208, 92758, 7871, 36826, -52455, -90984, -130364, -92155, 47239, 46287, 120294, 69415, -2712, 91226, 143146, 208119, 176018, 137782, 155543, 107122, 70533, -2533, 119887, 121948, 143128, -28846, 2164, 97039, 122759, 80875, 41737, 22593, -18630, 71817, 152870, 126424, 72655, 198889, 170235]
6363A70235q2556Q0617M1962O436r5115L932M9787l0516P935r100j16558O690
6351C3749J02250J9015K7516J17475M0002K9272q907n8757j04741l2525m7849
6340A16500N4524J36454j4139j12067L3296J4161K8805j72176J2042N5073L1400
6329A83873l7378r0525L6270L777R1511j55131l4764K5j02720J40085J48202m7813
6317A35412j27330J4713k2577O3948n7325L2826p6484m9990Q5441p3458j9989
6306i4813L7724J03540j28527n3644N5840n946J6916K1364l8690J97365m9358
6295F1771p2490Q5698r1708n7268P0396M1705K2453l9769r2346J2095J3737N8820
6283A3094M62n7715J1481j07049K5157r410j2600k6713L9991K02099p5332q9407
$$ y = [170235, 87679, 168296, 210258, 216694, 121579, 125511, 175298, 144782, 152717, 143617, 27059, 33749, 135999, 155014, 182530, 300005, 340007, 369279, 360372, 301615, 196874, 164349, 116500, 171024, 307478, 293339, 181272, 214568, 228729, 257534, 85358, 97400, 152473, 183873, 146495, 55970, 92240, 96017, 187528, 32397, -2367, -2342, -105062, 35023, 183225, 135412, 8082, 22795, 218, 64166, 6841, 39667, -36817, -86807, -1366, -74824, -94813, -57089, 46451, -82076, -135720, -79880, -85826, -68910, -47546, -86236, 111129, 61771, -10719, 74979, -16729, -73997, -3601, 38104, 60557, 20788, -71558, -59463, -45726, 13094, 13556, -44159, -32678, -139727, -114570, -123980, -136580, -163293, -123302, 78797, 3465, -85942]
6271h5942R1212K5114J5451l7493M7971Q7798J3061j30383m8738J15626L0181
6260A23858r6465j03572J15537n0233M7017P2495j14020N5618J48305m2422k56147
6249a00029O0809k4609q9550J07428N0152J9730O5511M4752j69599q88P3778J04228
6237A41713j5982j47083P4239j23222J05805p034j7825r6974p1798q275J09788
6226e6648J55998n0254j6851k9224R3051L8760L6389o0973o2651J76702j02915
6215A21384j76624L4702J8635J16737K8425M3152p0451k2438j18533J12728J14650
6204B02367k35637N4467K7377O4062O2999r4486J3717l5415J8197J8770P9847
6193A76265K5713k6804o7449m9711J98182p1730l1492K4426L5038J90443j63939
$$ y = [-85942, 5270, 30384, 45835, 8342, 56313, 144111, 157172, 26789, -21949, 93677, 123858, 27393, -76179, 39358, -10875, 36142, 108637, -5383, 50235, 198540, 156118, -100029, -39220, -63829, -153379, -45951, 4201, 23931, 89442, 134194, -35405, -36293, 37485, 141713, 125731, -21352, 52887, -70335, 35470, 28436, 10611, -86363, -158161, -166436, -56648, 99350, 49096, 32245, 3021, 96072, 134832, 171221, 110248, 47597, 224299, 121384, -55240, -20538, -1903, 114834, 143259, 186411, 115960, 93522, -25011, 87717, 202367, -33270, 21197, 48574, 112636, 175635, 81149, 94866, 59451, 77648, 96418, 176265, 201978, 175174, 107725, 58014, 256196, 184466, 152974, 177400, 212438, 402881, 238942]
6182B38942J11279j5646j24359O1420j42561P5822P9681j5284L7475o7025N1248
6171B90992k1441k0347O7335J30704j06332j10712k0064r5635j5307R1950R8520
6160B89663j19883k3536O5604j9185R5373q1011k3242N6854l5621j945Q5890K5180
6148C14141r50j686l6619N5931M9556O0280J4801n2390n7836N3588j07094j7858
6136B73864N4315k4728j00321J5170L2527K5111Q2946k3197m4003O7376q2029
6125B77031o1145R030l6085L3528P3224l474r6087l5129O8622j3208o2627J43962
6113B97642K3676J19762j20627m1400r8659M74Q9660K1657J11599m3190r6499
6102B64095j56014J03026O4054j0824K9683Q4097k0236N907l3295p0386K094O5822
$$ y = [238942, 350221, 334575, 210216, 271636, 129075, 204897, 284578, 269294, 306769, 239744, 290992, 269551, 249204, 316539, 447243, 340911, 230199, 210135, 114500, 99193, 191143, 289663, 169780, 146244, 211848, 192663, 288036, 207025, 183783, 240637, 205016, 203071, 288961, 314141, 313191, 311505, 274886, 330817, 380373, 440653, 455454, 403064, 345228, 398816, 291722, 273864, 328179, 303451, 203130, 218300, 250827, 275938, 358884, 335687, 291684, 359060, 277031, 215886, 224916, 188831, 222359, 295583, 292109, 196022, 160893, 229515, 216307, 153680, 297642, 321318, 441080, 320453, 279053, 180394, 180868, 270528, 292185, 403784, 360594, 264095, 108081, 211107, 275161, 264337, 294020, 378117, 357881, 363788, 330493, 260107, 262201, 328023]
6090C28023P7055N7434k3490j44666k5142l470j59774R5553J11613N3904J0275
6079C77315K4006J09097l1531j20267j59857O6479j3514k9611Q7556j71476p6478
6068F1719J18028K3641J23621R1562l5238l2226k8271R7709j7522J0742l4273
6057C79492o8384R885q7852J06406m4939k9131J67864P3183j13235q3587Q2438
6046C92140J059L9649L3945J05929m7015j7329N249j2942n7496Q5025k1625N4678
6034E61267q9019M9167J4058Q3121Q5962r4002p4490j05951N6350R8282m2254
6023E42491J1057k0783Q8045M7736p3535J16661p8488k7335M456J09869l4652
6012F85522m7501K9758Q6629l0116J07321j2967j65578k2733J46251M2591L3621
$$ y = [328023, 405078, 462512, 439022, 294356, 269214, 265744, 105970, 201523, 313136, 367040, 377315, 401321, 510418, 478887, 358620, 198763, 265242, 251728, 222117, 309673, 138197, 61719, 179747, 203388, 327009, 418571, 383333, 351107, 322836, 420545, 403023, 413765, 379492, 311108, 320993, 233141, 339547, 294608, 265477, 433341, 506524, 393289, 309702, 392140, 393199, 432848, 466793, 572722, 525707, 508378, 513627, 500685, 443189, 528214, 506589, 561267, 472248, 521415, 535473, 618594, 704556, 610554, 536064, 430113, 486463, 584745, 542491, 553548, 532765, 620810, 668546, 595011, 711672, 633184, 605849, 610305, 720174, 685522, 638021, 667779, 754408, 724292, 831613, 818646, 653068, 630335, 776586, 819177, 852798]
6001H52798L8742n4621N3151n2342l034J25356r884j3181r0652Q286k87O2361
5989I16693j8497M8284R901r038O5935O9293N7262l5287q2894M6767q3625Q0246
5977A065040J08295R9182j2077J1938n262J84715R1637L8767l2029l3626J047
5966A517627n8225L4752j19700J29357J59300J01589k7164J8672J1932j39360
5956A628780o114K08964K12688K1492Q90q521m5276Q5043o3484m612O9098J21213
5944B220161J14032J6885J88266j8667O8234K48150P3599P8847j44936J0518Q8738
5933B943827P1679N2567J31062J47672P1761M5461K07511P5634p1779J37907Q9924
5922C903226Q3080k1678N6470J72354m2053J59141j4521J59466K04953J78620
$$ y = [852798, 891540, 836919, 890070, 837728, 834694, 960050, 950166, 936985, 846333, 854619, 854332, 916693, 898196, 946480, 956381, 947343, 1013278, 1082571, 1139833, 1104546, 1021652, 1068419, 984794, 1065040, 1173335, 1272517, 1260440, 1272378, 1267116, 1451831, 1543468, 1582235, 1550206, 1516580, 1517627, 1459402, 1494154, 1374454, 1503811, 1663111, 1764700, 1737536, 1756208, 1768140, 1628780, 1622666, 1831630, 2044318, 2065810, 2066700, 2058179, 2012903, 2097946, 2034462, 2029850, 2098948, 2220161, 2334193, 2351078, 2539344, 2520677, 2588911, 2837061, 2910660, 2989507, 2844571, 2855089, 2943827, 3015506, 3068073, 3199135, 3346807, 3418568, 3464029, 3671540, 3747174, 3675395, 3813302, 3903226, 3986306, 3964628, 4021098, 4193452, 4151399, 4310540, 4296019, 4455485, 4660438, 4839058]
5912D839058N5182Q2647K98306K15237J08377N6415J02230L37695K22907J45743
5902F463797K16688J80481K79531K16586L28111L37494K88689M51262M22447N58251
5892I743337N89654M32246N70861P42514P32958P25157P99604Q77689Q03267P27497
5882A6744784Q39765Q16244Q64153Q88081P54735O47463J86753l52392q91740
5873B0497846r92145q40136o78447n45810k54764j91774j04211Q6490J83521M10844
5863A7571414O91083R40317Q59676J128001J379461J410820J504306J597026J713669
5854B8795773K011437K157248K094149K075003J937301J885764J889253J767334
5846D4613262J741588J548670P88696p88428k854072m123027l830601l318567
$$ y = [4839058, 4894240, 4976887, 5275193, 5490430, 5598807, 5655222, 5757452, 6095147, 6318054, 6463797, 6680485, 6860966, 7140497, 7357083, 7685194, 8022688, 8311377, 8762639, 9185086, 9743337, 10332991, 10765237, 11336098, 12078612, 12811570, 13536727, 14336331, 15214020, 16017287, 16744784, 17584549, 18400793, 19264946, 20153027, 20907762, 21555225, 21741978, 21389586, 20497846, 19505701, 18665565, 17987118, 17441308, 17186544, 16994770, 16890559, 16977049, 17160570, 17571414, 18262497, 19202814, 20062490, 21190491, 22569952, 23980772, 25485078, 27082104, 28795773, 30807210, 32964458, 35058607, 37133610, 39070911, 40956675, 42845928, 44613262, 46354850, 47903520, 48692216, 47903788, 45049716, 40926689, 37096088, 33777521]
5838C3777521k751603k192355j810944j554090j031502p15657n35200j78667K62059
5829B3269562M95079N71499P70620R28965J100633J315085J432143J671168J741341
5820C3296095J767276J750854J692565J674658J739759J744289J638647J390795
5812D6694938Q94928l53854k621609m188657m434406l873749l394666k985866
5804B5737059k465883k054621j751454j261722j131452p99954n54377l91108k23137
5795A5103351k46114j67948J28447K51425K8276K57681J93677M37806L80734K91293
5785A6658628L49393M26579L97355L58264L68769K90710j48521p93257j512515
5776A6395405j663502j548971j338683j216698j007516p48513o91165p08772n93411
$$ y = [33777521, 31025918, 28833563, 27022619, 25468529, 24437027, 23721370, 23186170, 23007503, 23269562, 23764641, 24336140, 25106760, 26035725, 27136358, 28451443, 29883586, 31554754, 33296095, 35063371, 36814225, 38506790, 40181448, 41921207, 43665496, 45304143, 46694938, 47589866, 47236012, 44614403, 40425746, 35991340, 32117591, 28722925, 25737059, 23271176, 21216555, 19465101, 18203379, 17071927, 16271973, 15717596, 15326488, 15103351, 14857237, 14689289, 14817736, 15069161, 15097437, 15355118, 15548795, 15986601, 16367335, 16658628, 17008021, 17434600, 17831955, 18190219, 18558988, 18849698, 18701177, 17907920, 16395405, 14731903, 13182932, 11844249, 10627551, 9620035, 8871522, 8180357, 7471585, 6878174]
5767F878174m34427n13329l36918k85932j89190l24226k42408p7252q8213k74565
5757D111714j05903k1757k92839j58765l5394j00584k23356q7288k70042j14334
5747B701452K934q4933K292p7609o8984j63893K2492p6796k70159N2779K5183
5736B064758r7241o7971l7759j19448k0108n7073k8488k56570J1151R6258p0071
5725A417438p9843j00521O7502m4497J17832L7204p7252r9692o7518L6479M1726
5714A248858j00541J8772P6893J03944j18313j06672l8801M9719n9041P7953r4048
5703A058723K9405q6293j01894J3606l3707M9616o9241o912j5284J1094J8087
5692H67200r4676q685m4556r38J147m8409Q1574O9806r7068j3888P4187M6437
$$ y = [6878174, 6443747, 5930418, 5593500, 5307568, 5118378, 4794152, 4551744, 4474492, 4386279, 4111714, 4005811, 3984054, 3691215, 3532450, 3497056, 3396472, 3173116, 3085828, 2815786, 2701452, 2704386, 2619453, 2621745, 2544136, 2475152, 2311259, 2333751, 2256955, 1986796, 2039575, 2064758, 1967517, 1899546, 1861787, 1742339, 1722231, 1665158, 1636670, 1380100, 1391251, 1487509, 1417438, 1337595, 1237074, 1304576, 1260079, 1377911, 1415115, 1337863, 1238171, 1170653, 1207132, 1248858, 1148317, 1167089, 1243982, 1347926, 1229613, 1122941, 1084140, 1133859, 1074818, 1152771, 1058723, 1088128, 1001835, 899941, 913547, 879840, 929456, 860215, 853303, 838019, 849113, 867200, 772524, 763839, 719283, 718345, 719492, 671083, 752657, 822463, 725395, 711507, 785694, 832131]
5680H32131j67211N4885J23316N2570r7888L5049L6798m6668K6098j18306O430
5669G37204N4340k925p3390o4321J16944p3208n0489M4081j30257K0523O7713
5658F46215r6240M3867l9300k6140K3097k2111K0958R9033m570K9504Q2014o0360
5646F95967p9150j54458L1200J6824J05399j05499K8357J24228O33j89134O1650
5635E36017O6723k5388k6873N0502l996M8175n951q809o7421n3287j5564k7607
5623D66521j2548J394M962R923N6732J3419j55247O2087J64821K4606j74963r3463
5611C68244J60588K3785o6149L5334M7891j084j44809J276O371P2446Q0460r8340
5599D86013J26003n0145j0801m3019M1104j30487l3171J6877P9182M0623L7754
$$ y = [832131, 664920, 719805, 843121, 895691, 797803, 832852, 869650, 822982, 849080, 730774, 737204, 791544, 788619, 715229, 650908, 767852, 694644, 644155, 688236, 557979, 578502, 646215, 549975, 593842, 554542, 528402, 551499, 529388, 550346, 649379, 644809, 674313, 756327, 695967, 616817, 462359, 493559, 510383, 615782, 510283, 538640, 662868, 663501, 474367, 536017, 602740, 577352, 550479, 600981, 596985, 645160, 639209, 630400, 562979, 509692, 494128, 466521, 453973, 455367, 460329, 470252, 526984, 540403, 385156, 447243, 612064, 636670, 461707, 368244, 528832, 552617, 486468, 521802, 569693, 568609, 423800, 425076, 431447, 503893, 584353, 486013, 612016, 561871, 551070, 508051, 549155, 418668, 385497, 402374, 481556, 522179, 559933]
5588E59933J13443j19596N1011R9252r0257O5246K496j58313L9086K1995J6814
5577F01110r1921o1538n8262L4870M8727K4398N4634l7932q4350o7657j8808J49465
5565D92736m3264J0826k7321l47O475j01622j73165J35701L8022j9574J17305
5554D35772k270M310N4272M300l8181O8035r908o3444m0964n5249J08413M0748
5542E05834n2037P9674R471l4285P0390O421k3005K9347l6796o506O4460p4197
5530E38771r7580m913M1099M2475k3863J12416m4577L5405N913j02786m3111L7523
5518D96772O6427N5766m3710N2811M160o972K3211n0241j07194K38997k843p1759
5506F55425J23219K2850q1375r0136j23555K7686J4858n5127J54292J5023j6219
$$ y = [559933, 673376, 553780, 604791, 704043, 613786, 679032, 681528, 523215, 562301, 584296, 601110, 509189, 447651, 389389, 424259, 472986, 497384, 552018, 514086, 429736, 362079, 343271, 492736, 449472, 460298, 432977, 432630, 439105, 337483, 164318, 300019, 338041, 318467, 435772, 433502, 437812, 492084, 496384, 458203, 526238, 516330, 452886, 411922, 356673, 465086, 505834, 453797, 533471, 542942, 508657, 579047, 585468, 562463, 591810, 555014, 548508, 612968, 538771, 441191, 436278, 477377, 519852, 495989, 608405, 563828, 599233, 605146, 502360, 459249, 496772, 563199, 618965, 575255, 628066, 632226, 625254, 648465, 598224, 491030, 730027, 727184, 655425, 778644, 801494, 720119, 629983, 506428, 534114, 548972, 493845, 648137, 663160, 646941]
5495F46941m0112J5531q577n652J14196m3563L7718P734K6659R30P7562k444k8628
5482G98295K5367m7217J32669Q6658m3041J00249k0694K4211k3791K5812j53641
5471I04877M2734J11118j32859J4128p7208r53L8127K6042r123j5701M2254o3723
5459H79713J3751m685r6028L9790N1482p0306M0899N1244q8516P8239J38875R8354
5447A132812k3862n1438J58046n2242R997m4469o9246J6901K3135o2625k3636
5436A013373J97001k6542j51664m3838M6710P0127J98203n9924k05067n6614R1465
5425A073230j01639J7664j9071M3530n4922O8671l6376M442M6666r9968j3073
5414I29154L0504k3053Q4464M2364o552j26142N5642P4905j93085r8743M9785
$$ y = [646941, 606829, 622360, 613783, 608131, 722327, 678764, 716482, 724216, 750875, 751805, 829367, 826923, 798295, 823662, 776445, 909114, 995772, 952731, 1052980, 1032286, 1056497, 1032706, 1058518, 904877, 947611, 1058729, 925870, 939998, 862790, 861837, 899964, 926006, 916883, 901182, 943436, 879713, 893464, 888779, 792751, 832541, 884023, 813717, 854616, 905860, 817344, 895583, 1034458, 1132812, 1108950, 1057512, 1215558, 1163316, 1173313, 1128844, 1059598, 1076499, 1099634, 1037009, 1013373, 1210374, 1183832, 1032168, 988330, 1035040, 1105167, 1303370, 1243446, 1038379, 981765, 1073230, 971591, 989255, 970184, 1013714, 958792, 1027463, 991087, 995529, 1042195, 942227, 929154, 959658, 936605, 1021069, 1063433, 1056881, 930739, 986381, 1061286, 868201, 769458, 819243]
5403H19243J55455O1141j4065k6582L4133l8841R921O3821l1887R618j76158j6854
5391H48945J95604j1757j214r2936k8664J23287m8902j24323P622Q4397P1957
5380A024016j34411m642R9234N5917L0503p6297j9483o9478M5302J9752q5085
5369H85328l779r478j5278J21085o4450p1334m681k3834Q7862m9335M5503j3240
5357H84369j24438l0169n3561J72570j2537N9701p4755j25748J16694O0764o1469
5346H11421m4406r9081O4339O9464P65L959j0389Q4590j8489k4057j05836p3213
5334F59067m3763m0917J11820R3510l5063M7803L1528N252m4490j35420m2136
5323F07191J09947k3276J25577k8316q0530k9021M8331J401m7754j30402k2058
$$ y = [819243, 974698, 1035839, 1021774, 995192, 1029325, 990484, 1000405, 1064226, 1032339, 1041957, 865799, 848945, 1044549, 1032792, 1031578, 938642, 909978, 1033265, 984363, 860040, 867662, 952059, 1024016, 889605, 884963, 984197, 1040114, 1070617, 994320, 974837, 905359, 950661, 970413, 885328, 881549, 872071, 856793, 977878, 913428, 842094, 837413, 813579, 901441, 852106, 897609, 884369, 759931, 729762, 676201, 848771, 836234, 895935, 821180, 695432, 812126, 872890, 811421, 767015, 667934, 732273, 801737, 802502, 806461, 796072, 880662, 862173, 838116, 732280, 659067, 615304, 574387, 686207, 779717, 744654, 792457, 823985, 829237, 784747, 649327, 607191, 717138, 693862, 819439, 791123, 710593, 681572, 729903, 731304, 683550, 553148, 531090]
5312E31090L8240j5248m6614J10248J4340m1878J20334M0091j015L2542q956j2376
5300G60798J2205M6965K7439O555q5259K9148J06620Q045o0408M8610j03068j19845
5288F77805J04969r2267o2302l665L5710j2234Q4585O136k29770J84143J987M0375
5276G35472N6500l265M7062R5158j11881k08230J01597l5495J69294n7875J6439
5265H04776m6995n5401Q8823l3687r9157p6459R500J70112J39473j03319J880
5254G99546p1281j52706J21884n4098j26075J42679L6944k3208m6771j911J28846
5243G53849j25199j36660J25682K7114K9675O8298P8554j02108j14667j3508K6315
5232F17345O7014Q645l9387N6907p1781L9713M1635L1436K3360r1798m8616m0023
$$ y = [531090, 569330, 554082, 507468, 617716, 632056, 590178, 710512, 750603, 749588, 782130, 773174, 760798, 773003, 819968, 847407, 853962, 768703, 797851, 904471, 912516, 852108, 900718, 797650, 677805, 782774, 690507, 628205, 624540, 660250, 648016, 732601, 738737, 508967, 693110, 695097, 735472, 791972, 788707, 835769, 930927, 819046, 610816, 712413, 676918, 846212, 788337, 804776, 757781, 702380, 791203, 757516, 658359, 581900, 591400, 761512, 900985, 797666, 799546, 728265, 575559, 697443, 643345, 517270, 659949, 696893, 673685, 626914, 625003, 753849, 628650, 491990, 617672, 644786, 674461, 742759, 821313, 719205, 604538, 591030, 617345, 684359, 693004, 653617, 710524, 638743, 678456, 720091, 751527, 774887, 683089, 634473, 594450]
5220E94450P9585k5296j39860J9126K04635k2735r555n8480j9084J4779l2257
5209F05308M3036l0364j23797j04285O0692J18216J27402l2017l911J7266j53103
5198E24443P9801L9669n400j20394K0285J01504j33051N9549N0013K5976q9858
5187E52537P2355N2568r4096m0900N933p3246j3804K34768n5808n0527M8098p8784
5175E59094M646j4324O559j2730J680Q5612p6091j8003p0606J60279J16766r0259
5163F52623n1184j4092K204O640R6826l1979r4860p339J1372K4346O6611R5085
5151G56253j78707j24403J86013Q945j13309J26609o8320j34410R0041J37660
5141F86372j44429j2168N6592j0579N2852p9075R4222J37021j68404p9680R3160
$$ y = [594450, 674035, 648739, 508879, 528005, 732640, 709905, 700350, 641870, 622786, 637565, 605308, 648344, 617980, 494183, 389898, 450590, 568806, 696208, 664191, 660280, 677546, 524443, 604244, 643913, 638513, 518119, 538404, 639908, 506857, 566406, 616419, 642395, 552537, 624892, 677460, 583364, 542464, 548397, 475151, 461347, 696115, 640307, 589780, 637878, 559094, 563740, 549416, 555975, 543245, 544925, 630537, 554446, 536443, 465837, 626116, 742882, 652623, 601439, 587347, 589551, 596191, 693017, 661038, 566178, 558839, 570211, 594557, 661168, 756253, 577546, 453143, 639156, 648101, 534792, 661401, 593081, 458671, 548712, 686372, 541943, 529775, 586367, 575788, 628640, 549565, 643787, 780808, 612404, 532724, 625884]
5130F25884Q1650m0781Q9709l3114J3964J06706j57643m6090O9935p2947L7692
5119F74965o4960j46972J80608J40953K9182m0803q6147q6563J95131N87q7339
5108G08642q3724l9658P9610q0948J5052J5902j2940J18610n6849M3405J00858
5097H07960o6575L4915J05457R1611j47477L4030L9458j40440J14204o7394m2674
5086G63075P8227j9375J57816K3457j01124l5317J27301N9876Q4047m3876j02359
5075I91748K4895M2521N8838L189L7345r3196L8303o4528J0495j19414P4175o4560
5063I39811M4799P1969l8192j18104J43186K3260k05787j0580R7384m3073j3775
5052H90898L3314Q8688Q2246R375q8694q3583K09830R8261Q082k0843j80460q3583
$$ y = [625884, 707534, 666753, 756462, 723348, 737312, 844018, 686375, 640285, 710220, 637273, 674965, 610005, 463033, 643641, 784594, 813776, 772973, 686826, 600263, 795394, 795981, 708642, 624918, 585260, 664870, 583922, 598974, 614876, 601936, 720546, 663697, 707102, 807960, 741385, 776300, 881757, 973368, 825891, 859921, 899379, 758939, 873143, 805749, 763075, 841302, 821927, 979743, 1003200, 902076, 866759, 994060, 1053936, 1137983, 1094107, 991748, 1016643, 1059164, 1118002, 1121191, 1158536, 1065340, 1103643, 1039115, 1049610, 930196, 1004371, 939811, 984610, 1056579, 1018387, 900283, 1043469, 1066729, 860942, 850362, 947746, 904673, 890898, 924212, 1012900, 1095146, 1104521, 1015827, 932244, 1142074, 1240335, 1248417, 1227574, 1047114, 963531]
5040I63531J8270K3644O0606R729o2978n6405J02743M3107R3610n550L8975l8924
5028A190358N9263M6162M9994J15239l514p9850l7459J10861J8505R8543N3415
5017A621517M9134R8600J31506O922o6365M4855K3944J38635J12016K9779N3792
5006B244335J28806J33868q4664N7146N350j40078o6645K692O9546J8519M9100
4995B417975o3018N1249n3454J89020O5688O9419n5693m933M1109M6883Q3985
4984B788230J43651M2575n8114m4639P3736O4151j47306o2198m3715n5534l9958
4973B660879L3879p126N2993O5960O3379K6669p4063l162K33113Q2876K1145P7302
4961C233844K12097J66302j8636O2327l6177J19391o6906j48232J12807N2338
$$ y = [963531, 981801, 1005445, 1066051, 1075780, 1012802, 956397, 1059140, 1102247, 1195857, 1190307, 1229282, 1190358, 1249621, 1295783, 1345777, 1461016, 1457502, 1377652, 1340193, 1451054, 1469559, 1568102, 1621517, 1670651, 1769251, 1900757, 1907679, 1841314, 1886169, 1910113, 2048748, 2160764, 2190543, 2244335, 2373141, 2507009, 2422345, 2479491, 2484841, 2344763, 2278118, 2280810, 2350356, 2368875, 2417975, 2354957, 2406206, 2352752, 2541772, 2607460, 2676879, 2621186, 2616253, 2657362, 2704245, 2788230, 2931881, 2974456, 2916342, 2871703, 2945439, 3009590, 2862284, 2800086, 2756371, 2700837, 2660879, 2694758, 2687632, 2740625, 2806585, 2869964, 2896633, 2822570, 2819408, 3052521, 3135397, 3156542, 3233844, 3445941, 3612243, 3593607, 3655934, 3619757, 3739148, 3672242, 3524010, 3636817, 3689155]
4951C689155j63787K2670k0193J08998R9950m9278J41313m3647q6948M8032J54888
4940C901153k1383J5376K6291R3171k1556K4640R4708j3101j59402m3027M1916
4929C938786J00052M3397j91164P2710P2027j78322J2605R1631n2729O6587o5133
4918C910447J13720l4025p0799j8409m0498K9559L715J61998k009j060q6301j08393
4906C857945j10894O4323q7238m4850j4295J1132n6146j04358k87435K0310K1960
4895C270454k2140N3217L557Q4529k6357J02302p8565j2361O4118J21450j0610
4884C549594O3190R2503R5037J16874N6667m2061j8055Q3545R7129q6147l767
4873D004509m5143p5427N45j15583j64212Q6006K7220p7372j14587j19354j28016
$$ y = [3689155, 3525368, 3548038, 3527845, 3636843, 3736793, 3687515, 3828828, 3785181, 3698233, 3746265, 3901153, 3879770, 3895146, 3921437, 4014608, 3993052, 4017692, 4112400, 4099299, 3939897, 3896870, 3938786, 4038838, 4082235, 3891071, 3963781, 4035808, 3857486, 3870091, 3961722, 3908993, 3975580, 3910447, 4024167, 3990142, 3919343, 3900934, 3860436, 3889995, 3893710, 4055708, 4053699, 4052639, 3966338, 3857945, 3747051, 3811374, 3724136, 3679286, 3664991, 3676123, 3619977, 3515619, 3228184, 3248494, 3270454, 3248314, 3301531, 3305088, 3389617, 3363260, 3465562, 3386997, 3374636, 3438754, 3560204, 3549594, 3612784, 3705287, 3800324, 3917198, 3973865, 3931804, 3913749, 3997294, 4094423, 4008276, 4004509, 3959366, 3883939, 3884484, 3768901, 3604689, 3690695, 3717915, 3640543, 3525956, 3406602, 3278586]
4862C278586j19766o2397j82325R39n5580j34796n7516j37836j38095N8992R32
4851B451138j25120q3959j18156P2495J16307m425j446Q5762n1589L6508o2122
4840B315393k30751J50288J24001r993r5390k1008p6938J14697N6730J11354J15715
4829B554098j15096j22035P3776q3708k43385P8094j04416q3636L280L1571L1744
4818B020287r7318j28486O3315J95770q8248o8616m846q809q0689o2847M2981
4807A782494K0263m6184j9571K1880o8532j10846j01847M3975o667n3517L7908
4796A499356J0039r8216L1973R2279o6648P6445K0275o3170q5059j6296L3599
4785A434577m081r7069Q7179p5057l3524N7362p9478L1697R6765K3265n4377k1113
$$ y = [3278586, 3158820, 3096423, 2914098, 2915037, 2859457, 2724661, 2667145, 2529309, 2391214, 2450206, 2451138, 2326018, 2242059, 2123903, 2196398, 2312705, 2308280, 2306834, 2392596, 2341007, 2377515, 2315393, 2084642, 2234930, 2358931, 2348938, 2253548, 2232540, 2155602, 2270299, 2327029, 2438383, 2554098, 2439002, 2316967, 2390743, 2307035, 2063650, 2141744, 2037328, 1953692, 1956972, 1988543, 2020287, 1922969, 1794483, 1857798, 2053568, 1965320, 1896704, 1891858, 1883049, 1802360, 1739513, 1782494, 1802757, 1756573, 1737002, 1758882, 1690350, 1579504, 1477657, 1521632, 1514965, 1461448, 1499356, 1509395, 1411179, 1443152, 1535431, 1468783, 1545228, 1565503, 1502333, 1417274, 1400978, 1434577, 1430496, 1333427, 1420606, 1345549, 1312025, 1369387, 1289909, 1321606, 1418371, 1441636, 1387259, 1366146]
4773A366146J108j49996J1441J01818J1112J0361q8032M4284q3249K6529J08826
4762A360348k5209j00552o1366R4950J20221O628j7959l8882k0240N5710L6696
4751A410345K5242K2000j7700M2069n7285L1380J15836l4913l1637J05925o6991
4740A544271M2465J462q7026L723j0455J94854J42439j13816O3956j66585j47071
4729A468217J05377r6490l1621o8482J1539Q0790j79742j86153j4730J21898J00200
4718A310803k260n7441L1078j671K6068M5488J08537l5421o2988j03230q5792
4707A173171M9936p640k1528j08869J26457K1201r8725K43920m2461l1578J00847
4696A404731m8827o0508m9299l7935J35394O4544l5859k6501j21364J29225m2135
$$ y = [1366146, 1367254, 1217258, 1228699, 1330517, 1341629, 1351990, 1263958, 1308242, 1224993, 1251522, 1360348, 1335139, 1234587, 1173221, 1268171, 1388392, 1395020, 1377061, 1338179, 1317939, 1373649, 1410345, 1435587, 1457587, 1439887, 1481956, 1424671, 1456051, 1571887, 1536974, 1505337, 1611262, 1544271, 1586736, 1588198, 1501172, 1504895, 1494440, 1689294, 1831733, 1717917, 1781873, 1615288, 1468217, 1573594, 1477104, 1445483, 1377001, 1388540, 1469330, 1289588, 1103435, 1088705, 1210603, 1310803, 1308543, 1251102, 1282180, 1280509, 1306577, 1352065, 1460602, 1425181, 1362193, 1258963, 1173171, 1223107, 1215467, 1193939, 1085070, 1211527, 1232728, 1134003, 1377923, 1335462, 1303884, 1404731, 1355904, 1295396, 1246097, 1208162, 1343556, 1408100, 1372241, 1345740, 1224376, 1353601, 1311466]
4685A311466J3673J46665O0194M205j18931J02478J34077j12602n6590M645N2468
4674A541748J33140L9292Q7803J07479j11301j51616Q0475k1109r5165k2172j46893
4663A441681l622j28390j10826n9600j8785K7954R8489R4135q8411O9881L5428
4652A357934j11325j18424j21387Q8578M0460o2139N4274M2068m5706o994O193
4641A123532p8741r9002k287P0765J47631J183j1514r7317p1440N4697N5036j07791
4629I84752q709N6112o3197Q93R0194O4791o0753j01342k4707M5476N3484n2651
4617I84343q7791J02821M0676j944N4639j8575m9819M380R258L5830P9582j43742
4605A009658J09759Q47r860l0343j2610p8130n0690O1842J16692O336j35505m7290
$$ y = [1311466, 1325139, 1471804, 1531998, 1536203, 1417272, 1519750, 1653827, 1541225, 1484635, 1489280, 1541748, 1674888, 1714180, 1801983, 1909462, 1798161, 1646545, 1727020, 1705911, 1610746, 1588574, 1441681, 1438059, 1309669, 1198843, 1139243, 1120458, 1148412, 1246901, 1341036, 1252625, 1322506, 1357934, 1246609, 1128185, 1006798, 1095376, 1135836, 1073697, 1127971, 1170039, 1124333, 1117339, 1123532, 1044791, 945789, 943502, 1014267, 1161898, 1163081, 1151567, 1054250, 982810, 1037507, 1092543, 984752, 976043, 1032155, 968958, 969851, 1060045, 1124836, 1064083, 962741, 938034, 983510, 1036994, 984343, 896552, 999373, 1040049, 1038105, 1092744, 1074169, 1024350, 1028730, 1037988, 1073818, 1153400, 1009658, 1119417, 1120264, 1110404, 1080061, 1067451, 989321, 938631, 1000473, 1117165, 1123501, 987996, 940706]
4593I40706M4043J06362q5744J48187K3391o172L368M7678l3559r187N5490k3589
4581A210974j51794O1355j8896O8220J38555J7107J4481o8868p0248q4250L4110
4570A150746N3936O1561L7743M9841N5500R8212j17799J8269n1187k25366J39850
4559A271306M3685n3147M0135J01126q92Q0776M292J6915l5350k7293R899N4721
4547A506173R9111q1674j1646J11724j63423j38560j018J27411M3475J51903L1654
4536A675130o2252N2193M2538K0040n1233N5623J26318O641n9994p0826j01241
4525A632937J10331N6437J10789m8983J03386l1201K6079r6644p8176J58071k1332
4514A921694Q7209J6972o4703k6433N5057M2752J29389l8867P3132l6223M9497
$$ y = [940706, 984749, 1091111, 1005367, 1153554, 1176945, 1170773, 1174141, 1221819, 1188260, 1179073, 1234563, 1210974, 1059180, 1120535, 1101639, 1169859, 1308414, 1325521, 1340002, 1271134, 1200886, 1116636, 1150746, 1204682, 1266243, 1303986, 1353827, 1409327, 1507539, 1389740, 1408009, 1356822, 1131456, 1271306, 1314991, 1261844, 1301979, 1403105, 1402213, 1482989, 1487281, 1504196, 1468846, 1441553, 1451452, 1506173, 1605284, 1523610, 1511964, 1623688, 1460265, 1321705, 1320687, 1448098, 1491573, 1643476, 1675130, 1612878, 1665071, 1707609, 1727649, 1676416, 1732039, 1858357, 1864998, 1805004, 1734178, 1632937, 1743268, 1799705, 1910494, 1861511, 1964897, 1933696, 1959775, 1863131, 1784955, 1943026, 1921694, 2008903, 2025875, 1961172, 1934739, 1989796, 2032548, 2161937, 2123070, 2196202, 2159979, 2209476]
4503B209476N9773p0438Q6110O793R6088O1650J05269k9172J5332k9172J7366
4492B529075J81792J10186m2102L51J4192J4865J54547J38176j31808K23826N476
4481C198576p9350J33327K2096M1339l9985Q2506J6364p4167j6836P9712j38333
4470C225249Q5500j382l028M3499j9974K9922n0355o3218K3970m1839N80j22998
4458C105926j61861J27884J07990m5179m958O247J08319L6395l3552j9857L8208
4447C265562J3725j02460J25786m7274m6325J5366m0817J52948M452M3742m4829
4436C339876j85458J09867M2147l4379j9636K9090k8396m463j92001K7655m5878
4425C038424k8342K3161o3467M0056O9880j6957p1575r6112m6038j7090J53405
$$ y = [2209476, 2269249, 2198811, 2284921, 2291714, 2387802, 2449452, 2554721, 2525549, 2540881, 2511709, 2529075, 2710867, 2821053, 2778951, 2779302, 2793494, 2808359, 2962906, 3101082, 2969274, 3193100, 3198576, 3119226, 3252553, 3274649, 3315988, 3276003, 3358509, 3374873, 3300706, 3283870, 3363582, 3225249, 3310749, 3309367, 3306339, 3349838, 3329864, 3359786, 3309431, 3246213, 3270183, 3228344, 3228924, 3105926, 2944065, 3071949, 3179939, 3134760, 3129802, 3136049, 3244368, 3280763, 3247211, 3227354, 3265562, 3279287, 3176827, 3302613, 3255339, 3209014, 3224380, 3183563, 3336511, 3340963, 3384705, 3339876, 3154418, 3264285, 3306432, 3272053, 3252417, 3281507, 3253111, 3248648, 3056647, 3084302, 3038424, 3010082, 3033243, 2969776, 3009832, 3079712, 3062755, 2991180, 2895068, 2849030, 2831940, 2985345]
4414B985345K8018j0330K8307J2711k049K1743p0075O786J63770n0354K0225M3482
4402C177579L8106p8510M5692J13006J18278l5626j5166P3349K1954q7105r6468
4391C275089m486m7179M601q4166M7065R8588n6077m7726J2177q479n8108R8810
4379C230109P5649M0076P9150K4876j2354L5787q9027Q0876j0684J76555K10078
4368C841091r5255J19675K63553m1901n0815K0565K56553K2610K0631j9795m8551
4357D288361J37255l9594j38255r769p4175j19102J73163R776k5668j4392j35077
4346D052523j7275n9650j8967L9566J97097K0490p0698J1160q4251J02609l677
4335D168927j2422j0839L1116n4100l6861J8314O8172N1529J33231q546l8030
$$ y = [2985345, 3013363, 3003033, 3031340, 3044051, 3042002, 3063745, 2993670, 3000456, 3164226, 3113872, 3134097, 3177579, 3215685, 3137175, 3182867, 3295873, 3414151, 3378525, 3363359, 3436708, 3458662, 3371557, 3275089, 3270603, 3223424, 3228025, 3143859, 3190924, 3289512, 3233435, 3185709, 3197886, 3189407, 3131299, 3230109, 3305758, 3345834, 3424984, 3449860, 3437506, 3473293, 3384266, 3465142, 3454458, 3631013, 3841091, 3745836, 3865511, 4129064, 4087163, 4036348, 4056913, 4313466, 4336076, 4356707, 4336912, 4288361, 4425616, 4386022, 4247767, 4237998, 4163823, 4044721, 4217884, 4227660, 4201992, 4187600, 4052523, 4035248, 3975598, 3956631, 3996197, 4193294, 4213784, 4143086, 4154246, 4069995, 4172604, 4168927, 4156505, 4145666, 4176782, 4122682, 4085821, 4104135, 4172307, 4223836, 4357067, 4348521, 4310491]
4324D310491M8952K1267n2215N9024J10859r1526l531J70967R3205K8637R0972
4313D787102k1927J1630k032m7486J30347l382j7291N4809m5629j7277K8962N877
4301D863703J2575J39068l5049M3867R4020Q4467m4233n8873J38911Q6646K10686
4290E535788k9022j13999l9126M8805Q6812J34741j04281j6691J14198J86810
4280E804035K7498l473l9079N3659J06056k0770m5148J14807Q8842n0411O523
4269F042539J40043J15560l7220n6485l5775K10460O7978Q1593Q5115J81417P8009
4258F873234R1449P1854N0844R1026J32363K2708j32704J59858J37370L9620J19386
4247G657008K01357K01285J16473J31957O8350J15165k792K5538K30305J00580
$$ y = [4310491, 4359443, 4380710, 4328495, 4387519, 4498378, 4406852, 4403321, 4574288, 4667493, 4696130, 4787102, 4765175, 4776805, 4774773, 4727287, 4857634, 4854252, 4836961, 4891770, 4846141, 4828864, 4857826, 4863703, 4876278, 5015346, 4980297, 5024164, 5118184, 5202651, 5158418, 5099545, 5238456, 5325102, 5535788, 5506766, 5392767, 5353641, 5402446, 5489258, 5623999, 5519718, 5503027, 5617225, 5804035, 5831533, 5828060, 5788981, 5842640, 5948696, 5927926, 5882778, 5997585, 6086427, 6036016, 6042539, 6182582, 6298142, 6260922, 6204437, 6168662, 6379122, 6447100, 6528693, 6613808, 6795225, 6873234, 6964683, 7036537, 7087381, 7178407, 7310770, 7333478, 7200774, 7360632, 7498002, 7537622, 7657008, 7858365, 8059650, 8176123, 8308080, 8376430, 8491595, 8488803, 8514341, 8744646, 8845226]
4237H845226q5043n6459p4668O8840k0340n0574R5763K51617O8386o9297R4915
4226I068366K7333Q8737J80257k3384L5801J67411J96406J29519N0786J09947
4216A0031179L9470k5100m7571J11322L4231P6489J11075J28576J55662N0201
4206A0665534o155L8819J37682J86359J72184O2973J1039r8903m8472R173J34517
4195A1264750J07632O6535m9744K09969K15535m3341J85499J07655J58070J25583
4185A2348143J41161L54753K43157R5275J85243K85231K12313J58242J63888J78512
4175A4365918K45512J39713K28963K61280J82717L15330L67805Q8068K19296L63836
4165A6778438L75158M45742L90996J90951J63139K46369J67977J75341J59181
$$ y = [8845226, 8760183, 8703724, 8629056, 8697896, 8677556, 8626982, 8722745, 8974362, 9042748, 8973451, 9068366, 9095699, 9184436, 9364693, 9341309, 9377110, 9544521, 9740927, 9870446, 9921232, 10031179, 10070649, 10045549, 9997978, 10109300, 10143531, 10220020, 10331095, 10459671, 10615333, 10665534, 10659379, 10698198, 10835880, 11022239, 11194423, 11257396, 11268435, 11169532, 11121060, 11130233, 11264750, 11372382, 11438917, 11389173, 11599142, 11814677, 11771336, 11956835, 12064490, 12222560, 12348143, 12489304, 12844057, 13087214, 13182489, 13367732, 13652963, 13865276, 14023518, 14187406, 14365918, 14611430, 14751143, 14980106, 15241386, 15424103, 15739433, 16107238, 16195306, 16414602, 16778438, 17153596, 17599338, 17990334, 18181285, 18344424, 18590793, 18758770, 18934111, 19093292]
4156A9093292J6750j0089J83677J59604J00024J67458J2313R9376K04486J74860
4146B0201751K85193K20693K33620L09768M9404K25886J81218J36542Q6573R8721
4136B2029369M8788J16387R1594j43295J18828k3251R5892L11503K26751J12758
4126B2985324K47057J84255K19562K44755K88435M37069L55461M02824M76591
4117B5841333L14148L15617M00504L63385L85854M54530M01721N40868N13525
4108B9531485O00801N28144N57669M71852M34493L98275M80951N93102L82360
4099C3979132L36601L80214M09486L78931L62312M29179M53931N09883L76926
4090C7616595M05842N50210N17748M42163N48342N86386N64503N50737N64534
$$ y = [19093292, 19110042, 19099953, 19283630, 19443234, 19543258, 19710716, 19723029, 19822405, 20026891, 20201751, 20486944, 20707637, 20941257, 21251025, 21300429, 21526315, 21707533, 21844075, 21930648, 22029369, 22078157, 22194544, 22286138, 22142843, 22261671, 22238420, 22334312, 22645815, 22872566, 22985324, 23232381, 23416636, 23636198, 23880953, 24169388, 24606457, 24961918, 25364742, 25841333, 26155481, 26471098, 26871602, 27234987, 27620841, 28075371, 28477092, 29017960, 29531485, 30132286, 30660430, 31218099, 31689951, 32124444, 32522719, 33003670, 33596772, 33979132, 34315733, 34695947, 35105433, 35484364, 35846676, 36275855, 36729786, 37239669, 37616595, 38022437, 38572647, 39090395, 39532558, 40080900, 40667286, 41231789, 41782526, 42347060]
4081D2347060Q30629P01628Q06096Q66461J112954J171498J193340J476423J679432
4072E2185521J678967J793467J853412J845540K014459K181023K289179K483795
4064F8325363K562191K584738K774964K554700J419141o96409k262940k666847
4056G4594901k388534k098905j752209j560491j230695o91397l19261k25271o075
4047F4322063L96074M56570O53241R99002J163082J078169J539559J619458J900148
4038G4127366K013678K128006K452877K578169K904805K987078K948221L046039
4030I5186239L103566L348812L174507L264256L457408L401911L240867K921161
4022A21098727K308019O15122k064250l894733m462712m383673l700763l196635
$$ y = [42347060, 43177689, 43879317, 44685413, 45551874, 46664828, 47836326, 49029666, 50506089, 52185521, 53864488, 55657955, 57511367, 59356907, 61371366, 63552389, 65841568, 68325363, 70887554, 73472292, 76247256, 78801956, 80221097, 79524688, 77261748, 74594901, 72206367, 70107462, 68355253, 66794762, 65564067, 64872670, 64553409, 64328138, 64322063, 64718137, 65174707, 65827948, 66826950, 67990032, 69068201, 70607760, 72227218, 74127366, 76141044, 78269050, 80721927, 83300096, 86204901, 89191979, 92140200, 95186239, 98289805, 101638617, 104813124, 108077380, 111534788, 114936699, 118177566, 121098727, 123406746, 124021868, 121957618, 118062885, 113600173, 109216500, 105515737, 102319102]
4014A02319102k686295k039084j626391j194533p54326j86768J67281J62632K94819
4005I4456437L93318M89736N25619P36153Q33770P67369P79478Q19742J078186
3996A00879808J096023J122650J298842J189179J216316J304994J399252J426444
3988A10933508J542198J468086J468964J476140J491569J700790J743462J717591
3980A23542308J806625J792912J699576J662664K078838K070588K057530K391733
3972A39102774K636399K819000L225907L665891L930782M592355N178845N898903
3964A71050856O603377O954919P375775P724357Q112858Q505533Q996281R328326
3956B34652282R486030R094457Q983801R005090R408002R402403Q483430P797491
$$ y = [102319102, 99632807, 97593723, 95967332, 94772799, 94018473, 93831705, 93998986, 94161618, 94456437, 94849755, 95339491, 95865110, 96601263, 97435033, 98202402, 98981880, 99801622, 100879808, 101975831, 103098481, 104397323, 105586502, 106802818, 108107812, 109507064, 110933508, 112475706, 113943792, 115412756, 116888896, 118380465, 120081255, 121824717, 123542308, 125348933, 127141845, 128841421, 130504085, 132582923, 134653511, 136711041, 139102774, 141739173, 144558173, 147784080, 151449971, 155380753, 159973108, 165151953, 171050856, 177654233, 184609152, 191984927, 199709284, 207822142, 216327675, 225323956, 234652282, 244138312, 253232769, 262216570, 271221660, 280629662, 290032065, 298515495, 306312986]
3948C06312986O361590j510136j3556217j8641418j6775568j4038495j1766275
3941B36386467r850153q339956p080066o117026n266611m474552m095207l615019
3933A87547877l306479l214956l014681k853560k723679k585593k484670k367613
3925A64996646k200256j991788j746257j751367j458546j271412j150163j130509
3917A52296348j112348q02457p30784m61450n02607l51718m24848o46208o59060
3908A46604868j037788j253449j558921j928588k111268k344061k409692k260571
3900A31700530k457807k287334k283571k190531k265940k351164k275737k241092
3892A13347354k220489k560951k678543k598843k717987k663864k493994k338069
$$ y = [306312986, 312674576, 311164440, 297608223, 278966805, 262191237, 248152742, 236386467, 226536314, 218196358, 211116292, 204999266, 199732655, 195258103, 191162896, 187547877, 184241398, 181026442, 178011761, 175158201, 172434522, 169848929, 167364259, 164996646, 162796390, 160804602, 159058345, 157306978, 155848432, 154577020, 153426857, 152296348, 151184000, 150381543, 149650759, 149189309, 148686702, 148334984, 147910136, 147263928, 146604868, 145567080, 144313631, 142754710, 140826122, 138714854, 136370793, 133961101, 131700530, 129242723, 126955389, 124671818, 122481287, 120215347, 117864183, 115588446, 113347354, 111126865, 108565914, 105887371, 103288528, 100570541, 97906677, 95412683, 93074614]
3884I3074614k244229j940916j994127j569666j747261j487905j220595j194559
3876G9675356r69850r20847q37229p60110n82438n32867n17052l14858j67377
3867G4072728j42334Q8066J14048K44463K50700L17872N87085O53445R78041R09123
3857G8073237R75763J107389J140004J297938J631909J636399J555584J751440
3849H9169663J787049J894256J835214K044695K011887K186785K392181K690726
3841A06012456K754920L035780L670146M041495M428351M942954N250132N548195
3833A39684429O057690O360802O562557O952254P182394P290971P399341P187365
3825A94677803O974801O836257O018213N088856L701429K402631J136794l77730
$$ y = [93074614, 90830385, 88889469, 86895342, 85325676, 83578415, 82090510, 80869915, 79675356, 78705506, 77784659, 76947430, 76187320, 75604882, 75072015, 74554963, 74240105, 74072728, 73930394, 74018460, 74132508, 74376971, 74627671, 74945543, 75532628, 76186073, 77164114, 78073237, 79049000, 80156389, 81296393, 82594331, 84226240, 85862639, 87418223, 89169663, 90956712, 92850968, 94686182, 96730877, 98742764, 100929549, 103321730, 106012456, 108767376, 111803156, 115473302, 119514797, 123943148, 128886102, 134136234, 139684429, 145742119, 152102921, 158665478, 165617732, 172800126, 180091097, 187490438, 194677803, 201652604, 208488861, 214507074, 219595930, 223297359, 225699990, 226836784, 226459054]
3817B26459054j343190k028936k650166l180293l581004l714676l748779m067014
3809B02144996m515398m809747n395456n858007o356498p150056p867469q014950
3801A52177415q065740p806280p542457p084577o574724o031748n226514m781421
3793I9063954m427712l785800l418796l036169k636236k375100k160378j923714
3785G5300049j730495j858575j768817j617014j710961j782723j814680j649790
3777F1366994j622966j607113j539158j538851j350988j270114j368154j079205
3769D9990445r11849r57915p52606o02751n92330o23980l69734m39250l45007
3760D4395023j58000l4633j37154l9823j86797n2195N8660P71m9453j09855l86685
$$ y = [226459054, 225115864, 223086928, 220436762, 217256469, 213675465, 209960789, 206212010, 202144996, 197629598, 192819851, 187424395, 181566388, 175209890, 168059834, 160192365, 152177415, 144111675, 136305395, 128762938, 121678361, 115103637, 109071889, 103845375, 99063954, 94636242, 90850442, 87431646, 84395477, 81759241, 79384141, 77223763, 75300049, 73569554, 71710979, 69942162, 68325148, 66614187, 64831464, 63016784, 61366994, 59744028, 58136915, 56597757, 55058906, 53707918, 52437804, 51069650, 49990445, 49078596, 48120681, 47368075, 46765324, 46172994, 45549014, 45179280, 44740030, 44395023, 44237023, 44202390, 44065236, 44025413, 43838616, 43786421, 43845081, 43845852, 43796399, 43686544, 43299859]
3749D3299859l73936k00918k78374o23268l71660m39709m04740m31799o65355
3740C9510100o10033n10743o71704p52792o49199n84422o82659n49222l52296
3731C4147030n34868l81767k35831j55307j04924k9385m4612O4265r987N1245
3721C2765859K8571J21133J44362m5161m555r1542k44378j42546n9948M8142j72459
3710C2347478j42275j25428q950k03673k54894k68729k77161o7846l6621j73070
3700C0788831j48845j03976p8651m0927N5325j7098K9153K36355K44339N6995
3690C1021501R6018L51216K40780J21921L2023J53243J84944J37681J87543J83904
3680C2710774J84794K75994K47849M07992L91169L06474M30803M22450M05154
$$ y = [43299859, 42925923, 42725005, 42446631, 41823363, 41451703, 41011994, 40607254, 40175455, 39510100, 38900067, 38389324, 37717620, 36964828, 36315629, 35731207, 35048548, 34499326, 34147030, 33612162, 33230395, 32994564, 32839257, 32734333, 32704948, 32660336, 32724601, 32714614, 32765859, 32794430, 32915563, 33059925, 33014764, 33010209, 32918667, 32674289, 32531743, 32471795, 32519937, 32347478, 32205203, 32079775, 32070825, 31867152, 31612258, 31343529, 31066368, 30998522, 30961901, 30788831, 30639986, 30536010, 30457359, 30416432, 30471757, 30454659, 30483812, 30720167, 30964506, 31021501, 31117519, 31468735, 31709515, 31831436, 31863459, 32016702, 32201646, 32339327, 32526870, 32710774, 32895568, 33171562, 33419411, 33827403, 34218572, 34525046, 34955849, 35378299, 35783453]
3671C5783453L78673L68622K91322L02471M42123L38590N64754O28049N88264
3662C9686321N82456N12175P71821Q16043P85071P65251Q41415R76762J083783
3653D6821098J008940R39506J084727J122612R49193J262958J377229J385806
3645E5952069J407866J556788J636314J566138J820165K110058K083051K190065
3637G0322514K367150K378104K386822K574167K648125K591601K899955K928940
3629I1097378K877785K942267K776845K969517K802472K820717K652090K507291
3621A13446362K490337K240886K195797K185962K234625K068203K161877J927112
3613A30951161J647273J599564J652669J574291J376209J299719J270319J385465
$$ y = [35783453, 36162126, 36530748, 36822070, 37124541, 37566664, 37905254, 38470008, 39098057, 39686321, 40268777, 40780952, 41552773, 42368816, 43153887, 43919138, 44760553, 45737315, 46821098, 47830038, 48769544, 49854271, 50976883, 51926076, 53189034, 54566263, 55952069, 57359935, 58916723, 60553037, 62119175, 63939340, 66049398, 68132449, 70322514, 72689664, 75067768, 77454590, 80028757, 82676882, 85268483, 88168438, 91097378, 93975163, 96917430, 99694275, 102663792, 105466264, 108286981, 110939071, 113446362, 115936699, 118177585, 120373382, 122559344, 124793969, 126862172, 129024049, 130951161, 132598434, 134197998, 135850667, 137424958, 138801167, 140100886, 141371205, 142756670]
3605A42756670J523040J612204J869293K014149K420865K594126K894484K995324
3597A60680155L130762L218742L493443L618708L564016L694376L598375L371497
3589A88370074L115267K624390K370397K026514J771050J352059J334267J246680
3581B04210698J180025J018950O02866J39711m80601j320481k094656k775817
3573B00480695l819024m602540n180471n760114n956303n914529n854654n880180
3565A57512880n719618n599975n579745n566004n574691n679801n796375n936382
3557A12060289o030769n864039n698566n433368n006163m656769m433958m013704
3549G0922953l592418l307131k986726k757452k619258k335664k089353j928985
$$ y = [142756670, 144279710, 145891914, 147761207, 149775356, 152196221, 154790347, 157684831, 160680155, 163810917, 167029659, 170523102, 174141810, 177705826, 181400202, 184998577, 188370074, 191485341, 194109731, 196480128, 198506642, 200277692, 201629751, 202964018, 204210698, 205390723, 206409673, 207012539, 207152250, 206671649, 205351168, 203256512, 200480695, 196661671, 192059131, 186878660, 181118546, 175162243, 169247714, 163393060, 157512880, 151793262, 146193287, 140613542, 135047538, 129472847, 123793046, 117996671, 112060289, 106029520, 100165481, 94466915, 89033547, 84027384, 79370615, 74936657, 70922953, 67330535, 64023404, 61036678, 58279226, 55659968, 53324304, 51234951, 49305966]
3541D9305966j975821j708887j671441j533589j436274j185675j170065j143240
3533C7480974r79595j035974r73461j077290p23918p02381r74734p95273o62687
3524B9555661o49390p49495m91641o53639n21843o42827n97888n51636n71302
3515B4126000o47994o01973m92412n02424n28306n49949n32592l33755l85694
3506A9550901n42122m61320m76062n19463m40030m27723l46466n28308l80742
3497A5428665l14608l46744k30748l81048k19124j27898l34141k41517l34851
3488A2897986k67353k96864k87769j14301l44339l17328j42576k63168j56712
3479A0707576j50197k01526o470n0003j32159k58184k13005k92180o200o2808
$$ y = [49305966, 47330145, 45621258, 43949817, 42416228, 40979954, 39794279, 38624214, 37480974, 36501379, 35465405, 34491944, 33414654, 32690736, 31988355, 31013621, 30218348, 29555661, 28906271, 28156776, 27665135, 27011496, 26489653, 25846826, 25248938, 24697302, 24126000, 23478006, 22876033, 22383621, 21881197, 21352891, 20802942, 20270350, 19936595, 19550901, 19008779, 18547459, 18071397, 17551934, 17111904, 16684181, 16337715, 15809407, 15428665, 15114057, 14767313, 14536565, 14155517, 13936393, 13808495, 13474354, 13232837, 12897986, 12630633, 12333769, 12046000, 11931699, 11587360, 11270032, 11127456, 10864288, 10707576, 10557379, 10355853, 10349383, 10299380, 10167221, 9909037, 9696032, 9403852, 9397652, 9334844]
3469I334844k74198l0687j04877m6944n9008j40257j45648j13742q4496k55133
3459H079854Q6866p7755j13506j95339K0078j03580o3550j3409j38965q5887M2297
3448G437104q7109j26056L9742r5144n4607j51506l07J25211j3952q2554j26556
3437F864266l6561k7678j10015N5269O330o0880l0172m8221j05704J4570L4241
3426F555445k485O811l0579q3384n5385Q5287p5670L691K1028j16896j40043j9280
3414F148540J825J7971J6230N8972j33965O6047M3061j35402J62370j44137j70688
3403E930824J03256M0526k4063p1155Q3361j630m1120l1619l0945M0544j74971
3392E823008N6361m324L0721n7518k32660K3616n1514L1263l0779M5485K55725
$$ y = [9334844, 9060646, 9029959, 8925082, 8878138, 8819130, 8678873, 8533225, 8419483, 8334987, 8079854, 8166720, 8088965, 7975459, 7780120, 7800198, 7696618, 7633068, 7619659, 7480694, 7394807, 7437104, 7349995, 7223939, 7263681, 7168537, 7113930, 6962424, 6962117, 7087328, 7073376, 6990822, 6864266, 6827705, 6800027, 6690012, 6745281, 6751611, 6690731, 6660559, 6612338, 6506634, 6521204, 6555445, 6552960, 6559771, 6529192, 6445808, 6390423, 6475710, 6400040, 6403731, 6424759, 6307863, 6167820, 6148540, 6150365, 6168336, 6184566, 6243538, 6109573, 6175620, 6218681, 6083279, 6245649, 6101512, 5930824, 6034080, 6074606, 6050543, 5979388, 6062749, 6061119, 6019999, 5988380, 5957435, 5997979, 5823008, 5879369, 5875045, 5905766, 5848248, 5615588, 5639204, 5587690, 5618953, 5588174, 5633659, 5889384]
3381E889384J06885p9592M324j38875r339L5476n5437O1364n6809J77450K6302
3370E961133p7789J2191O8827K6874L7206J41719K7022N5873Q2090K4694J7451
3359F377291J09335j01187j0978J22102K47699p057o2402J24862J08858j15386
3349F793137j1908P8580K2873J65005m4282N4780L8361J23380K4849M4394Q2498
3338G371667O8055J79054J64746M1254P7659J11636R6757J38245K46311K00100
3328H695484J98547J01020O5999J00496O8416J43795J95619J40186J80208J82424
3318A0072194Q2878J24907K96820K13063K77039j4498J61941J78427Q7726K68513
3308A1749010L63555K85883J45225K91811M06499L61162K28177L77730L54086
$$ y = [5889384, 5996269, 5916677, 5921001, 5782126, 5772787, 5808263, 5752826, 5814190, 5757381, 5934831, 5961133, 5883344, 5895535, 5964362, 5991236, 6028442, 6170161, 6197183, 6253056, 6335146, 6359840, 6377291, 6486626, 6385439, 6374461, 6496563, 6744262, 6737205, 6674803, 6799665, 6908523, 6793137, 6781229, 6859809, 6882682, 7047687, 7003405, 7058185, 7096546, 7219926, 7244775, 7289169, 7371667, 7439722, 7618776, 7783522, 7824776, 7902435, 8014071, 8110828, 8249073, 8495384, 8695484, 8894031, 8995051, 9061050, 9161546, 9229962, 9373757, 9569376, 9709562, 9889770, 10072194, 10155072, 10279979, 10576799, 10789862, 11066901, 11052403, 11214344, 11392771, 11480497, 11749010, 12112565, 12398448, 12543673, 12835484, 13241983, 13603145, 13831322, 14209052, 14563138]
3299A4563138M98982L23620N23530N25556M03769L67628M48200N13455O43600
3290A8811478N40997N64559Q00246Q31800J048214J180168J231242J446705J524943
3281B7980352J688852J941451K033870K108770K184941K358424K590907K453344
3273D5340911K408164K357687K410035K526918K435302K170786J847096R86482
3265F2483381k196746m213974m149107l331873k807909k325025j536660j142560
3257D0779527q20901n24801J45743N02701R04308J497488J791659K245222K549606
3248D9070552K792837L027175L371956L541649L915785M112474M413138M112307
3240G8357873L946217L895926M415365M204194L560541K952346K498314k680665
$$ y = [14563138, 15062120, 15385740, 15909270, 16434826, 16838595, 17206223, 17654423, 18167878, 18811478, 19352475, 19917034, 20717280, 21549080, 22597294, 23777462, 25008704, 26455409, 27980352, 29669204, 31610655, 33644525, 35753295, 37938236, 40296660, 42887567, 45340911, 47749075, 50106762, 52516797, 55043715, 57479017, 59649803, 61496899, 62483381, 60286635, 56072661, 51923554, 48591681, 45783772, 43458747, 41922087, 40779527, 39958626, 39433825, 39579568, 40082269, 40986577, 42484065, 44275724, 46520946, 49070552, 51863389, 54890564, 58262520, 61804169, 65719954, 69832428, 74245566, 78357873, 82304090, 86200016, 90615381, 94819575, 98380116, 101332462, 103830776, 101150111]
3232A01150111q969958r786135q550189p382830o396944n197042m452184l577476
3224D6837353l151177k434691j729843j302452q02744m74543l59768K09485L27682
3215C7119302M99531P02688P47232J115690J183899J283761J413211J358761J389062
3206D6813137J272999J471589J306135R40992O48496k74603l542913n373980m851549
3197C8410303m099434l575817l142689k632088k015159j968643j619850j272176
3189A8084447r97633r72233p79508o62521o73077o67269n16322n02409m08943
3180A1904532n10536n35290l20101m05996l31527m52041k88812j78990k34271
3171H646968m84622m36494k40814j46934q3679k28776k64875l07184l00811n3600
$$ y = [101150111, 92180153, 82394018, 73843829, 66460999, 60064055, 54867013, 50414829, 46837353, 43686176, 41251485, 39521642, 38219190, 37416446, 36941903, 36582135, 36791620, 37119302, 37618833, 38321521, 39068753, 40184443, 41368342, 42652103, 44065314, 45424075, 46813137, 48086136, 49557725, 50863860, 51804852, 52453348, 52178745, 48635832, 43261852, 38410303, 34310869, 30735052, 27592363, 24960275, 22945116, 20976473, 19356623, 18084447, 17086814, 16114581, 15335073, 14672552, 13999475, 13332206, 12815884, 12313475, 11904532, 11393996, 10858706, 10538605, 10132609, 9801082, 9349041, 9060229, 8881239, 8646968, 8162346, 7725852, 7485038, 7338104, 7254425, 7025649, 6760774, 6453590, 6152779, 6099179]
3161F099179k50404k05856K6200n7860j91814k01174j61297j66673j73097j02104
3151D615100j77937j2235j71348P4629j66784j07952m4913j02216J419l24088
3141C583675k7918J3223q287j18398n1691M5102N6923j04335j74210M1957N8454
3130C314495m5887r4861m4412p6999r1415q8853j85420k05577o8436L7297l7348
3119B412584q5107m2965l6008n5405J24498l7681j57007J6574O7715k17178j041
3108A988979J33616j13584q3510O1097j511J954J28737j08238r4709L9066n4778
3097A897119k8010J4597l0686j5341j5487M7920k0596q9712l8226K0576r0653
3086A651501M5091j07637o702L1488J01586M9757k7277P8043N8960j27841j06890
$$ y = [6099179, 5848775, 5642919, 5669119, 5611259, 5419445, 5218271, 5056974, 4890301, 4717204, 4615100, 4437163, 4424928, 4253580, 4328209, 4161425, 4053473, 4008560, 3906344, 3907763, 3583675, 3555757, 3568980, 3560693, 3442295, 3390604, 3435706, 3492629, 3388294, 3214084, 3256041, 3314495, 3268608, 3173747, 3129335, 3052336, 2960921, 2872068, 2686648, 2481071, 2412635, 2449932, 2412584, 2327477, 2284512, 2248504, 2193099, 2317597, 2279916, 2122909, 2139483, 2207198, 1990020, 1988979, 2122595, 2009011, 1925501, 1986598, 1985087, 1987041, 2115778, 2007540, 1912831, 1951897, 1897119, 1869109, 1883706, 1853020, 1837679, 1822192, 1870112, 1849516, 1759804, 1721578, 1742154, 1651501, 1696592, 1588955, 1582253, 1613741, 1715327, 1765084, 1737807, 1815850, 1874810, 1746969, 1640079]
3075A640079j28210j0032P4075m1022N6316l3158k8484p912j04817K5347K9637
3064A471819P6010m6438j06813j02293K34317N5246q8097j02351l4111P0042k1098
3053A406233k1993M5380K9848O8386j01594K2341o8247o1084Q5081J7397j32413
3042A289335N8561R2659m8833j0501n2024j47855Q888m6851L7977l6898j1968
3031A132490K7706O0193O7720j03255L4311m2277L2436P1369j56814P525J00139
3020A231543j10586r167K7575j8942o7026P8146p0288J27099j94885J6635P0101
3009A080205L7549n1626P3575o2161J6997Q309o3361J3944N3466p8489j38816
2998H89592k9150N3227M7048O4624J6013K0202J3895j0743j25944R252K4897J49989
$$ y = [1640079, 1511869, 1501837, 1575912, 1534890, 1591206, 1558048, 1529564, 1521652, 1416835, 1442182, 1471819, 1547829, 1501391, 1394578, 1292285, 1526602, 1581848, 1493751, 1391400, 1357289, 1427331, 1406233, 1384240, 1429620, 1459468, 1527854, 1426260, 1448601, 1380354, 1319270, 1404351, 1421748, 1289335, 1347896, 1440555, 1391722, 1381221, 1329197, 1181342, 1190230, 1143379, 1181356, 1144458, 1132490, 1160196, 1220389, 1288109, 1184854, 1219165, 1176888, 1209324, 1280693, 1123879, 1131404, 1231543, 1120957, 1111790, 1139365, 1120423, 1053397, 1131543, 1061255, 1188354, 993469, 1010104, 1080205, 1117754, 1066128, 1139703, 1077542, 1094539, 1102848, 1039487, 1053431, 1106897, 1028408, 889592, 860442, 913669, 960717, 1025341, 1041354, 1061556, 1075451, 1064708, 938764, 948016, 972913, 1122902]
2986A122902p4508m3704P5761M5766M0591J7305j45626k7786J41797j7549O2477
2975A197426l4872k7462R7012n3712j7850m0852n3404J51289l4747r9721n3592
2964A029515J8479J08333L0555o8279O2973M7940L5435k0620j4969o7342L0379
2953A192399j9266O2736J41530j75875J02001P6549o3593K2197Q6450J36467j22936
2942A438659k15168P008O7167J94542p9623j13022q6791j6847P5343m6549J78482
2931A403201n1394P5645M6917j14070p9519N2673k3655M2539K1448l6479n6781
2920A280525P7114L5550J2283j5264l2697Q3130m5740k960p2679J06529R1798
2909A517589r311k0938n1945O0067j78147K8862O0713k043O2422J21994j0703
$$ y = [1122902, 1048394, 1004690, 1080451, 1126217, 1166808, 1184113, 1038487, 1010701, 1152498, 1134949, 1197426, 1162554, 1135092, 1232104, 1178392, 1160542, 1119690, 1066286, 1217575, 1182828, 1083107, 1029515, 1047994, 1156327, 1186882, 1118603, 1181576, 1229516, 1264951, 1244331, 1229362, 1162020, 1192399, 1173133, 1235869, 1377399, 1201524, 1303525, 1380074, 1316481, 1338678, 1425128, 1561595, 1438659, 1223491, 1230499, 1297666, 1492208, 1412585, 1299563, 1212772, 1195925, 1271268, 1224719, 1403201, 1351807, 1427452, 1474369, 1360299, 1280780, 1333453, 1309798, 1352337, 1373785, 1337306, 1280525, 1357639, 1393189, 1405472, 1390208, 1357511, 1440641, 1394901, 1391941, 1319262, 1425791, 1517589, 1508278, 1487340, 1435395, 1495462, 1317315, 1346177, 1406890, 1404847, 1467269, 1589263, 1578560]
2898A578560p9969p691N7649M4317j03839J83161p9270q8286r2973j17620O7705
2887A361744K3160R6020n1755p2729J06863m4995k00066n328m8902J08915O8781
2876A341708l6894L8411J1068j16478M0520O1702o7932j8011L5302j18351n7602
2865A113443R1061K2780l1072O1010j79108n2139j9486J6027l2379n3416m2706
2854H94015K1556m4719j2388P7L2463P196m7584n649j26543Q4378M6720r7425
2842G52097N6650j3362R8610j37119q8654R1387O2298j70429k255Q4979o6895
2831F67307p8650M1889R6928j27876n5186J32968k7343p3124o6127j88542K2168
2820C44412J1970J87932r7708N418o6790J4901J04321J9659r0917j12637m7774
$$ y = [1578560, 1498591, 1490900, 1548549, 1592866, 1489027, 1672188, 1592918, 1504632, 1411659, 1294039, 1361744, 1384904, 1480924, 1429169, 1356440, 1463303, 1418308, 1218242, 1212914, 1164012, 1272927, 1341708, 1304814, 1343225, 1354293, 1237815, 1278335, 1340037, 1272105, 1254094, 1289396, 1171045, 1113443, 1204504, 1227284, 1196212, 1257222, 1078114, 1025975, 1006489, 1022516, 990137, 936721, 894015, 915571, 870852, 858464, 858541, 891004, 898200, 850616, 844967, 718424, 802802, 849522, 752097, 808747, 795385, 893995, 756876, 668222, 759609, 821907, 651478, 649223, 734202, 667307, 588657, 630546, 727474, 599598, 544412, 677380, 650037, 576913, 510786, 322244, 344412, 356382, 544314, 446606, 452024, 385234, 400135, 504456, 524115, 433198, 320561, 272787]
2809B72787J00878n4613J06497k598k5284l1511k090m7578j1305M5872l924J49558
2797D96689N602k16577O1981l6158j58767J07296l1851j8984J23492j10446l4452
2786A87825Q5098o2898P0833M7876r4157p8608M0374R498K2529L435M7942k5734
2774B54013J2293n6128j13585J53569m0188j14740m6047J19430N7148r5255O2720
2763A93230j28604j5826J37719j0722R8431L6700J27189j48733p4131p7643Q8141
2752B25751k6132k4287J87183p8728j23996j1407m3184o1905K1900n5361k8774
2741a8940Q4407O6803K3200m4398p3097J25639j1628q2990J28218k2480q4814
2730H9920l8550o1804J38635m4516j603k6771j1461p3538N6209J11721n5614r7288
$$ y = [272787, 373665, 319052, 425549, 422951, 397667, 366156, 364066, 316488, 305183, 351055, 347131, 496689, 502291, 285714, 347695, 311537, 152770, 260066, 228215, 209231, 332723, 222277, 187825, 272923, 210025, 280858, 328734, 234577, 155969, 196343, 205841, 228370, 231805, 279747, 254013, 266306, 210178, 96593, 250162, 209974, 95234, 49187, 168617, 225765, 130510, 193230, 64626, 48800, 186519, 175797, 274228, 310928, 438117, 289384, 215253, 137610, 225751, 199619, 175332, 362515, 283787, 159791, 148384, 105200, 43295, 65195, 9834, -18940, 65467, 132270, 155470, 111072, 37975, 163614, 151986, 68996, 197214, 174734, 89920, 51370, -10434, 128201, 83685, 82082, 55311, 43850, -29688, 26521, 138242, 82628, -14660]
2718a4660J18122P0073r265R955L6624q0115p8083l1396M9240q5074l9222J96649
2706A42848r3963l9002k3372N5237j9941k6837M0444K9892n551m2241O1100l2392
2694D6222j0849M8165l516k5736P143L913k9013L8922R611l7675l5021N9335Q9517
2681A61018n0673M0468j79645J36006J02827q6957j0936n7444L8629J0297M0317
2670A43907o9609j49630L2879K6188M549N7728J8916p5856l412J12346o2544J239
2658C6701Q5099j85981j5010K24420R8017J2041p9866j8135j25448j89170J33934
2647b3398M1746O829J4465l5102J14560N9811P268m3642r9390N553j9282j49893
2635a20475m2151N5710O0275N3441q4249Q9821K6101m9418q3642J4483J14567
$$ y = [-14660, 103462, 173535, 164270, 174225, 210849, 130734, 52651, 21255, 70495, -14579, -53801, 142848, 48885, 9883, -13489, 41748, 21807, -5030, 35414, 65306, 59755, 17514, 78614, 46222, 35373, 83538, 80022, 54286, 61429, 65342, 36329, 75251, 84862, 47187, 12166, 71501, 161018, 110345, 150813, -28832, 107174, 210001, 123044, 112108, 54664, 93293, 103590, 143907, 74298, -75332, -42453, -16265, -11716, 46012, 64928, -10928, -14340, 98006, 35462, 36701, 121800, -64181, -79191, 145229, 243246, 255287, 175421, 157286, 31838, -157332, -23398, 18348, 25177, 39642, 4540, 119100, 178911, 186179, 142537, 43147, 48700, 29418, -120475, -162626, -106916, -46641, 6800, -77449, 12372, 38473, -10945, -94587, -80104, 34463]
2624C4463p755m1887j1628J50803p6387j1146n8487j6909J02419m51J29954n6584
2612A36405l8050j4961j18179Q0068p968K6575J00437L7404r6024o3525m6506
2601d324j11630O3160N1657J52233k9643r0539j07056l0698N1458P8480J21027
2590A44125j36965J1449O4368o6591k1127J5494j14850M5146L1751m1178J52897
2579H4519l3124n2479J19431J7357j2848n9107L4668L4482K6137o5256j80780
2568h7000N2472K7649M1023l7531K9592R4820q012L0582J859n715j8264M019r8285
2555B7209P9926l9212N3920j56833j36709L0518P5876R2151l8559R914N98L6273
2543C5072j344o0041J21622o4796j05964J90794j06145n7959k0026o8081M4543
$$ y = [34463, 26708, -15179, -26807, 123996, 47609, 36463, -22024, -38933, 63486, 63035, 192989, 136405, 98355, 83394, -34785, 45283, 37315, 63890, 164327, 201731, 105707, 42182, -4324, -115954, -52794, -1137, 151096, 121453, 30914, -76142, -106840, -55382, 23098, 144125, 7160, 18609, 82977, 16386, -4741, 10753, -104097, -58951, -27200, -68378, 84519, 51395, -1084, 118347, 135704, 122856, 63749, 98417, 132899, 159036, 93780, -87000, -34528, -6879, 34144, -3387, 26205, 121025, 113013, 143595, 145454, 139739, 121475, 125494, 27209, 107135, 67923, 121843, -34990, -171699, -141181, -65305, 26846, -11713, -1799, -1201, 35072, 33728, -26313, 95309, 30513, -75451, 115343, 9198, -48761, -68787, -136868, -92325]
2532i2325Q8705M9525K0268j31730M6038J22415k6497P201m2407K7019j5399k740
2520E0073k6344N9394r8337j35724K0982M8179j0038R3477J97R0486K8826j00632
2508B0539q1256J09098k6927j15688P0634n7587J05666N4168r760j17397r4994
2497a43504O4053j03413J72636O2884o3085J9795k3058J17215o6291n9478K4545
2486B299O5009j06541J73319q6344j31856K5524m133J27561m3680K4663o4471
2475a8650p1420J86046l4012l5761p8532j39405J64597J4834l2338j3216O3603
2464E746m633P5783L8736j37984r4691m7184J08260m0341j07707J49501p5240
2453a29754k0571J63911K4754N9912j76647J7388J10232m4466J1936k4574J12693
$$ y = [-92325, -3620, 45905, 66173, -65557, -19519, 102896, 76399, 83600, 41193, 68212, 52813, 50073, 23729, 83123, -15214, -150938, -129956, -81777, -91815, 1662, 1859, 92345, 121171, 20539, -60717, 48381, 21454, -94234, -23600, -81187, 24479, 78647, 68887, -48510, -143504, -79451, -182864, -10228, 52656, -10429, 9366, -13692, 103523, 37232, -22246, 2299, 67308, -39233, 134086, 47742, -84114, -58590, -62723, 64838, 21158, 45821, -18650, -90070, 95976, 61964, 26203, -52329, -191734, -27137, -12303, -44641, -57857, 5746, 1113, 76896, 115632, -22352, -117043, -164227, -55967, -96308, -204015, -54514, -129754, -150325, 13586, 38340, 98252, -78395, -61007, 49225, 4759, 16695, -7879, 104814]
2442A04814k3629R1068o0108j61298q2298o1366J23126n4718N5876J09311K5990
2431F6768P6689L9893j62027Q3007K4905o3301k3341J3774o4980P8589N9414Q546
2419A37936n5527K0108o3667j9273p2409Q8186m8972L6782j4617r0988p3216M4411
2407a11246P1676k3874P9934k2052K0816r7985j7305N5631M1047m9744k2406J1480
2395f4028Q8362j5912j2148J04655r7417p2108m6641J05017J16123p7110l262
2384B5531r8333j89191M489R5157P716J20081p966N1931P460q9090M3815J49954
2372A21554o3191j12411J34968o4330k6033Q5554O905Q5513o5714M7924p3846
2361G6893n0887R5034p1313q697J18701L028r7800J2976j4160q1891K386L1913
$$ y = [104814, 81185, 172253, 112145, -49153, -131451, -192817, -69691, -124409, -68533, 40778, 66768, 143457, 183350, 21323, 104330, 129235, 65934, 42593, 56367, -8613, 69976, 129390, 137936, 82409, 102517, 38850, 19577, -52832, 35354, -13618, 23164, 8547, -82441, -155657, -111246, -39570, -63444, 16490, -5562, 15254, -82731, -100036, -44405, -3358, -53102, -75508, -64028, 24334, 8422, -3726, 100929, 3512, -68596, -115237, -10220, 105903, 28793, 25531, -72802, -261993, -257504, -162347, -154631, -34550, -42516, 9415, 16875, -72215, -28400, 121554, 58363, -54048, 80920, 16590, -9443, 76111, 83016, 168529, 102815, 150739, 76893, 26006, 121040, 49727, 41030, 159731, 162759, 64959, 77935, 63775, -18116, -15730, 16183]
2349A6183n8512P9439M0032j28788J4605p0685m4611k6947J51995L2345J2686
2338A7742K2841L2532p1027J09925L6715j1308l8679l9961J46207j46724j17454
2327e9191N0565M2094l5613p6015O7723R7516j27013q0861J35911O1768J4960
2316I1844j6854l4134L5107K4767M0631j3934j52540Q5019R9394m9341q5265R7743
2304A22437o4776K2953m3951R4315O5535N7295j07565m1990L6341m6274O1277
2293A55597l8207r7458k6318j776j2079r84o5963N7202L0066J2076m6945L3770
2281a019m7734R4376J10835n7292q6189L3102l783j11459O1098J72320J5772j22772
2269E7255q9531M8220o852K0711l4575J44125n7439P0643J9884J8498m1370j4109
$$ y = [16183, -42329, 37110, 77142, -51646, -37041, -107726, -152337, -179284, -27289, 5056, 17742, 40583, 73115, 2088, 112013, 148728, 137420, 98741, 58780, 204987, 58263, -59191, -8626, 33468, -2145, -78160, -10437, 87079, -39934, -120795, 15116, 76884, 91844, 74990, 40856, 75963, 100730, 141361, 127427, -25113, 59906, 159300, 109959, 24694, 122437, 57661, 80614, 36663, 130978, 196513, 253808, 146243, 104253, 140594, 94320, 155597, 117390, 19932, -6386, -8162, -20241, -21225, -87188, -29986, 80, 12156, -34789, -1019, -48753, 45623, 156458, 99166, 12977, 46079, 42296, -69163, -8065, 164255, 180027, 57255, -32276, 15944, 9092, 29803, -4772, 139353, 81914, 152557, 172441, 190939, 149569, 135460]
2257A35460j11393K3742J58732j17178O8061K0405n1274o4373J8410P1634L5555
2246A87781K5381n3906k2410N6047m249j55397m4100m256J16768N7684Q1640j7478
2234B23505m2603Q0009J30686m1241k13148q580R0439q930p0223M6955M6784o1337
2222A72316J5653M9420J29424j9211o3289J490N1456k519M4482j05930p6847M991
2210B01436O3283L7533M5907j0348j16761K0115K0276o0502j5848O5323p9411
2199A71003L7907J31911M1330o5334m8059L4817k5602J12595J56128j3647j14031
2188D19018l2458J38031r3095J2287K5336J897J4724J4636k5308L6712J58094
2177F69874k007j83740J2141Q5318J20126L152m8319P920Q0580J5305q1580K9554
$$ y = [135460, 24067, 47809, 206541, 89363, 157424, 177829, 126555, 62182, 80592, 152226, 187781, 213162, 159256, 136846, 192893, 188644, 33247, -10853, -15109, 101659, 159343, 240983, 223505, 180902, 260911, 391597, 350356, 137208, 128628, 219067, 210137, 139914, 186869, 233653, 172316, 187969, 237389, 366813, 347602, 284313, 285803, 337259, 334740, 379222, 273292, 196445, 201436, 264719, 302252, 348159, 337811, 221050, 241165, 261441, 200939, 185091, 250414, 171003, 208910, 340821, 382151, 316817, 268758, 303575, 277973, 390568, 546696, 533049, 419018, 386560, 524591, 431496, 443783, 469119, 471016, 485740, 500376, 475068, 511780, 669874, 667867, 484127, 496268, 581586, 701712, 704864, 656545, 664465, 745045, 760350, 678770, 708324]
2165G08324j45812M1802J61284J10137m902l4733n0374K4437K7782L9111J23351
2154A000407k8312o3051m4643Q3255l2127l3923l4803J72930R8398r4848J23328
2143A146611J94376m9139l1985M9246P3012J73021J00535p4212N678J16898J29908
2132A833949M0772J37985J51161K4345m1848K29198J06313O1640J18562K45763
2122B907840L9477P3691J39127P1520J69499K07664J39198K10912L21815K54469
2112D535212K61444L22016M72324O67355M96621N50591P66708O67119N98178R02643
2102A0240211R08723Q61097P86414P43182Q57781R93588Q40380O11117O22746
2093A7465239O44468q32578k201491k075165j828668j241620j214952r95704r02263
$$ y = [708324, 562512, 604314, 765598, 875735, 870833, 836100, 785726, 810163, 837945, 877056, 1000407, 972095, 909044, 864401, 947656, 915529, 881606, 846803, 1019733, 1118131, 1023283, 1146611, 1340987, 1291848, 1259863, 1309109, 1382121, 1555142, 1655677, 1581465, 1587143, 1704041, 1833949, 1874721, 2012706, 2163867, 2188212, 2146364, 2375562, 2481875, 2543515, 2662077, 2907840, 2947317, 3021008, 3160135, 3231655, 3401154, 3608818, 3748016, 3958928, 4280743, 4535212, 4796656, 5118672, 5590996, 6258351, 6754972, 7305563, 8072271, 8739390, 9337568, 10240211, 11148934, 12010031, 12796445, 13539627, 14397408, 15390996, 16231376, 16842493, 17465239, 18109707, 17277129, 15075638, 13000473, 11171805, 9930185, 8715233, 7719529, 6817266]
2084F817266p14738o49060l99107m71844l19714k71336k43076j46035j77324k51645
2074C173387j87754l00535l9679k89795k48602j03724j23740K824j43635k25119
2064A513628l3166k297j62583j30223r6264Q5986P9129m1478j71806j45852M4721
2053I39795o1487q0707J8204L6092J57695j45106j70096n6330J0794k5225N2001
2042F75630J5156K514N1513m4156k1339J1921l9530M4532J4800j15407l8549m9445
2030E07640o1522O9641j12169m2479P0345J0039j9709n9914j5810j421J61049
2019E05690l7028j12507m2455m4118l9172K7900j8173K1401n6011Q4340k0335
2008B69532o7367M9926J06346r6093r4203O3249K2752N6681L1743m1471l1470
$$ y = [6817266, 6102528, 5453468, 5054361, 4582517, 4262803, 3991467, 3748391, 3602356, 3425032, 3173387, 2985633, 2685098, 2645419, 2355624, 2107022, 2003298, 1879558, 1882382, 1738747, 1513628, 1480462, 1478165, 1315582, 1185359, 1089095, 1175081, 1254210, 1212732, 1040926, 895074, 939795, 878308, 797601, 815805, 851897, 1009592, 864486, 694390, 638060, 648854, 623629, 675630, 690786, 693300, 744813, 700657, 679318, 691239, 651709, 696241, 711041, 595634, 557085, 507640, 446118, 515759, 403590, 361111, 431456, 441495, 421786, 361872, 346062, 344641, 505690, 468662, 356155, 313700, 269582, 230410, 258310, 240137, 261538, 205527, 289867, 269532, 202165, 252091, 358437, 262344, 168141, 231390, 254142, 310823, 342566, 301095, 269625]
1997B69625k1310j10209n6812n0191J25835L7732J1853j46115J9307l4499o1718
1986a6502J03830R1313L9660J9047m9406J3226l1899l6791N9796N969o9981j8398
1974A09864K0599j6399o6388o0698N952R7403M4228k5948q2310O6352j16865m8685
1962g2895J28669l8938N433j2543L40Q9482j4262R035l5553j5367Q2606J4213
1950A40220N0113j33273R1305k5524N0308r2668n3183Q9785l1096O0051n191j14863
1938B5984M3249M2259k0824p71j15514J10175J00863p1113P3097p6935m9434O4047
1926A25083J0805k0049j2273l3915n0857K9479K7943j35364M9191J16492k1362
1915H5173k8432l9849J01257P0036m6961l0807K8988m7274q0473p7613J515J2571
$$ y = [269625, 248315, 138106, 81294, 31103, 156938, 194670, 206523, 60408, 79715, 45216, -16502, 87328, 178641, 218301, 237348, 187942, 201168, 169269, 132478, 192274, 198243, 128262, 109864, 130463, 114064, 47676, -13022, -7070, 90333, 134561, 108613, 26303, 92655, -24210, -72895, 55774, 16836, 22269, 9726, 10066, 99548, 85286, 94321, 58768, 43401, 126007, 140220, 190333, 57060, 148365, 122841, 173149, 80481, 27298, 117083, 85987, 146038, 140847, 25984, 69233, 111492, 90668, 89897, -25617, 84558, 185421, 114308, 187405, 110470, 61036, 125083, 135888, 115839, 103566, 69651, 18794, 48273, 76216, -59148, -9957, 106535, 85173, 56741, 16892, 118149, 188185, 141224, 110417, 139405, 92131, 11658, -65955, -64440, -51869]
1903e1869N7169M4876J00013J3291j11324m4807O5026k2295r6349n1560K1420
1892g6409l8158l2925J05207N0008N829Q1806o8735L1990j7436K2740j26161M7655
1880a4589O1804j8216m6402l2664K5802k7353P1303l5526l9638N6310l4864p6351
1868a10384O277p896j424O8018J16384K3608k4474p8500n0518N2958P3030R4837
1856A61916j6494l6115q6926m9794L9151k7575P7411j47591o5720R2232P5653
1845A6148J25319O363n202p9776m38M7265m6808n1281J2841Q2830j6036M9885
1833A41110K8747J4512r4803l6310L1327m3630j15581k1898J2926J40083R2850
1822A49333l5905j06200k2480j5154L388O2289l8448m653K7936q1824j1149M7090
$$ y = [-51869, 5300, 50176, 150189, 163480, 52156, 7349, 72375, 50080, -46269, -97829, -76409, -114567, -147492, -42285, 7723, 13552, 95358, 26623, 58613, 41177, 63917, -62244, -14589, 47215, 28999, -17403, -50067, -24265, -51618, 19685, -15841, -55479, 831, -34033, -110384, -104107, -112003, -113427, -45409, 70975, 94583, 70109, -8391, -58909, -5951, 67079, 161916, 145422, 109307, 22381, -27413, 11738, -15837, 61574, -86017, -151737, -59505, 16148, 141467, 147830, 142628, 62852, 62414, 109679, 62871, 11590, 24431, 107261, 91225, 141110, 169857, 184369, 89566, 53256, 84583, 40953, -74628, -96526, -83600, 56483, 149333, 113428, 7228, -15252, -30406, -27018, 35271, -3177, -7830, 20106, -61718, -72867, -25777]
1810b5777J07483q1532j09336O4693k2283p4256N5794N7089J01322r7105n5226
1799g9134M5699k3664M5699J39572l5889M8815j36276m0834P9801J5055P5032
1788A33876n9685R6486n9428n8586n802L1465j30476L0493L535q987J5558N6037
1776D4486o989l7571K2137j3872p477M4177K5119j3264j29076M002N0870L8999
1764B1541O9495j83069n7212J65408K9925j47847m9804Q8675R8627P589p6321
1753c2993m713K6551j127r9302j1034Q7727m403n9794K8771k6646l779Q5518J4549
1740f75q3045P3223R9094k7596j36705j28198O0560j9642Q2480M6271q2946J98323
1728H1144J22217m3588j27539n671J7923M296J10387k3769j76890K8607J1275
$$ y = [-25777, 81706, 174, -109162, -44469, -66752, -141008, -85214, -28125, 73197, -23908, -79134, -33435, -57099, -11400, 128172, 92283, 141098, 4822, -36012, 43789, 58844, 133876, 74191, 170677, 111249, 52663, 46861, 78326, -52150, -21657, -18122, -27109, -11551, 44486, 37497, -74, 22063, 8191, 714, 44891, 70010, 56746, -72330, -68328, -17458, 21541, 91036, -92033, -149245, 16163, 46088, -101759, -151563, -62888, 35739, 43328, -32993, -37706, -11155, -12282, -111584, -122618, -34891, -39294, -99088, -70317, -96963, -100742, -15224, -675, -83720, -10497, 88597, 61001, -75704, -203902, -143342, -162984, -80504, -34233, -117179, 81144, 203361, 159773, 32234, 26563, 44486, 48782, 159169, 135400, -41490, -12883, -1608]
1717a608j06672N5400M0273O916o0669L9831l9480N3083q7491M3107m1660J19201
1705B0231J02840k8851N5853k0914o0326o9621K508J03271J766n4449m9928M1002
1693D3382J54711p5196j76284j00975J03971K2257J46549l9043j6568K1001q9926
1682f121P2618J5033q2894j2831j98016L7745J78663R647P261L9467r8141O1845
1670B4276N9572j34625n1212N1886J9990K6353o9099M5705K465k169Q4604J4197
1658G1943O706m8274k5420k4811p3485K5737J18627k5260j51551L9959R4919p5946
1646f6856Q1116o0842r4604Q8976R3813P6851n6657r0224Q9543L3365m2820j47392
1634i5731j7783N8631J57365j32558l5912j6950r6856P5944J36L1517N817q8647
$$ y = [-1608, -108280, -52880, -12607, -5691, -66360, -26529, -66009, -12926, -100417, -57310, -98970, 20231, 123071, 94220, 150073, 129159, 68833, -788, 1720, 104991, 106757, 52308, 2380, 43382, 198093, 122897, -53387, -154362, -50391, -28134, 118415, 79372, 62804, 83805, -6121, 66497, 81530, -1364, -14195, -212211, -174466, 4197, 13844, 21105, 60572, -37569, 24276, 83848, -50777, -101989, -50103, -30113, -3760, -72859, -27154, -24689, -26858, 57746, 71943, 78649, 30375, 4955, -19856, -93341, -67604, 51023, 25763, -125788, -85829, 9090, -66856, 14260, -46582, -141186, -52210, 41603, 118454, 61797, -28427, 61116, 94481, 51661, -95731, -113514, -54883, 102482, -30076, -65988, -82938, -179794, -103850, -103714, -72197, -66380, -155027]
1622a55027O9643l2023O3103j0874Q1888O5105j18741o8746j2368J15220J03335
1611A00515n1372r1350P538O8164M5360p8887j25335o210O2296J24180j06133
1600e1234j72201J60889R996J44841J1498j23089J16377N4857j20636k0445o2041
1589e1188l6429l065K9789N2427N9700N9508j70674j00463K53576j13393M0178
1578A9966M2586o6572O8014K973q0850M3136o8654p073P6549J1035l2905N177
1566A3382O9463l9486J1408j44226j25129J00119J69274p8890j685L2755m6965
1555c9980o4150L6896L7718L722J0807O4576k5689j1985k9874p064j2915R1238
1543E3300J52839m0143q6476j00364p7363l3416N0954M2600j8839p643k9054J44533
$$ y = [-155027, -85384, -117407, -54304, -65178, 16710, 81815, -36926, -105672, -118040, -2820, 100515, 49143, -42207, -34669, 33495, 78855, -32, -125367, -131577, -69281, 54899, -51234, -223435, -62546, -52550, 92291, 103789, -19300, 97077, 151934, 31298, 10853, -51188, -87617, -90682, -60893, -8466, 51234, 110742, -59932, -160395, 93181, -20212, 19966, 62552, -4020, 63994, 66967, -13883, 29253, -39401, -46474, 30075, 41110, 8205, 13382, 82845, 43359, 54767, -89459, -214588, -114469, 54805, -24085, -25770, 6985, -39980, -104130, -67234, -29516, -25794, -14987, 49589, 23900, 11915, -17959, -25023, -37938, 53300, 206139, 165996, 79520, -20844, -98207, -131623, -80669, -38069, -56908, -64551, -93605, 50928]
1531E0928Q2342j37518M8564l0008L6739j6644n0453J4123J6468m3061J3370j15145
1519a30295j01791J41444P5749J36695l6775n9737k6037m2789j5652q7092j9910
1508a66190J51837m328q6103j2714P3934Q047Q5123r4926j8066Q0036J8707K6202
1496F1559R1705M3671j67776n3472M4645Q0849l2869o6493j20353K947j4686O7759
1484f2514k8837N5398M2979r6695l3525q96O4524M57L3728q4267O4585p6438K1260
1471a00241J42307R9172m6589q0045j76727P7893J42431q5363l2681q4513l8111
1460a82467K28712O9676o7524q3534J0772J10924q5884n3407n0041r4382O5096
1449a32059J91789m0205r2486m2582O7162n7594k0964J08443J07328r2514P7945
$$ y = [50928, 133270, -4248, 44316, 14308, 51047, 34403, -16050, -1927, 14541, -28520, -15150, -130295, -232086, -90642, -14893, 121802, 85027, 25290, -747, -43536, -59188, -146280, -166190, -14353, -18681, -104784, -117498, -43564, -35517, 49606, -45320, -63386, 16650, 35357, 61559, 153264, 196935, 29159, -24313, 20332, 101181, 68312, 1819, -118534, -115587, -130273, -62514, -91351, -35953, 7026, -89669, -123194, -124090, -59566, -59109, -25381, -109648, -45063, -121501, -100241, 42066, 141238, 94649, 14604, -162123, -84230, 58201, -27162, -59843, -144356, -182467, 46245, 115921, 48397, -35137, -24365, 86559, 675, -52732, -102773, -197155, -132059, 59730, 19525, -72961, -115543, -48381, -105975, -126939, -18496, 88832, -3682, 74263]
1438G4263J5315M8168q8414o4650p7868J6249J79149N18j45113K242M7115q1548
1426g4574j10950O7571M4387L9919L7783J2931p3881K0014n9149P187J89420m5098
1414E5560j1546p3334P7004J3055o0402L810l9514j09607O1933R3183l3205J6089
1402f974P9124p5247j52232k9095J60941O1893k7071o3873j11606Q8972L6574
1391c8594J7020M4735j44556J00379O711N045o90l1493R1522m0938n7098o427
1379e4384P0114l4470l6315R1903R4620p8740m3733k9791P5488m647j5434o2491
1367b7880j9490j6966o286R3770O5310m0290K2604l6037n8328J05529M0286l2961
1355H9261l7600Q4688K2347j32101K1061l3571n5005L0670K720o807L5962K3103
$$ y = [74263, 89578, 137746, 49332, -15318, -93186, -76937, 102212, 102730, -42383, -40141, 6974, -74574, -185524, -117953, -73566, -33647, 4136, 17067, -56814, -36800, -95949, -88762, 100658, 55560, 44014, -29320, 47684, 60739, 337, 4147, -35367, -144974, -83041, 10142, -23063, -6974, 72150, -3097, -155329, -184424, -23483, 38410, 11339, -52534, -164140, -75168, -38594, -21574, 23161, -121395, -21016, -14305, -9260, -9950, -41443, 50079, 9141, -47957, -54384, 15730, -18740, -55055, 36848, 131468, 52728, 8995, -20796, 54692, 50045, 34611, -27880, -47370, -64336, -70622, 23148, 88458, 48168, 70772, 34735, -23593, 81936, 122222, 89261, 51661, 136349, 158696, 26595, 47656, 14085, -40920, -10250, -7530, -14337, 21625, 44728]
1343D4728j49900o48l571R5690O8267j2661j20317J6994m3315O1872J19825J7932
1331I4896j30625j17106P861J04510J06731J9688p6333l9169p3981Q5415P5712
1320E7599q8418m1033J38746o7901N5961M6730J25299j75714m0298K8780N4792
1309I4543O0066l8660J2601p6868m5645r6348K5304K1852m4639n1172J4173M3092
1297h1701l9110j5241J36800o0428J32884j3826L3095p0874l7724J08089l3715
1286E8249j30863n222L5937Q1478n9915J20526j20559P4911j1204L2835J8184
1275I4357p3689j99880L7369O7368m7311J19584J9241p3564K5178N5520o6828
1264d2655P4930p3466k1701M4580l5703L1793J99838j19164k3313o5838K5668
$$ y = [44728, -105172, -105820, -109391, -13701, 54566, 41905, -78412, -61418, -104733, -42861, 76964, 94896, -35729, -152835, -144974, -40464, 66267, 85955, 9622, -29547, -103528, -18113, 57599, -30819, -71852, 66894, -1007, 54954, 101684, 226983, 51269, 10971, 39751, 94543, 154609, 115949, 128550, 51682, 6037, -90311, -65007, -43155, -87794, -138966, -124793, -81701, -120811, -136052, 748, -59680, 73204, 59378, 92473, 21599, -16125, 91964, 58249, -72614, -77836, -41899, 39579, -20336, 100190, -20369, 54542, 43338, 76173, 94357, 20668, -179212, -141843, -74475, -121786, -2202, 17039, -56525, -31347, 24173, -42655, 32275, -41191, -62892, -18312, -54015, -22222, 177616, 58452, 35139, -30699, -5031]
1253e031P4249M7249j13607O1439J08569j44743q4556M051O4107O4408j9774K3288
1241G9649n77j32551K3732k2658J7961N5088j7912l6628n2740Q0585k4487k2038
1229e2576P7882J6656k7713n7745J18056r282J18818q4220j46772m5663R9356
1218F797j03908J9703R0655j3421K3331j37448q233R1063Q0022o4521o1511P4075
1206c396O0795o6714j40933O6739P2551j3693M1201j48094J5108J00172J14357
1195I8093q9581j08092J11852q741n5063P816J35045j41146n1236J31073m5708
1184a5688J0263L6227m221j6359L300L3595l1068n3363J09216P8563Q282r3957
1172F4790j25871q8610N9855l0625K4167K7868P1510J3564Q802m7365j3611J5349
$$ y = [-5031, 69218, 116467, 2860, 64299, 172868, 28125, -56431, -52380, 11727, 76135, 56361, 79649, 79072, -53479, -29747, -52405, -34444, 20644, 2732, -33896, -86636, -6051, -30538, -52576, 25306, 41962, 14249, -43496, 74560, 65278, 184096, 99876, -46896, -92559, 6797, -97111, -77408, 13247, -174, 23157, -114291, -122524, -31461, 48561, -15960, -77471, -3396, 57399, -9315, -150248, -83509, -10958, -24651, 16550, -131544, -116436, -16264, 98093, 8512, -99580, 12272, 3531, -51532, -43716, 91329, -49817, -101053, 30020, -15688, -5425, 30802, 26581, 10222, 13522, 47117, 16049, -37314, 71902, 150465, 158747, 64790, -61081, -149691, -89836, -120461, -96294, -68426, 3084, 16648, 25450, -21915, -35526, -20177]
1160b0177r1491o9073J49327K5754K9514j9127o5003n9259J47988O583m2508J28533
1148A21061j06433q8980o1008m399J39137k5689R6213M7954o6707n1446N5714
1137E5417j3388k0925J46806l5276j11493q9219p177j2874J2071q765Q9142L029
1125G348j4333p8076O2902J10672q3228p2481k1941n6891r8926N8115Q1811L862
1113a01166r969n158L1589p5027N2480M3349K097N4557J13991j27771K3547n451
1101b932j5086N0074J26846N0344j02768q0539m5307j00426J04034O0625O5071
1090A09936R6488o9706j66207o4557O1556M8518O3116o2660m2186p8739J25120
1079B0679k7642O5878o9676P522M2035o1181L6533K6101M3353m1021k4068r5464
$$ y = [-20177, -111668, -180741, -31414, -5660, 23854, 4727, -60276, -119535, 28453, 35036, -7472, 121061, 14628, -74352, -135360, -139759, -622, -26311, 69902, 117856, 51149, -297, 55417, 42029, 21104, 167910, 132634, 21141, -68078, -75255, -88129, -76058, -84823, 4319, 7348, -6985, -85061, -22159, 88513, 5285, -67196, -89137, -146028, -244954, -186839, -105028, -101166, -111135, -116293, -84704, -159731, -107251, -63902, -61805, -7248, 106743, -21028, 2519, -2932, -18018, 32056, 158902, 209246, 106478, 25939, -19368, -119794, -15760, 44865, 109936, 206424, 136718, -29489, -94046, -32490, 16028, 79144, 16484, -25702, -104441, 20679, -6963, 58915, -10761, -3239, 38796, -22385, 14148, 40249, 83602, 42581, 18513, -76951]
1067g6951L4001L5456k3278J1925n467o2230R0866N9959m0554k6984o152M4882
1055C5473k3478J0759k7166m5325k1762N7798p4200L8282K705k8420L927J24515
1043E3108L9401r2749m6663p3892N5972J28647J9074j01857Q4435o7840o5560
1032f7924N6241o1969P3131J49697r2305n1224L7882M3408l2201n742l9808k7434
1020a8248j4978O0157L7115q2234j5828R9637M3446n4587P5855r1743j08180k7699
1008i7287L9861m339P5267p89n4002j3509N3661K4896j03714M362o6989M0552
996a02030P2399L7378L3063R1805J33412r4283j55555l2574O7509p9904j37805
985a66585k3584J01502P9291J08714k9776l1339L6813q526p4864n2030J47430
$$ y = [-76951, -42950, -7494, -30772, -18847, -24314, -86544, 4322, 64281, 23727, -3257, -9409, 35473, 11995, 22754, -4412, -49737, -71499, -13701, -87901, -49619, -46914, -75334, -71407, 53108, 92509, -240, -46903, -120795, -64823, 63824, 82898, -18959, 65476, -2364, -67924, -11683, -73652, -521, 149176, 56871, 5647, 43529, 86937, 54736, 48994, 9186, -18248, -33226, 26931, 64046, -18188, -34016, 65621, 109067, 54480, 130335, 38592, -69588, -97287, -57426, -61765, 13502, 12713, -41289, -54798, -1137, 23759, -79955, -75593, -142582, -102030, -29631, 7747, 40810, 132615, 266027, 171744, 16189, -16385, 51124, -28780, -166585, -190169, -88667, -9376, 99338, 69562, 38223, 75036, 66510, -8354, -60384, 87046]
974H7046q3641j59580K5902K952K13279O6773r7299j4449n3480j1712J6244K0545
962A2580n5180M2563Q6959o4667l3186Q6042j15981L4280l9362R6266o0834Q2534
950G2014J7923j20682n0965N6053J0066J55097j11004p4521L6875L7345n4007
939b5806k7690N3254O7332m2652J5524p8603k0535J32623r3687K7363j01552J17338
927B2909l5603J1035K753J8105q1955R9587M0522m2278L8267J9752j56875j07112
915a70893O2787J48237o0508j32752o5421J58759O2822k555o7752J3211M8060
904f005J55036o4032L2155j10690k9753P6139m4071N64Q1273J3208j88846J24439
892C9417L1801M288K5254k7532m6835o8256J07142O8809K4630p3335j33554m9381
$$ y = [87046, 3405, -156175, -130273, -127321, 85958, 152731, 55432, 40983, -12497, -24209, -7965, 12580, -42600, -37, 86922, 22255, -10931, 75111, -40870, -6590, -45952, 50314, -10520, 72014, 89937, -30745, -81710, -25657, -15591, 139506, 28502, -46019, -9144, 28201, -25806, -53496, -242, 67090, 24438, 39962, -38641, -59176, 73447, -20240, 7123, -94429, 22909, -12694, -1659, 1094, 19199, -62756, 36831, 77353, 35075, 73342, 93094, -63781, -170893, -108106, 40131, -20377, -153129, -218550, -59791, 3031, 476, -67276, -54065, -6005, 149031, 84999, 117154, 6464, -23289, 52850, 8779, 9343, 90616, 103824, -85022, 39417, 71218, 75506, 100760, 73228, 26393, -41863, 65279, 134088, 158718, 85383, -48171, -97552]
880i7552L6020m9008P0584J07283j045K2464M1465j07984p8933K5179L1660J3611
$$ y = [-97552, -61532, -110540, -39956, 67327, 66282, 88746, 130211, 22227, -56706, -31527, 133, 13744]
$$ [...]
##END NTUPLES=NMR SPECTRUM
##END=
