##TITLE=1H_EC-3293(V-4)
 CDCl3
 8 sc, 
 21.4.2023
##JCAMPDX= 6.0         $$ Bruker NMR JCAMP-DX V2.0
##DATA TYPE= NMR SPECTRUM
##DATA CLASS= NTUPLES
##ORIGIN= UXNMR, Bruker Analytische Messtechnik GmbH
##OWNER= root
$$ XWIN-NMR		Version 3.5
$$ Fri Apr 21 13:55:38 2023 Russian Standard Time (UT+4h)  she@DPX200
##.OBSERVE FREQUENCY= 200.13135
##.OBSERVE NUCLEUS= ^1H
##.ACQUISITION MODE= SIMULTANEOUS
##.ACQUISITION SCHEME= undefined
##.AVERAGES= 8
##.DIGITISER RES= 18
##SPECTROMETER/DATA SYSTEM= spect
##.PULSE SEQUENCE= zg30
##.SOLVENT NAME= D2O
##.SHIFT REFERENCE= (INTERNAL, D2O, 0, 15.7337)
##AUDIT TRAIL= $$ (NUMBER, WHEN, WHO, WHERE, WHAT)
$$ ##TITLE= Audit trail, XWIN-NMR		Version 3.5
$$ ##JCAMPDX= 5.01
$$ ##ORIGIN= Bruker BioSpin GmbH
$$ ##OWNER= she
$$ F:/spectra/data/she/nmr/H-F/1/pdata/1/auditp.txt
$$ ##AUDIT TRAIL=  $$ (NUMBER, WHEN, WHO, WHERE, WHAT)
(   1,<2023-04-21 13:54:28.39 +0400>,<she>,<DPX200>,
      <created by zg, POWCHK disabled, PULCHK disabled
       configuration hash MD5:
       00 E9 B6 7A A2 85 ED C7 34 08 36 98 17 FE 4E 26
       data hash MD5: 16K
       3D ED 1A 7B DB 02 C1 7D C9 5B DB CA 42 17 C9 2A>)
(   2,<2023-04-21 13:54:32.56 +0400>,<she>,<DPX200>,
      <Start of raw data processing
       efp BC_mod = 2 LB = 0.24 FT_mod = 6 PKNL = 1 PHC0 = -19830.28 PHC1 = 7.200801 SI = 16K 
       data hash MD5: 16K
       24 0F 62 00 4B 96 61 DE E0 F5 19 63 00 7E 15 E4>)
(   3,<2023-04-21 13:54:49.67 +0400>,<she>,<DPX200>,
      <pk PHC0 = -4.513665 PHC1 = 9.6 
       data hash MD5: 16K
       B1 E6 63 C4 A2 7E FE 30 FC 43 40 B2 07 BC 83 C6>)
(   4,<2023-04-21 13:54:52.87 +0400>,<she>,<DPX200>,
      <abs ABSG = 5 
       data hash MD5: 16K
       A2 95 92 6D 52 22 34 3A 07 33 80 48 B5 0D 01 B4>)
$$ ##END=
$$ 
$$ hash MD5
$$ 0C 4C D6 14 49 EF 3D 12 26 FE 41 95 A6 7A 88 75
##$RELAX= 
##$RELAX= 
##$RELAX= 
##$RELAX= 
##$RELAX= 
##$RELAX= 
$$ Bruker specific parameters
$$ --------------------------
##$DU= <F:/spectra>
##$EXPNO= 1
##$NAME= <H-F>
##$PROCNO= 1
##$TYPE= <nmr>
##$USER= <she>
##$AMP= (0..31)
100 100 100 100 100 100 100 100 100 100 100 100 100 100 100 100 100 100 
100 100 100 100 100 100 100 100 100 100 100 100 100 100 
##$AQSEQ= 0
##$AQ_mod= 1
##$AUNM= <au_zg>
##$AUTOPOS= <>
##$BF1= 200.13
##$BF2= 200.13
##$BF3= 200.13
##$BF4= 200.13
##$BF5= 200.13
##$BF6= 200.13
##$BF7= 200.13
##$BF8= 200.13
##$BYTORDA= 1
##$CFDGTYP= 0
##$CFRGTYP= 5
##$CHEMSTR= <none>
##$CNST= (0..31)
1 1 145 1 1 1 1 1 1 1 1 1 1 1 1 1 1 1 1 1 1 1 1 1 1 1 1 1 1 1 1 1 
##$CPDPRG= <>
##$CPDPRG1= <>
##$CPDPRG2= <>
##$CPDPRG3= <>
##$CPDPRG4= <mlev>
##$CPDPRG5= <mlev>
##$CPDPRG6= <mlev>
##$CPDPRG7= <mlev>
##$CPDPRG8= <mlev>
##$CPDPRGB= <>
##$CPDPRGT= <>
##$D= (0..31)
0 1.2 0 0 0 0 0 0 0 0.06 0 0.03 0 0 0 0 0.0002 0 0 0 0 0 0 0 0 0 0 0 0 
0 0 0 
##$DATE= 1682070867
##$DBL= (0..7)
120 120 120 120 120 120 120 120 
##$DBP= (0..7)
150 150 150 150 150 150 150 150 
##$DBP07= 0
##$DBPNAM0= <>
##$DBPNAM1= <>
##$DBPNAM2= <>
##$DBPNAM3= <>
##$DBPNAM4= <>
$$ [...]
##$SUBNAM3= <"">
##$SUBNAM4= <"">
##$SUBNAM5= <"">
##$SUBNAM6= <"">
##$SUBNAM7= <"">
##$SUBNAM8= <"">
##$SUBNAM9= <"">
##$SW= 18.05172834244
##$SWIBOX= (0..15)
0 0 2 0 0 0 0 0 0 0 0 0 0 0 0 0 
##$SW_h= 3612.71676300578
##$TD= 16384
##$TD0= 1
##$TE= 0
##$TE2= 300
##$TE3= 300
##$TEG= 300
##$TL= (0..7)
0 120 120 120 120 120 120 120 
##$TP= (0..7)
150 150 150 150 150 150 150 150 
##$TP07= 0
##$TPNAME0= <>
##$TPNAME1= <>
##$TPNAME2= <>
##$TPNAME3= <>
##$TPNAME4= <>
##$TPNAME5= <>
##$TPNAME6= <>
##$TPNAME7= <>
##$TPOAL= (0..7)
0.5 0.5 0.5 0.5 0.5 0.5 0.5 0.5 
##$TPOFFS= (0..7)
0 0 0 0 0 0 0 0 
##$TUNHIN= 0
##$TUNHOUT= 0
##$TUNXOUT= 0
##$USERA1= <user>
##$USERA2= <user>
##$USERA3= <user>
##$USERA4= <user>
##$USERA5= <user>
##$V9= 5
##$VALIST= <valist>
##$VCLIST= <CCCCCCCCCCCCCCC>
##$VD= 0
##$VDLIST= <DDDDDDDDDDDDDDD>
##$VPLIST= <PPPPPPPPPPPPPPP>
##$VTLIST= <TTTTTTTTTTTTTTT>
##$WBST= 1024
##$WBSW= 4
##$XGAIN= (0..3)
0 0 0 0 
##$XL= 0
##$YL= 0
##$YMAX_a= 162155
##$YMIN_a= -222738
##$ZGOPTNS= <>
##$ZL1= 120
##$ZL2= 120
##$ZL3= 120
##$ZL4= 120
##$ABSF1= 15.72927
##$ABSF2= -2.322579
##$ABSG= 5
##$ABSL= 3
##$ALPHA= 0
##$AQORDER= 0
##$ASSFAC= 0
##$ASSFACI= 0
##$ASSFACX= 0
##$ASSWID= 0
##$AUNMP= <proc_1d>
##$AZFE= 0.1
##$AZFW= 0.1
##$BCFW= 0
##$BC_mod= 2
##$BYTORDP= 0
##$COROFFS= 0
##$CY= -3
##$DATMOD= 1
##$DC= 0
##$DFILT= <>
##$DTYPP= 0
##$F1P= 0
##$F2P= 0
##$FCOR= 1
##$FTSIZE= 16384
##$FT_mod= 6
##$GAMMA= 0
##$GB= 0
##$INTBC= 1
##$INTSCL= 3.70164e-10
##$ISEN= 128
##$LB= 0.24
##$LEV0= 0
##$LPBIN= 0
##$MAXI= 10000
##$MC2= 0
##$MEAN= 0
##$ME_mod= 0
##$MI= 1.114404
##$NCOEF= 0
##$NC_proc= -8
##$NLEV= 6
##$NOISF1= 3.799351
##$NOISF2= 2.8
##$NSP= 0
##$NTH_PI= 0
##$NZP= 0
##$OFFSET= 15.73367
##$PC= 1
##$PHC0= -19834.79
##$PHC1= 16.8008
##$PH_mod= 1
##$PKNL= yes
##$PPARMOD= 0
##$PSCAL= 0
##$PSIGN= 0
##$REVERSE= no
##$SF= 200.130007580277
##$SI= 16384
##$SIGF1= 3
##$SIGF2= 2
##$SINO= 5.538805
##$SIOLD= 16384
##$SREGLST= <1H.CDCl3>
##$SSB= 0
##$STSI= 16384
##$STSR= 0
##$SW_p= 3612.71676300578
##$SYMM= 0
##$S_DEV= 0
##$TDeff= 16384
##$TDoff= 0
##$TI= <>
##$TILT= no
##$TM1= 0
##$TM2= 0
##$TOPLEV= 0
##$USERP1= <user>
##$USERP2= <user>
##$USERP3= <user>
##$USERP4= <user>
##$USERP5= <user>
##$WDW= 1
##$XDIM= 16384
##$YMAX_p= 401932338
##$YMIN_p= -1083681
$$ End of Bruker specific parameters
$$ ---------------------------------
##NTUPLES= NMR SPECTRUM
##VAR_NAME=  FREQUENCY,     SPECTRUM/REAL,   SPECTRUM/IMAG
##SYMBOL=    X,             R,               I
##VAR_TYPE=  INDEPENDENT,   DEPENDENT,       DEPENDENT
##VAR_FORM=  AFFN,          ASDF,            ASDF
##VAR_DIM=   16384,         16384,           16384
##UNITS=     HZ,            ARBITRARY UNITS, ARBITRARY UNITS
##FACTOR=    0.220516191357247, 1,           1
##FIRST=     3148.77954333212, 0,            0
##LAST=      -463.937219673658, 0,           0
##MIN=       -463.937219673658, -1083681,    0
##MAX=       3148.77954333212, 401932338,    0
$$ Real data points
##PAGE= N=1
##DATA TABLE= (X++(R..R)), XYDATA
$$ [...]
8705 84554199 97623936 114600132 133747755 153837194 169932546 166557227 151679016
8698 151679016 134241236 113471632 93701813 78084835 67091237 58974762 52455712
8691 52455712 47288123 43605421 40784869 38820613 36764558 34720672 33741260 33049208
8683 33049208 32339690 31712148 31686582 31489735 31130787 30661882 30168911 29914664 29826985 29512568
8673 29512568 29428146 29481839 29593342 30016551 30433153 31149740 31628812 32382614 33496306 34035101
8663 34035101 34994348 36793559 38507959 39598955 40653198 42127533 43386868 44314283
8655 44314283 44876692 45135841 45321786 45161158 44096464 42657497 41331716 39875928 38727192
8646 38727192 37564389 36203187 35586987 34622701 33547586 33355160 33433598 33144988 32970806
8637 32970806 33287024 33595425 33852272 34690561 35894890 36930121 38116012 39799575 41334825
8628 41334825 42415574 44240342 46109407 47712664 49093992 49739787 49764828 49844467 49019943
8619 49019943 47769268 45968201 43922693 41570295 39524720 37898271 35857873 33786758
8611 33786758 31741036 30307849 28895895 27671157 26777725 26289844 25212492 24703476 24549184
8602 24549184 24163875 23877105 23765428 23922923 24262258 24307391 24141198 24804728 25493127 25836537
8592 25836537 25933245 25931203 25940678 25945896 25795125 25553754 24791518 23536401 23011613 22771129
8582 22771129 21690931 20485575 19156250 18357979 17768660 16916535 16215337 15615485 15158818
8573 15158818 14827400 14240415 13751102 13057578 12352818 12623782 12557973 12335590 11954808 12053212
8563 12053212 11562501 11755810 11600840 10870802 10601558 10338199 10422484 10152320 9708794 9795794
8553 9795794 9912351 9403544 9315111 9419119 9534668 9208637 9084536 8974973 8931974 8902870
8543 8902870 8573474 8478247 8490278 8535960 8047954 7824835 7649498 7755451 7535323 7353908
8533 7353908 7311173 7673870 7770070 7507679 7095160 7266950 7459112 7533240 7566870 7602312
8523 7602312 7258555 6820959 6407639 6650624 6735033 6363936 6226705 6184408 5859177 6056784
8513 6056784 6031957 5962541 6088464 6186961 6004050 5439002 5247311 5498418 5195012 5187839
8503 5187839 5015952 5000616 5090751 4747355 4808027 5076589 5245776 4795253 4694226 4640107
8493 4640107 4628556 4562286 4652915 4149612 4059050 3833222 4013229 3979924 3752474 3721134 3730330
8482 3730330 3659689 3963539 4018827 4561118 4094445 3855640 3403420 3632099 3967521 3811037
8472 3811037 3777017 3789014 3643032 3646974 3497645 3743410 3538071 3431302 3614089 3223384
8462 3223384 3433806 3638635 3460967 3775079 3519476 3276353 3351145 2979215 3094834 2877362
8452 2877362 2702743 2881812 3156430 3088283 2760269 2948869 2785558 2461203 2651473 2658023
8442 2658023 2812385 2966157 2827097 2862431 2741364 2769273 2361437 2215144 2366231 2479566
8432 2479566 2365938 2557221 2806599 2585466 2507807 2503046 2338352 2126169 2711450 2556978
8422 2556978 2379628 2210953 2317771 2205272 2120204 2141434 1876520 2282396 2101874 2031821
8412 2031821 2419220 2226404 2354254 2558658 2677074 1982630 1918584 2340384 2127487 2072299
8402 2072299 2246559 2474016 2577785 2355955 2316902 2233490 2175329 1850765 2137799 2196246
8392 2196246 2178954 2128644 1953356 1998969 1971436 1693377 1858737 1965721 2258003 1827262
8382 1827262 1879853 1847371 2017686 1958844 1906668 2031981 1751547 1420833 1462055 1565135
8372 1565135 1463384 1512734 1704796 1576789 1700238 1665720 1524227 1702642 1619486 1676965
8362 1676965 2013162 2440936 2476216 2295798 1901864 1963338 1775108 1704868 1697117 1953765
8352 1953765 1517375 1303544 1305373 1580857 1837078 1498317 1196591 1503843 1720192 1630192
8342 1630192 1823100 1644060 1483495 1355425 1270830 1192817 797688 1506779 1276191 1092526
8332 1092526 1141736 864144 1274405 1585559 1180077 985490 989707 1512214 1433327 931161
8322 931161 809992 989367 1451787 1684241 1608015 1240410 1415775 1669129 1168558 1110421
8312 1110421 1104801 1045050 1167311 1323428 1280221 947909 933089 1341430 1260739 1132161 1414299
8301 1414299 1479162 1474553 1311211 1355037 1471434 1505849 1100355 957037 1150577 904228
8291 904228 477893 524316 749421 955058 841315 1103315 1038245 883742 1118760 1412325
8281 1412325 1214421 1085711 832677 957745 831416 883474 989146 1260540 1272789 1002978
8271 1002978 962790 750454 847325 896205 794397 767276 852811 961137 643520 587528 823527
8260 823527 1005917 987813 1189449 766347 398863 662251 1202645 1386895 1366921 1390927
8250 1390927 1245011 1351987 1054649 1395613 1444642 1091003 779964 1031537 913364 730020
8240 730020 776530 917620 655110 691088 819100 700975 721042 1004992 707398 584775
8230 584775 838428 914115 1491600 1793892 1668342 1494952 1380222 1595586 1047861 1358875
8220 1358875 1342032 1742618 1675704 1600043 1675567 1134657 998881 983494 640209 739065 407514
8209 407514 493536 459281 900030 834429 470513 416562 676767 910685 1231315 828952
8199 828952 824969 789790 882004 809289 751685 954512 2952032 7387092 2460517 607311
8189 607311 600671 -85865 -252135 -186582 191669 581121 354438 114476 357981 454120
8179 454120 493810 263817 304996 83812 103475 287628 -16611 -10165 112602 165098 550032
8168 550032 608313 612285 223089 -16740 98872 188149 23743 -139071 -38436 98595
8158 98595 235869 353722 -15028 263794 450103 731683 692448 666236 198470 361525
8148 361525 -32219 53035 -162772 448420 361583 74058 314063 289601 -31610 -270365
8138 -270365 229625 460059 173837 1646 37499 -20546 -22100 -63799 249110 394980 261316
8127 261316 190523 -56216 157110 147701 185286 -64637 22577 52057 -163069 -208138 51763
8116 51763 364553 -4849 -324898 -127607 -47549 6266 -40785 -595353 104326 462475
8106 462475 147220 -17876 77389 -485974 -452068 -108145 -104161 -155549 -256125 -243083 75656
8095 75656 -387316 -484239 -209297 52981 343718 590240 634494 609021 199133 -126965
8085 -126965 -391955 -152693 -189556 -64195 32362 -159688 -290413 22904 -69211 -38129
8075 -38129 118062 25078 9873 -207029 112112 93729 221186 -150096 157096 401729
8065 401729 -84419 -74784 -181256 -415010 -364033 -379351 -335689 -238970 -152568 -14569 -47097
8054 -47097 186519 451301 170522 182466 -200414 -319687 -412328 -596014 -129559 40480
8044 40480 53610 114728 22547 54475 -85167 -198876 -247121 142135 282616 530239 31636
8033 31636 -251447 -548248 -314969 -84724 -304717 57160 -171767 42673 -141419 -50221
8023 -50221 5914 -43264 -192644 -333032 -448612 -409719 -469173 -500971 -437503 -391772 -80246
8012 -80246 -246883 -272030 -82811 355476 -117855 -156512 -301006 -405095 -367151 -338462 -186529
8001 -186529 -211817 -446487 -437349 -259235 -8686 266403 311144 242900 330995 467081 175669
7990 175669 -65543 -174385 -466512 -434198 169060 -98526 -201485 -100602 -51813 177508
7980 177508 353234 202870 136560 -376112 -122305 -380197 -377414 -84860 87819 51262
7970 51262 -336865 -224977 -138114 24404 -134607 -215851 -161669 -162970 -210417 29452 -47790
7959 -47790 -162390 -365675 -372331 -350870 -328556 -169292 380545 -98667 -204891 64622 -499262
7948 -499262 -515976 -177939 -279635 -415072 -332159 -224663 199259 -109721 -326256 -219209
7938 -219209 -36475 -345058 -208469 -159647 -231948 -175208 -309561 -630466 -227420 -259289
7928 -259289 157774 21004 -400623 -361724 -384491 -271509 -396947 -637624 -304383 -40775
7918 -40775 -90575 -174243 -301238 -325600 -777730 -543414 -475419 62749 123615 83934 2480
7907 2480 -35223 -277136 -624352 -683394 -403003 -264795 -147721 -109445 -310121 -225371 -545525
7896 -545525 -993761 -796197 -826088 -769648 -665109 -238530 -186043 -188841 -170254 -116013 -185413
7885 -185413 -233240 -240286 77296 145683 -146301 -294554 -351845 -136762 -456984 -493867 -337863
7874 -337863 -342890 -103580 -186396 -349819 -277250 -355105 -483439 -312637 -140578 -217913 -55826
7863 -55826 -397785 -502817 -303485 -189241 195325 39401 -690133 -493480 -146259 -70298
7853 -70298 316185 361349 67727 -18295 327591 33206 -264512 30721 -145256 -519940
7843 -519940 -525036 -212795 -475411 -606526 -473233 -395759 -253436 83246 87706 -223040 -496358
7832 -496358 176099 -26393 -225836 -269761 -439409 -475328 -563572 -246489 -307969 -393130 -273528
7821 -273528 -580073 -479113 -569058 -555058 -166563 -64932 -326613 -392258 100511 -384085
7811 -384085 -646615 -285317 -482434 -560253 -497960 -428043 -344868 47320 -241337 -567225
7801 -567225 -1083681 -190854 236211 -684993 -457604 -418631 -247555 -41667 -29943 -254331
7791 -254331 -162725 -372638 6122 -271083 -97774 -83016 -121077 -127346 -222891 -115714 185044
7780 185044 5424 -57853 83009 133633 -15918 71885 -69641 -138636 4663 -68592 -234238
7769 -234238 -355462 -409496 -487772 -346684 -405276 -544744 -715500 -537889 -562961 -450474
7759 -450474 -622615 -987841 -633230 -245657 -352744 -416345 -397298 58697 -470729 -445994
7749 -445994 -374824 -361815 36685 189011 266010 249587 -272204 -583473 -855061 -622533
7739 -622533 124894 -130994 -55701 -414946 -305589 -364192 -76193 205080 15465 -117776
7729 -117776 237179 8636 -230469 55442 -9662 -143601 85117 -40401 -334224 -71896
7719 -71896 -44825 16055 3165 79007 -6512 186796 272442 366081 316624 108246 33180
7708 33180 -114401 -53986 -123430 33013 223967 -53641 203972 201433 225728 -189318 -385464
7697 -385464 231579 242216 272361 304393 74097 -716394 -543646 -286918 -350252 -460879
7687 -460879 -395390 -123780 15546 381241 -372092 -430047 -368077 -362842 -349899 -235084 -168605
7676 -168605 -328558 108819 199673 103860 127005 176959 -14447 -123237 -106651 -48307 -33659
7665 -33659 9607 198077 74108 108148 -158878 17554 -357029 -559847 -430403 -273274
7655 -273274 -303372 109880 69847 -92081 -36529 -227579 -166409 -71798 56939 139814 93189
7644 93189 29842 8706 -282529 -474990 -49978 -119849 -247324 -110219 -119123 114533 -221389
7633 -221389 -287260 -295694 -56238 -144657 -80035 -368691 -6809 -111864 -200446 -380311 -458012
7622 -458012 -87232 -174814 -399569 -124460 -16834 -441893 -94481 274508 277051 167716
7612 167716 12861 -135807 -43418 -132320 -27170 180394 623211 132692 -20585 -93314
7602 -93314 -234024 -138746 -225999 121838 301368 302829 115992 -82005 -10837 -53317 -104424
7591 -104424 260087 -21147 -378514 -125063 -236966 -264128 -250013 -451178 152313 255167
7581 255167 465732 19661 -448111 -402147 -250427 -296109 -81098 -92587 189674 -86267
7571 -86267 -67584 374624 33912 230739 -30483 -275705 -178907 86365 185562 207483 -239172
7560 -239172 -407993 -206666 -272680 -173690 186878 261625 132408 157607 237309 207270 61477
7549 61477 -64675 40928 -46337 194214 157960 -99892 -5092 218759 -161620 -163514 -61713
7538 -61713 -87243 133233 -161580 -214136 3011 -110746 -22162 -141628 -298270 -484942
7528 -484942 -345275 254106 -80949 -463553 -396225 -2314 93819 150712 252027 318533
7518 318533 320801 364512 335527 58175 115856 206675 62517 -205053 18170 189295 -114461
7507 -114461 -344009 -92016 -38169 213856 27100 -108569 -56264 -112308 -11056 -396151
7497 -396151 -224263 6846 379246 130065 41725 -35509 174528 229423 72461 71623 61139
7486 61139 223371 184442 249387 131520 28031 223025 -21519 -213588 103780 479687
7476 479687 382885 245098 602340 706778 676910 522228 691813 161784 137808 24865
7466 24865 -20218 -92431 47179 333455 -94392 -15532 30190 -146458 -103000 -187763 -280639
7455 -280639 -80914 -17226 160574 235406 513879 382518 39687 476617 425196 99525
7445 99525 67716 183071 11204 -578642 -413734 -120321 -110514 -91762 -237042 -652112 -419370
7434 -419370 -64887 36382 -356826 49608 638359 472876 -215833 -59959 256530 467477
7424 467477 575745 204655 201644 336460 491760 438848 573989 175997 290312 231596
7414 231596 -53459 -74273 389581 428006 415353 328572 420570 458242 422933 346241 496877
7403 496877 609851 302761 119466 179316 260230 400299 339787 220107 224927 721844 906673
7392 906673 800648 293422 415552 690822 250734 494585 520678 566585 828988 332133
7382 332133 295602 470608 420302 507507 598787 231435 387280 727120 856067 629400
7372 629400 283190 398819 423175 708053 264551 624710 544274 658371 915422 882691
7362 882691 884786 822805 516818 506644 945635 1010242 843556 798488 891490 989529 960347
7351 960347 1006662 718993 1125725 922867 491960 360885 488327 953316 919097 1118911
7341 1118911 994410 828158 1042445 1027487 1170707 1473535 1308691 1032163 1008607 1224733
7331 1224733 1381987 939399 818574 602897 812094 935688 683664 902794 1274634 1611569
7321 1611569 1344077 1277742 1597263 1196588 1330311 1469772 1410852 1330471 1804322 1664660
7311 1664660 1381785 1626172 1793830 1689987 1672562 1360478 1741783 1863932 1448302 1673666
7301 1673666 1473374 1630817 1137062 832728 1153770 1500782 1864361 2023744 2156051 2545790
7291 2545790 2089420 1957010 1603398 1751389 1628968 1862088 2472367 2306409 2071030 2107452
7281 2107452 2337696 2616264 2427347 2257938 2248545 2451396 2657929 3054760 3108324 3344650
7271 3344650 3095877 2994700 2859386 2971872 3190327 3241500 3317483 3411822 3612087 3695800
7261 3695800 3502697 3763423 3966433 3732243 3836027 4139513 4148830 4218001 4371463 4173262
7251 4173262 4286831 4391044 4464992 4498939 4896943 4796749 4788479 5141997 5361603 5534330
7241 5534330 5427779 5620862 5998840 6201450 6291223 6456984 6551562 6547856 6787194 6968385
7231 6968385 7470963 7456702 7416779 7868654 7855013 7784609 7878618 7593556 7421241 7660173
7221 7660173 7367368 7144634 7395924 7267385 6812461 6232447 6632973 6489759 6349198 6442548
7211 6442548 6353887 6199935 5825472 5574828 5383366 5392876 5350723 5195830 4907223 4731883
7201 4731883 4995886 4988510 4677884 4748917 4821754 4415377 4681570 4657554 4686173 4694969 4461389
7190 4461389 4699730 4650367 4517038 4217568 4309324 4698797 4388155 4449146 4562198 4528935
7180 4528935 4677014 4716887 4665799 4618008 4710787 4970991 4789927 4651384 4316761 4909398
7170 4909398 4918656 4945727 5208921 5069972 5238489 5316282 5445750 5427273 5336411 5291649 5730570
7159 5730570 5835788 5953777 5784111 5819127 5752720 6059157 5841319 5689820 5596344 5936392
7149 5936392 6164143 6119119 6277466 6596473 6697555 6646969 6620479 7075339 7217049 6878513
7139 6878513 6988641 7174197 7510693 8033575 8042960 7910280 7989622 8075014 8493021 8822059
7129 8822059 8501527 8150928 8697711 9052040 9558262 9737123 9843353 10177972 10315172 10271519
7119 10271519 10754276 10919551 11090617 11451187 11849829 12061349 12443949 12634433 12470091
7110 12470091 13182969 13898717 14046079 14251541 15030898 15691436 16115476 16279003 16628054
7101 16628054 16907968 17373068 17671686 17840484 18338492 18863140 19432593 20389218 20853984
7092 20853984 21509078 22460251 22594426 23306228 24018126 24752160 25000908 25182792 26282034
7083 26282034 27058655 27919158 28189625 28975079 29558824 30003435 30347250 30733408 31389598
7074 31389598 31602657 31632205 31987792 32412000 32355564 32016191 32118090 31989061 31506298 31595539
7064 31595539 31371635 30889726 30530925 29881472 29252969 28854028 28453933 28274996 27673003
7055 27673003 26909676 26134822 25620460 25161040 24601719 23840323 22438361 21698198 21286308
7046 21286308 21054466 20607902 19388231 19224703 19084015 18611640 17789886 17241594 16528056
7037 16528056 16164922 16112293 15399299 14915864 14675747 14398979 13459765 13012804 12929200 12454827
7027 12454827 12564844 12138182 11995804 11527284 11150997 10917879 10642981 10299920 9878346
7018 9878346 9605655 9359120 9203055 9171132 9232385 8831040 8941916 8969136 8474990 8141382
7008 8141382 7419676 7625774 7863771 7723573 7716085 7662121 7584269 7186618 6695067 6865803
6998 6865803 7186775 7076755 6883273 6926595 6847029 6414126 6503413 6382348 6111680 5910113
6988 5910113 6019246 6215152 6100640 6223016 6610383 5659357 5693871 6115469 6151108 6117608
6978 6117608 5697183 5233910 5259547 5118064 4952709 4869381 4979581 5189287 4915956 4864347
6968 4864347 4864930 4628446 4722322 4459895 4318917 4413043 4632728 4508452 4579156 4531034 4226027
6957 4226027 4176411 4060780 3895106 4012926 4071205 3632800 3486337 3906920 3732427 3526590
6947 3526590 3639984 3049879 2564048 2529287 2621050 2740986 3300183 3274822 3199851 2570903
6937 2570903 2405575 2855815 2642494 2458919 2530793 2409127 2634727 2740333 2323235 2212613
6927 2212613 2368553 2419133 2391987 2243140 2317720 2192594 2496001 2471663 2517808 2260520
6917 2260520 2275169 2507580 2193196 2260431 2144274 1826634 1684542 1779204 1787004 1695069 1595786
6906 1595786 1390553 1227167 1719515 1605303 1601215 1477909 1351862 1609673 1331583 1356012
6896 1356012 1394325 1483113 1054296 877147 878926 1005641 1403982 1364483 1381934 1322124 931678
6885 931678 1224360 1344750 1267111 1324042 1125452 1016283 1139804 892996 913668 760699
6875 760699 685811 839986 724563 1254257 1161198 1144816 1437759 1273919 1176993 1309165
6865 1309165 844629 415881 520437 985202 665637 620518 951481 855859 989521 880945
6855 880945 764043 1120641 1141058 932606 558057 979799 713398 900936 845159 673628
6845 673628 865733 1201429 982599 912287 538935 -102025 91864 681339 695077 868948
6835 868948 549621 337428 572254 472285 848593 693363 819320 916594 774247 557636
6825 557636 575000 801708 674385 728181 768972 332314 537945 644273 661382 642422 852541
6814 852541 417559 777566 976663 464456 507260 675872 586315 810558 707895 572134
6804 572134 789502 1003611 726400 896724 993303 764408 786986 766815 648130 541652
6794 541652 827828 915939 835005 1172366 1135568 908167 529477 885022 961969 750821
6784 750821 824320 984878 812674 381764 268012 213336 126862 569284 541398 547371 740465
6773 740465 444614 315624 333694 336825 729280 908877 846458 632748 457984 653774
6763 653774 750839 617147 657718 645382 716959 588781 352069 712179 475789 345993
6753 345993 388103 192402 447722 890361 569689 342486 283124 173149 -25478 25587
6743 25587 265707 730017 608791 327645 163545 354359 606145 366528 155154 50864
6733 50864 68031 197882 350526 552645 445963 70084 364233 653217 508052 673297
6723 673297 160300 144033 707818 799151 1173845 955964 633359 944938 756144 986136
6713 986136 909787 982155 1074584 962933 1196471 1077740 488314 636822 897581 1348496
6703 1348496 994241 630542 688885 930056 1070104 826860 839598 746571 436119 728773
6693 728773 938901 339299 2817 288085 418363 590881 241959 489151 548495 451349
6683 451349 552295 599988 114149 178091 358258 -1189 378994 385980 656443 481854
6673 481854 157468 417015 388511 109912 -176286 -123632 3935 -302768 170935 509641
6663 509641 594089 259164 -29503 237122 289180 336679 200905 83953 168482 338177
6653 338177 593919 34662 403831 178479 217064 425988 519077 203911 -125123 -57846
6643 -57846 345585 192542 461953 512865 180509 282224 252247 81253 255414 202413
6633 202413 206095 254181 253671 472674 217895 30477 328530 250283 202131 496842 72748
6622 72748 193400 165496 241175 416925 7760 -133766 33066 -106019 193686 132992
6612 132992 -240927 -48373 -101071 -638806 -601825 -209362 -109081 -143407 -354555 -174928
6602 -174928 -409553 -230223 176641 32964 -586825 -643322 -15252 328962 124328 -26265
6592 -26265 418637 345360 406656 150168 -117080 -116816 -56202 -194726 -401949 -131576 15837
6581 15837 -9226 54355 89467 42246 -169111 -276830 -59097 -36622 -122952 28699 -365815
6570 -365815 -658427 -131722 327548 202813 -306325 -603353 -265706 -23310 126589 171890
6560 171890 -117574 -459867 -904661 -200871 263399 248144 64713 -132684 -198606 -338596
6550 -338596 -417034 -511721 -69501 174433 274145 -95722 -354869 -55582 -59362 95553 81987
6539 81987 -260557 -93398 -242634 -166097 236801 244182 76112 292849 100141 -19347
6529 -19347 -61864 -96291 98879 -28539 -168780 -571548 -490596 -211820 -258057 -176226 -367302
6518 -367302 -88563 -517752 -372933 162803 -157934 -380300 -16883 -256797 -493580 -288604
6508 -288604 76405 67725 62674 -125405 -121770 -323597 -349948 -357821 -474806 -386990 -387321 53204
6496 53204 -21817 -409901 -171877 428308 624975 523249 -104595 133258 163574 327042
6486 327042 414424 -120558 -573886 -243524 -81311 -272960 -228971 292778 545179 378737
6476 378737 145499 62088 -106953 -643005 -498670 -488054 -91563 390730 60697 159797
6466 159797 391250 508166 266670 567215 221822 -286007 -734374 -388336 92318 207496
6456 207496 392146 224211 391993 388745 236306 76207 628424 208243 289680 -101722
6446 -101722 -131911 -118252 -347149 -115763 45290 -89299 -221614 75007 -177190 -7216
6436 -7216 60772 59633 73227 40491 128938 -28943 40025 55449 34331 171325 120683 355165
6424 355165 304556 -2867 -489296 -353290 -195031 25046 -40014 -184670 -146515 -99992
6414 -99992 302800 257698 227824 66333 -131496 -73691 -1172 -295276 -381550 -397309 -265225
6403 -265225 -400659 -486731 -260509 -423327 118575 252520 47326 245845 124077 6197
6393 6197 86959 -428959 -194880 167874 153634 -102120 174322 82110 48774 -82462 -193815
6382 -193815 -430460 -791121 -156008 208823 -110237 -75136 -137833 223403 495179 387358
6372 387358 -23255 166280 221177 -109692 300552 -12159 25736 -155087 -244152 -188649
6362 -188649 -225637 -440821 -234101 -189556 -202691 99530 208387 124515 -328591 -416079 11309
6351 11309 -118626 -145845 119582 79219 -323255 -54690 44077 -187199 -40067 -2611 61265
6340 61265 36053 -109541 -189219 -152188 170348 198852 280391 -72875 -124823 -526651 -582355
6329 -582355 -209161 -344318 -378173 -256821 15217 269535 73197 -299630 -535937 -557360
6319 -557360 66946 -309871 -541553 -84369 -120000 29905 13701 -213702 177109 -32005
6309 -32005 -153033 -376986 -759881 -529993 -45227 -205800 -405699 -496198 -470613 -222761
6299 -222761 -149178 -136104 39333 -208276 -379827 -63514 -7922 -404 -100860 148964 379535
6288 379535 287492 46456 66247 50625 172188 -316520 -505208 -239297 -368815 -164566
6278 -164566 93785 -2808 -48698 112183 98749 -235404 125301 165638 94711 244343 -346108
6267 -346108 -285249 -421053 -95816 347621 13306 -273573 -588987 -521163 -42287 417493
6257 417493 -4171 -21509 485598 145412 316388 354425 -78224 149076 9502 -289678
6247 -289678 9129 344438 -25808 -401993 -179671 -187361 -274389 387092 1752 -356332
6237 -356332 -447751 39015 91789 -22830 -106511 -582096 -484470 -184906 -6010 181423
6227 181423 -41045 -153906 -84641 -529615 -679686 -545384 -350027 106853 -125250 -102116
6217 -102116 -251886 -80549 330544 -112000 -234226 -27504 196137 -126623 59765 -16653
6207 -16653 190812 -326487 241032 240356 437257 219704 114940 359659 364719 233869 -186932
6196 -186932 -433910 -46561 30887 -6728 42482 -35932 -113406 -329766 -252180 -150789 53634
6185 53634 -43678 86322 140959 535323 214890 67388 -335247 -420925 -389101 -775949 -679420
6174 -679420 -252313 -415836 -239643 3552 33438 -19717 -159984 -254232 -380757 -287022
6164 -287022 -411312 287174 340095 14710 -100517 -167278 -17554 161889 -81923 -312552
6154 -312552 -235767 -85469 133751 145744 -61387 427866 55789 -596902 -1029740 -1006702
6144 -1006702 195043 -27884 -42689 27142 24577 -127334 -223314 -128016 -47276 -257629 -234916
6133 -234916 143081 53374 -67615 343839 179238 -205538 -128831 -144678 -109688 -362035
6123 -362035 -53248 249153 396121 306934 34951 -491963 -531230 -135992 -86000 164974
6113 164974 -55327 -234331 100423 147579 -265122 -611764 -355469 74043 98285 -239097
6103 -239097 -278222 -313973 -287858 -481286 -482883 -405856 -417548 -465755 -402678 -377200 -111471
6092 -111471 -231816 -115485 -100537 -453776 -268055 126085 97322 -131478 -164471 -443190
6082 -443190 89708 119807 66289 292909 62039 -437753 -294540 -267884 13084 -522578
6072 -522578 -631459 -16279 -18947 -180487 -39131 -168843 -173134 -182101 -214891 -4704 -286756
6061 -286756 -128847 -31733 -39037 182096 -96157 -185424 -258187 -336223 -268115 75483 110018
6050 110018 31299 30597 -49364 -191751 96584 193970 267343 147893 -374214 -43440 122313
6039 122313 226036 213567 -91334 -167022 -117546 95847 136327 -232722 171198 297510
6029 297510 -168277 -53055 229273 513138 264515 338839 251496 -117362 -166240 -310104
6019 -310104 -244497 -144119 -183155 -17904 308505 -162630 -292359 -223521 -88306 -129245
6009 -129245 -219906 189930 443789 29551 455456 681180 545742 204156 -278526 -150422
5999 -150422 331282 724404 690570 113359 -23490 236380 -59228 -160042 -397584 221478
5989 221478 301080 90481 45764 -43755 -218107 -8204 86136 -236307 -185885 7198 127462
5978 127462 361298 358787 143881 345701 235646 108757 -195983 122088 -60685 -475106
5968 -475106 58481 500779 391479 176525 41117 -168490 -171998 290206 464535 250041
5958 250041 -83137 23647 255028 37577 59862 229017 362665 386691 376714 -67072
5948 -67072 -148571 544269 407625 149676 -75952 66624 173358 140202 291798 450183
5938 450183 391972 224642 69251 400416 285915 442170 295384 231145 627045 805315
5928 805315 653883 632822 411424 241767 245086 406428 708460 956413 769571 462186
5918 462186 174715 428975 452712 218754 -238104 -210879 127171 192093 318150 525950
5908 525950 570021 340776 337866 331967 632102 281882 352487 395782 386413 359520 261661 428125
5896 428125 655295 988452 757452 396108 522331 521131 515234 470730 368228 187560 33835
5885 33835 672 527973 611019 419881 363673 556205 472786 877995 780444 762900 775480
5874 775480 726551 350334 259102 529733 568669 561613 1011320 985394 612033 555782 594423
5863 594423 398900 421043 493057 333783 128261 53922 533967 718951 371331 726703
5853 726703 909807 615195 404668 775135 456315 774924 591205 223269 568268 601769
5843 601769 629998 682036 935203 861665 502723 624110 433439 314078 719347 659988
5833 659988 341682 452882 449203 537786 735537 436627 552151 664956 1015326 1043482
5823 1043482 920598 688450 587450 691060 844182 633032 460176 725783 580103 356213
5813 356213 506456 798666 598096 778793 1304973 1020742 937690 627823 712059 508497
5803 508497 1094406 1194345 1032155 1162679 795271 860237 688211 918305 695455 518497
5793 518497 530200 551917 752986 623559 490898 857972 943090 786246 865773 773682 800550
5782 800550 723250 929620 901359 648571 736043 942901 716676 1209750 624678 665780
5772 665780 296827 357103 555087 627165 416181 970621 955854 394097 726321 698074
5762 698074 785875 872972 850007 1100784 915617 846239 1020957 802713 877864 882644 946625
5751 946625 1062011 746335 1031611 1321071 887227 797469 747816 997089 1162277 1040387
5741 1040387 1259849 1437587 1341282 1263028 874393 933412 1100100 1117098 1274546 1076948
5731 1076948 1148768 1192483 742210 80002 724360 995906 835278 896744 745773 962210
5721 962210 1102632 1570859 1172979 1139657 1620527 1904898 1443649 1675999 1671051 1613562
5711 1613562 1387513 1528132 1356319 1504979 1496541 1360514 1152216 1340066 1250096 1431199
5701 1431199 1592893 953648 959872 1624909 1769566 1805444 1829318 1330220 1441224 1580288
5691 1580288 1807021 1767152 2099230 1999661 1881461 2132091 1837844 1664860 1527729 1917184
5681 1917184 1934894 2193152 2430486 2302723 2117230 2445855 2429593 2592493 2777184 2450032
5671 2450032 2722275 2564295 2397372 2089603 1975043 2177057 2339378 2709795 2509811 2667324
5661 2667324 2747484 2860124 2719660 2938873 2865890 3047729 3247852 3170005 3250606 3166045
5651 3166045 3420706 3482278 3557519 3700985 3646840 3906368 4132385 3964723 4022999 3837524
5641 3837524 4084167 4043399 3981282 4058826 4626365 4502764 4584730 4783215 5148071 5141489 5245951
5630 5245951 5113452 5399880 5739537 5654226 5999162 6254858 6351194 6575666 6328269 6587468
5620 6587468 7181071 7538328 7706135 7864426 7719649 7920643 8503212 8959806 9293534 9843575
5610 9843575 9896215 10036941 10419243 10661838 11122493 11410062 11660995 11960784 13012884 13500017
5600 13500017 13842707 13950663 14338025 14380667 14511806 15115956 15738400 15939714 16244952 16516572
5590 16516572 16606691 16623632 17175956 17806853 18114940 18258282 18403704 18986350 19006716 19173656
5580 19173656 19239173 19079268 19538180 19908890 20199140 20092599 20263522 20329442 20065738 20143310
5570 20143310 19738360 19867582 19593861 19828006 20051616 20074383 20092091 19601034 18591365 18453332
5560 18453332 18715798 18787715 18556290 18347913 17955700 17502506 16744557 16543878 16794096 16418471
5550 16418471 16269447 15728963 15292033 15008333 14878831 14348141 14171525 13758827 12963194
5541 12963194 12946610 12669560 12230593 12001055 11768094 11247028 10589279 10459973 9940524 9523422
5531 9523422 9268634 9038437 8856665 8976255 8730715 8112544 7802991 7655149 7065348 7155929
5521 7155929 6890212 6730008 6937687 6599833 6022061 6339134 6172235 5719237 5645884 5531249
5511 5531249 5302756 4952582 5438805 5363332 5014911 5032610 4704463 4489402 4752975 4711453
5501 4711453 4477674 4086608 4212349 4084333 3908967 3666784 3721526 4007816 3760308 3789672
5491 3789672 4135939 4159551 3818882 4137286 4063164 3902659 3934033 3865813 3597765 3577847
5481 3577847 3755465 3538951 3358185 3041412 3317258 3472418 3301970 3596709 3380302 2974936
5471 2974936 3023653 2821592 3321021 3325403 3337501 3459315 2914494 3152345 3509702 3185992
5461 3185992 3222750 3336895 3465160 3869748 3858269 3306744 3152778 3403946 3240497 3112544
5451 3112544 3010151 3374307 3178517 3262290 2974825 2769656 2523118 2901296 3072334 3198635
5441 3198635 3285426 3198709 3322453 3234761 3625162 3625510 3518985 3461860 3525420 3474216 3028754
5430 3028754 3182057 3535867 3072692 3313908 3250695 3391322 3048890 3010752 2687907 2761206
5420 2761206 2898639 2836794 2826570 2874293 3112158 3026211 2765658 2606937 2716158 2854953
5410 2854953 2735572 2332561 2882653 3162843 2795258 3092818 3345190 2756071 2478552 2606042
5400 2606042 2471997 2585773 2622589 2555237 2485430 2757543 2930187 2957695 2805837 2582062
5390 2582062 2364559 2516644 2583879 2313547 2306926 2223663 2326708 2330678 2286708 2471065 2384485
5379 2384485 2575168 2607208 2487775 1986827 2071544 2161359 2176470 2111775 2227963 2515671
5369 2515671 2359811 2225752 2031037 2249055 2250998 2156118 2130455 2349804 2127586 2506802
5359 2506802 2373113 2270759 2079201 2386522 2222293 2145307 2596197 2575246 2597195 2454023
5349 2454023 2221436 2294914 2316068 2205579 2017048 2091570 1783345 2012908 2150489 2235572
5339 2235572 2484914 2372031 2098120 2416303 2472777 2615568 2369969 2338940 2330365 2094717
5329 2094717 2178329 2330066 2002122 1813683 2018207 1948229 2463846 2258749 2140246 1857440
5319 1857440 1903401 1728822 1514466 1883282 2241984 2391590 2453771 2697109 2405530 2517130
5309 2517130 2423297 1947660 2040043 1903526 2353583 2109596 2248003 2207848 1524671 1308065
5299 1308065 1914239 1926151 1733859 1978799 1938180 1504016 1494584 1433285 1826901 1909357 2065070
5288 2065070 2288391 2162765 2119277 1941677 1969095 1878762 2041360 2087573 1922609 1573509
5278 1573509 1770610 1744691 1605314 1944399 2155031 2090028 1901126 1957849 1682456 1644670
5268 1644670 1994851 1749853 1989044 2043844 1781939 1657673 1771822 1826385 2001613 2254147
5258 2254147 2390426 2226362 2041670 1732666 1655076 1727022 1771370 1904341 2068444 2098441
5248 2098441 1857001 2051348 2204841 2063878 2131399 1969943 1723469 1566133 1919818 1954298
5238 1954298 1547619 1203766 1359493 1570113 1168122 1345231 1603472 1660728 1158594 1576432
5228 1576432 1446752 1314472 1294445 1209266 1073138 1483714 1765568 1690411 1521087 1472232
5218 1472232 1382360 1318216 1545253 1294376 979115 997459 1445619 1589421 1233997 1119501
5208 1119501 1182373 1414743 1552074 1530444 1330091 1478006 1304623 1185700 1574723 1402861
5198 1402861 1140088 853778 1493022 1474695 978917 773650 1079398 762059 852557 879208
5188 879208 941501 925147 963641 1112372 1372251 1643766 1117539 1016682 1054934 1018488 965784
5177 965784 734943 725125 977231 1537448 1305999 1228694 1418843 1610210 1579024 2107190
5167 2107190 2550702 2284611 1654357 1359079 1282235 1102459 1106999 1524568 1285777 1347699
5157 1347699 2169997 1985457 2018780 1695273 2016093 1787472 2064738 2367455 2695032 2412191
5147 2412191 2680938 2837577 2982129 3339453 2895583 3182456 3415524 3647633 3272452 3310112
5137 3310112 3807081 3993710 4250982 4956389 4782052 4672285 4612212 4441835 4470682 4672458
5127 4672458 4552419 3936263 4130435 4364824 4099713 3922183 4004391 4657001 4903299 4914509
5117 4914509 4755253 4837598 5026265 4439361 4758066 5014104 4917853 4727044 4585653 4730454
5107 4730454 4564617 4535117 4325840 4084578 4207762 4377364 4662649 4354222 4646535 4852083
5097 4852083 4550218 4694015 5015725 5142372 5155003 5038524 4984014 5045078 4668176 4547889
5087 4547889 4675246 4888307 4461244 4408159 4748528 4424674 4251787 4141174 4519943 5063581
5077 5063581 4836681 4586906 4012863 4370950 4935779 4560799 3951036 3785527 3601485 3628338
5067 3628338 3512794 2874334 2401884 2435611 2819027 2929401 2831721 2373706 1991716 2070861
5057 2070861 2199267 1961869 1928657 1709420 1403778 1233940 1344942 1453974 1189264 1386702
5047 1386702 1672725 1622871 1428729 1326051 1176515 942121 487785 663296 1270395 1564115
5037 1564115 1367018 1555045 1746987 1477088 1194305 1077991 1381327 817332 440668 642279
5027 642279 1189274 885012 890487 1111336 902386 808660 688152 515684 672122 769431
5017 769431 744192 683657 701687 858967 795773 714424 1347369 1370222 1145169 1240177 880106
5006 880106 1122271 1205804 894180 716692 738979 700167 888660 873569 857635 625639 617649
4995 617649 677235 698817 811453 776668 752544 750335 779485 1127399 1450564 1188868 1708719
4984 1708719 1760125 1351017 948364 836821 950030 1158024 1146134 875804 772527 1317283
4974 1317283 1281997 1278945 1087163 741067 738095 522055 679704 708217 1029717 1695697 1224400
4963 1224400 742838 893872 1144407 1329960 1376321 1427694 1367049 1350443 1289259 1053629
4953 1053629 1323629 1101571 760947 697201 524651 875763 1009597 1156419 1482372 1394042
4943 1394042 728655 1083259 1281905 1501032 1444512 1065311 1243540 1482547 1599479 1602230
4933 1602230 1203602 1251289 1269500 1230079 1409136 991715 898255 793875 1356102 1493549
4923 1493549 1492200 1322240 1104404 1270169 1196946 1409740 1191493 1595233 1149271 1215897
4913 1215897 1410747 1261923 1389858 1498076 1044139 963549 1014639 1205837 1684135 1865982
4903 1865982 1304270 1301692 1610997 1499276 1558194 1839592 1451107 1279058 1239372 972998
4893 972998 1237088 1749651 1528480 1640353 1714300 1507492 1817076 1648330 1635474 1832793
4883 1832793 1748534 1438886 1628822 1901907 1865008 1325751 1319393 1450228 1128618 1188167
4873 1188167 1033415 1317673 1280286 1639928 1803796 1680206 1539185 1526260 1580332 1571031
4863 1571031 1603050 1748875 2013154 1968600 1847201 1734863 1900354 1876387 1662692 1532021
4853 1532021 1758239 1816423 2030821 2064179 1879247 2105730 2254659 2042144 2245359 1932769
4843 1932769 1733481 1736038 2044551 2061485 2289867 1927353 1818763 1837513 1889132 2303407
4833 2303407 2248222 2170516 1977187 1716200 2216156 2614019 2880770 2447291 2503326 2779489
4823 2779489 3292960 3252593 3120032 3096019 3081246 3141887 2645056 2575649 2789512 2818606 2966360
4812 2966360 2801893 2660368 2633488 2952573 3174678 2958128 2867857 3438294 3476210 3562675
4802 3562675 3101430 3221840 3766685 4048026 4210830 4200971 4354225 4508549 4742550 5248578
4792 5248578 5612030 5777234 6321216 6360134 6818461 7554843 8488184 9912686 10832078 11743507
4782 11743507 12782392 13171322 13110993 12782450 11866217 10564882 9678649 8764607 7794915
4773 7794915 6894648 6177740 5340629 5095400 4802263 4466403 4007255 4140955 4005589 3763335
4763 3763335 3751432 3890626 4014796 4010136 3919659 3904732 3743172 3876579 3716928 4040613
4753 4040613 4217127 3842533 3873816 4065153 3690157 4082738 3857797 3987276 4124061 4106862
4743 4106862 4073057 3844562 4126247 4196939 4077258 4055068 4176388 4444999 4327043 4267624
4733 4267624 4347817 4393186 4780424 4636396 4668762 5218540 5505708 5199371 5519047 5751685
4723 5751685 6199725 6432966 7061452 7971142 8540286 9111791 10083895 11317275 12342974
4714 12342974 13018117 13711126 14233708 13527014 11967431 10907349 9956200 8851421 8213042
4705 8213042 7671173 6890564 6411666 5973794 5688513 5706578 5319764 5080702 5122126 4911409
4695 4911409 4675592 4409911 4084824 4332021 4381720 4327029 4271566 4113266 3706697 3960901
4685 3960901 4060072 4062518 3990758 4245907 4041095 4062879 4148218 4074746 3933514 3983025 3544323
4674 3544323 3262190 3862605 3913020 3681411 3398388 3963778 4062353 3612649 3389647 3447924
4664 3447924 3513750 3825106 3799630 3558707 3909770 3832378 3989458 4083728 3881188 4057518
4654 4057518 4014550 4026038 3975086 4189604 4103668 4041322 4103695 3955847 4315459 4109669 3713359
4643 3713359 4119794 4157634 3864345 4072732 3959767 4412329 4405644 4006673 3845567 3934395
4633 3934395 4376273 4228854 4266635 4054260 4084898 4180417 4295307 4425646 3845186 3616413
4623 3616413 3561706 3281997 3977544 4031011 4125522 3922026 3940885 4237363 4107675 3891522
4613 3891522 3977246 3960614 4398307 4201168 4275304 4163415 3880136 3831130 3939350 4134028
4603 4134028 4150111 3976740 4203110 4198248 4406158 4206829 4348206 4392076 4753702 4927502
4593 4927502 4817778 4613386 4554933 4040080 4227725 4630702 4434471 4209852 4518207 4697640
4583 4697640 4651205 4563929 4480601 4555624 4484381 4815477 4543760 4431013 4367710 4662217 4607622
4572 4607622 4673204 4528107 4111550 4065672 4843464 4739500 4661831 4579539 4471543 4394878
4562 4394878 4818736 4801830 4852454 4577482 4583626 5140011 5249784 5228302 5169431 5015591 5275026
4551 5275026 5202923 5611816 5473412 5508080 5468553 5367657 5116096 5279599 5401535 5753457
4541 5753457 6212109 6313695 6097390 6134799 6546671 6863166 6748710 6832697 7018767 7251236
4531 7251236 7404337 6902709 7302599 7876228 7859833 7505194 7701170 8054168 7891785 8332498
4521 8332498 8458000 8415090 8763078 8634240 8696993 9111692 9092894 9007303 9526988 9647208
4511 9647208 9991737 10071376 10370019 10723411 10827284 10484669 10701730 11444732 11782970 12053331
4501 12053331 12474430 12861262 13215238 13228241 13421057 14011511 14640980 15137225 15375116 15776274
4491 15776274 16170596 16707504 17278655 17681404 18287061 19105232 19444320 20170944 20990465
4482 20990465 21581738 22850536 24071982 25047729 26136394 26708745 28098865 29703447 30626598
4473 30626598 32215958 33931409 36012343 37873496 40047352 42264635 43738353 45530797
4465 45530797 47211429 48052047 48726516 49102807 49153499 48847635 48571464 48482235 48371689 48314673
4455 48314673 49046188 49293564 49334305 49713423 49787473 50103565 50427776 50656776 51153228 51630195
4445 51630195 51876649 52292186 51967114 52190842 52143327 51691501 51968923 52310852 52277770 52259539
4435 52259539 52540641 52851689 53188176 53522836 54039483 54213128 54226716 54791027 55432338 55635685
4425 55635685 56009368 56437906 56430610 56911304 57248796 57154832 57568669 57598011 57489888 56742021
4415 56742021 55746063 55172808 54656499 53663317 53031210 52258339 50966867 50009368 48520097
4406 48520097 46984123 46204715 45077952 43843996 42324609 40947497 39731578 38662056
4398 38662056 37660253 36685968 35837842 34924022 34004521 33623290 33457243 33043268 32502250
4389 32502250 31946398 31246138 31001184 31360519 31183890 30520486 30208321 30085054 30067187 30249912
4379 30249912 29696165 29497713 29465716 29074015 28718688 28892436 28987827 29187634 29416971 29740082
4369 29740082 29714379 29852976 29902401 30315644 30574928 30748590 31039141 31242051 31825671 32091630
4359 32091630 32419692 32654030 33416627 33765424 33995172 34318629 34774053 35591169 35941905
4350 35941905 36404127 36683371 37251542 38049948 38632208 38929359 39412054 40412402 41242212
4341 41242212 42266013 43193617 44275553 45834086 47218971 48573878 49709784 50937232
4333 50937232 52268252 53150452 54111048 55123547 56347308 57663384 58650740 59694679 60463303
4324 60463303 60605129 60953101 61338410 61507323 61587520 61647925 61776074 61876144 61828979 61601654
4314 61601654 61830940 62455361 61844090 61947984 61966935 61588502 61726954 61480006 61464607 61776392
4304 61776392 61476298 61230236 61744839 61887442 61722202 61804482 61363830 60820909 60976889 60263340
4294 60263340 60083566 60052785 59356936 58651787 58161691 57931839 57506346 57386998 56851757 56153084
4284 56153084 55565082 54810106 54361023 53725462 53515397 52745863 51853883 51442859 50513004
4275 50513004 49709195 49083171 48621989 47983134 47065848 46548638 45520998 44788696 44435829
4266 44435829 44161665 43481441 42490956 41743986 41144195 41129816 40693184 40358298 40181138 39395493
4256 39395493 39282758 39087098 38794378 38538592 38622605 39059220 39259409 39495278 39550282 39923429
4246 39923429 40481720 40960850 41092644 41287239 41067705 41174533 41394821 41888707 42302373
4237 42302373 42226786 42274131 42464884 42773860 42648514 42648779 42741651 42763187 43422730 43970703 43785883
4226 43785883 43746968 43828547 44264579 44048395 44385965 44588667 44559865 44685262 44443331 44360197
4216 44360197 44249948 44431767 44519326 44321927 44345281 44087558 43768981 43295600 42507232 42094402
4206 42094402 42486473 41873890 41583991 41289674 40935600 40716728 40526685 40309982 40060744
4197 40060744 39860466 39563872 39326489 39185085 38648274 37658203 37673533 37397217 37096093 37002385
4187 37002385 36713826 36454450 36544887 35938352 35342496 34877379 34699620 34565350 34628787 34269439
4177 34269439 33958036 33575838 33762133 33789539 33250642 33253672 33536287 33461130 33264205 32876428
4167 32876428 32979118 33090094 33474811 33597142 33498333 33702077 33824264 33908481 34099012 34301171
4157 34301171 34284416 34024920 34000063 34190525 34232005 34280563 34677591 34824397 34959460 35294768
4147 35294768 35281744 35400263 35391941 35515946 35341897 35032957 34767913 34664537 34823296 34985917
4137 34985917 35147507 35186783 35132817 34989780 35169329 35434042 35977095 36202200 36525316 36312089
4127 36312089 36486552 36924704 37560091 38179666 38546640 38892834 39147492 39475995 40179629
4118 40179629 41020352 41432378 42219821 42744746 43280345 44121011 45029759 45431484 46509870
4109 46509870 47398997 48311422 49100773 50027624 51221872 52634483 53847620 55306960 56679092
4100 56679092 57533697 58675888 59884731 61592015 63615282 65100004 67252376 69432682
4092 69432682 71718694 74095289 76251674 79270711 82484548 86167494 89801166 93927318
4084 93927318 98847729 103802642 109639287 115968971 123084348 131138898 140275234 150856959
4076 150856959 161529935 172909059 184239044 194829063 204528221 212449514 218354817
4069 218354817 222215255 224069046 223689523 220823909 215542663 208525037 199622730 189041256
4061 189041256 177936604 167086468 157171448 147735224 138883313 130955824 123501849 117099476
4053 117099476 111176199 106124592 101582122 97607990 93525739 90463120 87644685 84884767
4045 84884767 83022373 81110627 78916043 77166506 75562284 74235047 73230914 72546016
4037 72546016 71625896 71197421 70772458 70060073 69489165 69241391 68917096 68828909 68775070 69466168
4027 69466168 69613093 69346124 69736045 69907497 70094391 70590793 71496577 72021777 72623393
4018 72623393 73730949 75101781 76569383 77889728 79253400 80466871 82227324 84189599
4010 84189599 85972656 88245335 90164013 92446206 95158406 97284403 99474309 102201458
4002 102201458 104885103 108119520 111364557 114303490 117139249 120668110 124302103 127980041
3994 127980041 131463062 135254142 138805061 142494396 146520152 150791597 154105025 157669637
3986 157669637 161445499 165334018 168935785 172325186 175912526 179466602 182594183 186044185
3978 186044185 188994583 191792157 194574800 196748577 198964792 201368750 203009462 204817408
3970 204817408 206145491 207254861 208678561 209607776 209966905 210112709 210008911 209656402 209224426
3961 209224426 208865609 208062295 207031969 205327504 203368553 201897531 200420202 198803176
3953 198803176 196723452 194633074 192371227 189825118 187262331 184656429 182269997 179859233
3945 179859233 177042342 174611791 172624890 170585304 168919892 166879979 165177102 163473402
3937 163473402 161600339 160802734 159603717 158358870 157858310 157532562 157135718 157632106 158214421
3928 158214421 159305123 160821657 162564326 164883679 167453525 170416756 174074256 177863077
3920 177863077 182944974 188298324 194060571 200126877 206627896 213203000 219619541 226127221
3912 226127221 231616208 237054467 242330007 246747005 250630222 253858403 256615385 259263702
3904 259263702 262326213 265013705 267245282 269412495 271985870 273295631 273861025 273785266
3896 273785266 273102025 271907959 269991499 267701721 265589361 263394312 261984286 261217678
3888 261217678 260833168 261095913 262364307 264005184 266800464 270493468 274177370 279054162
3880 279054162 284677301 291057082 297841775 305293429 312413330 319896371 326328195 331037236
3872 331037236 334581817 336167746 336286186 334795635 332215464 328377740 324141108 319546896
3864 319546896 314798893 309640614 303664841 297455073 290596607 283249429 274811885 265704882
3856 265704882 255301338 244104224 233005737 220903859 208779959 197174661 185866471
3849 185866471 175354151 166024388 157317972 148940143 141352904 135090379 129528447 124172138
3841 124172138 119570129 115289125 110906616 107447869 104327788 101139637 98431175 95438353
3833 95438353 92968350 90506980 87764664 85381677 82951698 81237939 79470823 77389039
3825 77389039 75561313 73227907 72179309 70620062 69003954 67362022 65761748 64388882
3817 64388882 62580927 61017820 60070800 58667066 57325141 56149751 54852668 54062138
3809 54062138 52801576 51756697 51129547 50194522 49240301 48700577 47814918 47063318 46186973
3800 46186973 45566708 44951911 44434262 43480929 42687526 42209433 41487704 40505413 39905064
3791 39905064 39753942 39175622 38569900 37958062 37727694 37180212 37076778 36472284 35857924
3782 35857924 35745412 35186996 35124397 34502087 33867084 34003830 33205122 33146534 33021369 32398649
3772 32398649 31500514 31568432 31098669 30876953 30200218 29965283 29735105 29512338 29482445 29573261
3762 29573261 29391457 28664064 28236376 28108888 28256215 27923145 27489613 27364638 27200115
3753 27200115 26973479 26514777 26201747 26207748 25976311 26242177 25877320 25992982 25743765 25872620
3743 25872620 25341873 25600454 25435384 25018961 25276915 25426721 24810330 24812630 24517763 24518587
3733 24518587 24801319 25017906 24882432 24595687 24584317 24836433 24850517 24927128 25379898 25005851
3723 25005851 24932708 25283143 25365777 25585014 25854566 26007700 25992013 26156922 26002911 25995625
3713 25995625 26285031 26325419 26288036 26615041 27037251 27649509 27915917 27981949 28171305 28410367
3703 28410367 28664110 29040637 29650110 30037637 30324549 30627215 31419566 31891590 32398309
3694 32398309 32975824 33473168 33822720 34722403 35491299 35856835 35814607 36657447 37471533 38038637
3684 38038637 38738920 38618527 39552889 40239708 41080583 42168755 43045988 44087845 44791450
3675 44791450 45457823 46349668 47690543 48494601 49382027 50601387 51412012 52982092 54414496
3666 54414496 55309593 56627408 57876906 59581065 60503670 62467301 63942359 64857983 66636798
3657 66636798 68429078 70524526 71990564 74041304 76494513 79508480 82362286 84679667
3649 84679667 88076751 91797613 95435925 99045118 103071556 107311945 112886823 118027194
3641 118027194 123900544 130207686 137100586 144620066 152909304 161536564 170404479 179230527
3633 179230527 188305840 197277692 206533269 215075486 223613221 232374664 241355370 250875551
3625 250875551 260679532 271468945 282436150 294232138 305687134 317201666 327591617
3618 327591617 337996000 347798403 356715657 364794058 372328734 379169031 384541263 389043156
3610 389043156 392513974 395090937 396403087 397393798 399076037 400027368 400655442 401380122 401932338
3601 401932338 401378489 399565078 396209518 391285339 384773294 376382881 366721159 355545526
3593 355545526 343388073 331559286 319852234 308496003 296996894 286706106 277110853
3586 277110853 267101830 257361837 248363744 238812930 228014524 217120961 206138153
3579 206138153 194965598 184409104 173974316 164551161 156238192 148107058 141078168 134425804
3571 134425804 128662209 123213758 117914704 113326969 108876921 105235728 101627136 97726844
3563 97726844 94755641 91868323 89274138 86863412 84197510 81741816 79513426 77529577
3555 77529577 75405751 73685619 71799331 70279811 68978080 67046516 65310609 63944785
3547 63944785 62687094 61124871 59899647 58501214 57285813 56391755 54998767 53693194
3539 53693194 52712698 51735838 50513982 49458566 48111121 47227116 46463937 45854835 44620755
3530 44620755 43690883 43172740 42146355 40970726 39929248 39380204 39040511 38251146 38028351
3521 38028351 37329303 36745364 36219378 35561107 35164380 34417028 33716716 32935384 32704180
3512 32704180 32299485 31857973 31729564 31062962 30346499 30143856 29973368 29651732 29008264
3503 29008264 28634713 27844033 27539068 27318523 27013278 26330329 26180160 26201715 25644777 25087891
3493 25087891 24975321 24564027 24050524 23788878 23365771 23061329 22973518 22873740 22318869 21787364
3483 21787364 21359770 21322845 20995409 20643091 20290094 20207651 20086805 19408398 19276956 19161868
3473 19161868 19032519 19061991 18846287 18627337 18527828 17977911 17943845 17713884 17719714 17344242
3463 17344242 17256507 17265225 16843838 16783531 16564442 16499040 16206192 16004575 15767825 15644211
3453 15644211 15431168 15319721 15066069 14592729 14656581 14755449 14946421 14837753 14800923 14375060
3443 14375060 14152845 13925564 13814097 13845750 14107462 14228170 13620676 13554091 13683578 13364385
3433 13364385 13446965 13405466 13284668 13062652 13129058 13351349 13429204 13460366 13420057 13334175 12956348
3422 12956348 13112659 13379458 13308460 13359385 13400158 13251062 13232313 13171790 13050110 12937366
3412 12937366 13326002 13162933 13129896 13168020 13318728 13202972 12880966 13048937 13466366 13579900
3402 13579900 13424091 13280432 13272374 13445735 13371421 13287001 13225534 13143151 12944694 12729517
3392 12729517 13027229 13007942 13032280 13351286 13449627 13130859 12788870 12724996 12801870 12607628
3382 12607628 13090795 13384806 12962608 12700186 12538858 12938669 13500990 13633532 13329340
3373 13329340 13686625 13708810 13588035 14094101 13740540 13793512 13979651 14161629 14031099 14246702
3363 14246702 14366929 13956291 14023704 14302059 14678751 14678343 14964330 15259634 15098853 15154095
3353 15154095 15030894 14899096 14766299 15115165 15707186 15716794 15766355 15921049 16216199 16637528
3343 16637528 16865692 16834304 16979320 17248872 17528363 17937335 18186685 18423019 18423222 18969857
3333 18969857 19265892 19342507 19371874 19272952 19923770 20293784 20726519 20929726 21259270 21433459
3323 21433459 21929499 22167070 22427469 22502564 22786931 23212278 23454522 23968825 24061243 24461707
3313 24461707 24751565 24880554 25153703 25517343 25933201 26296958 26614141 27117919 27482992
3304 27482992 28032714 27986619 28005312 28849460 29506964 29956252 30418689 30914041 31641394 32033451
3294 32033451 32326719 32641840 33497193 34224336 34500534 35133581 35947825 36485012 37130482
3285 37130482 37860736 38153227 39157894 39603322 40682363 42120297 42310958 43170023 44110989
3276 44110989 45124478 46324706 47740484 49123184 50208330 51294780 52490910 53907770
3268 53907770 54852014 56234051 57910788 59740610 61285718 63583918 65666218 68167940
3260 68167940 70555955 73092158 75860473 78840377 82329284 85921069 89678949 94010046
3252 94010046 98575248 103568748 109117606 114796024 120733635 126770904 132574712 137864079
3244 137864079 142501705 145419366 147016265 146982713 143892044 138922014 132885774 125343496
3236 125343496 117159850 108690196 100493283 91911452 84601377 78309178 72370338 67302216
3228 67302216 63090612 59070111 55442798 52287831 49532762 47091656 45498871 43600698
3220 43600698 41983986 40257256 38300463 36746255 35490575 34061035 32747342 32280753
3212 32280753 31220977 30190941 28936691 27645522 26735996 26126595 25025144 24788870 24516962
3203 24516962 23911296 22399742 21600160 21476348 21512461 20950878 19811153 19822137 19540732
3194 19540732 18741407 18763594 18784904 18424277 17701654 17295384 17158959 16805292 16284046 15727537
3184 15727537 15898859 15828352 15660878 14899842 14544351 14336313 13889207 13610987 13780770 13459291
3174 13459291 13130819 13202699 13170023 13003580 12723463 12316284 11996751 11819354 11598927 11793622
3164 11793622 11881263 11200847 10928615 10504183 10248225 10390552 10217936 10115666 10368487 10341153
3154 10341153 10436923 10498554 10319816 9979092 9771732 9468729 9573740 9548429 9260935 8743873
3144 8743873 8691100 8521244 8683444 8799072 8595309 8650608 8244299 8276040 8024745 8021159
3134 8021159 8430921 8621544 7935354 7650684 7885503 7805694 7722263 7413547 7295052 7187777
3124 7187777 7154705 7516213 7515544 7215667 7356280 7073877 6829783 7190559 6736537 6409072
3114 6409072 6828679 6851148 6052307 6368626 6485643 6563274 6804774 6477629 6661318 6436351
3104 6436351 6377811 6272390 6312294 6191442 6310233 6262780 6068851 6547333 6399332 6057062
3094 6057062 6027700 6069334 6015467 5799276 5213022 5227667 5393051 5748251 5883272 5307827
3084 5307827 5248803 5357145 5199969 5352328 5439115 5595372 5533698 5350680 5135049 5677100
3074 5677100 5374082 5690507 5647736 5173151 5390215 4908006 5365485 5246421 5143406 5510144
3064 5510144 5428360 5347857 4970828 4776955 4782974 5051527 5111554 5017898 4842172 4796308 4864948
3053 4864948 4884453 4824113 4781124 4458184 4440172 4680264 4415247 4664196 4527525 4502254
3043 4502254 4406715 4601299 4597829 4517134 4315855 4114433 4291323 4007227 4322411 4662679
3033 4662679 5115253 4925851 4794633 5040079 4828083 5073709 4852432 4618621 4650009 4636841
3023 4636841 4210473 4367511 4593033 4476378 4296614 4336988 4590945 4840805 5264300 4876072
3013 4876072 4789030 5174719 4798743 4982059 5223644 5210166 4888803 4947167 4968580 4741004
3003 4741004 4757130 5076234 5319662 5390272 5457499 5565771 5804842 5581581 5269289 5539550
2993 5539550 5667769 5398412 5606076 5774019 6088822 6071150 5784617 5565090 5556624 5697230
2983 5697230 5684075 5839681 6060178 5980160 6080283 6270546 6382100 6570907 6554266 6621380
2973 6621380 6859475 6691001 6718471 6779863 6847078 6975670 6880617 6998080 7222527 7237050
2963 7237050 7228644 7497342 7970459 7681905 7393769 7782571 7620695 7636723 7416838 7460844
2953 7460844 7775461 7370988 7826135 8154781 8400354 8640914 9146150 9305342 9499939 9503380
2943 9503380 9801363 9865685 10043733 10399899 10758208 11300585 11860202 12144861 12432952 12889764
2933 12889764 13471536 13791709 13510687 13820676 14079433 14171574 14072127 14196720 14125685 14442866
2923 14442866 14638830 14618241 14874933 15307862 15177035 14927200 15206873 15432506 15796908 15731712
2913 15731712 16166369 17134703 17252413 17750511 18334240 19118648 19918163 20931794 21787709
2904 21787709 22702433 23241335 23005260 22757530 22400905 21403246 20273887 19038210 17972083
2895 17972083 17208630 16996801 16237354 15802156 15672365 15185585 15445730 15266407 15207862 15536116
2885 15536116 15507099 15483347 15554583 15621310 15840821 15861198 16187015 16460932 16652906 16921633
2875 16921633 16708623 16109912 15705263 15773607 15582698 15077065 14502347 14128569 13505824 12514373
2865 12514373 12082226 12197681 11822240 11713992 11325491 10715422 10593521 10138952 10149883 10353122
2855 10353122 9991532 9817352 9578895 9171124 8916569 9073107 9182562 8826927 8185552
2846 8185552 7644635 7443043 7182294 6835175 6565091 6529430 6705155 6944895 6448844 6129198
2836 6129198 5899309 5752451 5645697 5262517 5107916 5529268 5326874 5136426 4896872 4813835
2826 4813835 4675622 4707341 4565412 4265879 4479499 4512518 4554313 4411663 4082492 3726778
2816 3726778 3480514 3528075 3433168 3428562 3747704 3478511 3199954 2792750 2552756 2828961
2806 2828961 3087258 3039408 3107535 2966106 2922738 2809477 2772170 3100773 2841111 2917991
2796 2917991 2783171 2779221 2588096 2745542 3234420 2963148 2726833 2698176 2512730 2237039
2786 2237039 2342847 2510040 2156238 1921320 1962959 1912006 2052655 2283902 2082669 2565932
2776 2565932 2783096 2662745 2177772 1826005 1965009 1803753 2039487 1949562 2150103 1967425
2766 1967425 2313158 2425687 2206528 2344661 2102176 1901641 1577360 1446361 1636550 1924813
2756 1924813 1674457 1225712 1352461 1407414 1779222 2246959 1796592 1687693 1920692 1891192
2746 1891192 1510429 1467644 1147516 1269783 1447392 1530913 1968497 1713248 1447057 1085445
2736 1085445 1166148 1073708 948469 1245939 1048026 1277194 1374942 1272857 1505525 1179955
2726 1179955 1428475 1704061 1467135 1496411 2078027 1940059 1718281 1354128 1390075 1315804
2716 1315804 1216141 1073167 1262354 1353639 1195046 1089571 1079950 885191 834271 816957 642259
2705 642259 882898 543504 528610 405750 901266 1090104 1229087 1259032 1082128 1090427
2695 1090427 1261593 1250453 1192213 1406988 1254734 1050193 783910 739298 602937 788862
2685 788862 870828 954974 898385 684059 712423 699480 814050 1046146 779527 485664 292471
2674 292471 412237 916177 1159623 801931 453845 702411 582605 843965 746845 377061
2664 377061 250549 345603 503956 710068 913754 961656 1002595 756367 478467 569185
2654 569185 683789 819815 1131598 1059929 736682 581275 513338 1031062 1066747 651201
2644 651201 394712 393945 1092062 931249 588372 355599 453156 699757 699286 1051845 1360354
2633 1360354 864643 454315 658626 376005 771290 874783 711076 650691 645294 643209
2623 643209 335952 666917 964965 546704 822198 845228 495020 647971 875379 1241510
2613 1241510 860959 1067092 1181218 751862 582908 507096 653937 464358 410967 396123
2603 396123 202868 82732 134507 233156 423331 650474 762006 799340 627434 727538
2593 727538 599787 713038 1022659 964253 937681 953194 1238833 1104257 868004 672636
2583 672636 724591 852842 930742 675370 585612 688468 213383 826778 823599 963213 634439
2572 634439 538618 793818 606045 802567 663519 641345 544520 637024 522718 658805
2562 658805 504028 454641 519027 298178 600913 676276 697209 719379 705910 580542 523625
2551 523625 543606 658578 845088 165138 -360162 212073 581710 448480 304607 421019
2541 421019 537954 -26485 315643 337096 670 133773 585498 604373 351758 347099
2531 347099 -79103 -496382 -159094 -149000 -232458 302640 203131 105281 441564 386655 437510
2520 437510 526051 911889 689014 585259 423083 305655 508223 334101 113869 335671
2510 335671 289483 427489 478180 258322 285817 141612 -61176 -212673 103319 440904
2500 440904 50252 -280163 -67748 249098 549657 354460 766072 750272 778137 703492
2490 703492 416285 -138067 448795 198875 135035 -13815 196524 357339 -26472 -131443
2480 -131443 105698 -107475 -216567 161898 -25680 22036 219011 264413 732488 502231
2470 502231 34551 -110885 -25513 -76811 -91663 122200 -252817 -99032 351406 259020
2460 259020 115741 295453 -37419 -343120 -147272 445841 375921 203740 456035 301145
2450 301145 -50276 -265735 -191714 174036 18332 -41418 89044 172101 99375 406526
2440 406526 180134 535717 401099 496296 676494 505120 396427 281564 172589 276540
2430 276540 692653 941922 302993 151964 166036 532352 265724 494423 431676 261034
2420 261034 292323 243706 433075 103025 265771 -18285 -221186 -185641 -27721 40555
2410 40555 -105368 80949 366007 243052 476732 269566 2523 -21838 -254575 369566
2400 369566 131338 -122758 -240139 -510099 -306204 -106634 274426 177471 -313750 -493813
2390 -493813 -425809 -292764 -343411 -68312 359071 -178373 54404 91990 192695 -253104
2380 -253104 113385 97557 332936 240128 -13093 425395 675051 563517 495871 715404
2370 715404 1099371 1175893 981876 955821 870647 658259 708934 490596 369073 459661 482447
2359 482447 274171 91421 39100 -94114 -87020 137557 165905 -52190 181556 401026
2349 401026 237091 -66467 -4591 182953 531883 424695 191388 -15173 16801 508062
2339 508062 355967 -6282 103371 -52372 -36928 -96539 -249976 -228 30154 -245470
2329 -245470 -250800 188428 258025 73474 187541 581875 702312 390536 231667 142465
2319 142465 573618 342699 -46203 233246 451682 464478 288459 218167 59522 -91466
2309 -91466 81530 -240696 60478 169408 -63387 -110024 -255164 -111873 257645 706015
2299 706015 364980 162716 299316 579746 443252 46927 222021 408897 381890 409950
2289 409950 874618 723880 234638 -2762 7690 412653 168053 -149879 92274 -7418
2279 -7418 547761 338920 474773 685415 687525 729090 615174 624857 914458 785105 -7098
2268 -7098 602068 759300 619310 576195 835227 698747 -110818 -67788 152650 390002
2258 390002 249342 765230 906119 355950 219235 564140 512571 440263 437857 421867 484403
2247 484403 589218 647657 556400 551426 415022 548871 188519 404826 672647 612858 239426
2236 239426 288872 102299 -29125 136246 653361 1218823 1439904 1441005 1083055 857349
2226 857349 1078158 1029183 992682 843988 1007890 1193562 714612 1035246 1021533 864363
2216 864363 380569 976928 1146730 648414 961471 1330003 1425769 1257146 1230995 1270299
2206 1270299 1100858 1268670 1127096 1192604 1325534 1068148 822686 912867 1505728 1561844
2196 1561844 1765525 1227483 1119305 1111079 1166439 1781847 1633442 1680019 1965223 2170160
2186 2170160 2340790 2067276 2270456 2216690 2022285 2184361 2249760 2084101 2523882 2587265
2176 2587265 2970660 2916959 3063487 2942306 2831622 2772768 2882317 3214078 3272627 3390759
2166 3390759 3269402 3425953 3355597 3613336 3498753 2847856 2903672 3698128 3095924 2872668
2156 2872668 3592157 3934849 4109442 4029323 4113779 4531769 4746492 5070846 5348418 5622429
2146 5622429 5800775 6048396 6209363 6078793 6760818 6804858 7330643 7654700 7948755 8522859
2136 8522859 8368175 8180805 8811622 9773847 10098034 10863998 11344045 11761070 12669419 13303640
2126 13303640 14084155 14657399 15850570 17209597 18805778 20604235 22539015 24102373
2118 24102373 25612020 27503382 29326463 31653078 34794304 38537506 43483800 49676849
2110 49676849 57111544 68263330 82883215 98676185 117127437 132836513 127326528
2103 127326528 114308109 100827079 83032623 67039152 54087503 44789850 37995890
2096 37995890 33188727 29191008 26208765 24024635 21967736 20737142 19699255 18517679
2088 18517679 17649663 16372801 15133010 14349019 13626153 12722578 12351198 11460583 10587150
2079 10587150 10227628 9587483 9108412 8785620 8323606 7946992 7351748 7447407 7122245 6427665
2069 6427665 6262273 6074000 5988151 5449661 5124931 4743702 4408893 4351188 4358852 4455379
2059 4455379 4352580 4142955 3993027 4354419 3978913 3720603 3816158 3541233 3781536 3459490
2049 3459490 3803116 3435687 3125175 3389221 3255844 2934281 2828978 2928626 2411008 2073514
2039 2073514 2143619 2264514 2076383 2592410 2472423 2412940 2152048 2042047 2002402 2173829
2029 2173829 2472384 2132753 1698435 1640968 1427075 1638181 1374876 1395448 1629488 1723578
2019 1723578 1808994 1449229 1314274 1709063 1283054 1360742 1384665 1180210 903786 1104995
2009 1104995 1655358 1354735 1265702 951437 1088343 1086486 863034 742885 977130 758465
1999 758465 738228 830939 748303 315549 521639 415908 225732 794205 588522 902512
1989 902512 944285 894215 489507 349523 321026 431855 902112 835048 556630 361495
1979 361495 601969 688831 412777 396088 769066 1033623 1147393 520488 585685 840661
1969 840661 183606 385805 534155 508440 273820 164685 516552 445556 440912 369426 580845
1958 580845 773261 785616 706805 542814 514328 731034 461869 366446 96947 37490 169804
1947 169804 -80816 -302659 -215572 -144876 32851 500946 433404 64546 29424 51608 439172
1936 439172 196694 14018 178854 210821 259277 520719 537975 144984 443605 656622
1926 656622 487659 384958 527365 693152 414643 222793 268487 47636 161052 210277
1916 210277 324419 311627 -224831 164182 319518 200008 107049 126898 497315 819497
1906 819497 646317 316085 489664 245833 8721 4962 34558 89130 205424 265441 146294
1895 146294 79223 56847 76338 305497 340595 238098 297956 16417 129510 -113849 -397913
1884 -397913 -120707 153825 81574 73201 273940 382707 474426 161281 -137463 -46977 294090
1873 294090 163759 54799 -202216 -116297 -92344 228363 233759 454845 743522 229296
1863 229296 3515 219763 15023 -389760 174853 573567 307203 413317 466998 790986
1853 790986 465326 258528 477700 151610 -90938 616740 477401 162681 -2295 -102756
1843 -102756 494168 419806 359455 675398 -3567 -60233 457863 570020 601125 609244 645736
1832 645736 403540 128876 -47251 343874 560277 478065 483207 340065 487667 324440
1822 324440 524156 540269 2182 471898 231230 321274 195026 43474 279367 148890
1812 148890 -49270 -133491 -416764 -317441 -167805 -283496 -407045 5313 -305612 -114532
1802 -114532 185120 432527 379323 -22386 63863 -456719 -123417 195495 315294 406116
1792 406116 292713 300884 137994 -266248 -207314 -5354 -257710 -605779 -892464 -1004530
1782 -1004530 -295858 162326 -295866 -68565 17848 22464 47024 198807 287402 400428
1772 400428 489877 72916 -185255 -127895 -360776 -232496 125514 145892 -257991 -274164
1762 -274164 -18556 259527 335448 347587 296467 31528 -337281 -277103 66100 317624
1752 317624 395068 115253 78875 206086 -116651 -87884 -322992 -65155 102049 -26057
1742 -26057 -7418 -113377 -205084 -41933 -190016 -438968 69964 -17682 158565 -89838
1732 -89838 248864 1535 -193507 -239898 -214476 -21199 48816 87404 232391 108850 64084
1721 64084 307661 458716 58044 70879 91649 74562 105238 -75897 -64201 -159947 -121419
1710 -121419 110702 -347303 -272861 -222008 -401499 -153569 -143933 -183634 248315 -79221 -220603
1699 -220603 -81365 -392379 -127034 -192854 -378014 -695040 -550270 -224446 52911 127430
1689 127430 -223058 -314719 43425 -92334 -37194 238421 98710 -65615 339453 60590
1679 60590 -56666 -85961 -512542 -259962 84976 340970 340677 -93655 -103863 471410 644509
1668 644509 353313 260656 520688 468090 108477 11643 284447 336363 263512 203202 -32938
1657 -32938 -163292 72257 -370522 -440517 -534814 -533035 -466584 -343267 -76486 -144558 -224049
1646 -224049 -61973 61228 66746 -158695 -132840 165832 20755 328959 -56109 -98584
1636 -98584 228547 -3575 217933 -81105 -148310 254697 -28557 -356140 -590805 -513128
1626 -513128 -560169 -198962 33581 206458 -283182 -240064 25960 -36963 82597 347281
1616 347281 147153 -170452 -327617 -379653 -193393 -406183 -141821 -187638 13748 45697
1606 45697 103102 102537 147606 -34549 -33996 138699 -193364 -281849 -153181 96482 168407 309782
1594 309782 407732 398778 310297 258613 117337 -20428 -198804 329712 423302 357652 -116950
1583 -116950 -72126 38095 178048 -137083 -134565 -28732 169750 130733 317997 208084
1573 208084 77851 -104258 -328667 147268 49195 -191074 -153560 -170745 49860 130659
1563 130659 78840 127661 113094 197270 139705 479842 93608 -160544 41882 104068 143360
1552 143360 -240598 -100974 256644 -80703 -24215 167988 158084 -271483 -395119 -64442
1542 -64442 124195 15298 256766 -42171 -173448 -256210 164251 528531 196612 21863
1532 21863 -70985 -1533 148555 -161742 125874 350695 182250 -175142 -467352 -387171
1522 -387171 -15706 -75340 413462 -184229 -255083 -109807 -24653 -197368 -512165 -283213
1512 -283213 -390124 -94290 291509 -77685 213473 9751 -2465 -414944 -324987 -114768
1502 -114768 -116496 391181 153904 150013 -350911 -154118 -161676 13559 -3785 216316 -26403
1491 -26403 180645 -10193 274520 -79934 -506974 9361 -71534 93657 356825 33476
1481 33476 -165757 -106891 -155577 -284044 -288708 -5263 12587 79442 180381 359204 -129552
1470 -129552 -550358 -184693 -144669 -196033 64153 267883 -108452 -87056 -38047 95774
1460 95774 142367 -131814 -130090 -442330 -240588 -100496 -167201 -174007 -273276 -281934 54076
1449 54076 297552 204007 108498 210229 -86881 -334508 -207349 -275437 -290689 -141102 -97276
1438 -97276 -99566 -29490 33267 24685 219261 78028 -232027 -166871 -313065 173197 185195
1427 185195 45153 -135095 -383301 -38511 -148963 -65492 180926 489529 291825 -114204
1417 -114204 -182050 137091 495481 240828 220616 373565 -104304 -322615 11958 171344
1407 171344 240887 -122189 -90721 -146537 66020 109019 -246396 274547 380488 -8546
1397 -8546 32640 -109059 1714 158724 112868 -261826 151974 179542 -145085 -537849 -538951
1386 -538951 -256893 -78572 -379025 -486499 -886892 -441580 -325908 -277709 -210638 -233837
1376 -233837 -158602 160473 454322 267296 116833 -368825 -123256 -331600 -141964 -311154
1366 -311154 -618290 -569491 -471276 -342698 -502937 -532827 -220541 53248 -15499 -211787
1356 -211787 68094 143317 144384 -66277 -81390 102053 15254 -310025 -9906 -137275 -39657
1345 -39657 -161855 -220978 -155264 197173 140941 -526893 -334576 -234144 55351 -72650
1335 -72650 -722638 -201623 -233318 -33329 398816 208958 206018 268499 -184453 150428 266556
1324 266556 -14815 -66209 -236277 -300058 -292856 -333695 -572904 -429532 -77557 63705 179231
1313 179231 288605 19548 -36115 34102 163301 327766 48257 -137338 -244830 63531
1303 63531 -177266 -234189 -291453 -70714 231666 35587 104981 76268 360288 409018 -80596
1292 -80596 -13884 -87815 -539992 -325508 329677 902057 624841 207686 349410 357689 16914
1281 16914 -240613 -50771 -214650 -771004 -218079 -126664 158963 -159491 -326974 -229578
1271 -229578 -232386 -363571 -518957 -413006 -64335 293110 -34605 -254795 -96050 -93432
1261 -93432 -49782 -442694 -358753 -545432 -445720 -122951 467976 183426 -193768 58094
1251 58094 -164004 -176865 -99250 -485613 -124065 42060 -49358 23650 -85193 390904 96141
1240 96141 290021 377747 163930 -46193 125829 95023 -319353 -388563 -313679 -189667 -186671
1229 -186671 -54734 101056 -141730 -334135 -243 -28477 -88529 -265248 163663 254728
1219 254728 224499 133816 -22053 -109209 -192631 229653 47751 -124710 -145389 33783 -48936
1208 -48936 -213112 -29348 -150724 -673009 -348381 -280181 -449188 -89585 -55922 -136311
1198 -136311 -439124 -334316 -75817 -237701 -4602 138002 229549 104191 -83394 -512292
1188 -512292 -353533 -176663 80130 -249266 -371651 -491681 -241096 -225499 -162981 -67174
1178 -67174 -243339 -146856 -141618 -201399 -21405 -10031 -223861 123631 305000 405334 35185
1167 35185 -310994 -401067 -452002 -222259 137183 150281 -85217 -245320 -244267 35978 -25732
1156 -25732 -281935 -343908 -383256 -83464 68932 86009 -230964 -158010 211654 -16359 -314166
1145 -314166 -453137 -322086 -130698 -58405 -407380 -386292 -440070 -358954 -7260 162481
1135 162481 261793 193353 340269 -266095 80824 254638 -496759 -214204 -49961 -394945
1125 -394945 -334154 -229544 -22003 -70484 204916 521220 143865 159141 436496 396503
1115 396503 294649 5134 397872 368423 30363 -134973 48794 90366 170247 265880
1105 265880 -501540 -721384 -713502 -515809 -473840 -201424 -46324 -75155 124760 78217 -26715
1094 -26715 -462257 -208681 -61770 -146365 -325156 -383998 -465962 -67436 66956 177895
1084 177895 167133 231493 -132195 -668204 -705197 -376106 -153346 -181067 -208888 -370758 -375336
1073 -375336 -206112 123251 491175 539276 18340 -95812 303677 252616 172166 426522
1063 426522 -190349 -392189 175145 194792 -173607 -384196 -262398 -416171 247105 420079
1053 420079 -211242 185506 148319 -133145 -364119 -82424 -287475 -398199 -415900 -473017
1043 -473017 -280595 -27792 5147 -208250 -319777 75068 54155 260524 204263 121673
1033 121673 73868 -167102 -136236 -242482 93065 -33554 -57306 151350 -81699 -118683
1023 -118683 -336163 139955 -36253 -67495 192935 91391 113791 -152394 -614733 -703394
1013 -703394 -517979 -193996 -260702 -192727 -84958 -186253 -34594 -16250 126859 368889
1003 368889 82753 373301 163844 154508 464871 266758 110433 191504 165702 -222156
993 -222156 -442208 -461679 -4453 167490 -239888 126759 299107 -58939 134655 -80616
983 -80616 96002 412718 -27945 -219960 22010 146789 83799 -137554 378690 213148
973 213148 89528 43149 -56233 -148645 155678 -55484 -194871 -400499 -497651 -12774 52813
962 52813 -191583 -161606 -113640 -143263 52049 -189237 -70 158452 -92417 -138345 153009
951 153009 130202 -425106 -127112 -158742 -189993 -101285 245113 33636 290162 301121 45714
940 45714 113397 -74684 55310 152222 -44379 244401 226304 144062 -218705 -359678 28245
929 28245 57250 196625 250821 139659 324375 170174 96272 236771 6857 -300611 -143821
918 -143821 316308 -57570 -22174 -199574 -113595 -40443 31145 135906 -44858 -457823 -190938
907 -190938 191278 -138496 -210655 81042 71215 -48206 240945 565828 29790 -303612
897 -303612 -81815 2835 -220175 -531321 -598354 -228372 -8933 144401 69275 121093 -103328
886 -103328 -193525 -137196 19048 129434 45300 189093 314830 -132895 -159310 -466663 -264347
875 -264347 718 -154365 -157028 -189118 48933 5634 88631 435113 439266 214581 158304
864 158304 -119876 -386529 -244956 63991 231515 47770 -151008 182062 359435 470098
854 470098 -100123 -73231 -229714 -26500 37016 46341 -169691 -106156 -101163 211714 130677
843 130677 -101597 57430 -185866 -102266 466422 641256 -80382 -323220 -393599 -265627
833 -265627 163070 184128 420816 388898 -126998 -159593 112778 171050 134992 331613 -228861
822 -228861 -64262 17787 117900 328280 79825 47104 195785 -112730 -255432 137040
812 137040 -175383 -116271 83417 -315277 -35397 127827 347137 435645 270794 79453
802 79453 -108056 -214993 -257224 -385159 -383450 -283844 -95475 -4368 25721 -113850 -203813
791 -203813 -27207 -77990 -78223 52389 -446380 -507769 -37830 424644 402218 157759 -24100
780 -24100 -309705 -71467 90237 410278 283011 85514 309338 308726 392468 9354 -390340
769 -390340 -147316 -92498 -69656 153369 -40407 -141747 171261 -85485 -188813 -491227
759 -491227 -699499 -333374 -200152 -32739 -168455 149247 -67319 35633 64839 -24145
749 -24145 203765 2383 -52957 -241686 -301041 -442236 79137 120158 -61703 -164302 -303507
738 -303507 -112736 212432 43925 235479 137676 4730 -122009 -158939 -214949 -50160
728 -50160 -119092 -438156 87022 -108465 -95116 -49688 -270168 -262698 -153141 -496319 -327583
717 -327583 -173516 -458965 -76642 -327956 -168197 -82792 -342525 -487973 -427202 -466004
707 -466004 -725725 -719432 -469545 -311198 -237269 -79484 -100033 -339054 -586867 -532862 -347582
696 -347582 -398369 -433337 -284109 -14050 -22975 -45645 -268111 -447390 -205538 -164449 -402881
685 -402881 -400992 -468350 -857238 -320936 -66649 -528315 -656302 5225 -173801 -423522
675 -423522 -359910 -229091 116749 182970 -154080 -419588 -262141 -307786 149049 168200 21608
664 21608 465422 479713 201714 -99479 76775 -193152 -255655 137527 356637 422354 66309
653 66309 -113159 22773 16321 -63467 -134780 -308117 112993 -85141 -234652 -572394 -394539
642 -394539 12029 -43416 322434 79923 7468 49853 7668 184695 94116 139040 219566
631 219566 -95393 257711 16486 -167987 -425492 -513954 -409966 93831 190449 -228178
621 -228178 -81381 247594 38349 -47221 -239356 -263575 -104159 -280861 -85927 -330806
611 -330806 -266063 -118125 -28064 -179111 37812 -114053 -109654 -199209 -154410 -412249 88425
600 88425 196947 -148571 -247610 187733 389991 387159 342784 557923 709896 376759 300000
589 300000 168369 123740 82136 24589 40919 170519 305603 -149395 -245064 13233 -9044
578 -9044 256030 -12201 173982 -372796 -238771 496329 684559 436296 340221 238947
568 238947 -203304 -259981 49218 50200 98715 -111268 -294605 -114475 -267226 113042 161994
557 161994 46307 450328 641076 249863 -243379 220021 281779 180234 -41910 -354034
547 -354034 115197 527820 230243 155347 13453 192936 389003 194395 88489 333342
537 333342 273172 809873 426760 392715 283452 -311653 -185210 -217738 -408523 -232863
527 -232863 157182 2557 -8516 -174240 -27337 38143 -193197 9351 58878 -48909
517 -48909 279355 228621 8614 -149878 -78646 -177820 -299454 -153097 182627 172509 -100916
506 -100916 -30732 13130 -4913 -215997 40293 -211028 -679570 -300217 -76312 -253737
496 -253737 -483885 26674 167079 52094 2064 191234 186423 -354317 -158083 153895
486 153895 350986 227115 813250 984226 133245 -188798 -113702 -312608 -63884 175255
476 175255 258136 214831 152313 -189777 -392021 195951 267122 387203 116921 139191 247762
465 247762 12214 28733 200605 276023 372106 -92587 16145 263992 207515 -301379 -68484
454 -68484 -100314 -2135 -72933 35412 -9376 13853 -154328 35600 -196867 116474 121687
443 121687 26071 69490 17406 -148200 -347671 -166065 20823 305672 442045 276669
433 276669 335765 72423 -232020 -142826 49400 129309 23726 143916 417943 676133
423 676133 344749 302197 660726 416547 52680 432734 402273 30373 -324223 -88728
413 -88728 17197 93480 150073 216977 -106958 -64312 -90507 207951 185002 -84907 -162420
402 -162420 -80980 -37501 -115558 -512323 -350560 -277204 -257880 -178259 -93066 -12365 -9152 -144750
390 -144750 -166670 -436555 -235846 -146609 -189651 160749 183540 48601 361744 138445 -124843
379 -124843 -107564 51895 64399 81423 102705 -103216 -211846 124490 679929 620838 180302
368 180302 455039 79758 -279579 250453 420353 402967 292312 382084 183437 -374394
358 -374394 -272267 -41185 -248826 -588106 -759813 -490175 -354546 -306123 48721 -110306
348 -110306 -134681 -127925 -117299 -373482 -107713 -126448 -131753 -138593 -256544 156781 -11571
337 -11571 21442 -9086 -104035 82308 -3604 -318845 -341477 -129348 -100028 -185584 -179476 -365994
325 -365994 -69811 309670 236755 372310 63633 74446 555852 262735 -57510 79023
315 79023 242233 -84330 -150608 -278606 -68688 215872 5110 -391701 59256 -108450
305 -108450 -183207 -229688 -312984 -46138 -118519 -363144 148172 -9822 294684 411792 -165268
294 -165268 172357 333590 -36267 58840 160848 55058 -45749 -103402 52618 365849
284 365849 312042 126754 333146 172200 61929 87652 54598 298401 52185 -73611
274 -73611 250967 174054 67426 437936 339311 320926 480290 278905 -164546 -263794 -472670
263 -472670 -169324 -88879 -32310 -263252 -526824 -220690 -245618 -374230 -48958 -164108
253 -164108 -316320 -246996 -170721 187181 -132863 -105768 -350448 -285747 -74355 126608 202665
242 202665 -104398 -212190 126690 444305 261548 12241 -228410 -562977 3649 -31543
232 -31543 -55706 -372747 -202379 -381942 -105071 162994 52136 287949 5036 -120500
222 -120500 -154180 19134 -26991 49720 -101830 322509 261654 228632 122684 285397 375363
211 375363 -52600 86182 168503 23660 -83620 -27157 -279087 -295400 -274587 -343614 -295918
200 -295918 52664 -358222 -263063 216635 355577 338877 323886 119593 -98512 96164
190 96164 481909 484758 401827 134758 1708 398486 209652 255485 315292 168532 102154
179 102154 -158350 15258 -113393 -223629 -143481 274327 198575 55562 413722 224685
169 224685 100735 67112 84876 109533 144574 -494071 -394722 -197865 -87683 -82871 184697
158 184697 296410 -25328 251068 486400 155151 -136749 99151 143883 338060 580330
148 580330 578080 291168 -54218 -315991 -299110 -256864 23769 338487 197984 452027 241129
137 241129 348436 302368 199845 134002 -84246 -111870 -247479 -287622 -431567 -317571 -304152
126 -304152 -298128 -464427 -247904 -64455 -122294 -164004 233537 643695 673576 270975 228510
115 228510 313564 393528 -11544 116090 302530 95961 -245314 25792 295049 141259
105 141259 470995 313048 263083 297144 268168 1902 -85224 213199 384830 515561 417286
94 417286 318828 340283 209623 156257 -161009 -148861 -193632 -17183 -884 -225244 -148624
83 -148624 58121 91269 9323 -52466 73131 181981 244126 72674 -134095 -79749 30302
72 30302 46477 345442 583957 278085 232438 189786 -50776 -82058 18245 64558 -37402
61 -37402 150639 46537 -106214 114409 244799 -111978 94017 186832 47687 -7642 -141522
50 -141522 31873 234420 58723 -220109 14093 90966 -158912 -198985 42667 324260
40 324260 379463 288588 295732 222039 -99201 19193 251235 169250 11232 -71063 294206
29 294206 518191 130046 52155 174324 18653 232513 179563 144279 42264 75355 155472
18 155472 17455 -138686 -116459 67404 126287 440488 393100 246561 299345 255002 118647
7 118647 57154 249899 64980 219420 318717 135137 45192
0 45192
$$ Imaginary data points
##PAGE= N=2
##DATA TABLE= (X++(I..I)), XYDATA
16383 -3268206 -3121353 -2526620 -2625078 -2860922 -3022655 -3144247 -2951899 -2693783 -2560679 -2740113
16373 -2740113 -2729180 -2569564 -2490465 -2436432 -2590891 -2238653 -1987416 -2081227 -2225538 -2550908
16363 -2550908 -2075276 -1948982 -1822974 -1844103 -2127714 -2009014 -1962545 -1939964 -1857069 -1769106
16353 -1769106 -1705369 -1829546 -1928575 -1488676 -1512378 -1465366 -1382157 -1262640 -1167706 -815717
16343 -815717 -853591 -761309 -846149 -913417 -888503 -975474 -1088773 -1035542 -1054778 -907619 -901967
16332 -901967 -959000 -937132 -561756 -310113 -383256 -215885 -264695 -131899 -190285 -123239 -378538
16321 -378538 -508707 -344327 -341020 -361745 -146241 -105297 -86233 -181722 -374373 -19189 166649
16310 166649 6184 68116 68993 504573 351962 352513 485658 551369 382549 556994 727764
16299 727764 852013 854024 917251 828949 792988 883626 1135964 1283596 1220717 1206400 1363625
16288 1363625 1023636 902866 995015 952692 1151500 1043527 1211717 1219411 1519270 1697050
16278 1697050 1638525 1501422 1255209 1765100 1597542 1735612 1942179 1798642 1771567 1681737
16268 1681737 1981633 1752099 1760557 2233959 2298989 2559901 2701052 2356107 2743827 2554723
16258 2554723 2229765 2368837 2464930 2527768 2437833 2463337 2754694 2707006 2821061 2449396
16248 2449396 2528426 2698300 2534129 2410065 2556886 2671086 2374826 2793963 2957317 3214346
16238 3214346 3211100 2883049 2879436 2875163 2840237 2678812 2880831 2646958 2808963 2897607 2818373
16227 2818373 3131171 3558679 3565804 3266581 3245535 2939241 2802866 3294597 3190024 3167371
16217 3167371 3267174 3611707 3518287 3604036 3566632 3409443 3207498 3318308 3230767 3462822
16207 3462822 3650517 3837778 3822493 3272313 3380182 3302482 3547676 3584957 3377025 3774280
16197 3774280 3754265 3736558 3772684 3740167 4137474 3740228 3866289 3750522 3519972 3486720
16187 3486720 3446824 3687864 3993070 4254687 4037662 3886728 3689163 3748676 3829555 4265105
16177 4265105 3810789 3806143 4001371 3857432 4025657 3985237 4337956 4005839 3898117 3735232
16167 3735232 3805721 3970986 4233166 4249948 4269754 4260339 3782393 3523513 3861806 4341215
16157 4341215 4200172 4015997 4396843 4322991 4620317 4562312 4083448 4219427 4503689 4489005
16147 4489005 4861533 4578604 4394819 4375575 4480024 4494169 4656703 4992360 4835383 4448727
16137 4448727 4160003 4348099 4249715 4256401 4575309 4559990 4383803 4291180 4450602 4487312
16127 4487312 4555598 4768501 4900317 4473138 4383218 4599642 4697634 4538062 4205265 3935735
16117 3935735 4362995 4604352 4511237 4646833 4687532 4410211 4686469 5047913 4937347 4661941
16107 4661941 4643430 4469440 4323697 4367781 4118133 4491605 4382018 4548679 4729665 4591164
16097 4591164 4530214 4528903 4468594 4593316 4770479 4607441 4665404 4859697 4746205 4500168
16087 4500168 4134565 4519287 4830715 4349894 4350994 4701308 4637047 4360874 4051580 4280248
16077 4280248 4495712 4731440 4890334 4587054 4068201 3993074 4322502 4320662 4142537 4209292
16067 4209292 4115870 4394448 4723705 4805369 4586560 4335209 4222687 4492637 4505739 4387634
16057 4387634 4532767 4730091 4605148 4839723 4798124 4896048 4690571 4811568 5089605 4859392
16047 4859392 4330534 4507948 4591937 4517763 4930503 5148255 5045563 4662654 4929794 4507125
16037 4507125 4693638 4825857 4650665 4817231 4604903 4403990 4171396 4431705 4593666
16028 4593666 4372715 4610153 4574636 4416865 4498156 4919942 4618076 4580115 4733500 4579885
16018 4579885 4742204 4822786 4849416 4792034 4994257 5151554 5139906 5080708 4801643 4724864
16008 4724864 4512588 4106902 4477674 4837745 5123378 4986491 4674842 4940798 4873872 4593334
15998 4593334 4622366 4937089 5012398 4697358 5299168 5259060 4935327 4984638 4978327 4874347
15988 4874347 4622866 4885110 4884579 4379402 4115123 4657818 4479404 4262411 4217115 4507540
15978 4507540 4905462 5020834 5322494 5281550 4945543 5097567 4757035 4606145 4534270 5068959
15968 5068959 5105186 5097809 5149627 4969574 4972561 4829078 4720105 4737829 4279120 4251603 4717065
15957 4717065 5006515 4995262 4662149 4613341 5106106 5154342 5016321 4808684 4493738 4670832
15947 4670832 4470069 4500800 4669893 4625435 4581196 4805602 4367682 3929874 4162353 4347974
15937 4347974 4331680 4509565 4481098 4681705 4971812 5337543 5519846 5526084 4678864 4800577
15927 4800577 4882066 5012243 5014765 4589575 4390370 4532510 4749463 4961563 5169234 4880890
15917 4880890 4895654 4937584 4862941 5036917 4973976 5152181 5126926 5074817 5097311 4582976 4568215
15906 4568215 4483394 4567303 4862018 4620578 4368674 4857833 4903853 4485938 4686547 4674270
15896 4674270 4541675 4977233 4614905 4528930 4847117 4737146 5019350 4871091 4802941 4965307
15886 4965307 4820464 4932741 4649343 4945592 5365608 5056535 4975014 4975563 4855191 4946381
15876 4946381 5000080 4655674 4483581 4480400 4467967 4609107 4615388 4632438 4513471 4589644 4714945
15865 4714945 5131895 5016859 4863379 5036052 4719907 4559591 4733125 4963065 4905861 4615495
15855 4615495 4565147 5020117 5276872 4834646 4802996 4644174 4359488 4153412 4359072 4850046
15845 4850046 4963229 4955847 4770930 4453971 4682505 4462735 4863868 4857389 4308085 4435821
15835 4435821 4828795 4846119 5104322 5320885 4725294 4713196 4204157 4334073 4906829 5190616
15825 5190616 4616602 4473104 4507311 4583079 4352201 4510731 4544844 4656380 4904237 4846309
15815 4846309 5048801 5224704 4946870 5058115 5351582 5130971 4706770 4756154 4748971 4737623
15805 4737623 4916438 4961641 4630879 4249415 4449829 4622659 5144755 5149471 4923437 4850391
15795 4850391 4912549 4944606 4870710 4944244 5067654 4987049 4948683 4781132 4645870 4557495 4727901
15784 4727901 4572706 4524606 4827677 5167474 4996652 4680088 4394626 4598471 4963845 4852278
15774 4852278 4491886 4275856 4403955 4645229 4871149 5087527 5109695 5012034 5008591 4967911
15764 4967911 4753304 4572334 5094819 5329176 4885064 5166287 5130056 4939656 4605739 4509885
15754 4509885 5108990 5489303 5043738 4991078 4764883 4940655 5208009 5249630 5346734 4569168
15744 4569168 4775068 5013015 5160691 4813663 5028760 4829818 4622525 4910493 4989583 4946892
15734 4946892 5263091 5062962 4508217 4750262 4905449 5194092 5158195 5045963 5206767 5129902
15724 5129902 4681288 4599434 4691557 4657078 4861802 4948141 4853493 4820868 4968743 4636028
15714 4636028 4510143 4733268 5069670 5008808 5087114 5351623 5071925 4937326 4977739 5125116
15704 5125116 4664937 4268864 4290993 4568326 4768476 4823440 4941013 4980581 4759186 4831829
15694 4831829 5248267 5330416 5371518 5331165 5086904 4653026 4858871 4837399 5203401 5447663
15684 5447663 5215564 4807718 5006085 5332469 4749557 4599198 4541358 4478036 4531679 4227905
15674 4227905 4347205 4723091 5003690 4814594 5048650 5129275 4766639 5152849 4782873 4332034
15664 4332034 4626171 4828181 4606632 4646832 4858057 5209704 5427097 5144259 5105685 4899705
15654 4899705 5066418 4764540 4491221 4684484 4913217 5096913 4841041 4807464 4608010 4549199
15644 4549199 4642357 5115765 5028537 4875517 4660112 4948166 5120571 4851063 4705298 4857231
15634 4857231 5315343 5067171 5463547 5545647 5404695 5575246 5823159 5342562 5197654 5412043
15624 5412043 5192862 5035429 4466924 4695119 4641135 4936694 5064784 5410073 5309892 5262135
15614 5262135 5082891 5091085 5259795 4563364 4512233 5175806 5057369 4906661 5044065 4877406
15604 4877406 4803664 4843478 5140207 5101782 4741059 4645171 4666202 4665721 4270748 4431648 4839106
15593 4839106 5271884 5584172 5022951 4968852 5031662 5046271 5151401 5080716 5566826 5665428
15583 5665428 5081288 4712872 4972469 5200848 5182029 5450993 5599744 5303384 5319990 5417829
15573 5417829 5306477 5077985 5149888 5297245 5613247 5485285 5392542 5210240 4872463 4873073
15563 4873073 5149188 4893945 4606659 4830397 5022494 4686413 4884662 5078851 5223603
15554 5223603 5318109 5169397 4821184 4568095 5223423 5222568 5057434 4710284 4709052 4808681 5092159
15543 5092159 5000483 4755158 4603402 5023399 4939725 4839333 4872953 4856297 4992876 5289617
15533 5289617 4966904 4752152 4590308 4883009 5087409 4785068 4522604 5125693 5139824 5233070
15523 5233070 4995371 5131793 5240690 5350687 5286420 4740410 4372685 4908625 5012287 4970447
15513 4970447 5216602 5070253 4827041 4892175 4699489 4938303 5239790 5033508 4960479 5130031
15503 5130031 5411036 5357944 5049803 5244452 5306979 5002565 5137407 5085879 5317254 5373340
15493 5373340 5311185 4635410 4925206 4934680 4754184 4771673 5399494 5325552 4958917 5034609
15483 5034609 4993175 4872365 4517110 4673174 4698821 4718450 4963903 4714510 4966372 4992704
15473 4992704 5071977 5146336 4963420 4810256 4895775 5186040 4711994 4860894 5002755 4810909
15463 4810909 5082921 5031245 5242182 4933262 4666124 4641157 4709275 5171160 4862834 4896756
15453 4896756 4885630 4911413 5124613 5062837 5021975 4956523 5076686 5026520 5125679 4858385 4850001
15442 4850001 5171831 5202338 5382472 5499837 5476127 5368883 5146770 5145691 5089758 5319248
15432 5319248 5330732 5452160 5129917 5072618 4873349 4743915 4988525 5380675 5300569 5222844
15422 5222844 5259596 5260897 5391865 5393402 5077214 4665748 4658840 4834052 5074311 5282918 5206369
15411 5206369 5116860 5350235 5523187 5046231 4801314 4716535 5123454 5365517 5008659 4818917
15401 4818917 4922526 5011881 4777184 4951126 5222390 4939206 4893476 5266255 5383169 5594988
15391 5594988 5279009 5139710 5354689 5233664 5102477 5072841 4897626 5040876 4833701 4741698
15381 4741698 5044104 5003608 5361345 5578622 5644550 5659526 5324939 5159760 4761249 4857931
15371 4857931 5015721 4952384 5360146 5175629 5207259 5172617 4674389 4866213 4867273 4952006
15361 4952006 5102431 4983451 4971916 5482870 5330044 5260541 5176434 5094042 5173075 5141600
15351 5141600 5051635 5227054 5512034 4954148 4991434 5027312 4866393 4816480 4981277 5187428
15341 5187428 5052689 5284192 5031510 4938488 5143424 4808945 5151651 5324656 5164808 5477826
15331 5477826 5310735 5343579 4943459 5046688 4896519 4925688 5021224 5034548 5068944 5383978
15321 5383978 5359865 5318265 5136422 5426589 5284755 4951212 5178008 5044723 5092962 5378668
15311 5378668 5267279 5016549 4946696 5088118 5366005 5323774 5009216 5202240 5160173 5095853
15301 5095853 5044479 4605143 4923971 4566237 4699455 5219550 5339436 5171564 5171773 5115405
15291 5115405 5077658 5267257 5164875 5229075 5374037 5434149 5122410 4879817 5046126 4932722
15281 4932722 4919184 4845702 5332013 5349311 5041705 4975252 5347694 5429887 5310924 5471947
15271 5471947 5748603 5558363 5190428 5191363 4897764 4859325 4941996 4724375 4865485 5090789
15261 5090789 5152039 5055913 5059345 5205553 5285583 5414654 5322321 5071778 5154540 5021732 5177863
15250 5177863 5041037 4621037 4860056 4946512 4736940 4731590 5218017 5323386 4652091 4659586
15240 4659586 4891348 4996538 4864151 4812630 5278005 5573589 5183890 4430180 4807745 4686417
15230 4686417 4517814 4646322 5137868 5114192 4981762 4540445 4863872 5244634 5199409 5501889
15220 5501889 5654739 5574859 5155003 5137440 5089935 5069948 5176821 5529581 5328496 5290456
15210 5290456 5160604 5307541 5509476 5252838 5050972 4944773 5167916 5351999 5045824
15201 5045824 5073294 5621978 5517610 5613068 5626983 5419900 5143557 4997012 5395384 4827156
15191 4827156 5112452 4975541 5074334 5025913 5084028 5377257 5379354 5517815 5495791 5285638
15181 5285638 5495470 5115217 4569163 4509200 4903790 5150502 5332400 5017316 5085831 5066935
15171 5066935 5134181 5157336 5034877 4940934 5269419 5181636 4951610 5175922 5026217 4920841
15161 4920841 4972577 4953287 4792922 4879211 4705578 5101998 5173574 5323739 4981515 4932219
15151 4932219 4951936 5064214 4971904 5263173 4984555 4620744 5000602 4875875 4676711 4866371
15141 4866371 5078749 5585001 5383809 5197404 5427795 4962257 5135358 5318226 5078270
15132 5078270 5616518 5295327 5230006 5429135 5286853 5189014 5002218 5035715 4781715 4810056
15122 4810056 4915603 5084109 5344257 5537407 5494818 5030857 5116446 5539050 5510465 5472678
15112 5472678 5335269 5187976 5539467 5587033 5429918 5266624 5280522 5014159 5162370 5236993
15102 5236993 5807385 5143970 4903133 4997255 5026378 5152378 5149789 5392723 5337259 5013267
15092 5013267 4928125 5223050 5310130 5289571 5589976 5427092 5130889 5640803 5390359 5044451
15082 5044451 5260432 5484259 5199827 5199736 5191854 4994810 4966711 4928778 5592562 5711659 5479808
15071 5479808 5286078 5028671 4984978 5584548 5780858 5299489 5113628 4971594 5088461 5281047
15061 5281047 5476005 5480032 5270545 5394139 5383966 5318176 5215133 5405887 5684240 5180463
15051 5180463 5139164 5342365 5206817 4914052 5174549 4976884 4918113 5339622 5059501 5006129
15041 5006129 4861969 4532155 5193819 4889416 4841526 5224582 5577912 5069675 4751382 5008980
15031 5008980 5222225 5148693 5396633 5437139 5235382 5032076 5069474 5442566 5461533 5154542
15021 5154542 5032847 5127429 5268771 5076511 4959411 4694300 4708033 5258040 5376911 5136055
15011 5136055 5100164 4709719 4815616 4716748 4795516 5007196 5035599 5186700 5525172 5422676
15001 5422676 5426367 5651920 5252604 5226722 5446705 5362764 5819187 5296134 5362634 5251971
14991 5251971 5006822 5414283 5609505 5603732 5179188 4928193 5026678 5458384 5405858 5656083
14981 5656083 5580455 5687425 5162981 5330826 5732516 5968634 5824936 6364638 5562574 5631423
14971 5631423 5909710 5420915 5247720 5286762 5272860 5093045 5265515 5524100 5340917 5290830
14961 5290830 5203241 5339374 5819771 5365768 5277444 5372412 5637792 5521117 5721497 5500481
14951 5500481 5542364 5600949 5668266 5784059 5667022 5476397 5307735 4995501 5113629 5207711
14941 5207711 5135820 5343185 5492815 5571103 5350639 5520500 5474780 5489848 5280362 5448793
14931 5448793 5516079 5269375 5341628 5540260 5236968 5273960 5337841 5868995 6096670 5664508
14921 5664508 5356629 5066723 5047116 5269227 5534103 5661150 5329657 5201659 5235229 5172728
14911 5172728 5447282 5731139 5473245 5379303 5571584 5363120 5337924 5278277 5461420 5592924
14901 5592924 5558663 5259349 5481612 5387694 5697127 5508918 5210092 5094259 5264364 5559293
14891 5559293 5385595 5295856 5299735 5548916 5360799 5142107 5124310 5052622 5328056 5098154
14881 5098154 5030008 5171426 4953477 5209585 4978619 5007428 4925778 5302845 5543760 5176052
14871 5176052 4948586 4995103 5120760 5457386 5497589 5323898 5601135 5968982 5883287 5770243
14861 5770243 5392370 5107770 4959924 5378853 5495743 5142070 5210402 5071283 5501152 5584370
14851 5584370 5666675 5744728 5468382 5659532 5577113 5698373 5686840 5524141 5711787 5640805
14841 5640805 5432536 5404947 5409970 5504764 5150894 5315028 5151233 5236533 5299090 5097294
14831 5097294 5301556 5345976 5235485 5401918 4850123 4876212 5396498 5403954 5702065 5993280
14821 5993280 5806179 5386194 5665269 5609066 5329391 5103804 5204557 5288431 5398157 5327537
14811 5327537 5355357 5418359 5439610 5186084 5332699 5594142 5401387 5268034 5638925 5513374
$$ [...]
##END NTUPLES=NMR SPECTRUM
##END=
