##TITLE=1H_EC-3293(V-3)
 CDCl3
 8 sc, 
 21.4.2023
##JCAMPDX= 6.0         $$ Bruker NMR JCAMP-DX V2.0
##DATA TYPE= NMR SPECTRUM
##DATA CLASS= NTUPLES
##ORIGIN= UXNMR, Bruker Analytische Messtechnik GmbH
##OWNER= root
$$ XWIN-NMR		Version 3.5
$$ Fri Apr 21 14:01:29 2023 Russian Standard Time (UT+4h)  she@DPX200
##.OBSERVE FREQUENCY= 200.13135
##.OBSERVE NUCLEUS= ^1H
##.ACQUISITION MODE= SIMULTANEOUS
##.ACQUISITION SCHEME= undefined
##.AVERAGES= 8
##.DIGITISER RES= 18
##SPECTROMETER/DATA SYSTEM= spect
##.PULSE SEQUENCE= zg30
##.SOLVENT NAME= D2O
##.SHIFT REFERENCE= (INTERNAL, D2O, 0, 15.7458)
##AUDIT TRAIL= $$ (NUMBER, WHEN, WHO, WHERE, WHAT)
$$ ##TITLE= Audit trail, XWIN-NMR		Version 3.5
$$ ##JCAMPDX= 5.01
$$ ##ORIGIN= Bruker BioSpin GmbH
$$ ##OWNER= she
$$ F:/spectra/data/she/nmr/H-F/1/pdata/1/auditp.txt
$$ ##AUDIT TRAIL=  $$ (NUMBER, WHEN, WHO, WHERE, WHAT)
(   1,<2023-04-21 14:00:08.57 +0400>,<she>,<DPX200>,
      <created by zg, POWCHK disabled, PULCHK disabled
       configuration hash MD5:
       00 E9 B6 7A A2 85 ED C7 34 08 36 98 17 FE 4E 26
       data hash MD5: 16K
       38 DA 26 21 CA E5 15 D2 A5 61 52 DD 9B D0 A0 FE>)
(   2,<2023-04-21 14:00:10.85 +0400>,<she>,<DPX200>,
      <Start of raw data processing
       efp BC_mod = 2 LB = 0.24 FT_mod = 6 PKNL = 1 PHC0 = -19834.79 PHC1 = 16.8008 SI = 16K 
       data hash MD5: 16K
       E1 3D 94 F0 20 80 B8 1F 9E A9 A1 C3 88 69 73 C7>)
(   3,<2023-04-21 14:00:30.64 +0400>,<she>,<DPX200>,
      <pk PHC0 = 4.455179 PHC1 = -5.8 
       data hash MD5: 16K
       7C D7 9D B5 63 E9 01 0E 11 31 A5 DE 75 AE DB A5>)
(   4,<2023-04-21 14:00:34.09 +0400>,<she>,<DPX200>,
      <abs ABSG = 5 
       data hash MD5: 16K
       11 33 93 32 C7 F8 AC 9D B0 85 BF C9 18 4C 7E 4D>)
$$ ##END=
$$ 
$$ hash MD5
$$ 72 68 1F 39 8C BE F0 B5 C8 65 5B 38 24 D2 62 30
##$RELAX= 
##$RELAX= 
##$RELAX= 
##$RELAX= 
##$RELAX= 
##$RELAX= 
$$ Bruker specific parameters
$$ --------------------------
##$DU= <F:/spectra>
##$EXPNO= 1
##$NAME= <H-F>
##$PROCNO= 1
##$TYPE= <nmr>
##$USER= <she>
##$AMP= (0..31)
100 100 100 100 100 100 100 100 100 100 100 100 100 100 100 100 100 100 
100 100 100 100 100 100 100 100 100 100 100 100 100 100 
##$AQSEQ= 0
##$AQ_mod= 1
##$AUNM= <au_zg>
##$AUTOPOS= <>
##$BF1= 200.13
##$BF2= 200.13
##$BF3= 200.13
##$BF4= 200.13
##$BF5= 200.13
##$BF6= 200.13
##$BF7= 200.13
##$BF8= 200.13
##$BYTORDA= 1
##$CFDGTYP= 0
##$CFRGTYP= 5
##$CHEMSTR= <none>
##$CNST= (0..31)
1 1 145 1 1 1 1 1 1 1 1 1 1 1 1 1 1 1 1 1 1 1 1 1 1 1 1 1 1 1 1 1 
##$CPDPRG= <>
##$CPDPRG1= <>
##$CPDPRG2= <>
##$CPDPRG3= <>
##$CPDPRG4= <mlev>
##$CPDPRG5= <mlev>
##$CPDPRG6= <mlev>
##$CPDPRG7= <mlev>
##$CPDPRG8= <mlev>
##$CPDPRGB= <>
##$CPDPRGT= <>
##$D= (0..31)
0 1.2 0 0 0 0 0 0 0 0.06 0 0.03 0 0 0 0 0.0002 0 0 0 0 0 0 0 0 0 0 0 0 
0 0 0 
##$DATE= 1682071207
##$DBL= (0..7)
120 120 120 120 120 120 120 120 
##$DBP= (0..7)
150 150 150 150 150 150 150 150 
##$DBP07= 0
##$DBPNAM0= <>
##$DBPNAM1= <>
##$DBPNAM2= <>
##$DBPNAM3= <>
##$DBPNAM4= <>
$$ [...]
##$SUBNAM3= <"">
##$SUBNAM4= <"">
##$SUBNAM5= <"">
##$SUBNAM6= <"">
##$SUBNAM7= <"">
##$SUBNAM8= <"">
##$SUBNAM9= <"">
##$SW= 18.05172834244
##$SWIBOX= (0..15)
0 0 2 0 0 0 0 0 0 0 0 0 0 0 0 0 
##$SW_h= 3612.71676300578
##$TD= 16384
##$TD0= 1
##$TE= 0
##$TE2= 300
##$TE3= 300
##$TEG= 300
##$TL= (0..7)
0 120 120 120 120 120 120 120 
##$TP= (0..7)
150 150 150 150 150 150 150 150 
##$TP07= 0
##$TPNAME0= <>
##$TPNAME1= <>
##$TPNAME2= <>
##$TPNAME3= <>
##$TPNAME4= <>
##$TPNAME5= <>
##$TPNAME6= <>
##$TPNAME7= <>
##$TPOAL= (0..7)
0.5 0.5 0.5 0.5 0.5 0.5 0.5 0.5 
##$TPOFFS= (0..7)
0 0 0 0 0 0 0 0 
##$TUNHIN= 0
##$TUNHOUT= 0
##$TUNXOUT= 0
##$USERA1= <user>
##$USERA2= <user>
##$USERA3= <user>
##$USERA4= <user>
##$USERA5= <user>
##$V9= 5
##$VALIST= <valist>
##$VCLIST= <CCCCCCCCCCCCCCC>
##$VD= 0
##$VDLIST= <DDDDDDDDDDDDDDD>
##$VPLIST= <PPPPPPPPPPPPPPP>
##$VTLIST= <TTTTTTTTTTTTTTT>
##$WBST= 1024
##$WBSW= 4
##$XGAIN= (0..3)
0 0 0 0 
##$XL= 0
##$YL= 0
##$YMAX_a= 443686
##$YMIN_a= -560034
##$ZGOPTNS= <>
##$ZL1= 120
##$ZL2= 120
##$ZL3= 120
##$ZL4= 120
##$ABSF1= 15.73366
##$ABSF2= -2.31819
##$ABSG= 5
##$ABSL= 3
##$ALPHA= 0
##$AQORDER= 0
##$ASSFAC= 0
##$ASSFACI= 0
##$ASSFACX= 0
##$ASSWID= 0
##$AUNMP= <proc_1d>
##$AZFE= 0.1
##$AZFW= 0.1
##$BCFW= 0
##$BC_mod= 2
##$BYTORDP= 0
##$COROFFS= 0
##$CY= -3
##$DATMOD= 1
##$DC= 0
##$DFILT= <>
##$DTYPP= 0
##$F1P= 0
##$F2P= 0
##$FCOR= 1
##$FTSIZE= 16384
##$FT_mod= 6
##$GAMMA= 0
##$GB= 0
##$INTBC= 1
##$INTSCL= 3.70164e-10
##$ISEN= 128
##$LB= 0.24
##$LEV0= 0
##$LPBIN= 0
##$MAXI= 10000
##$MC2= 0
##$MEAN= 0
##$ME_mod= 0
##$MI= 1.114404
##$NCOEF= 0
##$NC_proc= -7
##$NLEV= 6
##$NOISF1= 3.799351
##$NOISF2= 2.8
##$NSP= 0
##$NTH_PI= 0
##$NZP= 0
##$OFFSET= 15.74579
##$PC= 1
##$PHC0= -19830.33
##$PHC1= 11.0008
##$PH_mod= 1
##$PKNL= yes
##$PPARMOD= 0
##$PSCAL= 0
##$PSIGN= 0
##$REVERSE= no
##$SF= 200.130005153176
##$SI= 16384
##$SIGF1= 3
##$SIGF2= 2
##$SINO= 5.538805
##$SIOLD= 16384
##$SREGLST= <1H.CDCl3>
##$SSB= 0
##$STSI= 16384
##$STSR= 0
##$SW_p= 3612.71676300578
##$SYMM= 0
##$S_DEV= 0
##$TDeff= 16384
##$TDoff= 0
##$TI= <>
##$TILT= no
##$TM1= 0
##$TM2= 0
##$TOPLEV= 0
##$USERP1= <user>
##$USERP2= <user>
##$USERP3= <user>
##$USERP4= <user>
##$USERP5= <user>
##$WDW= 1
##$XDIM= 16384
##$YMAX_p= 532223591
##$YMIN_p= -777716
$$ End of Bruker specific parameters
$$ ---------------------------------
##NTUPLES= NMR SPECTRUM
##VAR_NAME=  FREQUENCY,     SPECTRUM/REAL,   SPECTRUM/IMAG
##SYMBOL=    X,             R,               I
##VAR_TYPE=  INDEPENDENT,   DEPENDENT,       DEPENDENT
##VAR_FORM=  AFFN,          ASDF,            ASDF
##VAR_DIM=   16384,         16384,           16384
##UNITS=     HZ,            ARBITRARY UNITS, ARBITRARY UNITS
##FACTOR=    0.220516191357247, 1,           1
##FIRST=     3151.20493935806, 0,            0
##LAST=      -461.511823647716, 0,           0
##MIN=       -461.511823647716, -777716,     0
##MAX=       3151.20493935806, 532223591,    0
$$ Real data points
##PAGE= N=1
##DATA TABLE= (X++(R..R)), XYDATA
$$ [...]
$$ plain form
6458 88241 96386 30449 -167225 -118171 -33392 95259 -10854 91073 42339 -103730 -150894
6447 -150894 99839 192404 45622 82293 -89601 -52418 -17746 -64289 -87515 31140 104081
6436 104081 -53621 10285 76751 -33686 -168637 -143438 -53214 -72417 -11967 143349 55774
6425 55774 27276 -3135 25951 18547 -156636 -48728 65488 -203963 30274 -24425 -6289
6414 -6289 -92154 -49018 -36696 -140567 -154939 -97375 26410 -16864 19004 55995 68037 -65680
6402 -65680 -219450 149740 89045 -10410 55696 -80183 -235232 -275228 -92165 -140922 -101140
6391 -101140 -82201 42639 9008 -186976 -89377 -121302 -208460 -192617 121141 341297 124081
6380 124081 101600 40116 -120759 -107355 -99058 -64988 -48403 -162235 -139184 -141440 -60055 -153587
$$ packed form
6458H8241Q145o5937j97674M9054Q4779J28651j06113J01927m8734j46069m7164
6447a50894K50733R2565j46782L6671j71894L7183L4672m6543k3226J18655P2941
6436A04081j57702O3906O6466j10437j34951K5199R0224j9203O0450J55316q7575
6425E5774k8498l0411K9086p404j75183J07908J14216k69451K34237n4699J8136
6414f289q5865M3136J2322j03871j4372N7564J23785m3274L5868L6991J2042j33717
6402f5680j53770L69190o0695r9455O6106j35879j55049l9996J83063m8757L9782
6391a01140J8939J24840l3631j95984R7599l1925q7158J5843L13758K20156k17216
6380A24081k2481o1484j60875J3404Q297L4070J6585j13832K3051k256Q1385r3532
$$ plain form
6368 -153587 -174578 -180575 -331301 -276444 -278988 -393324 -411525 -276933 -268875 -355807 -311751 -159661
6356 -159661 -145627 -112925 64735 45523 -210457 -143628 162587 -122043 -40098 -53270 -16634
6345 -16634 -182730 -211059 -181192 -114462 -59046 -120646 -121435 -367103 -314389 -146406 -96618 33922
6333 33922 9945 -71491 -61891 -71864 -238331 -292043 -329702 -209585 -175052 -189496 -228427 -163192
6321 -163192 -64921 -182533 -200486 13460 20097 -179025 -231662 -179706 -304290 -195712 -86156
6310 -86156 56833 213118 184349 143598 44778 -63256 -212366 -136048 -290328 -111621 -41103
6299 -41103 -7890 29656 118478 175613 199932 -39169 -4756 -174476 -185705 -123614 -245266
6288 -245266 -197309 -132464 79608 224710 323182 210411 212447 67075 -42654 -27104 65590
$$ packed form
6368a53587k0991n997j50726N4857k544j14336j8201J34592Q058q6932M4056J52090
6356a59661J4034L2702J77660j9212k55980O6829L06215k84630Q1945j3172L6636
6345a6634j66096k8329K9867O6730N5416o1600p89k45668N2714J67983M9788J30540
6333C3922k3977q1436R600r973j66467n3712l7659J20117L4533j4444l8931O5235
6321a63192R8271j17612j7953K13946O637j99122n2637N1956j24584J08578J09556
6310h6156J42989J56285k8769m0751r8820j08034j49110P6318j54280J78707P0518
6299d1103L3213L7546Q8822N7135K4319k39101L4413j69720j1229O2091j21652
6288b45266M7957O4845K12072J45102R8472j12771K036j45372j09729J5550R2694
$$ plain form
6277 65590 -212066 -177356 -116079 -273872 -98983 85385 -78397 -153845 -54284 -37983 -33089
6266 -33089 131410 -129548 -149901 34969 -66738 -150860 -224195 -199416 -203167 -199575 -335811
6255 -335811 -272096 -199893 -97907 -80160 -111414 -193914 -152208 -171605 -207969 -251569 -247653 -120205
6243 -120205 -47606 -119349 -24333 -121456 -204695 -173536 -110220 -183924 -434344 -453582 -260368
6232 -260368 -21281 -67287 -139102 -326559 -609601 -344907 -223958 -132969 -144683 -317720
6222 -317720 -412978 -250173 -54805 -204147 -307405 -152387 -245021 -203081 -67494 -146432
6212 -146432 -321999 -398367 -378541 -170800 -26441 -104464 -64265 -51823 -254862 -421321 -401246
6201 -401246 -325489 -220866 -142746 74909 -15230 41718 -150857 -224688 38485 186662 147953
$$ packed form
6277F5590k77656L4710O1277j57793J74889J84368j63782p5448R9561J6301M894
6266c3089J64499k60958k0353J84870j01707q4122p3335K4779l751L592j36236
6255c35811O3715P2203J01986J7747l1254q2500M1706j9397l6364m3600L916J27448
6243a20205P2599p1743R5016r7123q3239L1159O3316p3704k50420j9238J93214
6232b60368K39087m6006p1815j87457k83042K64694J20949R0989j1714j73037
6222c17720r5258J62805J95368j49342j03258J55018r2634M1940J35587p8938
6212a46432j75567p6368J9826K07741J44359p8023M0199J2442k03039j66459K0075
6201d01246P5757J04623P8120K17655r0139N6948j92575p3831K63173J48177l8709
$$ plain form
6190 147953 55708 77609 -54213 -84266 -99355 -129650 -159659 -43660 -154316 -115112 -21948
6179 -21948 7967 99758 94429 87263 28967 -174478 -204028 -176868 -79279 185383 39231 25844
6167 25844 188769 168318 32410 37578 -116613 -87819 -139674 -66796 -13700 -96870 -125027
6156 -125027 -101417 -208731 -136097 -195522 -181469 -163151 -262177 -172303 -258600 -146422 -6184
6145 -6184 90709 -147514 -112781 -235938 -72288 131561 -75818 -257946 -323699 -118070 9606
6134 9606 157033 -16531 -97809 -179712 -239558 -205816 -16305 -177040 -282405 -121978 -58606
6123 -58606 -210236 -235093 -286301 -231743 -125730 -202945 -212511 -33501 -48358 -95821 -153926
6112 -153926 -149495 -120053 -107368 -105971 -137193 -296783 -217967 -149594 -211236 -199994 -90628 33634
$$ packed form
6190A47953r2245K1901j31822l0053j5089l0295l0009J15999j10656L9204R3164
6179b1948K9915R1791n329p166n8296k03445k9550K7160R7589K64662j46152j3387
6167B5844J62925k0451j35908N168j54191K8794n1855P2878N3096q3170k8157
6156a25027K3610j07314P2634n9425J4053J8318r9026Q9874q6297J12178J40238
6145f184R6893k38223L4733j23157J63650K03849k07379j82128o5753K05629J27676
6134I606J47427j73564q1278q1903n9846L3742J89511j60735j05365J60427O3372
6123e8606j51630k4857n1208N4558J06013p7215r566J79010j4857m7463n8105
6112a53926M431K9442J2685J397l1222j59590P8816O8373o1642J1242J09366J24262
$$ plain form
6100 33634 -172459 -201976 -224731 -201621 3898 -7459 -142107 -155343 -90340 -260969 -156473
6089 -156473 174473 32404 -148948 -317104 -106657 97481 2729 -60458 -1447 159962
6079 159962 -6942 -67820 -222200 -553245 -232788 -36505 3656 -242029 -126393 -74229
6069 -74229 75312 -110918 -116713 -4811 -60380 -33695 -40998 -181125 -118404 157380 255621
6058 255621 84963 -47721 -36973 -151021 -92278 -3048 -70176 -217835 -145634 -12480 -89473
6047 -89473 -62897 -40946 -962 71591 148180 63363 159639 -39509 -40951 -13407 188399 169280
6035 169280 24048 38495 -143087 26587 -8128 -247047 -70865 -1640 -46568 65555
6025 65555 108711 271077 -86334 -151179 32625 -148484 -131402 18934 -113956 -22581 -111833
$$ packed form
6100C3634k06093k9517k2755K3110K05519j1357j34648j3236O5003j70629J04496
6089a56473L30946j42069j81352j68156K10447K04138r4752o3187N9011J61409
6079A59962j66904o0878j54380l31045L20457J96283M0161k45685J15636N2164
6069g4229J49541j86230n795J11902n5569K6685p303j40127O2721K75784R8241
6058B55621j70658j32684J0748j14048N8743Q9230o7128j47659P2201J33154p6993
6047h9473K6576K1951L9984P2553P6589q4817R6276j99148j442K7544K01806j9119
6035A69280j45232J4447j81582J69674l4715k38919J76182O9225m4928J12123
6025F5555M3156J62366l57411o4845J83804j81109J7082J50336j32890R1375q9252
$$ plain form
6014 -111833 -53651 -50923 -44978 -192140 -117951 73163 177045 133353 244277 124010 315614
6003 315614 227034 143875 29299 -114483 -136646 -219590 -139674 -9042 -83875 -145962 51832
5992 51832 224543 143734 149963 242299 182052 216931 168464 112112 245496 176566 132673 216292
5980 216292 204545 126054 -873 1011 -50009 -55479 -61272 -36197 128448 191359 138756 -57536
5968 -57536 -11482 15132 -88957 -75190 -127119 -104446 8097 59042 -21407 20974 113093
5957 113093 131209 116436 305834 191390 67577 130313 150169 89843 -22528 -3222 161931
5946 161931 189047 144283 -58587 -75522 -53623 284383 240517 206307 295507 273221 184424
5935 184424 88879 111109 86076 160320 270893 210917 268748 263914 384901 249299 206396
$$ packed form
6014a11833N8182K728N945j47162P4189J91114J03882m3692J10924j20267J91604
6003C15614q8580q3159j14576j43782k2163q2944P9916J30632p4833o2087J97794
5992E1832J72711q0809O229R2336o0247L4879m8467n6352J33384o8930m3893Q3619
5980B16292j1747p8491j26927J884n1020n470n793K5075J64645O2911n2603j96292
5968e7536M6054K6614j04089J3767n1929K2673J12543N0945q0449M2381R2119
5957A13093J8116j4773J89398j14444j23813O2736J9856o0326j12371J9306J65153
5946A61931K7116m4764k02870j6935K1899L38006m3866l4210Q9200k2286q8797
5935A84424r5545K2230k5033P4244J10573n9976N7831m834J20987j35602m2903
$$ plain form
5924 206396 123452 62524 -89970 189761 310489 153756 27777 139678 173751 269482
5914 269482 158840 -109638 -107754 34038 284223 342639 250848 161827 180708 282174 312503
5903 312503 257321 113348 78894 616 60653 138158 60779 208841 134451 225011 132358
5892 132358 278986 300657 370619 146892 271006 294682 299856 321241 437784 441938 301293
5881 301293 79342 106287 300969 188019 -15040 309863 429615 218359 96566 213685
5871 213685 287790 279186 159062 393374 414598 262804 146762 153315 286062 264226 354091
5860 354091 350140 237678 248526 456878 283561 376618 320270 284961 333179 270420 335300
5849 335300 371086 413926 217565 305177 529708 274218 254224 509799 509905 409517 438617
$$ packed form
5924B06396q2944o0928j52494K79731J20728j56733j25979J11901L4073R5731
5914B69482j10642k68478J884J41792K50185N8416r1791q9021J8881J01466L0329
5903C12503n5182j43973l4454p8278O0037P7505p7379J48062p4390R0560r2653
5892A32358J46628K1671O9962k23727J24114K3676N174K1385J16543M154j40645
5881C01293k21951K6945J94682j12950k03059L24903J19752k11256j21793J17119
5871B13685P4105q604j20124K34312K1224j51794j16042O553J32747k1836Q9865
5860C54091l951j12462J0848K08352j73317R3057n6348l5309M8218o2759O4880
5849C35300L5786M2840j96361Q7612K24531k55490j9994K55575J06j00388K9100
$$ plain form
5838 438617 440148 506364 303623 349642 529573 624902 511836 387276 356990 498037 377372
5827 377372 218829 311037 365204 509383 351442 314140 405381 353676 458613 338715 454140
5816 454140 413156 142706 283280 414252 352248 371329 475087 342744 521784 475560
5806 475560 445910 543623 429850 122706 290992 262636 245273 569581 449014 313389
5796 313389 440020 466427 386038 515471 598771 604333 554449 329144 461304 407497 443318
5785 443318 514739 374644 457008 494273 388135 336658 628672 501281 637605 668333 601377
5774 601377 470440 320147 474794 513158 501299 521556 377148 377401 536647 407849 346251
5763 346251 453918 463799 433577 478903 594990 558221 458571 579143 624929 682419 831585
$$ packed form
5838D38617J531O6216k02741M6019J79931R5329j13066j24560l0286J41047j20665
5827C77372j58543R2208N4167J44179j57941l7302R1241n1705J04937j19898J15425
5816D54140m0984k70450J40574J30972o2004J9081J03758j32343J79040m6224
5806D75560k9650R7713j13773l07144J68286k8356j7363L24308j20567j35625
5796C13389J26631K6407q0389J29433Q3300N562m9884k25305J32160n3807L5821
5785D43318P1421j40095Q2364L7265j06138n1477K92014j27391J36324L0728o6956
5774F01377j30937j50293J54647L8364j1859K0257j44408K53J59246j28798o1598
5763C46251J07667R881l0222M5326J16087l6769r9650J20572M5786N7490J49166
$$ plain form
5752 831585 738634 462085 358491 512872 597058 511051 446718 483407 550778 550290 345447
5741 345447 299035 330785 480892 540716 441103 559778 449905 456664 487012 343098 479163
5730 479163 508793 464061 503145 491711 505653 562810 496647 663143 537926 464492 654763
5719 654763 718105 567628 485926 598355 746310 758859 679917 607344 566432 563275 512161
5708 512161 577452 667847 469953 412968 508482 562830 635373 771177 691514 502619 585629
5697 585629 644105 597688 501154 390761 609501 759158 854736 688040 539329 505657 442569
5686 442569 769362 699022 631159 790391 660209 498064 692051 568596 507892 736203
5676 736203 902124 833313 621388 612217 742964 703211 705159 663670 678315 778931 670765
$$ packed form
5752H31585r2951k76549j03594J54381Q4186q6007o4333L6689O7371m88k04843
5741C45447m6412L1750J50107N9824r9613J18675j09873O759L0348j43914J36065
5730D79163K9630m4732L9084j1434J3942N7157o6163J66496j25217p3434J90271
5719F54763O3342j50477q1702J12429J47955J2549p8942p2573m0912l157n1114
5708E12161O5291R0395j97894n6985R5514N4348P2543J35804p9663j88895Q3010
5697E85629N8476m6417r6534j10393K18740J49657R5578j66696j48711l3672o3088
5686D42569L26793p0340o7863J59232j30182j62145J93987j23455o0704K28311
5676G36203J65921o8811k11925r171J30747l9753J948m1489J4645J00616j08166
$$ plain form
5665 670765 590864 920952 1092733 1068639 1153128 1171993 951933 743626 782028 828834 787244
5654 787244 1095899 1086835 870332 929069 910532 778661 903644 1087772 1023663 997154 998979
5643 998979 1070447 964122 900404 994061 1033102 1083814 1089632 1011621 1009951 1142281 1182014 1326442
5631 1326442 1381069 1295155 1377810 1214207 1244383 1290923 1255807 1373415 1391638 1562799 1387146
5620 1387146 1429956 1497829 1509523 1597732 1629941 1604348 1694002 1654913 1794845 1647474 1685991
5609 1685991 1723501 1900494 1978256 1868567 1793280 1876175 2122560 2186472 2266120 2279173 2205484
5598 2205484 2208461 2511535 2333053 2289786 2410008 2648306 2707710 2839338 2793023 2925978
5588 2925978 3007738 3184533 3198648 3274200 3287835 3210770 3302917 3436573 3501008 3666782 3796291
$$ packed form
5665F70765p9901L30088J71781k4094Q4489J8865k20060k08307L8402M6806m1590
5654G87244L08655r064k16503N8737j8537j31871J24983J84128o4109k6509J825
5643I98979P1468j06325o3718R3657L9041N0712N818p8011j670J32330L9733J44428
5631A326442N4627q5914Q2655j63603L0176M6540l5116J17608J8223J71161j75653
5620A387146M2810O7873J1694Q8209L2209k5593Q9654l9089J39932j47371L8517
5609A685991L7510J76993P7762j09689p5287Q2895K46385O3912P9648J3053p3689
5598B205484K977L03074j78482m3267J20222K38298N9404J31628m6315J32955
5588B925978Q1760J76795J4115P5552J3635p7065R2147J33656O4435J65774J29509
$$ plain form
5577 3796291 3895408 4027354 4176304 4318615 4322702 4550921 4579099 4605546 4764231 5007639
5567 5007639 5002410 5216355 5362785 5423881 5525372 5715491 6031018 6143512 6062051 6162269
5557 6162269 6245672 6179254 6335007 6369442 6538419 6631854 6677728 6704697 7026143 7287919 7065314
5546 7065314 7113014 7270720 7363077 7381194 7161661 7503850 7474217 7290375 7210493 7328542
5536 7328542 7408284 7202975 7294129 7316224 7258771 7210092 7256661 7181468 6909836 6889656 6687746
5525 6687746 6637856 6872143 6659250 6517512 6571716 6563795 6501729 6354716 6351851 6449013 6276382
5514 6276382 6440646 6459117 6128389 5870360 5646197 5635285 5679537 5669925 5578019 5405088 5484074
5503 5484074 5490193 5375971 5287244 5228637 5346300 5247236 5272946 5406325 5543354 5623881 5695675
$$ packed form
5577C796291R9117J31946J48950J42311M087K28219K8178K6447J58685K43408
5567E007639n229K13945J46430O1096J01491J90119L15527J12494q1461J00218
5557F162269Q3403o6418J55753L4435J68977R3435M5874K6969L21446K61776k22605
5546G065314M7700J57706R2357J8117k19533L42189k9633j83842p9882J18049
5536G328542P9742k05309R1154K2095n7453m8679M6569p5193k71632k0180k01910
5525F687746m9890K34287k12893j41738N4204p921o2066j47013k865R7162j72631
5514F276382J64264J8471l30728k58029k24163j0912M4252r612r1906j72931P8986
5503E484074O119j14222q8727n8607J17663r9064K5710J33379J37029Q0527P1794
$$ plain form
5492 5695675 5805255 5733248 5811405 6183338 6272867 6212377 6341763 6262352 6037670 5940796 5702931
5481 5702931 5640671 5595655 5573803 5336737 5291767 5510776 5313258 5300693 5159461 5295849
5471 5295849 5505689 5362496 5483083 5708822 5975184 6219422 6554119 7036910 7369090 7585157
5461 7585157 7822725 8350373 8879463 9547470 9831398 10255828 10575077 10571153 10426500 10038707
5451 10038707 9649020 9024540 8660835 8381511 7950474 7607475 7456905 7446269 7487312 7343135
5441 7343135 7137147 7339168 7442422 7437414 7667606 7696420 7720170 8214967 8499898 8953258
5431 8953258 9551026 9908203 10368700 10851740 11488230 12071775 12378205 12672625 12774958 12887347
5421 12887347 12553435 12053963 11504307 11071520 10659622 10111227 9847814 9653284 9217135
$$ packed form
5492E695675J09580p2007P8157L71933Q9529o0490J29386p9411k24682r6874k37865
5481E702931o2260m5016k1852k37066m4970K19009j97518j2565j41232J36388
5471E295849K09840j43193J20587K25739K66362K44238L34697M82791L32180K16067
5461G585157K37568N27648N29090O68007K83928M24430L19249l924j44653l87793
5451A0038707l89687o24480l63705k79324m31037l42999j50570j0636M1043j44177
5441G343135k05988K02021J03254n008K30192K8814K3750M94797K84931M53360
5431H953258N97768L57177M60497M83040O36490N83545L06430K94420J02333J12389
5421A2887347l33912m99472n49656m32787m11898n48395k63413j94530m36149
$$ plain form
5412 9217135 9081637 9130642 9165509 9184865 9187255 9182213 9095495 9083017 9078940 9169908 9258494 9212791
5400 9212791 9107021 9245040 9358985 9311419 9344118 9498636 9722434 9650778 9631828 9583215
5390 9583215 9174577 8994581 8875770 8761538 8317127 7962481 7677483 7415045 7385853 7355881
5380 7355881 7254279 7091255 7047315 6835842 6430561 6407765 6504850 6398444 6260146 6259561 6247289
5369 6247289 6184804 5957703 5843410 5885230 5883358 5707373 5428453 5169679 5369672 5445616
5359 5445616 5306695 5228141 5156924 4944841 4887938 4740244 4525730 4518491 4547783 4467213 4363361
5348 4363361 4397465 4373339 4245240 4120463 4202369 4023354 3909526 3747915 3681259 3806641
5338 3806641 3766711 3867158 3743068 3617593 3612024 3682484 3706089 3542783 3554297 3430921 3332732
$$ packed form
5412I217135j35498M9005L4867J9356K390n042q6718j2478m077R0968Q8586m5703
5400I212791j05770J38019J13945m7566L2699J54518K23798p1656j8950m8613
5390I583215m08638j79996j18811j14232m44411l54646k84998k62438k9192k9972
5380G355881j01602j63024m3940k11473m05281k2796R7085j06406j38298n85j2272
5369F247289o2485k27101j14293M1820j872j75985k78920k58774J99993P5944
5359E445616j38921p8554p1217k12083n6903j47694k14514p239K9292q0570j03852
5348D363361L4104k4126j28099j24777Q1906j79015j13828j61611o6656J25382
5338C806641l9930J00447j24090j25475n569P0460K3605j63306J1514j23376r8189
$$ plain form
5327 3332732 3421606 3378640 3539541 3332723 3222066 3189549 3087721 3069558 3179872 3172079 3222652
5316 3222652 3191914 3199402 3105755 3021299 3133792 3074102 2950675 2777933 2759474 2858605 2833073
5305 2833073 2607690 2641307 2594461 2611758 2504194 2652229 2680994 2566620 2364994 2462857
5295 2462857 2565831 2687806 2502989 2445095 2738534 2480531 2511386 2727682 2708540 2807613
5285 2807613 2746402 2661305 2661895 2556920 2407987 2530099 2404543 2355034 2288790 2321963 2299462
5274 2299462 2232244 2260316 2068154 1862269 1853777 1965072 2154028 2249487 2265088 2280043 2099345
5263 2099345 2014518 2040661 2130579 2103979 2085360 2099596 2093085 1976683 2225783 2262945 2525310
5252 2525310 2461635 2447608 2319026 2085474 2051123 2079529 1808604 1662781 1839730 1789484
$$ packed form
5327C332732Q8874m2966J60901k06818j10657l2517j01828j8163J10314p793N0573
5316C222652l0738P488r3647q4456J12493n9690j23427j72742j8459R9131k5532
5305B833073k25383L3617m6846J7297j07564J48035K8765j14374k01626R7863
5295B462857J02974J21975j84817n7894K93439k58003L0855K16296j9142R9073
5285B807613o1211q5097N90j04975j48933J22112j25556m9509o6244L3173k2501
5274B299462o7218K8072j92162k05885q492J11295J88956R5459J5601J4955j80698
5263B099345q4827K6143Q9918k6600j8619J4236o511j16402K49100L7162K62365
5252B525310o3675j4027j28582k33552l4351K8406k70925j45823J76949n0246
$$ plain form
5242 1789484 1842080 1994819 2076261 2027639 1993823 1784539 1641151 1723404 1804484 1918097 2082825
5231 2082825 1904884 1958375 1791133 1744028 1780800 1720736 1910955 2049759 2026441 2004742 2047400
5220 2047400 2221266 2239654 2224638 2443992 2436644 2538674 2652981 2434223 2417569 2261890
5210 2261890 2168978 2061375 1913174 1760879 1679292 1760594 1767644 1719029 1701689 1564721 1490945
5199 1490945 1546648 1714458 1621595 1398741 1390650 1546975 1559368 1478702 1439839 1299493 1417033
5188 1417033 1484397 1428740 1234309 1318517 1308312 1419274 1474030 1382276 1469076 1347161 1266248
5177 1266248 1376678 1475996 1514468 1412051 1309875 1181308 1206684 1331699 1488907 1412345
5167 1412345 1337899 1086127 1081670 1165707 1220229 1188926 1227970 1099006 1001869 1233886 1093805
$$ packed form
5242A789484N2596J52739Q1442m8622l3816k09284j43388Q2253Q1080J13613J64728
5231B082825j77941N3491j67242m7105L6772o0064J90219J38804k3318k1699M2658
5220B047400J73866J8388j5016K19354p348J02030J14307k18758j6654j55679
5210B261890r2912j07603j48201j52295q1587Q1302P050m8615j7340j36968p3776
5199A490945N5703J67810r2863k22854q091J56325J2393q0666l8863j40346J17540
5188A417033O7364n5657j94431Q4208j0205J10962N4756r1754Q6800j21915q0913
5177A266248J10430R9318L8472j02417j02176j28567K5376J25015J57208p6562
5167A412345p4446k51772m457Q4037N4522l1303L9044j28964r7137K32017j40081
$$ plain form
5156 1093805 1095498 1085919 1050336 1149559 1363628 1333640 1226594 1340028 1333478 1289303 1422479
5145 1422479 1087090 1065819 1346545 1316810 1307488 1401865 1280594 1370262 1627781 1554026 1634585
5134 1634585 1669934 1833308 1955250 1921282 1798246 1929999 1944974 1978443 2162414 2225381
5124 2225381 2468386 2614183 2496568 2188945 2336091 2445920 2530019 2662368 2801653 2714205
5114 2714205 2738278 2930905 3079783 3101280 3045795 3205905 3220226 3350378 3280202 3130423
5104 3130423 3395254 3495522 3566526 3419852 3486831 3512285 3434323 3575444 3782526 3964569
5094 3964569 4159430 4165048 4125591 4106609 4229903 4085286 4076302 4064117 3930399 3929343 3712911
5083 3712911 3607642 3822266 3940918 3788429 3752583 3881747 4018592 3857051 3964233 4084530
$$ packed form
5156A093805J693r579l5583R9223K14069k9988j07046J13434o550m4175J33176
5145A422479l35389k1271K80726k9735r322R4377j21271Q9668K57519p3755Q0559
5134A634585L5349J63374J21942l3968j23036J31753J4975L3469J83971O2967
5124B225381K43005J45797j17615l07623J47146J09829Q4099J32349J39285q7448
5114B714205K4073J92627J48878K1497n5485J60110J4321J30152p0176j49779
5104C130423K64831J00268P1004j46674O6979K5454p7962J41121K07082J82043
5094C964569J94861N618l9457j8982J23294j44617q984j2185j33718j056k16432
5083C712911j05269K14624J18652j52489l5846J29164J36845j61541J07182J20297
$$ plain form
5073 4084530 4150737 3980423 4112370 4172097 4256672 4472637 4546374 4417620 4421227 4487429 4643463
5062 4643463 4754635 4689580 4546236 4568277 4498761 4371877 4439459 4460451 4324530 4160020
5052 4160020 3966134 3508554 3556840 3653688 3505932 3354207 3185159 3216165 3108492 2980093
5042 2980093 2921112 2902859 2843929 2826236 2719023 2519231 2228336 2453904 2708029 2445880
5032 2445880 2081753 2143003 2023994 2017567 2042544 1992675 1966563 1974071 1997012 1956984 1836458
5021 1836458 1857242 1927783 1898312 1923705 1810141 1607430 1594857 1870947 1696390 1663835 1691331
5010 1691331 1787199 1768128 1798456 1768557 1667118 1687060 1852665 1857623 1836525 1699134 1610884
4999 1610884 1872477 1808659 1704549 1633797 1554557 1704222 1852989 1794023 1595763 1716917
$$ packed form
5073D084530O6207j70314J31947N9727Q4575K15965P3737j28754L607O6202J56034
5062D643463J11172o5055j43344K2041o9516j26884O7582K0992j35921j64510
5052D160020j93886m57580M8286R6848j47756j51725j69048L1006j07673j28399
5042B980093n8981j8253n8930j7693j07213j99792k90895K25568K54125k62149
5032B445880l64127O1250j19009o427K4977m9869k6112P508K2941m0028j20526
5021A836458K0784P0541k9471K5393j13564k02711j2573K76090j74557l2555K7496
5010A691331R5868j9071L0328k9899j01439J9942J65605M958k1098j37391q8250
4999A610884K61593o3818j04110p0752p9240J49665J48767n8966j98260J21154
$$ plain form
4989 1716917 1703313 1886332 1729292 1641116 1537107 1529283 1687508 1689303 1803066 1694146 1644525
4978 1644525 1574263 1663818 1473457 1563099 1696364 1732448 1772253 1774039 1771549 1577425 1743441
4967 1743441 1690888 1676749 1755180 1843077 1792639 1875773 1931535 1878969 1847306 1878414 1753683
4956 1753683 1889639 1819775 1788838 1938768 1997132 2027458 2082717 2061693 1953478 1959985 1908128
4945 1908128 1883230 1976105 2188953 2379363 2395048 2454997 2457083 2376700 2416573 2355237 2429280
4934 2429280 2632995 2634668 2779287 2777901 2762311 2727013 2832299 3024499 3127856 3288989 3337443
4923 3337443 3372335 3469530 3599100 3758095 4099520 4182329 4216789 4216976 4317676 4254809 4394342
4912 4394342 4543444 4865119 4761801 4725892 4654041 4838172 4928177 4799072 4901056 4857368
$$ packed form
4989A716917j3604J83019j57040q8176j04009p824J58225J795J13763j08920m9621
4978A644525p0262Q9555j90361Q9642J33265L6084L9805J786k490j94124J66016
4967A743441n2553j4139P8431Q7897n0438Q3134N5762n2566l1663L1108j24731
4956A753683J35956o9864l0937J49930N8364L0326N5259k1024j08215O507n1857
4945A908128k4898R2875K12848J90410J5685N9949K086q0383L9873o1336P4043
4934B429280K03715J673J44619j386j5590l5298J05286J92200J03357J61133M8454
4923C337443L4892R7195J29570J58995L41425Q2809L4460J87J00700o2867J39533
4912D394342J49102L21675j03318l5909p1851J84131R0005j29105J01984m3688
$$ plain form
4902 4857368 5020526 5195537 5124150 5238229 5266408 5494531 5604933 5970264 6173688 6161137
4892 6161137 6198110 6310040 6497124 6637718 6378305 6432123 6337522 6249682 6646446 6764064
4882 6764064 6785122 6911193 6946075 6794564 6977149 7056256 7257734 7309364 7317705 7288457 7389290
4871 7389290 7503712 7543773 7685846 7659946 7602321 7637308 7690721 7713704 7778648 7867756 7951871
4860 7951871 8073340 7925148 7850306 8103191 8050314 7854843 7869861 7895080 7990832 8176335
4850 8176335 8527748 8575289 8721843 8652851 8605600 8694493 8672344 8859584 9019919 9148653
4840 9148653 9138151 9214173 9266416 9418009 9531339 9482647 9509548 9423831 9415994 9371506 9577310
4829 9577310 9595360 9435325 9451090 9459277 9637080 9588644 9582155 9625921 9685391 9791065 9741142
$$ packed form
4902D857368J63158J75011p1387J14079K8179K28123J10402L65331K03424j2551
4892F161137L6973J11930J87084J40594k59413N3818r4601q7840L96764J17618
4882F764064K1058J26071L4882j51511J82585P9107K01478N1630Q341k9248J00833
4871G389290J14422M0061J42073k5900n7625L4987N3413K2983O4944Q9108Q4115
4860G951871J21469j48192p4842K52885n2877j95471J5018K5219R5752J85503
4850H176335L51413M7541J46554o8992m7251Q8893k2149J87240J60335J28734
4840I148653j0502P6022N2243J51593J13330m8692K6901q5717p837m4488K05804
4829I577310J8050j60035J5765Q187J77803m8436o489M3766N9470J05674m9923
$$ plain form
4818 9741142 10108264 10063472 9785800 9673906 9741132 9828060 10053605 9985783 9981448 10033143 10001068
4807 10001068 9949945 10004910 10055623 9922724 9906633 10014236 10060800 10123883 10316521 10417812
4797 10417812 10396886 10607872 10753733 11035771 11260936 11390539 11330351 11565524 12115646 12456419
4787 12456419 12608522 12717701 13020589 13135033 13322902 13588994 13946242 14288612 14381272 14718011
4777 14718011 15174317 15594573 16188287 16442576 16721994 16984650 17465517 18003299 18588414
4768 18588414 19130298 19899881 20602052 21694193 23118044 24537655 26369415 28607385 31049850
4759 31049850 33795383 37091135 41191064 46237709 52800533 60852089 69946266 78761637
4751 78761637 85041218 87048976 84953317 80197593 73088712 64411245 55783866 48197947
$$ packed form
4818I741142L67122m4792k77672j11894O7226Q6928K25545o7822m335N1695l2075
4807A0001068n1123N4965N0713j32899j6091J07603M6564O3083J92638J01291
4797A0417812k0926K10986J45861K82038K25165J29603o0188K35173N50122L40773
4787A2456419J52103J09179L02888J14444J87869K66092L57248L42370R2660L36739
4777A4718011M56306M20256N93714K54289K79418K62656M80867N37782N85115
4768A8588414N41884P69583P02171J092141J423851J419611J831760K237970K442465
4759C1049850K745533L295752M099929N046645O562824Q051556R094177Q815371
4751G8761637O279581K007758k095659m755724p108881q677467q627379p585919
$$ plain form
4743 48197947 41715755 36559211 32572813 29470042 26741634 24466121 22927415 21469029
4735 21469029 20079187 19149978 18297060 17452812 16889910 16278632 15713047 15402278 15082160
4726 15082160 14665605 14475574 14243693 14134134 13944336 13950602 13961952 13849465 13764390 13849984
4716 13849984 13588399 13653934 13894241 13762924 14090700 14248471 14433780 14503479 14914830 15154869
4706 15154869 15309907 15817404 16414039 17009063 17260451 17779545 18378241 19101018 19832952
4697 19832952 20865683 22337014 23876004 25602093 27739817 30147219 33081274 36643967
4689 36643967 40918449 45958143 52078797 59398235 67374010 75269497 81068647 82996581
4681 82996581 81485328 77421530 70925714 63018786 55032927 47640497 41365655 36247514
$$ packed form
4743D8197947o482192n156544l986398l102771k728408k275513j538706j458386
4735B1469029j389842r29209q52918q44248n62902o11278n65585l10769l20118
4726A5082160m16555j90031k31881j09559j89798O266J1350j12487q5075Q5594
4716A3849984k61585O5535K40307j31317L27776J57771J85309O9699M11351K40039
4706A5154869J55038N07497N96635N95024K51388N19094N98696P22777P31934
4697A9832952J032731J471331J538990J726089K137724K407402K934055L562693
4689C6643967M274482N039694O120654P319438P975775P895487N799150J927934
4681H2996581j511253m063798o495816p906928p985859p392430o274842n118141
$$ plain form
4673 36247514 31946666 28542687 25660562 23446131 21548561 19819944 18559250 17454279
4665 17454279 16501914 15779702 14972105 14364702 13834952 13362615 13076806 12724807 12351583
4656 12351583 12097097 11653810 11322375 10760559 10146427 9871226 9503477 8993198 8830763
4647 8830763 8567254 8390366 8315884 8006838 7888108 7395035 7052130 6975733 6844356 6674993
4637 6674993 6573058 6414769 6272339 6341194 6001078 6055243 5898083 5604329 5577463 5548145
4627 5548145 5366368 5291049 5254492 5369440 5489621 5322714 5281193 5159399 5097697 5042388
4617 5042388 4879741 4912298 4911045 4609468 4532901 4306571 4431513 4491543 4373837 4239345
4607 4239345 4417219 4422040 4383615 4429043 4200008 4184700 4008042 3945524 4315674 4309522 4079589
$$ packed form
4673C6247514m300848l403979k882125k214431j897570j728617j260694j104971
4665A7454279r52365p22212q07597o07403n29750m72337k85809l51999l73224
4656A2351583k54486m43287l31435n61816o14132k75201l67749n10279j62435
4647H830763k63509j76888p4482l09046j18730m93073l42905p6397j31377j69363
4637F674993j01935j58289j42430O8855l40116N4165j57160k93754k6866k9318
4627E548145j81777p5319l6557J14948J20181j66907m1521j21794o1702n5309
4617E042388j62647L2557j253l01577p6567k26330J24942O0030j17706j34492
4607D239345J77874M821l8425M5428k29035j5308j76658o2518L70150o152k29933
$$ plain form
4596 4079589 4028124 4195230 4276374 4275787 4175895 3766019 3622183 3556898 3712249 3767012 3775851
4585 3775851 4075095 4028991 3798541 3657205 3654061 3697745 3621900 3634901 3717526 3824499 3973341
4574 3973341 3831512 3647346 3891338 3915824 3804295 3654920 3775023 3872256 3763014 3509545
4564 3509545 3485192 3642259 3750923 3868042 3816635 3676745 3651011 3726780 3886719 4009923
4554 4009923 3862876 3960154 3894364 3804232 3912303 3956441 3807957 3696250 3791423 4145695
4544 4145695 4128948 3982582 3805392 3931161 4217594 4366039 4231889 4049218 4071294 4145826
4534 4145826 4183341 4188177 4230101 4238264 4449036 4471876 4423413 4518548 4690471 4688937 4647194 4783035
4522 4783035 4964689 5016961 4908936 4811894 4858851 4911660 5004219 5127458 5248739 5368016
$$ packed form
4596D079589n1465J67106Q1144n87r9892m09876j43836o5285J55351N4763Q839
4585C775851K99244m6104k30450j41336l144M3684p5845J3001Q2625J06973J48842
4574C973341j41829j84166K43992K4486j11529j49375J20103R7233j09242k53469
4564C509545k4353J57067J08664J17119n1407j39890k5734P5769J59939J23204
4554D009923j47047R7278o5790r0132J08071M4138j48484j11707R5173L54272
4544D145695j6747j46366j77190J25769K86433J48445j34150j82671K2076P4532
4534D145826L7515M836M1924Q163K10772K2840m8463R5135J71923j534m1743J35841
4522D783035J81654N2272j08025r7042M6957N2809R2559J23239J21281J19277
$$ plain form
4512 5368016 5560142 5541887 5406468 5353664 5457532 5627027 5668143 5794306 5987124 6069838
4502 6069838 6201443 6184016 6197687 6281330 6358632 6503271 6690459 6771172 6878966 7075586
4492 7075586 7112471 7359897 7463478 7493608 7774139 7928680 8026910 8321308 8520097 8673986
4482 8673986 8816423 8907701 9199793 9535321 9908487 10033432 10200927 10536575 11084145 11797089
4472 11797089 11996876 12188455 12599177 13075236 13398983 13947766 14380220 14496828 14881128
4463 14881128 15146242 15389045 15457916 15569708 15907673 16278305 16467028 16574643 16621273 16945734
4453 16945734 17000674 17139690 17408076 17648783 18076678 17997118 18750472 19325377 19673213 20278802
4443 20278802 20917538 21601959 22017923 22550281 23440004 24211030 25092026 26010102 26974283
$$ packed form
4512E368016J92126j8255j35419n2804J03868J69495M1116J26163J92818Q2714
4502F069838J31605j7427J3671Q3643P7302J44639J87188Q0713J07794J96620
4492G075586L6885K47426J03581L0130K80531J54541R8230K94398J98789J53889
4482H673986J42437R1278K92092L35528L73166J24945J67495L35648N47570P12944
4472A1797089J99787J91579M10722M76059L23747N48783M32454J16608L84300
4463A4881128K65114K42803O8871J11792L37965L70632J88723J07615M6630L24461
4453A6945734N4940J39016K68386K40707M27895p9560P53354N74905L47836O05589
4443B0278802O38736O84421M15964N32358Q89723P71026Q80996R18076R64181
$$ plain form
4434 26974283 27709710 28571805 29189173 29726922 30432520 31133413 31517074 31627072 31907858
4425 31907858 32325634 32623306 33018286 33448675 33737343 34077096 34215175 34465725 34911176
4416 34911176 35382984 35565715 35770871 35785311 35869720 36098463 36175442 36350816 36573124 36514980
4406 36514980 36732981 37070510 37304857 37338013 37722094 37898569 38228181 38531978 38802042 39133148
4396 39133148 39537949 39971759 40309897 40585035 40927636 41159262 41341402 41457101 41431275 41548026
4386 41548026 41694687 41719081 41523813 41218919 40639543 39997742 39705976 39151249 38245918 37564966
4376 37564966 36923971 35949851 34895975 34253859 33406196 32352391 31296292 30541485 29876998
4367 29876998 28958555 28167993 27265821 26569101 26064809 25504439 24843378 24161492 23455645
$$ packed form
4434B6974283P35427Q62095O17368N37749P05598P00893L83661J09998K80786
4425C1907858M17776K97672L94980M30389K88668L39753J38079K50550M45451
4416C4911176M71808J82731K05156J4440Q4409K28743P6979J75374K22308n8144
4406C6514980K18001L37529K34347L3156L84081J76475L29612L03797K70064L31106
4396C9133148M04801M33810L38138K75138L42601K31626J82140J15699k5826J16751
4386D1548026J46661K4394j95268l04894n79376o41801k91766n54727r05331o80952
4376C7564966o40995r74120j053876o42116q47663j053805j056099p54807o64487
4367B9876998r18443p90562r02172o96720n04292n60370o61061o81886p05847
$$ plain form
4358 23455645 23063364 22806718 22604374 22329215 21996687 21840344 21751082 21492410 21578600 21413332
4348 21413332 21211910 21226797 21291038 21374104 21276497 21200508 21299676 21507536 21621130 21660939 21870786
4337 21870786 22017161 22216344 22415322 22597017 23157779 23541744 24042430 24273183 24793888
4328 24793888 25339908 25853585 26305144 26818016 27339548 27817111 28302046 28913668 29467109
4319 29467109 30136868 30801478 31599521 32235189 33006991 33820390 34607895 35420195 36226477
4310 36226477 36945879 37941243 38760447 39362771 39937334 40509393 40955460 41437026 41811113
4301 41811113 42317905 42388858 42527102 42613037 42575146 42512442 42413346 42295926 42047292 42119581
4291 42119581 42093784 41822385 41483820 41233942 41227170 41279781 41167006 41099072 40909868 41232201
$$ packed form
4358B3455645l92281k56646k02344k75159l32528j56343q9262k58672Q6190j65268
4348B1413332k01422J4887O4241Q3066r7607p5989R9168K07860J13594L9809K09847
4337B1870786J46375J99183J98978J81695N60762L83965N00686K30753N20705
4328B4793888N46020N13677M51559N12872N21532M77563M84935O11622N53441
4319B9467109O69759O64610P98043O35668P71802Q13399P87505Q12300Q06282
4310C6226477P19402R95364Q19204O02324N74563N72059M46067M81566L74087
4301D1811113N06792P0953J38244Q5935l7891o2704r9096j17420k48634P2289
4291D2119581k5797k71399l38565k49878o772N2611j12775o7934j89204L22333
$$ plain form
4281 41232201 41290595 41309706 41392622 41408393 41253380 41260867 41445907 41586054 41813034 41763335 41689838
4270 41689838 41576679 41549527 41481405 41315124 41153983 40900812 40311327 39987223 39774563 39170351
4260 39170351 38821037 38373298 37767101 37199674 36775380 36575867 36265544 35843079 35508726
4251 35508726 35128989 34946929 34739315 34520909 34228438 34136451 34001110 33519155 32966314 32597790
4241 32597790 32093507 31612308 31063634 30718423 30472187 30201837 29961705 29949405 29574180 29413455
4231 29413455 29143983 29065601 28977668 28961121 29022280 28985473 28935678 29133520 29565400 29983300
4221 29983300 30284190 30339762 30504813 30403271 30343346 30333033 30364495 30476718 30593736 30792472
4211 30792472 30873231 30900573 31011007 30999237 31045111 31382357 31366609 31297987 31536858 31484086 31363533
$$ packed form
4281D1232201N8394J9111Q2916J5771j55013P487J85040J40147K26980m9699p3497
4270D1689838j13159k7152o8122j66281j61141k53171n89485l24104k12660o04212
4260C9170351l49314m47739o06197n67427m24294j99513l10323m22465l34353
4251C5508726l79737j82060k07614k18406k92471r1987j35341m81955n52841l68524
4241C2597790n04283m81199n48674l45211k46236k70350k40132j2300l75225j60725
4231B9413455k69472p8382q7933j6547O1159l6807m9795J97842M31880M17900
4221B9983300L00890N5572J65051j01542n9925j0313L1462J12223J17018J98736
4211C0792472Q0759K7342J10434j1770M5874L37246j5748o8622K38871n2772j20553
$$ plain form
4200 31363533 31436245 31669618 31795222 32057055 32089786 32208819 32461397 32610465 32833926 33127554
4190 33127554 33343929 33330565 33491825 33772413 33986509 34250897 34371167 34325719 34144278 34283484
4180 34283484 34385926 34544216 34600168 34616394 35074224 35179533 35083280 35322428 35522381 35389245
4170 35389245 35403454 35409649 35520798 35516791 35450007 35446189 35337920 35263725 35230941 35233919 35147131 35389542
4158 35389542 35386631 35304863 35468349 35622826 35714588 35886737 36139660 36376638 36580240 37054979
4148 37054979 37394085 37854913 37822222 38033853 38475049 38599941 38766596 38988075 39360216 39524216
4138 39524216 39788697 40254679 40823458 41419026 41825093 42367209 43061133 43491585 43757387
4129 43757387 44066440 44094483 44104414 44219954 44029451 43921218 43924854 43735386 43681887 43408341
$$ packed form
4200C1363533P2712K33373J25604K61833L2731J19033K52578J49068K23461K93628
4190C3127554K16375j3364J61260K80588K14096K64388J20270m5448j81441J39206
4180C4283484J02442J58290N5952J6226M57830J05309r6253K39148J99953j33136
4170C5389245J4209O195J11149m007o6784l818j08269p4195l2784K978q6788K42411
4158C5389542k911q1768J63486J54477R1762J72149K52923K36978K03602M74739
4148C7054979L39106M60828l2691K11631M41196J24892J66655K21479L72141J64000
4138C9524216K64481M65982N68779N95568M06067N42116O93924M30452K65802
4129D3757387L09053K8043R931J15540j90503j08233L636j89468n3499k73546
$$ plain form
4119 43408341 43267448 43254205 43206444 43311870 43550195 43843580 44270563 44898608 45157081 45579161
4109 45579161 46224215 46733416 47028027 47285599 47859637 48269799 48769786 49117495 49128388 49632558
4099 49632558 50309602 51110554 51750768 52331570 53173320 54094193 54995679 55853407 56563508
4090 56563508 57594541 58545427 59463585 60612467 61459627 62327863 63476690 64560045 65899071
4081 65899071 67385456 68793137 70378827 71933073 73711771 75520722 77104845 78887695
4073 78887695 80698577 82432590 84585586 86411782 88331317 90447538 92828958 95325091
4065 95325091 97932647 101016778 104155573 107758927 111623520 116239655 121443626 127711265
4057 127711265 134496238 141658591 149131400 156463177 163180257 169066334 174430953 179947348
$$ packed form
4119D3408341j40893j3243m7761J05426K38325K93385M26983O28045K58473M22080
4109D5579161O45054N09201K94611K57572N74038M10162M99987L47709J0893N04170
4099D9632558O77044Q00952O40214N80802Q41750R20873R01486Q57728P10101
4090E6563508J031033R50886R18158J148882Q47160Q68236J148827J083355J339026
4081F5899071J486385J407681J585690J554246J778698J808951J584123J782850
4073G8887695J810882J734013K152996J826196J919535K116221K381420K496133
4065I5325091K607556L084131L138795L603354L864593M616135N203971O267639
4057A27711265O784973P162353P472809P331777O717080N886077N364619N516395
$$ plain form
4049 179947348 185884339 192217592 199052177 206113549 213216785 220024633 225911805 230891267
4041 230891267 235373288 239187490 243038335 247794762 253336779 258964104 261911665 259660902
4033 259660902 252872398 242947751 230310240 216016304 202085435 189854284 179847600
4026 179847600 172014092 166203513 161919727 159004118 157567748 157376822 158258905 160320617
4018 160320617 163266876 167378501 172919812 179747619 188027383 197148363 206552657 214591084
4010 214591084 219297809 219949159 216795079 210618851 202135378 192661811 183748677 176017290
4002 176017290 169619093 164616962 160709044 157865927 156006999 154900575 154305961 154290123
3994 154290123 154855340 155755691 156880062 158371022 160193240 162261984 164533116 167004371
$$ packed form
4049A79947348N936991O333253O834585P061372P103236O807848N887172M979462
4041B30891267M482021L814202L850845M756427N542017N627325K947561k250763
4033B59660902o788504r924647j2637511j4293936j3930869j2231151j0006684
4026A79847600p833508n810579m283786k915609j436370j90926Q82083K061712
4018A60320617K946259M111625N541311O827807Q279764R120980R404294Q038427
4010B14591084M706725O51350l154080o176228q483473r473567q913134p731387
4002A76017290o398197n002131l907918k843117j858928j106424n94614j5838
3994A54290123N65217R00351J124371J490960J822218K068744K271132K471255
$$ plain form
3986 167004371 169804532 172498110 175238625 178458562 181896995 185265968 188694870 192437697
3978 192437697 196321401 200161761 204174476 208142487 212235112 216514241 220372902 224133194
3970 224133194 227873445 231468383 234749535 237831760 240935167 244198306 247333284 250668913
3962 250668913 253845647 257524646 261369290 265109117 269049864 272964524 276898751 280900662
3954 280900662 284866738 288652315 292342685 295864715 299368868 302806592 306102655 309312955
3946 309312955 312287097 315259977 318088975 320727592 323169339 325400742 327526454 329534125
3938 329534125 331489130 333298223 335271909 336843151 338573496 340317776 341300267 341579262
3930 341579262 340969677 339466902 337168777 334140758 330459381 326324676 321811203 317070875
$$ packed form
3986A67004371K800161K693578K740515L219937L438433L368973L428902L742827
3978A92437697L883704L840360M012715L968011M092625M279129L858661L760292
3970B24133194L740251L594938L281152L082225L103407L263139L134978L335629
3962B50668913L176734L678999L844644L739827L940747L914660L934227M001911
3954B80900662L966076L785577L690370L522030L504153L437724L296063L210300
3946C09312955K974142K972880K828998K638617K441747K231403K125712K007671
3938C29534125J955005J809093J973686J571242J730345J744280R82491K78995
3930C41579262o09585j502775k298125l028019l681377m134705m513473m740328
$$ plain form
3922 317070875 312693157 308415625 304366470 300404394 296339536 292368650 288603060 284928911
3914 284928911 281261110 277721435 274303075 271019737 268483417 266494532 264925748 263737501
3906 263737501 263416533 263901099 265286123 267257798 270054551 273947095 278742794 284578136
3898 284578136 291063203 298106601 305640704 313196318 320256194 326488247 331620563 335942096
3890 335942096 338693598 340422678 341378786 341614368 341472418 341167044 340782036 340288666 339675963
3881 339675963 338711959 337373729 335402465 332467782 328929226 324410157 319109216 313531226
3873 313531226 307962802 302509047 297308273 292872755 288931135 285743196 283014125 281167597
3865 281167597 280146761 279685094 279800072 280212437 281425203 283092524 284705316 286643628
$$ packed form
3922C17070875m377718m277532m049155l962076m064858l970886l765590l674149
3914B84928911l667801l539675l418360l283338k536320j988885j568784j188247
3906B63737501l20968M84566J385024J971675K796753L892544M795699N835342
3898B84578136O485067P043398P534103P555614P059876O232053N132316M321533
3890C35942096K751502J729080R56108K35582j41950l05374l85008m93370o12703
3881C39675963r64004j338230j971264k934683l538556m519069n300941n577990
3873C13531226n568424n453755n200774m435518l941620l187939k729071j846528
3865B81167597j020836m61667J14978M12365J212766J667321J612792J938312
$$ plain form
3857 286643628 288824166 290812577 292933823 294402140 295593574 296289055 296653445 296627444 296167659
3848 296167659 295581138 294639240 293343817 291859571 290193483 288416733 286178287 283409128
3840 283409128 280601322 277564943 274139379 270882006 267691960 264647697 261920576 259775965
3832 259775965 258916338 259002451 260085430 262085116 265458474 270762462 277733797 285918619
3824 285918619 296096969 307289088 319899419 333583035 346861341 359270191 370127435
3817 370127435 378411787 383632759 386057139 385686496 383470343 379447470 374539489 369589627
3809 369589627 364531370 359592695 354972192 349901305 344314513 338012380 330282993 321189199
3801 321189199 310158442 297336570 283090254 268303991 253234121 238383735 224121070
$$ packed form
3857B86643628K180538J988411K121246J468317J191434O95481L64390k6001m59785
3848B96167659n86521r41898j295423j484246j666088j776750k238446k769159
3840B83409128k807806l036379l425564l257373l190046l044263k727121k144611
3832B59775965q59627Q6113J082979J999686L373358N303988O971335Q184822
3824B85918619J0178350J1192119J2610331J3683616J3278306J2408850J0857244
3817C70127435Q284352N220972K424380l70643k216153m022873m907981m949862
3809C69589627n058257m938675m620503n070887n586792o302133p729387r093794
3801C21189199j1030757j2821872j4246316j4786263j5069870j4850386j4262665
$$ plain form
3794 224121070 211029559 198911388 188048753 178606669 169998445 162451120 155652382 149862379
3786 149862379 144831252 140166464 136163369 132554310 129156619 126388014 123746412 121159420
3778 121159420 118655424 116134421 113655951 111101150 108421517 105726827 103007593 100483240
3770 100483240 97969626 95433474 93054737 90920005 89041151 87075184 85243667 83532659
3762 83532659 82341788 81031214 80067475 79134371 78136851 77196380 76463932 75675744 75066519
3753 75066519 74548013 73864277 73271250 72856313 72637495 72381224 72311509 72369026 72137763 71930434
3743 71930434 71702274 71267585 70691429 70193674 69488298 68140301 66928924 65512010 63977002
3734 63977002 62435285 61090376 59480238 58213659 57328453 56375974 55712937 54961134 54208406
$$ packed form
3794B24121070j3091511j2118171j0862635r442084q608224p547325o798738n790003
3786A49862379n031127m664788m003095l609059l397691k768605k641602k586992
3778A21159420k503996k521003k478470k554801k679633k694690k719234k524353
3770A00483240k513614k536152k378737k134732j878854j965967j831517j711008
3762H3532659j190871j310574r63739r33104r97520r40471p32448p88188o09225
3753G5066519n18506o83736n93027m14937k18818k56271o9715N7517k31263k07329
3743G1930434k28160m34689n76156m97755p05376j347997j211377j416914j535008
3734F3977002j541717j344909j610138j266579q85206r52479o63037p51803p52728
$$ plain form
3725 54208406 53692387 53173210 53021546 52777265 52564989 52421977 52468836 52418431 52658913 52758703
3715 52758703 52786101 52737142 52605706 52457527 52388807 52390006 52417456 52273524 52160975 51908633
3705 51908633 51792458 51427455 51208523 50900663 50394378 50100450 49706326 49463441 48969150
3696 48969150 48610230 48289510 48121651 48103186 48273058 48043110 47905102 47971021 48064484 48112687
3686 48112687 48249574 48221534 48353193 48518287 48601819 48864756 49154048 49454533 49828900 50248217
3676 50248217 50716694 51203371 51467648 52087124 52629857 53092435 53567945 53908770 54618329
3667 54618329 54979599 55118917 55519835 56034386 56872519 57541040 57944199 58494836 59161277
3658 59161277 60276245 61155567 62103789 63134312 64390855 65584460 66606973 67811072
$$ packed form
3725E4208406n16019n19177j51664k44281k12276j43012M6859n0405K40482R9790
3715E2758703K7398m8959j31436j48179o8720J199K7450j43932j12549k52342
3705E1908633j16175l65003k18932l07860n06285k93928l94124k42885m94291
3696D8969150l58920l20720j67859j8465J69872k29948j38008O5919R3463M8203
3686D8112687J36887k8040J31659J65094Q3532K62937K89292L00485L74367M19317
3676E0248217M68477M86677K64277O19476N42733M62578M75510L40825P09559
3667E4618329L61270J39318M00918N14551Q38133O68521M03159N50637O66441
3658E9161277J114968Q79322R48222J030523J256543J193605J022513J204099
$$ plain form
3650 67811072 69373711 70975509 72727488 74532810 76289843 78291893 80449844 82723187
3642 82723187 85083782 87518586 89902739 92360240 95235184 98435917 101780744 105158409
3634 105158409 108922765 112787579 117239250 122326494 127672084 133550424 139750668 146364445
3626 146364445 153210085 160275527 167847103 176040289 184583770 193907490 203819495 214660165
3618 214660165 226198227 237998158 249479415 261307379 272920945 283663065 293724568
3611 293724568 303714757 313400285 322909370 332628560 342842744 353491685 364278285 374926224
3603 374926224 385405912 395721628 405496673 414621073 422886671 430610367 437752950 444691813
3595 444691813 451624596 458684227 466032432 473798895 481569405 489712139 497926327 505661630
$$ packed form
3650F7811072J562639J601798J751979J805322J757033K002050K157951K273343
3642H2723187K360595K434804K384153K457501K874944L200733L344827L377665
3634A05158409L764356L864814M451671N087244N345590N878340O200244O613777
3626A46364445O845640P065442P571576Q193186Q543481R323720R912005J0840670
3618B14660165J1538062J1799931J1481257J1827964J1613566J0742120J0061503
3611B93724568R990189R685528R509085R719190J0214184J0648941J0786600J0647939
3603C74926224J0479688J0315716R775045R124400Q265598P723696P142583O938863
3595D44691813O932783P059631P348205P766463P770510Q142734Q214188P735303
$$ plain form
3587 505661630 512583816 518835491 524031202 527695720 530001684 531258223 531964060 532223591
3579 532223591 532011501 531605900 530963713 529995746 528400387 525921315 522006241 516234256 508537230
3570 508537230 498754366 486965556 473367999 458473615 442551933 426186758 409772583
3563 409772583 393595144 378022329 363083963 348341145 333949369 319564618 304855101
3556 304855101 290109520 274806259 259480081 244300057 229276226 215086288 201646408
3549 201646408 188895834 177318829 167054599 157535089 149066776 141514255 134406420 128219593
3541 128219593 122671776 117443110 112586369 108117222 104375761 100371253 96588971 93389587
3533 93389587 90140753 87206041 84522415 81810004 79495159 77243463 75024561 72925095
$$ packed form
3587E05661630O922186O251675N195711L664518K305964J256539P05837K59531
3579E32223591k12090m05601o42187r67967j595359k479072l915074n771985p697026
3570E08537230r782864j1788810j3597557j4894384j5921682j6365175j6414175
3563D09772583j6177439j5572815j4938366j4742818j4391776j4384751j4709517
3556C04855101j4745581j5303261j5326178j5180024j5023831j4189938j3439880
3549B01646408j2750574j1577005j0264230r519510q468313p552521p107835o186827
3541A28219593n547817n228666m856741m469147l741461m004508l782282l199384
3533I3389587l248834k934712k683626k712411k314845k251696k218902k099466
$$ plain form
3525 72925095 71018315 69117266 67172429 65308374 63491050 62050526 60475629 59021181
3517 59021181 57651843 56289054 54872150 53573039 52271408 51044124 49978835 48947911
3509 48947911 47701148 46416689 45326277 44557935 43404155 42268095 41394521 40516223 39556450
3500 39556450 38529565 37766253 36973956 36431960 35539293 34728095 33813891 32874247 32346936
3491 32346936 31629183 31104457 30483243 29796607 29151250 28571258 28265050 27770821 27301742
3482 27301742 26840880 26364285 25875099 25235724 24849324 24534745 24009856 23660850 23440827
3473 23440827 23186495 22824795 22416074 22067702 21673071 21359834 21052218 20683627 20477430
3464 20477430 20249028 19903216 19368437 19281767 18944085 18876654 18699837 18528111 18294187 17740099
$$ packed form
3525G2925095j906780j901049j944837j864055j817324j440524j574897j454448
3517E9021181j369338j362789j416904j299111j301631j227284j065289j030924
3509D8947911j246763j284459j090412p68342j153780j136060q73574q78298r59773
3500C9556450j026885p63312p92297n41996q92667q11198r14204r39644n27311
3491C2346936p17753n24726o21214o86636o45357n79992l06208m94229m69079
3482B7301742m60862m76595m89186o39375l86400l14579n24889l49006k20023
3473B3440827k54332l61700m08721l48372l94631l13237l07616l68591k06197
3464B0477430k28402l45812n34779q6670l37682o7431j76817j71726k33924n54088
$$ plain form
3454 17740099 17493997 17271166 17008982 16899767 16861175 16519541 16337359 16163639 15887826 15671183
3444 15671183 15576099 15082994 14808906 14930048 14845302 14470647 14472906 14129483 14024831 13998439
3434 13998439 13781995 13555411 13519568 13294853 12977696 12902779 12846089 12983075 12822767 12476275
3424 12476275 12371908 12297169 12219041 12169042 12047040 11903438 11577662 11325271 11304984 11016537
3414 11016537 10792134 10749479 10530019 10458513 10192601 10053302 9991280 9860829 9690320 9778828
3404 9778828 9727890 9636799 9534880 9255719 9040401 8784080 8893317 8987760 8794486 8551621
3394 8551621 8332440 8322182 8292480 8277036 8054746 8074334 7981994 7868556 7757563 7436796
3384 7436796 7520665 7623410 7670766 7373262 7219212 7159815 7103362 7096757 7144119 7177074 6791410
$$ packed form
3454A7740099k46102k22831k62184j09215l8592l41634j82182j73720k75813k16643
3444A5671183r5084m93105k74088J21142q4746l74655K259l43423j04652k6392
3434A3998439k16444k26584l5843k24715l17157p4917n6690J36986j60308l46492
3424A2476275j04367p4739p8128m9999j22002j43602l25776k52391k0287k88447
3414A1016537k24403m2655k19460p1506k65912j39299o2022j30451j70509Q8508
3404I778828n0938r1091j01919k79161k15318k56321J09237R4443j93274k42865
3394H551621k19181j0258k9702j5444k22290J9588r2340j13438j10993l20767
3384G436796Q3869J02745M7356k97504j54050n9397n6453o605M7362L2955l85664
$$ plain form
3373 6791410 6671310 6937713 6960165 6867138 6652861 6567298 6629409 6764973 6816721 6738927 6734579
3362 6734579 6654518 6691587 6433302 6322310 6487934 6515580 6492126 6501073 6471855 6481049 6538485
3351 6538485 6548235 6420936 6328695 6319645 6423477 6396574 6456765 6486091 6501738 6358937 6319544
3340 6319544 6422798 6479697 6529278 6505031 6594527 6651266 6799265 6720854 6716614 6724737 6792224
3329 6792224 7090512 6979283 6830650 7028908 7061504 7023950 7191608 7209021 7085758 7327436
3319 7327436 7419638 7351373 7378503 7436929 7327097 7480201 7636967 7667065 7780572 7802442 7773002
3308 7773002 7941303 7989079 8051864 8021109 7995246 8198838 8153885 8092491 8178130 8214368 8409854
3297 8409854 8630639 8568834 8473008 8495618 8547439 8577329 8699347 8607048 8571148 8676378 8693107
$$ packed form
3373F791410j20100K66403K2452r3027k14277q5563O2111J35564N1748p7794m348
3362F734579q0061L7069k58285j10992J65624K7646k3454Q947k9218R194N7436
3351F538485R750j27299r2241r050J03832k6903O0191K9326J5647j42801l9393
3340F319544J03254N6899M9581k4247Q9496N6739J47999p8411m240Q123O7487
3329F792224K98288j11229j48633J98258L2596l7554J67658J7413j23263K41678
3319G327436R2202o8265K7130N8426j09832J53104J56766L0098J13507K1870k9440
3308G773002J68301M7776O2785l0755k5863K03592m4953o1394Q5639L6238J95486
3297H409854K20785o1805r5826K2610N1821K9890J22018r2299l5900J05230J6729
$$ plain form
3286 8693107 8675862 8672757 8621195 8773767 8913793 8753160 8774661 8789271 8639698 8667054 8582744
3275 8582744 8547334 8667817 8865179 9071340 8813326 8896398 9011464 8922992 8852858 8812301
3265 8812301 9101792 9152572 9335786 9332543 9224528 9496454 9731204 9774756 9992872 9983973 10110548
3254 10110548 10406242 10784776 11119433 11281164 11326144 11816220 12244478 12436584 12793575 13262195
3244 13262195 13719996 14292729 14775140 15373915 16362532 17316977 18288406 19183282 20427490
3235 20427490 21637757 22896203 24482707 26090700 27477880 28621446 29189146 29434838
3227 29434838 28782078 27596213 25938520 24310911 22585934 20902202 19589943 18398066
3219 18398066 17397089 16452915 15543335 14873128 14491146 14012189 13675876 13333139 12970034
$$ packed form
3286H693107j7245l105n1562J52572J40026j60633K1501J4610j49573K7356q4310
3275H582744l5410J20483J97362K06161k58014Q3072J15066q8472p0134m0557
3265H812301K89491N0780J83214l243j08015K71926K34750M3552K18116q899J26575
3254A0110548K95694L78534L34657J61731M4980M90076M28258J92106L56991M68620
3244A3262195M57801N72733M82411N98775R88617R54445R71429Q94876J244208
3235B0427490J210267J258446J586504J607993J387180J143566N67700K45692
3227B9434838o52760j185865j657693j627609j724977j683732j312259j191877
3219A8398066j000977r44174r09580o70207l81982m78957l36313l42737l63105
$$ plain form
3210 12970034 12947029 13073602 13176173 13250652 13544681 13977226 14554952 15400131 16418202 17516186
3200 17516186 18815108 20222751 21667780 22667758 22752851 21961925 20907675 19629878 18036770
3191 18036770 16576492 15181186 14128323 13401428 12849319 12342867 11897867 11277069 10844791
3182 10844791 10515849 9976715 9812057 9588789 9027769 9028067 9147673 9135113 9062777 9372805
3172 9372805 9586811 9913466 10492357 10915323 11517996 12058696 12386544 12737704 12825164 12138127
3162 12138127 11320004 10638748 9925570 9004981 8444436 7920698 7411062 7052440 6986784 6759548
3152 6759548 6348958 6097563 5939115 5709911 5345946 5217847 5053369 4969174 4778078 4544692
3142 4544692 4400443 4351006 4246375 4215612 4025282 4114365 3837542 3651004 3553807 3519622
$$ packed form
3210A2970034k3005J26573J02571P4479K94029M32545N77726Q45179J018071J097984
3200A7516186J298922J407643J445029R99978Q5093p90926j054250j277797j593108
3191A8036770j460278j395306j052863p26895n52109n06452m45000o20798m32278
3182A0844791l28942n39134j64658k23268n61020K98J19606j2560p2336L10028
3172I372805K14006L26655N78891M22966O02673N40700L27848L51160Q7460o87037
3162A2138127q18123o81256p13178r20589n60545n23738n09636l58622o5656k27236
3152F759548m10590k51395j58448k29204l63965j28099j64478q4195j91096k33386
3142D544692j44249m9437j04631l0763j90330Q9083k76823j86538r7197l4185
$$ plain form
3132 3519622 3380980 3362539 3244022 3330864 3426370 3323507 3055658 2957073 3006790 2836417
3122 2836417 3014667 2881522 2784781 2947764 2918762 2892011 2770397 2525730 2537732 2567967
3112 2567967 2600028 2610359 2762509 2558241 2476746 2526655 2392197 2144244 2206104 2402369
3102 2402369 2261865 2266777 2301578 2408990 2447055 2261533 2342270 2334381 2179284 2007933 1926712
3091 1926712 1997384 2131745 2119552 2076446 1880781 1907767 1918308 1889834 1969322 2019565 1956729
3080 1956729 1979475 1983792 2117662 2036181 1984449 1801950 1699987 1774446 1846320 1710527 1723362
3069 1723362 1732552 1898676 1937587 1804031 1812399 1749627 1681200 1691596 1757820 1778133 1625217
3058 1625217 1548539 1751884 1376713 1156848 1263856 1576311 1579380 1400797 1457482 1590792
$$ packed form
3132C519622j38642j8441j18517Q6842R5506j02863k67849r8585M9717j70373
3122B836417J78250j33145r6741J62983k9002k6751j21614k44667J2002L0235
3112B567967L2061J0331J52150k04268q1495M9909j34458k47953O1860J96265
3102B402369j40504M912L4801J07412L8065j85522Q0737p889j55097j71351q1221
3091A926712P0672J34361j2193m3106j95665K6986J0541k8474P9488N0243o2836
3080A956729K2746M317J33870q1481n1732j82499j01963P4459P1874j35793J2835
3069A723362R190J66124L8911j33556Q368o2772o8427J0396O6224K0313j52916
3058A625217p6678K03345l75171k19865J07008L12455L069j78583N6685J33310
$$ plain form
3048 1590792 1501912 1533231 1499042 1471403 1623775 1438922 1351924 1621110 1606495 1538967 1600905
3037 1600905 1683401 1725055 1933594 1967541 1644344 1640435 1476972 1420184 1389268 1224742 1526113
3026 1526113 1582604 1454103 1397918 1386386 1369692 1380574 1405523 1441084 1510081 1501537 1500312 1431148
3014 1431148 1419203 1540500 1353859 1417764 1461646 1460223 1299878 1263575 1199628 1074789 1176601
3003 1176601 1259804 1098019 1260102 1233015 1253700 1065204 1115812 1093994 975956 1265816
2993 1265816 1314480 1436984 1336419 1242425 1215072 1299947 1291968 1416284 1125905 1109320 1289916
2982 1289916 1325413 1126489 1145796 1257052 1290989 1282714 1267009 1119826 1048417 1149852 1070438
2971 1070438 989881 1213557 1288134 1280484 1148026 1122430 1356112 1232103 1252237 1140468 1215130
$$ packed form
3048A590792q8880L1319l4189k7639J52372j84853q6998K69186j4615o7528O1938
3037A600905Q2496M1654K08539L3947l23197l909j63463n6788l0916j64526L01371
3026A526113N6491j28501n6185j1532j6694J0882K4949L5561O8997q544j225o9164
3014A431148j1945J21297j86641O3905M3882j423j60345l6303o3947j24839J01812
3003A176601Q3203j61785J62083k7087K0685j88496N0608k1818j18038K89860
2993A265816M8664J22504j00565r3994k7353Q4875p979J24316k90379j6585J80596
2982A289916L5497j98924J9307J11256L3937q275j5705j47183p1409J01435p9414
2971A070438q0557K23676P4577p650j32458k5596K33682j24009K0134j11769P4662
$$ plain form
2960 1215130 1275213 1128254 1297006 1291465 1392091 1404843 1343211 1254849 1210570 1417627 1170469
2949 1170469 1203336 1333135 1283556 1428108 1319228 1429538 1504295 1512722 1418739 1449049 1644274
2938 1644274 1651021 1656981 1621460 1614359 1620909 1588984 1385675 1444811 1650667 1941909 2107032
2927 2107032 2156323 2204685 2337070 2195048 2248610 2509497 2603058 2319357 1981038 2220058
2917 2220058 2224169 2202663 2099617 2007083 2168940 2421312 2319090 2428402 2337931 2237029
2907 2237029 2241995 2375186 2247081 2307620 2381962 2263570 2352888 2648039 2908168 2997761 3161162
2896 3161162 3180974 3165554 3055563 3347127 3266704 3220183 3312730 3330774 3175469 2996344 2880630
2885 2880630 2619587 2611957 2566815 2324095 2162800 2255696 2380087 2434594 2297944 2186585
$$ packed form
2960A215130O0083j46959J68752n541J00626J2752o1632q8362m4279K07057k47158
2949A170469L2867J29799m9579J44552j08880J10310P4757Q427r3983L0310J95225
2938A644274O747N960l5521p101O550l1925k03309N9136K05856K91242J65123
2927B107032M9291M8362J32385j42022N3562K60887R3561k83701l38319K39020
2917B220058M111k1506j03046r2534J61857K52372j02222J09312r0471j00902
2907B237029M966J33191j28105O0539P4342j18392Q9318K95151K60129Q9593J63401
2896C161162J9812j5420j09991K91564q0423m6521R2547J8044j55305j79125j15714
2885B880630k61043p630m5142k42720j61295R2896J24391N4507j36650j11359
$$ plain form
2875 2186585 2099654 2016102 1942584 1909826 1980376 1793714 2020649 1895316 1931049 2087064 2024733
2864 2024733 1875359 1799108 1903491 1910384 1949329 2062030 2161188 2080197 1900000 1673321 1753481
2853 1753481 1751717 1614914 1703616 1531586 1554143 1578612 1534913 1606157 1550209 1491589 1544856
2842 1544856 1304164 1344156 1180149 1133937 1071466 1040316 1220274 1267173 1248104 1105993 1124080
2831 1124080 1159073 1312980 1190449 987169 1099811 1279788 1207518 1036707 854265 973792
2821 973792 918629 840835 856026 807892 963812 894196 845607 882457 849807 750815 805372
2810 805372 692390 465514 563924 482213 259090 505553 845945 728140 735536 647589 690937
2799 690937 643054 634519 670290 498826 505605 605383 567211 570467 677845 648652 519619 388186
$$ packed form
2875B186585q6931q3552p3518l2758P0550j86662K26935j25333L5733J56015o2331
2864B024733j49374p6251J04383O893L8945J12701R9158q0991j80197k26679Q0160
2853A753481j764j36803Q8702j72030K2557K4469m3699P1244n5948n8620N3267
2842A544856k40692L9992j64007m6212o2471l1150J79958M6899j9069j42111J8087
2831A124080L4993J53907j22531k03280J12642J79977p2270j70811j82442J19527
2821I73792n5163p7794J5191m8134J55920o9616m8589L6850l2650r8992N4557
2810H05372j12982k26876R8410q1711k23123K46463L40392j17805P396q7947M3348
2799F90937m7883q535L5771j71464O779R9778l8172L256J07378k9193j29033j31433
$$ plain form
2787 388186 237771 342898 177212 586920 463881 360097 307505 327029 414437 438116
2777 438116 522616 569799 480073 547418 423156 343746 560140 483405 617063 726168 569684
2766 569684 467258 734899 453593 531200 523866 495769 492845 356083 461510 573674 464911
2755 464911 456293 531801 419543 494722 557862 627452 429466 515524 499733 516242 540780
2744 540780 619098 745299 410253 171351 155223 218619 182456 241685 459546 389180 269403
2733 269403 428066 535132 614443 456825 229898 299409 478540 453643 439396 579764
2723 579764 458982 444258 543291 354117 478189 481890 169638 208653 332439 186953 308656
2712 308656 278313 297817 215407 487548 509602 525763 549238 407176 404628 312549 350929
$$ packed form
2787C88186j50415J05127j65686M09708j23039j03784n2592J9524Q7408K3679
2777D38116Q4500M7183q9726O7345j24262p9410K16394p6735J33658J09105j56484
2766E69684j02426K67641k81306P7607p334k8097k924j36762J05427J12164j08763
2755D64911q618P5508j12258P5179O3140O9590j97986Q6058j5791J6509K4538
2744E40780P8318J26201l35046k38902j6128O3396l6163N9229K17861p0366j19777
2733B69403J58663J07066P9311j57618k26927O9511J79131k4897j4247J40368
2723E79764j20782j4724R9033j89174J24072L701l12252L9015J23786j45486J21703
2712C08656l0343J9504q2410K72141K2054J6161K3475j42062k548r2079L8380
$$ plain form
2701 350929 142439 152407 211294 318110 346875 167297 127692 4034 102417 66721 121026
2690 121026 213097 174277 196373 335612 430142 439347 281420 450668 375633 140249 140736
2679 140736 332712 259156 122854 158170 271193 302134 95367 295055 372676 220394
2669 220394 243602 226108 231220 109768 51330 97314 181949 386209 255093 101561 260465
2658 260465 317110 344791 273891 314425 447000 314564 104719 128710 275115 311751 373419
2647 373419 160049 177912 251580 376931 432638 351970 231805 282014 17977 -24694 26309
2636 26309 180218 244877 169551 253448 373891 167318 -82897 177744 173953 235752 216376
2625 216376 111812 61761 155794 301004 227839 149123 291376 306768 177236 198702 367824
$$ packed form
2701C50929k08490R968N8887J06816K8765j79578l9605j23658R8383l5696N4305
2690A21026R2071l8820K2096J39239R4530R205j57927J69248p5035k35384M87
2679A40736J91976p3556j36302L5316J13023L0941k06767J99688P7621j52282
2669B20394K3208j7494N112j21452n8438M5984Q4635K04260j31116j53532J58904
2658B60465N6645K7681p0900M0534J32575j32436k09845K3991J46405L6636O1668
2647C73419k13370J7863P3668J25351N5707q0668j20165N0209k64037m2671N1003
2636B6309J53909O4659p5326Q3897J20443k06573k50215K60641l791O1799j9376
2625B16376j04564n0051R4033J45210p3165p8716J42253J5392j29532K1466J69122
$$ plain form
2614 367824 312366 275000 217426 288611 25808 -49964 330972 201079 183160 134884 249276
2603 249276 221655 154126 140981 348718 310453 412343 353954 124632 208912 577937 581008
2592 581008 428039 174135 99499 276117 448725 447063 300080 288800 289880 351326 142979
2581 142979 84623 155857 101351 78496 74240 15269 148161 214313 261310 327539 205767
2570 205767 204990 89689 164801 184649 162782 26291 -148203 -33 160663 258153 386457
2559 386457 334899 410871 272346 125092 123924 244543 43210 135899 264257 206140 322087
2548 322087 318632 441739 95364 120636 322658 249986 194847 97902 13397 172333 191253
2537 191253 283908 409686 298272 403204 461097 419515 304447 102267 200444 166464 -32534
$$ packed form
2614C67824n5458l7366n7574P1185k62803p5772L80936j29893j7919m8276J14392
2603B49276k7621o7529j3145K07737l8265J01890n8389k29322Q4280L69025L071
2592E81008j52969k53904p4636J76618J72608j662j46983j1280J080O1446k08347
2581A42979n8356P1234n4506k2855m256n8971J32892O6152M6997O6229j21772
2570B05767p77j15301P5112J9848k1867j36491j74494J48170J60696R7490J28304
2559C86457n1558P5972j38525j47254j168J20619k01333R2689J28358n8117J15947
2548C22087l455J23107l46375K5272K02022p2672n5139r6945q4505J58936J8920
2537A91253R2655J25778j11414J04932N7893m1582j15068k02180R8177l3980j98998
$$ plain form
2526 -32534 -287960 -225185 -6804 119955 199114 263023 78154 -6885 -50710 43921 51592
2515 51592 -56585 -189358 176540 154089 12157 -173552 -204255 -186470 -101543 13948 156533
2504 156533 237516 152313 -41485 -68808 4209 -3022 63858 38148 -26364 6127 99632 212872
2492 212872 129624 -43303 76236 140265 203906 163748 150864 187604 268681 64461 -20934
2481 -20934 -30621 -206807 -241352 -185949 20179 80164 80042 21375 155385 184414 106850 -133929
2469 -133929 -469 346129 318876 127529 264634 211529 231456 408063 178935 100120
2459 100120 80902 161000 47287 90475 140377 23521 -119515 128693 83511 -20025 66045
2448 66045 91060 78399 -20723 39916 -40886 28044 181375 -3530 89820 -15085 72567
$$ packed form
2526c2534k55426O2775K18381J26759P9159O3909j84869q5039m3825R4631P671
2515E1592j08177j32773L65898k2451j41932j85709l0703J7785Q4927J15491J42585
2504A56533Q0983q5203j93798k7323P3017p231O6880k5710o4512L2491R3505J13240
2492B12872q3248j72927J19539O4029O3641m0158j2884L6740Q1077k04220q5395
2481b0934r687j76186l4545N5403K06128N9985j22n8667J34010K9029p7564k40779
2469a33929J33460L46598k7253j91347J37105n3105J9927J76607k29128p8815
2459A00120j9218Q0098j13713M3188M9902j16856j43036K48208m5182j03536Q6070
2448F6045K5015j2661r9122O0639q0802O8930J53331j84905R3350j04905Q7652
$$ plain form
2437 72567 143100 59926 5896 -10416 97002 91367 -190876 -226445 -168203 -67546 78931
2426 78931 157081 93295 -171404 -62824 105073 49814 -88425 -79929 -13897 -8983 9136
2415 9136 -9446 191061 104629 334909 151111 -101400 -197228 -89356 197663 55060 61099
2404 61099 608 114649 80144 -26691 -6121 -65738 -40225 -155228 -61617 -72376 -52268
2393 -52268 128022 260583 27352 100506 259064 275888 184099 -28260 121565 134278 58088
2382 58088 107392 -43714 77107 140569 44860 157956 -13230 128995 94736 128669 194941
2371 194941 223307 214497 221768 196694 210478 194085 279295 395700 212592 193249 390183
2360 390183 528820 590812 563881 555211 424376 540932 429288 213080 174063 270584 262015
$$ packed form
2437G2567P0533q3174n4030j6312J07418n635k82243l5569N8242J00657J46477
2426G8931P8150o3786k64699J08580J67897n5259j38239Q496O6032M914J8119
2415I136j8582K00507q6432K30280j83798k52511r5828J07872K87019j42603O039
2404F1099o0491J14041l4505j06835K0570n9617K5513j15003R3611j0759K0108
2393e2268J80290J32561k33231P3154J58558J6824r1789k12359J49825J2713p6190
2382E8088M9304j51106J20821O3462r5709J13096j71186J42225l4259L3933O6272
2371A94941K8366q810P271k5074J3784j6393Q5210J16405j83108j9343J96934
2360C90183J38637O1992k6931q670j30835J16556j11644k16208l9017R6521q569
$$ plain form
2349 262015 201660 85944 -38004 23528 20232 -135202 284181 226125 -50422 72715 250424
2338 250424 208298 199467 410187 233947 195984 184277 94501 244846 228304 -9653 135161
2327 135161 260883 42337 27876 254843 241191 166803 82473 197468 217176 65119 7295
2316 7295 -61510 -168067 51480 277929 317931 220353 78756 102168 54004 -27868 123627
2305 123627 -33043 -196823 -132230 -2584 31623 24865 105270 160167 127277 -69972 10825
2294 10825 -68551 85037 179887 -2806 103007 9316 -49404 4664 -50492 5870 94706
2283 94706 71024 161728 174880 247276 438621 305487 197451 67791 264108 197602 168411
2272 168411 27086 -49224 162477 122128 212761 53659 128724 211346 5889 26096 42091
$$ packed form
2349B62015o0355j15716j23948O1532l296j55434M19383n8056k76547J23137J77709
2338B50424m2126q831K10720j76240l7963j1707q9776J50345j6542k37957J44814
2327A35161J25722k18546j4461K26967j3652p4388q4330J14995J9708j52057n7824
2316G295o8805j06557K19547K26449M0002r7578j41597K3412m8164q1872J51495
2305A23627j56670j63780O4593J29646L4207o758Q0405N4897l2890j97249Q0797
2294A0825p9376J53588R4850j82693J05813r3691n8720N4068n5156N6362Q8836
2283I4706k3682R0704J3152P2396J91345j33134j08036j29660J96317o6506k9191
2272A68411j41325p6310K11701m0349R0633j59102P5065Q2622k05457K0207J5995
$$ plain form
2261 42091 47901 204545 209359 240123 148276 224918 81116 -22732 2643 114881 204508
2250 204508 -34104 -15848 64171 119122 180939 73073 65361 57596 360545 333435 5083
2239 5083 -6228 241880 272028 173375 299607 238696 248219 276538 238351 35784 170275
2228 170275 447629 393637 194350 168696 232413 262297 502289 529548 220977 118158 187212
2217 187212 267041 335346 409983 429986 591706 516679 349988 287550 312147 184348 106724
2206 106724 127800 216417 197713 167411 322384 151979 158899 256997 266352 370666 399854
2195 399854 480390 701054 545369 512800 559776 404404 434363 193911 316107 563715
2185 563715 507787 532404 403550 515255 551665 577047 541010 493857 535606 632903 646692
$$ packed form
2261D2091N810J56644M814L0764r1847P6642j43802j03848K5375J12238Q9627
2250B04508k38612J8256Q0019N4951O1817j07866p712p765L02949k7110l28352
2239E083j1311K48108L0148r8653J26232o0911R523K8319l8187k02567J34491
2228A70275K77354n3992j99287k5654O3717K9884K39992K7259l08571j02819O9054
2217A87212P9829O8305P4637K0003J61720p5027j66691o2438K4597j27799p7624
2206A06724K1076Q8617j8704l0302J54973j70405O920R8098R355J04314K9188
2195C99854Q0536K20664j55685l2569M6976j55372K9959k40452J22196K47608
2185E63715n5928K4617j28854J11705L6410K5382l6037m7153M1749R7297J3789
$$ plain form
2174 646692 582870 770381 799834 593540 551219 919347 1043822 1121876 1187329 896759 771849
2163 771849 905431 1056296 1262450 1366561 1154753 1194975 1151049 1099432 1008274 1189105
2153 1189105 1342531 1367119 1397970 1507191 1472751 1374712 1511430 1647292 1698280 1794094 1713680
2142 1713680 1573386 1793705 1828961 1911778 1960995 1958711 1904938 2005451 2215372 2220214 2103185
2131 2103185 2117689 2202758 2543725 2681659 2769298 2964840 3129218 3421702 3527069 3670778
2121 3670778 4046888 4303872 4650517 4688645 4901065 5368467 5577146 6057778 6496211 6785283
2111 6785283 7256077 7697947 8142187 8957178 9580572 10104416 10953350 12006477 12991907
2102 12991907 14002291 15296025 16972624 19342679 22085960 25769568 30803498 37462727
$$ packed form
2174F46692o3822J87511K9453k06294m2321L68128J24475P8054O5453k90570j24910
2163G71849J33582J50865K06154J04111k11808M0222m3926n1617r1158J80831
2153A189105J53426K4588L0851J09221l4440r8039J36718J35862N0988R5814q0414
2142A713680j40294K20319L5256Q2817M9217k284n3773J00513K09921M842j17029
2131B103185J4504Q5069L40967J37934Q7639J95542J64378K92484J05367J43709
2121C670778L76110K56984L46645L8128K12420M67402K08679M80632M38433K89072
2111F785283M70794M41870M44240Q14991O23394N23844Q48934J053127R85430
2102A2991907J010384J293734J676599K370055K743281L683608N033930O659229
$$ plain form
2094 37462727 46323576 57691050 62890580 59718953 54808089 47354571 38959049 31203742
2086 31203742 25305994 21230668 17836266 15465589 13703944 12088333 11144946 10299300
2078 10299300 10049921 9378648 8713436 8123213 7348983 6788060 6127770 5619242 5330640
2069 5330640 5034114 4740616 4598136 4495451 4485410 4154100 3958788 3721782 3508583 3327357
2059 3327357 3224196 3242934 3159644 3115295 2963728 2776747 2669427 2543280 2445083 2406336
2049 2406336 2373336 2202619 2111919 2137019 2090352 1722356 1680230 1800533 1901390 1883679 1520903
2038 1520903 1296159 1392035 1476340 1508384 1553543 1275154 1063819 1355586 1295976 1242227 1209224
2027 1209224 1139735 1123715 1034854 1067391 1091439 926892 933198 893638 1017620 773485 654050
$$ packed form
2094C7462727Q860849J1367474N199530l171627m910864p453518q395522p755307
2086C1203742n897748m075326l394402k370677j761645j615611r43387q45646
2078A0299300k49379o71273o65212n90223p74230n60923o60290n08528k88602
2069E330640k96526k93498j42480j02685j0041l31310j95312k37006k13199j81226
2059C327357j03161J8738q3290m4349j51567j86981j07320j26147r8197l8747
2049B406336l3000j70717r0700K5100m6667l67996m2126J20303J00857j7711l62776
2038A520903k24744R5876Q4305L2044M5159k78389k11335K91767n9610n3749l3003
2027A209224o9489j6020q8861L2537K4048j64547O306l9560J23982k44135j19435
$$ plain form
2016 654050 695879 762994 583488 706965 697731 711307 808632 852670 648134 658066 599797
2005 599797 479660 559238 456478 504701 443177 556151 608399 500773 586382 534548 504686
1994 504686 614369 483230 631194 734183 478980 555145 668800 562331 560079 561637 583872
1983 583872 477764 537992 309319 348118 337320 340896 301440 338852 366843 273841 214002
1972 214002 268772 236680 271901 172205 257624 189793 255537 216977 333647 306143 360030
1961 360030 398835 114542 -80147 85054 164038 156951 90083 282857 302933 320515 208247
1950 208247 171646 44572 228693 218589 -29262 124152 154910 142615 244391 368878
1940 368878 283250 522148 319359 320133 177610 191493 383489 334116 376072 351295 464064
$$ packed form
2016F54050M1829O7115j79506J23477r234J3576R7325M4038k04536R932n8269
2005E99797j20137P9578j02760M8223o1524J12974N2248j07626Q5609n1834k9862
1994E04686J09683j31139J47964J02989k55203P6165J13655j06469k252J558K2235
1983E83872j06108O0228k28673L8799j0798L576l9456L7412K7991r3002n9839
1972B14002N4770l2092L5221r9696Q5419o7831O5744l8560J16670k7504N3887
1961C60030L8805k84293j94689J65201P8984p087o6868J92774K0076J7582j12268
1950B08247l6601j27074J84121j0104k47851J53414L0758j2295J01776J24487
1940C68878q5628K38898k02789P74j42523J3883J91996m9373M1956k4777J12769
$$ plain form
1929 464064 457097 156289 151194 243466 189620 62649 40396 91971 -112879 -105470 -72409 40281
1917 40281 134421 139550 62281 -28421 111127 203240 285457 13345 87184 57346 293706
1906 293706 248349 117118 48918 123389 135366 224563 286861 259270 46836 101075 249286
1895 249286 75158 -64060 -1959 -32406 -68714 60432 43954 -118649 141148 -47397
1885 -47397 -18522 188893 -786 50059 26189 63231 18572 -46261 -109032 34054 -75437
1874 -75437 -43825 31743 75611 63494 -16686 -174032 -92851 -19096 -153680 -34670 97887
1863 97887 189893 163032 138691 201347 291600 273182 183997 126110 177823 101402 61246 86984
1851 86984 45938 -147901 -249976 60290 17628 119466 -121921 -30391 210528 236237 106167
$$ packed form
1929D64064o967l00808n095R2272n3846j26971k2253N1575k04850P409L3061J12690
1917D0281R4140N129p7269r0702J39548R2113Q2217k72112P3839k9838K36360
1906B93706m5357j31231o8200P4471J1977Q9197O2298k7591k12434N4239J48211
1895B49286j74128j39218O2101l0447l6308J29146j6478j62603K59797j88545
1885d7397K8875K07415j89679N0845k3870L7042m4659o4833o2771J43086j09491
1874g5437L1612P5568M3868j2117q0180j57346Q1181P3755j34584J19010J32557
1863I7887R2006k6861k4341O2656R0253j8418q9185n7887N1713p6421m0156K5738
1851H6984m1046j93839j02075L10266m2662J01838k41387R1530K40919K5709j30070
$$ plain form
1840 106167 43093 107193 -24853 1321 -62888 32694 27712 84952 192966 157736 129131
1829 129131 199837 198389 239031 278783 234578 223276 29384 246212 297115 14700 4683
1818 4683 -11370 79239 101013 48446 -47850 65390 195237 190997 212095 -106265 -103000 54237
1806 54237 284801 131634 -38397 -115961 66636 134927 130025 106388 937 -157100 -236058
1795 -236058 -46978 20476 -40057 -194891 -134486 -118589 -124044 -163384 -16011 -119202 430
1784 430 -25566 -4099 208954 172510 53279 -11512 -106542 -137730 -16888 -12396 -176399 -218654
1772 -218654 -54482 -18240 -31212 124897 91175 37388 -199241 -258302 -176922 175315 204545
1761 204545 -67284 -3210 29578 202251 297596 226958 276359 157089 -190101 -12456 -51384
$$ packed form
1840A06167o3074O4100j32046K6174o4209R5582m982N7240J08014l5230k8605
1829A29131P0706j448M0642L9752m4205j1302j93892K16828N0903k82415j0017
1818D683j6053R0609K1774n2567r6296J13240J29847m240K1098l18360L265J57237
1806E4237K30564j53167j70031p7564J82597O8291m902k3637j05451j58037p8958
1795b36058J89080O7454o0533j54834O0405J5897n455l9340J47373j03191J19632
1784D30k5996K1467K13053l6444j19231o4791r5030l1188J20842M492j64003m2255
1772b18654J64172L6242j2972J56109l3722n3787k36629n9061Q1380L52237K9230
1761B04545k71829O4074L2788J72673R5345p0638M9401j19270l47190J77645l8928
$$ plain form
1750 -51384 -54055 -105563 -173794 84978 176409 240560 223457 11572 -198619 -148631 -21041
1739 -21041 143157 24582 -221014 -242867 48927 207560 -99140 -317322 -327761 -261342
1729 -261342 -30416 35680 -172298 -281315 -247649 -26473 -105407 -79250 -185551 3225
1719 3225 140978 116282 181914 151107 -83977 -217371 -125622 82978 78251 -41828 -85810
1708 -85810 -21857 55315 117793 162074 305614 130093 -75533 -14395 -166636 -87965 33222
1697 33222 75269 42195 127601 177568 183568 -23556 -114091 -102668 -127092 -304909 -155248
1686 -155248 -82556 -70751 -47305 -78328 -212911 -49833 -27986 53026 -48990 -74744 -202356
1675 -202356 -51331 -48441 -26292 276750 88237 21020 616 101984 203565 274130 181919
$$ packed form
1750e1384k671n1508o8231K58772R1431O4151j7103k11885k10191M9988J27590
1739b1041J64198j18575k45596k1853K91794J58633l06700k18182j0439O6419
1729b61342K30926O6096k07978j09017L3666K21176p8934K6157j06301J88776
1719C225J37753k4696O5632l0807k35084j33394R1749K08600m727j20079m3982
1708h5810O3953P7172O2478M4281J43540j75521k05626O1138j52241P8671J21187
1697C3222M2047l3074Q5406M9967O000k07124r0535J1423k4424j77817J49661
1686a55248P2692J1805K3446l1023j34583J63078K1847Q1012j02016k5754j27612
1675b02356J51025K890K2149L03042j88513o7217k0404J01368J01581P0565r2211
$$ plain form
1664 181919 113788 50637 -26693 -47147 -48299 -212058 -109269 54425 55659 60145 220588
1653 220588 135494 -117186 -22502 -24896 -88730 15284 123764 81113 37120 116835 178963
1642 178963 212083 32939 -8477 -81183 -41400 -94497 84232 154419 109966 198207 94713
1631 94713 -169581 -261227 -220556 -223030 -183002 -89943 -155945 -106651 28994 117615 -468
1620 -468 -141351 -61073 75903 271514 234169 160847 50518 -96169 -267244 -237325 25303
1609 25303 28227 216395 198824 167033 14754 -47668 64241 11985 159012 54944 -94624
1598 -94624 -123844 -335881 9572 50204 -96768 -9890 -116907 -188779 -55111 16978 -74453
1587 -74453 -45103 38928 -52804 -86569 -7136 -18197 -239016 -279900 -171416 -146839 -66561
$$ packed form
1664A81919o8131o3151p7330k0454j152j63759J02789J63694J234M486J60443
1653B20588q5094k52680R4684k394o3834J04014J08480m2651m3993P9715O2128
1642A78963L3120j79144m1416p2706L9783n3097J78729P0187m4453Q8241j03494
1631I4713k64294r1646M0671k474M0028R3059o6002M9294J35645Q8621j18083
1620d68j40883Q0278J36976J95611l7345p3322j10329j46687j71075K9919K62628
1609B5303K924J88168j7571l1791j52279o2422J11909n2256J47027j04068j49568
1598i4624k9220k12037L45453M0632j46972Q6878j07017p1872J33668P2089r1431
1587g4453K9350Q4031r1732l3765P9433j1061k20819m0884J08484K4577Q0278
$$ plain form
1576 -66561 45456 125786 -136549 -89315 -22948 74707 15597 54625 -96229 -184404 -152813
1565 -152813 -38193 28260 9531 67995 1394 -77691 234964 7469 -48423 -12347 -211274
1554 -211274 -137808 19492 -133688 -118205 -149533 -336170 -211988 -214405 -44160 -35713 -342195
1543 -342195 -272809 -210733 -34494 -87692 -69717 -62062 -97475 -21776 -83325 -141107 -346934
1532 -346934 -275407 -107737 -108905 146162 301011 338863 139902 -25567 -49439 -31885 -42200
1521 -42200 -56134 -40654 -68309 -186801 -218407 61120 -72533 -29354 6866 -4416 -145176
1510 -145176 -116387 -100015 41329 -36137 -182499 -91042 12985 -49090 -119886 21587 143308
1499 143308 41905 -29479 -93896 -127183 191444 38122 33044 214999 273486 188253 153336
$$ packed form
1576f6561J12017Q0330k62335M7234O6367R7655n9110L9028j50854q8175L1591
1565a52813J14620O6453j8729N8464o6601p9085L12655k27495n5892L6076j98927
1554b11274P3466J57300j53180J5483l1328j86637J24182k417J70245Q447l06482
1543c42195O9386O2076J76239n3198J7975P655l5413P5699o1549n7782k05827
1532c46934P1527J67670j168K55067J54849L7852j98961j65469k3872J7554j0315
1521d2200j3934J5480k7655j18492l1606K79527j33653M3179L6220j1282j40760
1510a45176K8789J6372J41344p7466j46362R1457J04027o2075p0796J41473J21721
1499A43308j01403p1384o4417l3287L18627j53322n078J81955N8487q5233l4917
$$ plain form
1488 153336 258857 57969 172055 197754 120075 128541 -2397 38146 -51358 -143744 84317
1477 84317 -220034 -100990 -197 -43593 2248 -575 50369 95198 90950 115573 157364 100350
1465 100350 86657 32269 -60958 -93715 30410 22743 -81736 26234 114613 24094 -177204
1454 -177204 -104421 -295068 -244383 -219722 -302141 -36656 67678 -84562 -156440 -36180 -37272
1443 -37272 5088 -36608 -215801 -351680 -97569 -119056 -145063 -107532 -190668 -14657 89997
1432 89997 -64521 -264083 -185313 -174865 -210172 -64579 -99147 -153602 -266478 -159567 -57453
1421 -57453 -133233 17250 6272 -17157 -56126 -154904 -158793 -40585 -53196 -40047 -11128 -94440
1409 -94440 -48207 -43616 2097 -112270 -122006 -54036 23265 88060 -36023 24835 44762 99377
$$ packed form
1488A53336J05521k00888J14086K5699p7679Q466j30938M0543q9504r2386K28061
1477H4317l04351J19044J00793m3396M5841k823N0944M4829m248K4623M1791n7014
1465A00350j3693n4388r3227l2757J24125p667j04479J07970Q8379r0519k01298
1454a77204P2783j90647N0685K4661q2419K65485J04334j52240p1878J20260j092
1443c7272M2360m1696j79193j35879K54111k1487k6007L7531q3136J76011J04654
1432H9997j54518j99562P8770J0448l5307J45593l4568n4455j12876J06911J02114
1421e7453p5780J50483j0978k3429l8969r8778l889J18208j2611J3149K8919q3312
1409i4440M6233M591M5713j14367r736O7970P7301O4795j24083O0858J9927N4615
$$ plain form
1397 99377 125925 -2070 39856 59338 79465 63046 -16724 -181022 -195145 -173429 -106681
1386 -106681 -48787 31321 177656 56942 -38396 -3603 -51487 -197671 -246961 -124298 -168135
1375 -168135 -82563 -134311 100379 259060 102335 85206 65963 41565 -127269 -176308 -143393
1364 -143393 -250972 -273229 -126977 -18488 -63589 38756 11715 -84552 -120766 -120564 -327495
1353 -327495 -260960 -120346 -337396 -381936 -244975 -26668 -14016 23174 130568 -41296
1343 -41296 -62624 -101004 -41840 -38960 28757 -63162 156904 145023 -92729 -178262 62090
1332 62090 121076 123258 113176 90561 187835 -47583 -65783 6207 -57245 -137666 -128807 -15506
1320 -15506 12795 -303617 -127640 -157960 -114010 -42157 40790 47837 -62199 -43034 31906
$$ packed form
1397I9377K6548j27995M1926J9482K0127j6419p9770j64298j4123K1716O6748
1386a06681N7894Q0108J46335j20714r5338L4793m7884j46184m9290J22663m3837
1375a68135Q5572n1748K34690J58681j56725j7129j9243k4398j68834m9039L2915
1364a43393j07579k2257J46252J08489m5101J02345k7041r6267l6214K02k06931
1353c27495O6535J40614k17050m4540J36961K18307J2652L7190J07394j71864
1343d1296k1328l8380N9164K880O7717r1919K20066j1881k37752q5533K40352
1332F2090N8986K182j0082k2615R7274k35418j8200P1990o3452q0421Q859J13301
1320a5506K8301l16412J75977l0320M3950P1853Q2947P047j10036J9165P4940
$$ plain form
1309 31906 -93311 -30564 -19489 123465 -90909 -206055 -73987 -184095 -100628 14149
1299 14149 -178250 -205324 -109667 38745 226053 139507 124654 39813 -47109 -243727 -264905
1288 -264905 68004 -11533 -21786 185362 -21181 23991 -75965 -185644 -176053 -70247 -57200
1277 -57200 -46047 35749 -14690 107795 114208 290776 192642 -82945 87393 231256 -52316
1266 -52316 -155622 -124696 -33687 103559 -63613 57114 68169 -97367 6730 -53209 37069
1255 37069 -17574 -73494 -15059 -49890 -251776 -212175 -84861 -205279 -118536 -38122 -94165
1244 -94165 -82602 2262 26714 79138 146630 39410 -23438 -262795 -418614 -126591 -2335
1233 -2335 75969 120500 9562 144976 -123345 50917 140770 37339 42760 -111597 -44242
$$ packed form
1309C1906j25217O2747J1075J42954k14374j15146J32068j10108Q3467J14777
1299A4149j92399k7074R5657J48412J87308q6546j4853q4841q6922j96618k1178
1288b64905L32909p9537j0253K07148k06543M5172r9956j09679R591J05806J3047
1277e7200J1153Q1796n0439J22485O413J76568r8134k75587J70338J43863k83572
1266e2316j03306L0926R1009J37246j67172J20727J1055j65536J04097n9939R0278
1255C7069n4643n5920N8435l4831k01886L9601J27314j20418Q6743Q0414n6043
1244i4165J1563Q4864K4452N2424O7492j07220o2848k39357j55819K92023J24256
1233b335P8304M4531j10938J35414k68321J74262Q9853j03431N421j54357O7355
$$ plain form
1222 -44242 -99031 -69097 30658 161567 -92854 -162992 -94165 -63522 17718 2353 -46026
1211 -46026 -104903 922 -12295 -19086 131893 141686 -83591 -95490 -1047 135367 9187
1200 9187 74183 175776 200911 284226 192327 241754 7147 98137 185180 108727 96632 -82033
1188 -82033 -231553 18075 119180 53514 -85307 -114365 -113027 6060 19342 215198 -22759
1177 -22759 -158192 183932 14956 -22837 159097 -8903 -113213 -54468 -83070 -114000 -160642
1166 -160642 14882 -3682 -99449 -166896 -147770 -17408 -126236 -117469 -89442 -72778 -201273
1155 -201273 -289208 -226370 -48854 -53260 -115672 12161 69622 92296 77918 -48096 -78885
1144 -78885 -17188 94250 -160843 -327908 -234292 -179081 -234088 -312641 -271472 -264220 -165879
$$ packed form
1222d4242n4789K9934R9755J30909k54421p0138O8827L0643Q1240j5365m8379
1211d6026n8877J05825j3217o791J50979R793k25277j1899R4443J36414j26180
1200I187O4996J01593K5135Q3315r1899M9427k34607R0990Q7043p6453j2095j78665
1188h2033j49520K49628J01105o5666j38821k9058J338J19087J3282J95856k37957
1177b2759j35433L42124j68976l7793J81934j68000j04310N8745k8602l0930m6642
1166a60642J75524j8564r5767o7447J9126J30362j08828Q767K8027J6664j28495
1155b01273q7935O2838J77516m406o2412J27833N7461K2674j4378j26014l0789
1144g8885O1697J11438k55093j67065R3616N5211n5007p8553M1169P252R8341
$$ plain form
1133 -165879 -148666 -166008 -107894 -5989 -70266 -15541 -42644 -102000 -25715 -82536 -13638
1122 -13638 -10383 33749 69441 235157 109932 -69382 -55670 23113 -101094 -84290 -76133
1111 -76133 -77848 -129094 4042 189681 -46020 -86179 195034 68915 -129195 -121014 -313789
1100 -313789 -202594 -123369 93994 67010 158184 59547 208070 108526 -10319 113874 328979
1089 328979 233077 21306 -18184 -159772 -197222 -107763 -4896 26082 24356 -25469 44276
1078 44276 91925 36423 -3254 -86965 19719 124055 -10819 -136571 -185639 -194806 -58097
1067 -58097 -201153 -103665 -47014 -159062 -43461 -15734 -62281 -100665 -204072 -81291 124124
1056 124124 6557 -34975 -9839 -103587 -40413 -90301 -35092 121078 121317 139838 -86703
$$ packed form
1133a65879J7213j7342N8114J01905o4277N4725k7103n9356P6285n6821O8898
1122a3638L255M4132L5692J65716j25225j79314J3712P8783j24207J6804Q157
1111g6133j715n1246J33136J85639k35701m0159K81213j26119j98110Q181j92775
1100c13789J11195P9225K17363k6984R1174r8637J48523r9544j18845J24193K15105
1089C28979r5902k11771l9490j41588l7450Q9459J02867L0978j726m9825O9745
1078D4276M7649n5502l9677q3711J06684J04336j34874j25752m9068r167J36709
1067e8097j43056R7488N6651j12048J15601K7727m6547l8384j03407J22781K05415
1056A24124j17567m1532K5136r3748O3174m9888N5209J56170K39J8521k26541
$$ plain form
1045 -86703 -66984 134320 84686 37875 14822 55912 -28515 -136535 -93040 31590 27492
1034 27492 -49116 -2338 146572 65600 -54275 -118771 -177478 -7961 68798 40398 -130150
1023 -130150 -242226 -159937 -141518 -106415 31083 -90397 -192733 21630 89535 -57075
1013 -57075 -208520 -134697 -155951 -255574 -141512 -163930 -213497 -271264 -42339 -67778 -27163
1002 -27163 -3562 3738 161151 82791 32310 -9110 -82106 -180143 -15487 -73718 -81376 19025
990 19025 -46064 -60123 -153740 -240321 -247388 -107093 93747 47763 -172252 -212237 -221046 -74954
978 -74954 -178564 -65139 -169476 -239283 -174975 -96986 42631 -135002 -27341 124514 -27766
967 -27766 -11302 38937 92526 -10726 -62338 -88178 -21154 -273632 -208797 -108107 -169711
$$ packed form
1045h6703J9719K01304m9634m6811k3053M1090q4427j08020M3495J24630m098
1034B7492p6608M6778J48910q0972j19875o4496n8707J69517P6759k8400j70548
1023a30150j12076Q2289J8419L5103J37498j21480j02336K14363O7905j46610
1013e7075j51445P3823k1254r9623J14062k2418m9567n7767K28925k5439M0615
1002b7163K3601P300J57413p8360n0481m1420p2996r8037J64656n8231p658J00401
990A9025o5089j4059r3617q6581p067J40295K00840m5984k20015l9985q809J46092
978g4954j03610J13425j04337o9807O4308P7989J39617j77633J07661J51855j52280
967b7766J6464N0239N3589j03252n1612k5840O7024k52478O4835J00690o1604
$$ plain form
956 -169711 -67810 52519 20119 54556 173383 104495 -16629 37747 146513 218701 -1453
945 -1453 -28205 17491 61746 60893 -256423 -211865 -209636 -17171 -110628 -71490 60777 46294
933 46294 -10625 -143081 -287037 -53227 -226080 -134779 -2592 -19287 118397 -7067 -97796
922 -97796 -83272 126941 103714 39892 83650 43903 -131230 6125 15072 72043 56031 94141
910 94141 223965 76237 183900 -92121 -65403 91977 34001 29944 85712 53347 -13798
899 -13798 -110062 -7558 53721 -168522 -186820 41941 18255 4477 -29853 288682 153789
888 153789 -177418 -88147 14888 148808 100529 -18780 -76873 -89464 -294474 -194831 156573
877 156573 267080 106541 259924 323355 270282 168537 187485 156599 39520 85351 258346
$$ packed form
956a69711J01901J20329l2400L4437J18827o8888j21124N4376J08766P2188k20154
945a453k6752M5696M4255q53l17316M4558K229J92465r3457L9138J32267j4483
933D6294n6919j32456j43956K33810j72853R1301J32187j6695J37684j25464r0729
922i7796J4524K10213k3227o3822M3758l9747j75133J37355Q947N6971j6012L8110
910I4141J29824j47728J07663k76021K6718J57380n7976m057N5768l2365o7145
899a3798r6264J02504O1279k22243j8298K28761k3686j3778l4330L18535j34893
888A53789l31207Q9271J03035J33920m8279j19309n8093j2591k05010R9643L51404
877A56573J10507j60539J53383O3431n3073j01745J8948l0886j17079M5831J72995
$$ plain form
866 258346 238823 114389 163120 281125 154738 112425 -19402 -211064 -197575 -44882 -33004
855 -33004 -315951 -221187 -127257 -118095 -20104 -109363 -172404 -272833 -203558 -151685 -222872 -330203
843 -330203 -138183 -28314 3253 -68439 47176 148014 88583 5406 -99158 -39010 -45129
832 -45129 -80094 -59430 88158 -117570 -78508 -40156 -4233 134339 146741 -31538 -117517
821 -117517 36731 253164 206025 70743 21000 222392 -58779 24532 147476 144069 126219
810 126219 -2537 -65025 105095 16431 -106688 -202613 -171407 -100275 -257819 76129 187393
799 187393 57343 -90119 -63607 -23604 142867 71219 50031 -74086 22129 231710 -11219
788 -11219 237500 101409 -26663 -22015 -132146 -61054 49466 94300 21065 -83292 -194673
$$ packed form
866B58346j9523j24434M8731J18005j26387m2313j31827j91662J3489J52693J1878
855c3004k82947R4764R3930R162R7991q9259o3041j00429O9275N1873p1187j07331
843c30203J92020J09869L1567p1692J15615J00838n9431q3177j04564O0148o119
832d5129l4965K0664J47588k05728L9062L8352L5923J38572J2402j78279q5979
821a17517J54248K16433m7139j35282m9743K01392k81171Q3311J22944l407j7850
810A26219j28756o2488J70120q8664j23119r5925L1206P1132j57544L33948J11264
799A87393j30050j47462K6512M0003J66471p1648k1188j24117R6215K09581k42929
788a1219K48719j36091j28072M648j10131P1092J10520M4834p3235j04357j11381
$$ plain form
777 -194673 -119995 -129489 -154968 -69140 3555 16936 -110873 -59590 -13232 -51352 -153613 -254918
765 -254918 12470 -36106 102640 58533 -251 -115131 87921 177230 128192 189584 62671
754 62671 57036 67138 -66361 -220321 -118422 -82402 -220799 -109784 150229 266580 46667
743 46667 -41050 14703 226955 122649 -115323 -282865 -146996 -49498 -30622 4284 -38668
732 -38668 -93694 -18600 72647 -84683 -253419 -220278 236182 77619 39748 172426 47948
721 47948 -50695 13925 23780 -113710 -44413 -221344 -133571 -65175 -278424 -122921 110635
710 110635 150599 -40897 -129720 -46419 -120376 40610 -40808 55647 156340 15767 42507
699 42507 -41513 -269307 -375405 -212127 -190950 -129457 -123373 -126492 -161854 29507 -50869 -127160
$$ packed form
777a94673P4678r494k5479Q5828P2695J3381j27809N1283M6358l8120j02261j01305
765b54918K67388m8576J38746m4107n8784j14880K03052Q9309m9038O1392j26913
754F2671n635J0102j33499j53960J01899L6020j38397J11015K60013J16351k19913
743D6667q7717N5753K12252j04306k37972j67542J35869R7498J8876L4906m2952
732c8668n5026P5094R1247j57330j68736L3141M56460j58563l7871J32678j24478
721D7948r8643O4620R855j37490O9297j76931Q7773O8396k13249J55503K33556
710A10635L9964j91496q8823Q3301p3957J60986q1418R6455J00693j40573K6740
699D2507q4020k27794j06098J63278K1177O1493O084l119l5362J91361q0376p6291
$$ plain form
687 -127160 23953 75428 -4963 -318491 -115081 20068 -752 27413 101997 120890 125213
676 125213 1004 -91026 -135701 -164839 -261286 -307670 -81479 -30427 24543 -123275 75463
665 75463 -24586 -91685 -20296 17356 71385 -45837 -174777 18379 131197 85285 70960
654 70960 89198 79592 -101372 -134140 4522 38477 53248 56616 110886 153629 123864 105299
642 105299 188164 98481 69262 248577 144486 68026 -1675 -45398 78084 -43229 -119718
631 -119718 -53916 -139579 -296263 -272810 -315777 -160499 -109560 -18694 120791 -109980 -62479
620 -62479 45746 -62902 -172892 -216404 3774 153456 318215 41660 -65543 -9871
610 -9871 24819 58174 23327 -223871 7582 106426 95537 47610 3041 -18211 -138130 -106967
$$ packed form
687a27160J51113N1475q0391l13528K03410J35149k0820K8165P4584J8893M323
676A25213j24209r2030m4675k9138r6447m6384K26191N1052N4970j47818J98738
665G5463j00049o7099P1389L7652N4029j17222j28940J93156J12818m5912j4325
654G0960J8238r606j80964l2768J38662L3955J4771L368N4270M2743k9765j8565
642A05299Q2865q9683k9219J79315j04091p6460o9701m3723J23482j21313p6489
631a19718O5802q5663j56684K3453m2967J55278N0939R0866J39485k30771M7501
620f2479J08225j08648j09990m3512K20178J49682J64759k76555j07203N5672
610i871L4690L3355l4847k47198K31453R8844j0889m7927m4569k1252j19919L1163
$$ plain form
598 -106967 -2621 53848 -79192 196685 248139 11153 -66325 41702 -128326 -81967 -140684
587 -140684 -77688 -119969 49623 11402 -44421 -89996 -113465 -53047 1596 -144330 -209895
576 -209895 -176365 -161154 -4593 -104728 -318742 -203261 -326339 -274421 -94536 -151240 -74340
565 -74340 -13814 -128466 -146614 -188791 -164958 88558 152419 -2716 -83307 -106610 2633
554 2633 -13322 100171 112598 -18525 7499 8776 -61344 -113663 -17001 -171389 -139248 -205041
542 -205041 -193539 -47358 52691 19281 29529 23762 85261 79843 -155288 62373 51551
531 51551 -56770 -12512 -2311 -33461 -15021 -11105 112541 148860 24003 -98231 -91975 48499
519 48499 121139 126675 83959 -25204 -48019 -123872 -39528 -30803 -30376 147742 36377 -164309
$$ packed form
598a06967J04346N6469j33040K75877N1454k36986p7478J08027j70028M6359n8717
587a40684O2996m2281J69592l8221n5823m5575k3469O0418N4643j45926o5565
576b09895L3530J5211J56561j00135k14014J15481j23078N1918J79885n6704P6900
565g4340O0526j14652j8148m2177K3833K53516O3861j55135q0591k3303J09243
554B633j5955J13493J2427j31123K6024J277p0120n2319R6662j54388L2141o5793
542b05041J1502J46181J00049l3410J0248n767O1499n418k35131K17661j0822
531E1551j08321M4258J0201l1150J8440L916J23646L6319j24857j22234O256J40474
519D8499P2640N536m2716j09163k2815p5853Q4344Q725M27J78118j11365k00686
$$ plain form
507 -164309 -79829 28380 55117 -82634 -145298 -87154 -236788 -376941 -179857 -66487 -74537
496 -74537 -7921 4700 -16582 61088 116255 29406 27241 -92324 -166343 527 39260 13377
484 13377 6494 -68706 -1299 4415 158425 158983 93436 -39983 -118047 -33026 -119621 -89183
$$ packed form
507a64309Q4480J08209K6737j37751o2664N8144j49634j40153J97084J13370q050
496g4537O6616J2621k1282P7670N5167q6849k165j19565p4019J66870L8733k5883
484A3377o883p5200O7407N714J54010N58o5547j33419p8064Q5021q6595L0438
$$ [...]
##END NTUPLES=NMR SPECTRUM
##END=
