##TITLE=1H_EC-3293(IV-4)
 CDCl3
 8 sc, 
 19.4.2023
##JCAMPDX= 6.0         $$ Bruker NMR JCAMP-DX V2.0
##DATA TYPE= NMR SPECTRUM
##DATA CLASS= NTUPLES
##ORIGIN= UXNMR, Bruker Analytische Messtechnik GmbH
##OWNER= root
$$ XWIN-NMR		Version 3.5
$$ Wed Apr 19 13:48:21 2023 Russian Standard Time (UT+4h)  she@DPX200
##.OBSERVE FREQUENCY= 200.13135
##.OBSERVE NUCLEUS= ^1H
##.ACQUISITION MODE= SIMULTANEOUS
##.ACQUISITION SCHEME= undefined
##.AVERAGES= 8
##.DIGITISER RES= 18
##SPECTROMETER/DATA SYSTEM= spect
##.PULSE SEQUENCE= zg30
##.SOLVENT NAME= CDCl3
##.SHIFT REFERENCE= (INTERNAL, CDCl3, 0, 15.7359)
##AUDIT TRAIL= $$ (NUMBER, WHEN, WHO, WHERE, WHAT)
$$ ##TITLE= Audit trail, XWIN-NMR		Version 3.5
$$ ##JCAMPDX= 5.01
$$ ##ORIGIN= Bruker BioSpin GmbH
$$ ##OWNER= she
$$ F:/spectra/data/she/nmr/H-F/1/pdata/1/auditp.txt
$$ ##AUDIT TRAIL=  $$ (NUMBER, WHEN, WHO, WHERE, WHAT)
(   1,<2023-04-19 13:47:13.48 +0400>,<she>,<DPX200>,
      <created by zg, POWCHK disabled, PULCHK disabled
       configuration hash MD5:
       00 E9 B6 7A A2 85 ED C7 34 08 36 98 17 FE 4E 26
       data hash MD5: 16K
       FA ED B9 3C 76 8B F0 44 C1 69 43 08 4D 90 0D FC>)
(   2,<2023-04-19 13:47:15.75 +0400>,<she>,<DPX200>,
      <Start of raw data processing
       efp BC_mod = 2 LB = 0.24 FT_mod = 6 PKNL = 1 PHC0 = -19827.83 PHC1 = 7.80081 SI = 16K 
       data hash MD5: 16K
       F5 2F 90 9F 61 8E 8B 5B 43 F9 C1 25 E9 26 48 95>)
(   3,<2023-04-19 13:47:33.57 +0400>,<she>,<DPX200>,
      <pk PHC0 = -17.86788 PHC1 = 23.8 
       data hash MD5: 16K
       D1 3A D2 B8 81 56 CA D3 DD 79 DF 50 98 68 49 B5>)
(   4,<2023-04-19 13:47:36.46 +0400>,<she>,<DPX200>,
      <abs ABSG = 5 
       data hash MD5: 16K
       E8 FE B5 9F 72 92 DC F4 13 65 DD BE C3 EC 23 85>)
$$ ##END=
$$ 
$$ hash MD5
$$ C0 36 1B F7 6D 2B 2D F4 6F FE 42 22 F2 42 31 9D
##$RELAX= 
##$RELAX= 
##$RELAX= 
##$RELAX= 
##$RELAX= 
##$RELAX= 
$$ Bruker specific parameters
$$ --------------------------
##$DU= <F:/spectra>
##$EXPNO= 1
##$NAME= <H-F>
##$PROCNO= 1
##$TYPE= <nmr>
##$USER= <she>
##$AMP= (0..31)
100 100 100 100 100 100 100 100 100 100 100 100 100 100 100 100 100 100 
100 100 100 100 100 100 100 100 100 100 100 100 100 100 
##$AQSEQ= 0
##$AQ_mod= 1
##$AUNM= <au_zg>
##$AUTOPOS= <>
##$BF1= 200.13
##$BF2= 200.13
##$BF3= 200.13
##$BF4= 200.13
##$BF5= 200.13
##$BF6= 200.13
##$BF7= 200.13
##$BF8= 200.13
##$BYTORDA= 1
##$CFDGTYP= 0
##$CFRGTYP= 5
##$CHEMSTR= <none>
##$CNST= (0..31)
1 1 145 1 1 1 1 1 1 1 1 1 1 1 1 1 1 1 1 1 1 1 1 1 1 1 1 1 1 1 1 1 
##$CPDPRG= <>
##$CPDPRG1= <>
##$CPDPRG2= <>
##$CPDPRG3= <>
##$CPDPRG4= <mlev>
##$CPDPRG5= <mlev>
##$CPDPRG6= <mlev>
##$CPDPRG7= <mlev>
##$CPDPRG8= <mlev>
##$CPDPRGB= <>
##$CPDPRGT= <>
##$D= (0..31)
0 1.2 0 0 0 0 0 0 0 0.06 0 0.03 0 0 0 0 0.0002 0 0 0 0 0 0 0 0 0 0 0 0 
0 0 0 
##$DATE= 1681897632
##$DBL= (0..7)
120 120 120 120 120 120 120 120 
##$DBP= (0..7)
150 150 150 150 150 150 150 150 
##$DBP07= 0
##$DBPNAM0= <>
##$DBPNAM1= <>
##$DBPNAM2= <>
##$DBPNAM3= <>
##$DBPNAM4= <>
$$ [...]
##$SUBNAM3= <"">
##$SUBNAM4= <"">
##$SUBNAM5= <"">
##$SUBNAM6= <"">
##$SUBNAM7= <"">
##$SUBNAM8= <"">
##$SUBNAM9= <"">
##$SW= 18.05172834244
##$SWIBOX= (0..15)
0 0 2 0 0 0 0 0 0 0 0 0 0 0 0 0 
##$SW_h= 3612.71676300578
##$TD= 16384
##$TD0= 1
##$TE= 0
##$TE2= 300
##$TE3= 300
##$TEG= 300
##$TL= (0..7)
0 120 120 120 120 120 120 120 
##$TP= (0..7)
150 150 150 150 150 150 150 150 
##$TP07= 0
##$TPNAME0= <>
##$TPNAME1= <>
##$TPNAME2= <>
##$TPNAME3= <>
##$TPNAME4= <>
##$TPNAME5= <>
##$TPNAME6= <>
##$TPNAME7= <>
##$TPOAL= (0..7)
0.5 0.5 0.5 0.5 0.5 0.5 0.5 0.5 
##$TPOFFS= (0..7)
0 0 0 0 0 0 0 0 
##$TUNHIN= 0
##$TUNHOUT= 0
##$TUNXOUT= 0
##$USERA1= <user>
##$USERA2= <user>
##$USERA3= <user>
##$USERA4= <user>
##$USERA5= <user>
##$V9= 5
##$VALIST= <valist>
##$VCLIST= <CCCCCCCCCCCCCCC>
##$VD= 0
##$VDLIST= <DDDDDDDDDDDDDDD>
##$VPLIST= <PPPPPPPPPPPPPPP>
##$VTLIST= <TTTTTTTTTTTTTTT>
##$WBST= 1024
##$WBSW= 4
##$XGAIN= (0..3)
0 0 0 0 
##$XL= 0
##$YL= 0
##$YMAX_a= 168180
##$YMIN_a= -223419
##$ZGOPTNS= <>
##$ZL1= 120
##$ZL2= 120
##$ZL3= 120
##$ZL4= 120
##$ABSF1= 15.74909
##$ABSF2= -2.302759
##$ABSG= 5
##$ABSL= 3
##$ALPHA= 0
##$AQORDER= 0
##$ASSFAC= 0
##$ASSFACI= 0
##$ASSFACX= 0
##$ASSWID= 0
##$AUNMP= <proc_1d>
##$AZFE= 0.1
##$AZFW= 0.1
##$BCFW= 0
##$BC_mod= 2
##$BYTORDP= 0
##$COROFFS= 0
##$CY= -3
##$DATMOD= 1
##$DC= 0
##$DFILT= <>
##$DTYPP= 0
##$F1P= 0
##$F2P= 0
##$FCOR= 1
##$FTSIZE= 16384
##$FT_mod= 6
##$GAMMA= 0
##$GB= 0
##$INTBC= 1
##$INTSCL= 3.70164e-10
##$ISEN= 128
##$LB= 0.24
##$LEV0= 0
##$LPBIN= 0
##$MAXI= 10000
##$MC2= 0
##$MEAN= 0
##$ME_mod= 0
##$MI= 1.114404
##$NCOEF= 0
##$NC_proc= -8
##$NLEV= 6
##$NOISF1= 3.799351
##$NOISF2= 2.8
##$NSP= 0
##$NTH_PI= 0
##$NZP= 0
##$OFFSET= 15.73587
##$PC= 1
##$PHC0= -19845.7
##$PHC1= 31.60081
##$PH_mod= 1
##$PKNL= yes
##$PPARMOD= 0
##$PSCAL= 0
##$PSIGN= 0
##$REVERSE= no
##$SF= 200.13000713755
##$SI= 16384
##$SIGF1= 3
##$SIGF2= 2
##$SINO= 5.538805
##$SIOLD= 16384
##$SREGLST= <1H.CDCl3>
##$SSB= 0
##$STSI= 16384
##$STSR= 0
##$SW_p= 3612.71676300578
##$SYMM= 0
##$S_DEV= 0
##$TDeff= 16384
##$TDoff= 0
##$TI= <>
##$TILT= no
##$TM1= 0
##$TM2= 0
##$TOPLEV= 0
##$USERP1= <user>
##$USERP2= <user>
##$USERP3= <user>
##$USERP4= <user>
##$USERP5= <user>
##$WDW= 1
##$XDIM= 16384
##$YMAX_p= 432838452
##$YMIN_p= -1132533
$$ End of Bruker specific parameters
$$ ---------------------------------
##NTUPLES= NMR SPECTRUM
##VAR_NAME=  FREQUENCY,     SPECTRUM/REAL,   SPECTRUM/IMAG
##SYMBOL=    X,             R,               I
##VAR_TYPE=  INDEPENDENT,   DEPENDENT,       DEPENDENT
##VAR_FORM=  AFFN,          ASDF,            ASDF
##VAR_DIM=   16384,         16384,           16384
##UNITS=     HZ,            ARBITRARY UNITS, ARBITRARY UNITS
##FACTOR=    0.220516191357247, 1,           1
##FIRST=     3149.21984772816, 0,            0
##LAST=      -463.496915277621, 0,           0
##MIN=       -463.496915277621, -1132533,    0
##MAX=       3149.21984772816, 432838452,    0
$$ Real data points
##PAGE= N=1
##DATA TABLE= (X++(R..R)), XYDATA
$$ [...]
8644 24328017 23310224 22435702 21680502 21788091 22047101 21967632 22279941 23030294 23211878
8635 23211878 23492960 24158535 24844706 26048235 27401175 29000675 30389424 31404501 32732489
8626 32732489 34130621 35722026 37716056 40040216 41740168 42779457 42323575 40324286
8618 40324286 37600684 34674153 31566440 28997935 27377438 26021978 24144166 22983072
8610 22983072 22199628 20649005 19570283 18769127 18196388 17839501 17560444 17548866 18020501
8601 18020501 17867133 18133732 17881721 17748526 18599529 19107046 19437640 19722126 20467783
8592 20467783 20898425 21270215 21484790 21868500 21867864 21696827 21348866 20551644 19101604 18184226
8582 18184226 17720540 16593291 15495083 14408934 13650378 12829628 11860986 11634182 11741996
8573 11741996 11690717 11431321 11346255 11262802 10898633 11054188 10911469 10777911 10687762 10428790
8563 10428790 10487152 10389758 10414960 10261495 10020490 10158487 9989364 9922360 9525321 9261391
8553 9261391 9072665 9224727 9188814 9414582 9000010 8457619 8396839 8550779 8223825 8127954
8543 8127954 8500806 8204183 8067668 7983445 7728736 8046462 8015925 8099999 8370474 7775169
8533 7775169 7934555 8182325 8152162 7878330 8038288 8337258 8148805 7783148 7977312 7728966
8523 7728966 7807997 7341889 7458752 7349445 7106538 6754266 6274518 6727207 6742411 6863362
8513 6863362 6642702 6606068 6185952 5802454 5870345 6079782 6062195 6051814 6070874 5860822
8503 5860822 5614716 5695838 5683328 5595089 5732732 5449406 5465023 5150110 4778934 5036181
8493 5036181 4808690 5014953 4924378 4981570 5082702 5040120 4828212 4667932 4601490 4565666
8483 4565666 4659003 4470654 4556285 4529056 4493148 4500860 4771604 4992030 4546057 3823205 4020753
8472 4020753 4462658 4606167 4340867 4457585 4540950 4442656 4555847 4218099 3935664 3978625
8462 3978625 4332978 4344933 3982227 4332301 4274185 3967558 4586407 4306026 4218653 3965969
8452 3965969 3825657 3975613 4065452 4096717 4108206 3870156 3739213 3811371 3758358 4011416
8442 4011416 3958756 3597935 4184230 4487035 4000646 3616984 3590599 3768658 3601408 3628800
8432 3628800 3781571 3743215 3621985 3628735 3737074 3977490 3901200 4273236 4119119 3854724
8422 3854724 3868675 3650513 3504293 3440177 3842369 4117606 3887300 3984448 4026011 3943172
8412 3943172 3714762 3705062 3454606 3875765 4065388 3889397 3686816 3682115 3883144 3473463
8402 3473463 3797085 3816335 3402066 3141521 3453952 3868073 3741335 3472128 3257735 3133598
8392 3133598 3175713 3682358 3743237 3504354 3642536 3857238 3373937 2589649 2806126 3169773
8382 3169773 3311834 3636461 3497644 2991529 3284452 3558166 3259740 3433855 3598727 3722481
8372 3722481 3591334 3565511 3843759 3860174 3812209 3745266 3495607 3495827 3529476 3713763 3742902
8361 3742902 3766292 3430367 3624095 3560761 3627794 3594800 3242831 3364080 2987860 3695449
8351 3695449 4236910 4092592 3593627 3346940 3090183 3149418 3212265 3067099 3188913 3394701
8341 3394701 3357278 3477437 3383342 3086704 3398007 3024886 2692397 2927333 2990865 3351404
8331 3351404 3384227 2991202 2732368 2958902 2869741 2703500 2729105 3056704 3351163 3186826
8321 3186826 2976433 3110224 2885112 2686157 3015058 3218235 3148669 2947400 2601014 2620145
8311 2620145 2597992 2484462 3033430 3119287 3314376 2935910 2411544 2576385 2698796 2980356
8301 2980356 3206298 2795777 2799538 2902461 2812686 2883647 3043874 2964185 2901750 3181379 2869803
8290 2869803 2569561 2635549 2419425 2261965 2350685 2362210 2352032 2398028 2871248 3240098
8280 3240098 2893721 2695789 2595198 2463024 2615515 2502539 2270243 2332890 2623005 2736445
8270 2736445 2852519 2796074 2536845 3068219 2896845 2589569 2936338 2470563 2093458 2503038
8260 2503038 2959124 2934070 2843279 2440248 2623802 2985257 3255780 2800980 2123121 2314125
8250 2314125 2730069 2443970 2299175 2572325 2314603 2283652 2443381 2306212 2563831 2522430
8240 2522430 2434038 2708688 2568251 2469004 2506600 2700400 2915895 2489342 2357781 2616667
8230 2616667 2855097 3202275 3292465 3196978 3325801 3196632 2999973 3266725 2919221 2790608
8220 2790608 3043150 2955116 2781347 2513094 2602003 2670207 2167547 2272485 2263271 1854237
8210 1854237 1368688 1635081 2186049 2218910 2191971 1994278 2269706 2160114 2215262 1987061
8200 1987061 1876980 1941859 1829900 2032829 1957112 2070880 2126748 1846316 759819 1176882
8190 1176882 1944496 2383033 2125844 1902719 1967508 1626956 1711907 1925185 1998801 1820351
8180 1820351 1786354 2088740 1629641 1657068 1893847 1566471 1663726 1515371 1732038 2001940
8170 2001940 1774962 1363662 1614188 2352716 2079923 1851505 1937585 1484811 1340425 1635377
8160 1635377 1448795 1312196 1597318 1551625 1843759 1527418 1781534 1838330 1688453 2150950
8150 2150950 2054879 1785412 1558855 1938558 2054741 1721228 1671605 1615088 1442106 1910235
8140 1910235 1703880 1685720 1728142 1432451 1705391 1826160 1833660 1672551 1813987 1916299
8130 1916299 1780055 1773059 2055793 1786634 1630852 1969647 1959052 1820796 1632730 1715464
8120 1715464 2012064 2316797 1658657 1208602 1476387 1766783 1751254 1771904 1769879 1817872
8110 1817872 1605523 1440057 1423278 1728068 1802910 2059094 2210753 1572260 1448979 1501107
8100 1501107 1617615 1380063 1681301 1283245 1089563 1224541 1189480 1510341 1574631 1446021
8090 1446021 1522359 1764861 1646141 1392113 1902661 1744685 1290315 1185041 1156555 1182935
8080 1182935 1668954 1778346 1450332 1389517 1248370 1318168 1065588 1128261 1395901 1556297
8070 1556297 2127949 1936861 1791803 1713181 1371527 1898754 1742585 1498359 1494434 1686384
8060 1686384 1304072 1130251 1267166 1589056 1737928 1539782 1536486 1267530 1369655 1287685
8050 1287685 1234525 824255 954048 860424 1115436 1543188 1792509 1103997 1156121 1519275
8040 1519275 1393844 1058819 1107239 1602374 1479804 1794193 1658393 1232065 1016015 1271854
8030 1271854 1649968 1646825 1942653 1568097 1218870 1299300 1202843 1308881 1507856 1639889
8020 1639889 1380630 1315702 1346184 1270281 1133251 1538360 1573377 1426575 1678310 1343227
8010 1343227 1241197 1474906 1465533 1604281 1258216 916239 773439 954282 1391649 1257382
8000 1257382 1356497 1464199 1372174 1548601 1445965 1322428 1638857 1820888 1961190 1900045
7990 1900045 1104307 620425 1088977 1512695 1727863 1530216 1284219 1776575 1684851 1636899
7980 1636899 1309679 1423445 1551635 1529619 1550967 1691673 1895960 1572110 1016716 1297686
7970 1297686 1160546 1298866 1497735 1725731 1742478 1653431 1285767 1479369 1888114 2033266
7960 2033266 1723298 1220556 1466960 1619470 1671190 1936096 1869997 1922894 1951181 1820672
7950 1820672 1981087 1671349 1950973 2033701 1974398 2004558 1974678 1772012 1554372 1599996
7940 1599996 1736823 1805338 1715636 1915050 1509384 1711938 2066188 2360811 2432235 2463343
7930 2463343 2240070 2367474 2446389 2229547 2089731 2311389 2382459 2583503 2921300 2725680
7920 2725680 2926419 2675020 2657628 2453666 2238631 2485889 3060623 2861849 2749445 2787558
7910 2787558 3035983 2634993 2758083 3002154 3148139 3065523 3207305 3286305 3395862 3113349
7900 3113349 3269910 3166156 3168758 3116516 2936375 3163512 3683388 3360752 3586733 3916660
7890 3916660 3951460 4122481 4224359 4116453 4224615 4612991 4757271 4744981 4630073 4728137
7880 4728137 4541413 4579847 4910816 5160732 5201809 5244065 5671749 5533909 5453608 5558593
7870 5558593 5799066 6269538 6004003 5722086 6048343 6338414 6173544 6036910 6459887 6853613
7860 6853613 6863250 7056257 6790070 6578243 6153758 6381905 6158014 6559754 6514671 6215780
7850 6215780 6340058 6333400 6160998 6168422 6238410 6052186 5942312 5565991 5089393 5237105
7840 5237105 5105055 4939226 4880121 4724158 4324222 4695470 4326292 4137247 3978509 4008087
7830 4008087 4364319 4100881 3705786 3328352 3086044 3413269 3120493 2802364 2906643 2594850
7820 2594850 2979984 2754202 3169692 2825469 2454890 2483035 2366941 2158290 2024084 2046251
7810 2046251 2163271 1759991 1804887 1436043 1022421 938621 1158004 780397 1368978 3144585
7800 3144585 2369468 1963706 1952032 1972557 1546420 1218698 1046468 1036270 991088 1533785
7790 1533785 1704605 1577877 1417849 1405273 1541210 1562290 1351022 1155114 920821 783011
7780 783011 1002253 964459 1109744 652468 520172 750444 1082994 1420532 1160899 1147116
7770 1147116 1097695 647281 743696 382758 567946 1057657 851734 779540 591174 417043
7760 417043 633287 826972 638112 683763 574617 122976 595766 225205 148658 321145
7750 321145 407288 128954 538139 703983 239395 325341 287868 408108 317999 14168
7740 14168 -142160 -249210 -137221 371183 308422 204080 213730 153385 310964 200265 14730
7729 14730 224375 456387 179100 216914 463128 769643 513314 422966 157495 232261
7719 232261 206501 -19414 175033 240279 265866 419726 381214 -39229 386305 672545
7709 672545 584564 169619 210830 80176 392895 629367 559756 474093 748425 683544 677323
7698 677323 317014 71221 247407 129999 373851 -108303 -356039 160857 386047 69803
7688 69803 193479 480835 324607 261117 -89292 156461 208056 203160 262505 513989 167732
7677 167732 -396368 -16656 171912 142619 189524 106481 124491 -45620 -357811 -284618 163178
7666 163178 665299 358161 142525 -127762 -247967 -241513 85515 237112 79545 136865
7656 136865 541258 729739 217924 -314944 -333194 -66858 173950 122355 -310101 -152243
7646 -152243 -185528 121018 311281 138418 11198 -36673 319224 -63142 36528 43773 20447
7635 20447 255856 372270 345679 306618 546215 307416 149944 337706 186560 110282
7625 110282 419435 340618 231150 195339 551833 -8775 -118888 100562 244592 -226693
7615 -226693 -356712 -190134 -32093 84018 14250 255556 -294263 -345217 -327037 18977
7605 18977 132925 284792 508909 480575 111421 372718 282366 274329 82609 262095 38273
7594 38273 -325607 -267931 -83949 330837 -14821 -165789 131803 418974 571438 224311
7584 224311 53249 82447 263796 116613 270841 285060 -51359 -12882 -184564 -31749
7574 -31749 197762 -28347 -178705 -371723 177130 179817 -135752 381955 193986 -74749
7564 -74749 -112053 131677 312361 166235 -176066 -221239 -155108 46878 160188 186313 18354
7553 18354 -131154 55460 296997 116917 -167127 -66202 -26057 -137653 63466 72159
7543 72159 134075 198948 -28690 -115164 52108 -210857 -11639 -85300 -690658 -624327 -199599
7532 -199599 -271798 -210534 -110761 193136 305146 185315 359724 142195 -138850 -307796
7522 -307796 -128021 121465 -85604 48986 394838 373321 345993 310020 326421 519038
7512 519038 103952 113163 67121 244303 187269 291066 -121223 -291391 411734 68472
7502 68472 -247036 -308463 -583633 -164961 273294 62087 42054 29392 7475 -161556 155086
7491 155086 42403 -210844 -156245 -114014 177772 515724 189857 162309 132430 39499 281944
7480 281944 55022 318788 561629 338593 479278 303550 486452 652474 572620 270511
7470 270511 -235854 -327562 132756 209946 -124291 -92366 128240 98764 -97650 -157437 -91726
7459 -91726 -60397 -6315 84789 102546 -200059 -88148 101767 115362 139275 435152 657552
7448 657552 341120 269252 312921 -236534 -237824 -4611 -181758 155795 335871 261599 29772
7437 29772 8003 -60933 38748 -483 6273 -177145 -410749 -159420 344765 -64942 -23576
7426 -23576 56150 -102012 -57026 -181732 4269 -209155 -298968 -115536 110835 -242381
7416 -242381 -23675 27690 159746 122277 -16604 -52415 -429356 -530170 -447453 -399905 -368599
7405 -368599 -331699 -308301 -308469 -172026 240616 480909 229559 175734 503066 339037 -77600
7394 -77600 -122757 120129 301413 -69295 -153290 360210 100990 349147 423837 390330 134071
7383 134071 16432 -100594 -72171 468788 126449 325349 273201 187961 -30199 223457
7373 223457 328121 152929 217724 359889 653262 553021 169681 131951 285295 257505
7363 257505 197011 432798 674970 121098 400801 219880 167005 219376 336164 52335
7353 52335 39407 -39222 241967 64763 81933 523907 498397 231034 314440 404126 131387
7342 131387 518357 378228 693517 509759 335288 375090 328295 105254 99334 164860 406239
7331 406239 455073 373600 599843 496767 287391 698584 498595 323255 483069 346312
7321 346312 155772 439152 514791 286460 342017 510829 529823 325727 463133 466237 11302
7310 11302 212178 528477 599544 1007895 1126051 769627 608561 724876 703500 863671
7300 863671 848834 527959 400264 403213 750825 867226 820705 819237 874006 690839 1104909
7289 1104909 1276468 895317 950969 1087581 1130557 1019075 1264694 1039460 1172944 1633437
7279 1633437 1467364 1041395 1220355 1482593 1109854 1161030 1065438 1174091 1366058 998971
7269 998971 1136622 1338020 1137939 1309053 1364367 1741869 2051309 1700806 1483610 1387816
7259 1387816 2073405 2233984 1833677 2113569 1884700 1514127 1605935 1529337 1734342 1592713
7249 1592713 1441650 1309893 1435554 1414529 1697475 1247598 1180502 1552240 2177319 2117510
7239 2117510 1682921 1531742 1400889 1454812 1533986 1721779 1746640 1753206 1484445 1161111
7229 1161111 1662235 1374067 1685380 2193235 1984340 2274315 2459233 2521048 2192822 1995260
7219 1995260 1971253 2321540 2423420 2046529 1865007 2312261 2309721 2354325 2589212 2317155
7209 2317155 2358926 2425095 2209382 2454004 2924557 3061046 3057525 2873216 2724316 2549182
7199 2549182 2809654 2682948 2591653 2529349 3017255 2812100 2582689 2995613 3017653 3463214
7189 3463214 3212567 3078487 2524775 2239898 2857132 2892538 2652327 2891417 2994919 3001241
7179 3001241 2929747 3766468 3489521 3159776 3085567 3527661 3458499 3538220 3851605 3770020
7169 3770020 3769640 3848567 3949423 3866661 3869074 3780838 3717403 3776869 3785687 4192624 3887331 3947049
7157 3947049 3595503 3674898 3676588 3915757 4207622 4167951 4605529 4312317 4493405 4509308
7147 4509308 4777017 4596317 4572880 5043198 5095811 5124175 4977503 4469309 4540303 4913646
7137 4913646 4771155 5235671 5818330 5734256 5697752 5575852 5881126 6232148 6404589 6626631
7127 6626631 6529280 6290314 6365941 6470459 6235307 6317676 6595462 6832881 6980517 6888274
7117 6888274 7014077 7361202 7563187 7453947 7396847 7264225 7178163 7569293 7617242 7416746
7107 7416746 8022012 8142079 8280167 8293085 8694288 8686166 8943763 9375812 9224669 9316230
7097 9316230 9606926 9782613 10105933 10065390 10137316 10545773 11004127 11132286 11061317 10829129
7087 10829129 11008190 11166937 11591621 12021713 12338546 12721861 12800049 12862513 12950730 13316056
7077 13316056 13719822 14455270 14875747 14806277 15125205 14935559 15219754 15701271 16163924 16680427
7067 16680427 16805921 17252263 17456643 18131572 17742089 17941136 18476002 18622145 19013078
7058 19013078 19166247 19131832 19855366 20138767 19827030 20028942 20183603 20401072 20257613 20140766
7048 20140766 20366603 20182568 20529510 20724481 20414167 20384553 20527078 20012659 19696427 19495088
7038 19495088 19600350 19361995 18704453 18567575 18278298 17817305 17185928 17293034 17175799
7029 17175799 16812113 16206447 15898455 15294770 15093815 14875687 14145665 13618599 13109890
7020 13109890 12422105 12341651 11716040 11551768 11713694 11531691 10873173 10601589 10202185 9847800
7010 9847800 9756606 9573718 9479550 9217654 9127411 8756672 8363183 8013244 8175607 7892079
7000 7892079 7491856 7087642 6924453 6622559 6695998 6816941 7030036 6454762 6173036 5942847
6990 5942847 5388060 5414895 5105519 5191058 5436524 5536932 5538094 5114514 5033013 5024164 4626575
6979 4626575 4617660 4931409 4676571 4373370 4247084 4200345 4175214 4152714 4194350 3986103 3990852
6968 3990852 3861879 4213417 3904955 3137499 3022041 2855989 3244579 3539127 3275177 2969713
6958 2969713 2678697 2896503 2816324 2831737 2778688 2348886 2542202 2819508 2868875 2720487
6948 2720487 2464018 2167445 2837597 2506563 2170018 1897139 1765886 1584144 1492483 1721006
6938 1721006 1722537 1308990 964187 1175718 1272649 1388805 1967952 1902418 1637782 1893532
6928 1893532 1684782 1449119 1437012 1385819 1286389 1150122 1559383 1416478 860784 1126606
6918 1126606 837281 614955 975811 911683 866652 928693 941163 866459 730262 675067 438337
6907 438337 758838 747325 808082 729031 262087 322289 538892 603639 534373 397303 465364
6896 465364 605646 763333 841533 476114 37960 108580 -63895 156700 212000 172040
6886 172040 -262371 -12129 604522 566167 604014 978411 883134 587681 196015 124775
6876 124775 378675 140531 242225 466844 288187 280458 428357 329381 169826 188668
6866 188668 590829 246195 447067 940715 614131 258217 157587 254397 72170 -198235
6856 -198235 36536 436345 584516 307487 570261 389388 238989 323713 72830 381157
6846 381157 254983 498743 125440 -275769 121715 482117 433030 406942 176646 -300628
6836 -300628 -228324 203841 158753 78758 -33568 -268966 -184409 -29082 -92111 -342075 -54567
6825 -54567 -391276 -739369 -311730 -135122 80579 117492 1123 266420 249298 264818
6815 264818 -204354 -136748 102420 20246 123034 211193 179196 -159388 -69965 -63885 144255
6804 144255 -324486 -317024 105106 146214 186383 -120746 -15906 61776 21750 -208041 -258566
6793 -258566 -586155 -6334 31947 -145743 63932 -90966 159972 614486 1021330 608642
6783 608642 728543 116189 -181119 57855 36980 30301 278940 640302 528923 576164
6773 576164 311496 -68628 -21451 179047 56606 149488 -202526 32432 64494 -69873
6763 -69873 250623 95166 -116375 -187031 -242157 -148503 65867 526723 512899 181989 359708
6752 359708 323990 73470 -367651 -171333 183378 321843 -68504 -182182 117868 -37632
6742 -37632 221411 380246 502483 159865 -86432 160361 -226130 53800 257919 48280
6732 48280 -144505 -317425 -536167 -205476 -306949 -167600 -124951 -131312 262645 -131238
6722 -131238 180968 698231 302481 76404 297219 27835 139890 155381 -37917 -300316
6712 -300316 -214494 -189759 211105 702201 510583 286550 351010 322142 396684 29320 331124
6701 331124 771651 679316 859212 572338 413457 789136 1017245 585442 649371 646539
6691 646539 476545 722126 947224 839486 862390 915112 853287 959555 771948 939728
6681 939728 1012055 888914 631014 750569 875494 948877 966527 953533 644344 462019
6671 462019 457978 339154 555126 566127 350337 26799 -220002 -63732 210655 -229407
6661 -229407 -347449 16512 42424 1017 293254 165863 436506 3245 -290737 -81092
6651 -81092 -51707 64549 43230 92484 -40538 120250 262697 13058 181948 42868
6641 42868 -186796 -325669 -569893 -290410 -42990 -207862 -401144 -555511 -772723 -746258
6631 -746258 -1024550 -375362 -592427 -590590 -327938 -399626 -244301 -335481 -572455 -358626
6621 -358626 -438901 -262417 29967 29597 -540860 -849455 -296885 126575 -473135 -569199 -119679
6610 -119679 -305032 -193741 -269693 152078 -298261 -461914 -389483 -426954 -182168 13681
6600 13681 68033 -129655 -298607 -153916 -378376 1843 -357802 -832479 -822094 -510165
6590 -510165 -367825 -325708 -285812 -635482 -286067 271467 -90794 -279940 -235970 -273997
6580 -273997 -613002 -358238 -476474 -590404 -430996 19207 -226518 -658971 -567227 -261166
6570 -261166 -289998 94505 16713 -27509 331479 -271 -343636 -179898 -213583 -256094 67729
6559 67729 -451075 -315801 -322515 -572034 -536864 -550688 -416534 -587186 -456311 -141072 -347540
6548 -347540 -126312 -471079 -207069 51121 -304416 -759507 -798799 -899029 -699942 -822657
6538 -822657 -679583 -212930 -312024 -469121 -832599 -712148 -633273 -794421 -584552 -640619
6528 -640619 -452117 -489284 -434736 -243592 -45414 -229825 -493287 -648380 -569408 -844438
6518 -844438 -519697 -390845 -291055 -378178 -563488 -374500 -188302 -267050 -321727 -740719
6508 -740719 -763615 -388268 -447128 -244191 -159083 -115772 -676568 -451824 -192543 -510677
6498 -510677 -640531 -513306 -434704 -353974 102805 -468915 -607946 -119906 -305572 -368685
6488 -368685 -412617 -369580 -4082 29584 -424315 -367312 -75954 46509 -117005 -239081
6478 -239081 -6648 -160596 -396287 -95244 -360677 -390588 -472615 -248793 77550 -118803
6468 -118803 -291713 -431674 -518662 -157795 139184 137130 151598 125175 19985 -287363 -195285
6457 -195285 -223352 166867 -12124 -525978 -109675 -100358 -104387 -115431 -464968 -238603 154657
6446 154657 397777 410670 101068 -257686 -28903 -61868 -346580 -306287 -484734 -327941
6436 -327941 221368 -152863 -685878 -549869 -240137 -224296 -434192 -412545 -594673 -345175
6426 -345175 -362179 -141170 -166192 -175650 -473701 -412124 -326030 -200988 -542910 -864372 -582377
6415 -582377 -733746 -1024153 -1002332 -564583 -336429 -481250 -469941 -223887 -482522 -441906
6405 -441906 -625087 -552970 -263355 39322 -402020 -507519 -99284 5238 -194514 89710
6395 89710 -288408 -237871 51111 -268403 -264841 -180174 235117 -105138 -120397 -531228 -515631
6384 -515631 -219429 -161914 -621852 -398327 -335185 -292759 -283166 -578780 -568686 -536243 -456773
6373 -456773 -565970 -372852 8826 -230906 -627731 -410327 177044 57156 -281389 -537114
6363 -537114 -866228 -488722 -656945 -359855 -50724 -533607 -463755 -278318 -179843 80879
6353 80879 -136214 -815779 -693432 -440279 -103814 -245388 -397662 -272518 -562753 -762219
6343 -762219 -750809 -696964 -647354 -684393 -458669 -333671 -309912 -169414 -226706 -309017 -203399
6332 -203399 -50602 -116339 -423917 -159767 -20912 -403569 -293111 -519727 -393949 -752272
6322 -752272 -553641 -362119 55671 -74123 -267128 -111711 -427642 -350936 -238302 -485917
6312 -485917 -600042 -639166 -374225 -319870 -494109 -639848 -277331 -237809 -654249 -901368
6302 -901368 -892016 -519970 -95629 203925 354821 -128176 -437390 -179088 -303130 -516383
6292 -516383 -543616 -359783 -478722 -416156 -373276 -613665 -636718 -42618 -27319 326451 514741
6281 514741 97267 18894 -256712 -368133 -278673 151146 8337 -278794 -425252 -569948
6271 -569948 -642089 -656601 -276331 19013 -220861 -542768 -455701 -262726 -117322 116527
6261 116527 338655 142560 -409139 -525093 -201249 -126444 -326807 -280066 -290562 -168938
6251 -168938 136968 158459 300342 -216369 -608019 -656338 -375426 -76996 51830 358842
6241 358842 111490 18761 199185 8191 -465030 -427222 190762 -18599 -113326 -73127
6231 -73127 -247971 -430694 -451892 -301409 -333213 -411068 -478528 -491141 -222272 -186756 -255898
6220 -255898 -89084 -66601 474695 557677 99660 -296472 -205116 -472643 -11787 -40722
6210 -40722 -149857 -250533 -273466 -467483 -631839 -306403 -331012 -178844 -566222 -312928
6200 -312928 -589487 -376882 39327 -301615 -483350 -452840 -375997 -231515 -354329 -299943
6190 -299943 -331151 -297734 -320028 -535760 -555246 -263547 -154503 -394604 -160106 -197308 12996
6179 12996 -408159 -646258 -233370 -430573 -24966 -69111 -112138 -562739 -740221 -722166
6169 -722166 -230280 -286118 -469319 -271075 -316277 -175770 -412715 -653542 -475864 -434010
6159 -434010 -697029 -478207 -46851 -86537 -193565 278717 271137 -9911 -53891 -513255
6149 -513255 -468087 -278684 -129537 -62518 -311613 132372 -99693 -357385 -722833 -28248
6139 -28248 519532 94040 -177883 -186881 157113 47292 -192116 -102028 245700 133861
6129 133861 181837 -101817 -70 -322692 -143443 23536 -191626 99071 -244319 -358569
6119 -358569 -4789 -427559 -239163 50855 89353 453060 -41196 -407983 -472970 -246640
6109 -246640 -327173 -159371 -503214 -390446 64407 313622 229388 -266271 -458528 -194979
6099 -194979 -71271 -192155 -125439 -576940 -490076 -284453 -119806 288590 246761 -317871
6089 -317871 -211743 2311 -204202 -386224 -540429 -212907 -229409 49904 197960 7010
6079 7010 -125548 -181998 -135626 -175460 -181110 140487 -74122 -89684 41549 275502 -40588
6068 -40588 -132583 -100499 253139 394657 324753 -132159 -240052 -120484 -233330 -226200 -566828
6057 -566828 -447874 -463595 -40635 201549 131141 634560 572467 181639 88456 441464
6047 441464 126393 -494703 -305872 -254273 -158504 -44763 -84015 -154962 -105059 -43444 78955
6036 78955 -250672 -320093 -16786 367247 389276 491197 520921 201079 106526 90808 -219638
6025 -219638 -104160 -127524 -259184 -315823 -161009 -378626 -201018 13068 93669 525474
6015 525474 38718 -67873 -90095 52349 -216466 -244596 -97390 -128043 -495478 -508636
6005 -508636 -236863 -141175 66091 247312 90436 -130450 109177 195561 -73391 -371378
5995 -371378 50332 -163803 -364500 -384847 -419633 -461670 -466526 -792428 -685526 -422726 -228950
5984 -228950 -207695 -684352 -568175 -476241 -350030 -404030 -290065 90623 303183 251693
5974 251693 -139965 -43466 -429453 -338874 -229474 -38598 -283388 -445799 -134364 113621
5964 113621 -197836 85825 7323 170433 104819 -149715 -46158 85361 129592 -121041
5954 -121041 -71932 219361 229143 395245 329179 -4731 -102753 -382992 141521 -211873 -351676
5943 -351676 -392894 6762 337529 -118180 -222633 -100721 -129104 -12274 -107463 -184232
5933 -184232 95136 204061 136622 286644 300139 100766 75221 769614 370433 373964 648105
5922 648105 581649 210298 329178 299153 537950 809958 261781 195432 175237 25694
5912 25694 -347036 -351844 269635 316685 485913 337860 258613 -13335 -179027 152234 48905
5901 48905 -337912 -340332 47594 370444 687057 647945 496797 198690 34890 -46565 166682
5890 166682 171869 272004 427838 25085 157946 637517 329284 183414 72762 -196936
5880 -196936 -205749 118391 177167 -67690 -386817 -120391 146332 479077 397905 38814
5870 38814 -37392 325165 44332 217987 420880 279255 189350 -124524 -136251 -307206
5860 -307206 -274713 151948 407804 513970 202572 210953 -162338 13193 340094 36588
5850 36588 315823 316088 22876 -30241 420753 376415 586162 414314 -68753 -70137 -163688
5839 -163688 48483 392326 793099 1038933 660523 511881 261494 842542 1112998 806795
5829 806795 519783 689158 357446 340823 256085 59986 97144 212876 236109 188151 168261
5818 168261 106206 270624 359451 532786 334791 470421 317125 320300 497504 392134
5808 392134 237748 23191 -157736 170217 268203 264522 643363 698620 596894 589454 341077
5797 341077 277189 652591 751504 391210 321026 -3454 732467 648356 393734 543118
5787 543118 483201 451801 242287 223749 314292 281944 584644 854612 764379 685736 518211
5776 518211 277899 157993 629356 769333 1175047 773582 825008 862759 512716 714550
5766 714550 826602 721244 748456 518512 519856 490572 580834 941693 527418 366822 565446
5755 565446 598140 750609 1173219 938092 761506 1023616 1097394 1067333 625047 891573
5745 891573 1064360 1200802 1172438 1022175 1041636 1002730 1256161 1755142 1744425 1727417 1482871
5734 1482871 1567989 1905346 1901207 1839070 1663791 1890507 1734484 1534249 1421672 1544649
5724 1544649 1806293 1652679 1673594 1879817 1617930 1550558 1494290 1477965 1491666 1619984
5714 1619984 1598668 1716098 1533463 1806517 2352881 2607942 2386996 2414636 2621846 2826868
5704 2826868 2816636 2488572 2383339 2511014 2749321 2430442 2348572 2415790 2080227 2399312
5694 2399312 2609141 2721161 2360147 1747083 1825461 1757540 1917241 1804968 1761717 2171295
5684 2171295 1850486 1708718 1941309 1925472 1948673 1967041 2396494 2464820 2594014 2229787
5674 2229787 2247641 2116637 2115689 2164721 2197099 2666645 2977134 2744683 2422901 2271062 2140982
5663 2140982 2121049 2119536 2153872 1885605 1705904 1800368 2502931 2063258 1884700 1894054 2067699
5652 2067699 2535982 2346133 2018653 2180887 2241984 2188162 2160390 2358094 2466390 2546443
5642 2546443 2692378 2436392 2394815 2401463 2453779 2817010 2648569 2601959 2596427 2496520 2703547
5631 2703547 3027804 3157426 3174525 3493916 3558544 3710637 3520914 3489363 3826944 4099447
5621 4099447 4036122 4152489 4233235 4266790 4286246 4592507 5252188 5267025 5652677 6127650
5611 6127650 6281815 6802082 7497630 7480415 7981389 8474774 9063925 9782847 10073054 10813191
5601 10813191 10980816 11343273 11863199 11553433 11064079 11047508 11067645 10635094 10544501 10414800
5591 10414800 10047895 10232580 10137559 10221017 10714663 11139204 11595038 12252519 12781773 13489970
5581 13489970 14330378 15243740 16134984 16461001 16531124 16773297 16545840 16343793 15924548 15136043
5571 15136043 14389852 13743915 12831352 12338809 11551358 10662862 10565876 10432172 10098520 10324408
5561 10324408 10307973 9975961 9976250 10665148 10747611 10876231 11349088 11312750 11500769 12010053
5551 12010053 11697826 11329412 10638706 9700663 8891555 8184086 7790342 7103738 6713209
5542 6713209 6088644 5560490 5556234 4986040 4319725 4270137 4313311 4179508 4006689 3865119
5532 3865119 3784766 3702974 3718882 3522669 3656567 3541033 3238776 2923051 3037172 2999984
5522 2999984 2651846 2710722 2659222 3180485 3102790 3210275 2981790 3205045 3430495 3306060
5512 3306060 2847197 2909565 2811945 2538147 2155380 1927468 2190212 2253544 2024448 1910951
5502 1910951 2468576 2619332 2714606 2396047 2176904 1956325 2107629 2524341 2402374 2788658
5492 2788658 2895927 2677030 2508267 2717870 2820852 2966798 3455039 3191711 2882324 3169650
5482 3169650 2937624 2911250 2695347 2709642 3020925 2509601 2535026 2856641 2916862 2752139
5472 2752139 2423088 2723370 2641709 2661256 2906083 3045251 2954066 2965957 2645373 2985732
5462 2985732 3022378 3347608 3329966 3037076 3253270 3556708 3690414 3674796 3908577 4086353
5452 4086353 4052646 3537183 3342163 3549623 3032550 2996557 3389150 3194987 3034713 3312798
5442 3312798 3382491 3324905 3438732 3378660 3240585 3331961 3180480 3164967 3564297 3680645
5432 3680645 3731472 3844634 4027686 3208828 3237160 3324120 3270325 3808186 4193403 3932940
5422 3932940 3992823 3830253 3812073 3646265 3591984 4162035 4103232 3775867 4261390 4900424
5412 4900424 5174876 4986950 4907133 5070513 4991453 4818275 4766897 4725088 4922678 4890600
5402 4890600 4902386 5096714 5429825 5768881 5846722 5445109 5288344 5560997 5739786 6078349
5392 6078349 5984344 6136156 6830994 7134500 7327138 7367577 8060670 8281048 8902413 9061909
5382 9061909 8951240 9484726 9641930 9949431 10026995 10055747 10147997 10181739 10325541 10238472
5372 10238472 10467808 11096883 11318255 10828287 10937403 10997422 10764785 10614592 10982601 10978265
5362 10978265 10884363 11107058 11261364 11628451 11468370 11124884 11671404 11910970 11916434 11735729
5352 11735729 12179732 12521084 12849293 13168197 13338955 13431935 13324935 13954026 13770615 14043885
5342 14043885 14244028 13748132 13635110 13747252 13526359 13455968 13505206 13839341 13857244 13796063
5332 13796063 13275926 13234649 13313551 12875838 12676828 12680570 12399709 12023993 12051621 12071164
5322 12071164 11840310 11962485 11707650 11968012 11598433 10702422 10778051 10934206 10739913 10601115
5312 10601115 10463209 10476842 10562248 10649070 10874707 10960812 10927276 10639994 10757865 10732585
5302 10732585 10414741 10161924 9643362 9620317 9431901 9110073 8935141 8978136 8928020 8327825
5292 8327825 7384590 7078688 7129716 6377612 6232316 6256417 6051898 5921070 5595292 5727513
5282 5727513 5405982 4990504 4841036 4508938 4256744 4379979 4599304 4540720 4167231 4035007
5272 4035007 4087274 4566751 4125828 4124576 3979957 4046184 3686575 3494752 3509807 3458190 2976546
5261 2976546 3016157 3059967 3282579 3726001 3310721 2797607 2863009 3136030 3553331 3826922
5251 3826922 3425238 3330701 3232296 3199201 2908660 2814295 2830067 2664952 2533381 2481649 2342396
5240 2342396 2521353 2119150 2142096 1877936 2440191 2598701 2392808 2258477 1954120 1555306
5230 1555306 1664471 2171078 2241921 2376822 2401675 2321173 2289269 2185430 1933600 1803907
5220 1803907 1645872 2018549 2077363 2150735 2383605 2251092 2348087 2288662 2037884 2056137
5210 2056137 2048111 1902068 1953093 2037716 2471698 2327894 2328493 2191386 1978169 1923385 1802807
5199 1802807 2042448 1786729 1238711 1779488 1743211 1787872 1754082 1997812 1883792 1915961
5189 1915961 1910787 2039589 1539182 879263 1251571 1738523 1997406 1983586 1745206 1595440
5179 1595440 1215091 1623776 1618411 1806841 2185913 2088664 1773309 1848442 1917923 1752903
5169 1752903 1894663 2158186 2278306 1882054 1696275 1868083 2050090 2129258 2208841 1950994
5159 1950994 1684054 1330748 1403168 1514048 1468897 1500074 1772675 1620601 1869003 1865675
5149 1865675 2029668 1803529 2041828 2223649 2402310 1991649 1745054 1802036 2039618 2107056
5139 2107056 1828918 1736658 1656136 1817774 1898387 2222792 2158604 2281446 2203032 1900588
5129 1900588 1612012 1556364 2064556 2293045 2377162 2499057 2232697 2476996 2705978 2676928
5119 2676928 2689942 2365260 2588695 2917219 2660628 2093425 2544956 2723347 2311460 2681738
5109 2681738 2589119 2221474 2402716 2339194 2246411 2409340 2423071 2300493 2474184 2001030
5099 2001030 2055865 2149246 2600524 1907427 2209394 2449556 2246330 2337026 2132534 1984275
5089 1984275 1967895 1845774 1798935 2039861 2276561 2080564 1984084 1563405 1766491 1872584
5079 1872584 1692618 1884573 1808885 2002272 2294011 2603544 1769198 2452891 2432600 2259890
5069 2259890 2083755 2093886 2238367 2300515 2127621 2203435 2178593 1856798 2003012 1904719
5059 1904719 1767873 2037727 1881798 2061974 2389892 2408694 2417587 2088323 1916530 1725333
5049 1725333 1780144 1764687 1834831 1758058 1565865 1658492 1766791 1667572 1669468 1878183 1826423
5038 1826423 1711584 1799866 1714637 1905557 1985172 1763676 1893527 1708576 1805799 1868492
5028 1868492 2080209 2371057 1972593 1963780 1918400 1867216 1794198 1786745 2350187 2373100 2226170
5017 2226170 2130275 1995379 2220062 1785239 1552438 1758271 1598309 1467043 1282505 1758869
5007 1758869 1856513 1855477 1680392 1742772 1752536 1836249 1875171 2140930 2059565 1629272 1702946
4996 1702946 1722006 1776700 1656537 1887748 2166451 2275130 1963716 1639684 2048317 2295460
4986 2295460 2311703 1758612 1634831 1685320 1746002 1635210 1743380 2079212 2051953 1749991
4976 1749991 1755942 1695386 1793359 1891382 1706639 1783426 1855251 1882412 1720303 1938858 1701497
4965 1701497 1663554 1418574 1618910 2020094 2128770 2020803 1795529 1641408 1508538 1609402
4955 1609402 1613785 1368408 1485617 1966145 2089230 1794887 1896711 1771446 1996030 1880651
4945 1880651 1579201 1638180 1711669 1629270 1533703 1525235 1484253 1600432 1941566 1951558 1820981
4934 1820981 1611807 1834249 1710156 1248343 1483626 1643675 1781374 2241795 2432048 2404012
4924 2404012 2092931 1922119 2086487 1804138 1697512 1571193 2038487 1956944 1999635 2423708
4914 2423708 2573813 2290612 2352834 2085250 1570459 1605217 1757016 2270042 2555762 2269056
4904 2269056 1980015 1793496 1835391 2035486 2062256 1890441 2004936 2021015 1842522 2070809
4894 2070809 2177682 2154439 2342151 2652432 2747342 2736396 2313708 2281904 2111273 2112001 1797528
4883 1797528 2186276 2574283 2514047 2212922 2060592 2545319 2661960 2732272 3215356 2764699
4873 2764699 2510933 2720573 2991729 2851080 2601879 2862372 2672966 2833750 2549620 2384352
4863 2384352 2446168 2730829 2691541 3088837 3197835 2972767 3205596 3274609 3148358 3211061
4853 3211061 2924240 2912848 3331393 3309733 3322214 3557493 3968729 3833849 4069415 3853301
4843 3853301 3545305 3649738 3726423 4061935 4007679 4413182 4443753 4331071 4342818 4523267
4833 4523267 4392448 4398942 4451367 4386638 4291302 4482666 4618722 4558849 4896499 4981634 5112740
4822 5112740 5585766 5401296 5144659 5803246 5619989 5535799 5683854 6185915 6089743 6171850
4812 6171850 6510290 6579698 7297170 7673085 7988481 8405672 8332216 8804210 9117653 9245734
4802 9245734 9620478 9450726 9684878 9917398 10223547 10680132 11572490 11972987 12367880 13186012
4792 13186012 14177141 15319863 16159119 17042632 18623193 21265675 24013893 26975897 29190283
4783 29190283 30057526 29101030 27034712 24270865 21675531 19647809 17884818 16474828
4775 16474828 15708476 15325945 14689651 14217520 13947113 14402311 14418030 14101729 14076823 14080225
4765 14080225 14021711 14227965 14455142 14620963 14433276 14702463 15107622 14861054 14778610 15335032
4755 15335032 15321279 15649777 15761967 15615069 15859165 16185053 16199867 16100237 15965315 16006858
4745 16006858 15906656 15971854 16297206 16321504 16336946 16732871 16863918 16950788 17434675 17393461
4735 17393461 17273962 17229242 17461438 17402522 17463472 17700030 18065054 18624398 19369161 19833766
4725 19833766 20965615 21584416 22114269 22873472 24208573 25975327 27906327 30611985 33185713
4716 33185713 33965924 33598604 32096061 29468954 26552079 23982875 21296861 19487102
4708 19487102 18363303 17436002 16620886 16006629 15838428 15277709 14442680 14198338 13837420
4699 13837420 13530803 13520621 13667815 13769193 13429394 13112337 12446215 12218431 11826326 11497037
4689 11497037 10998058 10224772 10143196 10345457 9903941 9571972 9593886 9461771 9496120 9440998
4679 9440998 9050583 9017149 8616037 8913660 8821637 8996101 9103318 9314194 9599017 9403590
4669 9403590 8960583 8804697 8558524 9200556 9325830 9097755 8921047 8911754 9054789 8694486
4659 8694486 8936256 8951944 9074895 9466605 9670839 9891784 9849197 9758353 9767985 9542323
4649 9542323 9850079 10029694 10229831 10511976 10640015 10493431 10640554 10875987 10806573 10996348
4639 10996348 11309139 11202927 11306863 11686902 11824752 12115529 12383316 11883876 12317721
4630 12317721 12834511 13115518 13233913 13243680 13283744 13554315 13591593 13925118 14007533 14199828
4620 14199828 14962419 15109733 15457081 15838006 15931629 16154448 16044209 16296960 16823798 16742851
4610 16742851 16591282 16665415 16506831 16658328 17029216 17235679 17129900 16975541 17324983 17304483
4600 17304483 17227236 17367097 17108964 17318548 17298165 16860286 17154529 17099279 17246221 18028387
4590 18028387 18075155 17944132 17497360 17523505 17760340 17738342 17803715 17744960 17601625 17208465
4580 17208465 17276245 17384462 16939107 16305892 15775462 16077178 15846723 15189398 15101151 14879712
4570 14879712 14617974 14518637 14248740 14250054 14445557 13896717 13627177 14091577 13864410 13492984
4560 13492984 13423713 12638054 12945521 12948425 12687712 12855780 12572464 12097106 12248570 11760623
4550 11760623 11710896 11933432 11840226 11970155 11893515 11311989 10954252 11112695 11054043 11278002
4540 11278002 11547357 11289971 11114504 11456464 11943353 11993959 12028546 12185112 11857752 11839241
4530 11839241 11917742 11924573 11896731 11435152 11257810 11645301 11935982 11938519 11643743 11384150
4520 11384150 11050060 11515718 12046877 12103720 12037157 12043879 12546749 12541742 12211209 12359071
4510 12359071 12633326 12884264 13063628 13041017 13482536 13691414 14220753 14259816 14445613 14965808
4500 14965808 15337150 15400160 15728091 16336829 16979032 17105128 17197247 17538175 17606723 18067096
4490 18067096 18594649 18752084 18900167 19711491 20294606 21026041 21769160 21974815 22490337
4481 22490337 23625713 24537189 24887353 25915788 26897773 28040891 29721573 31004622 33019785
4472 33019785 34971382 37175343 38487499 38682090 38228758 37277383 36374455 35226121 34462882
4463 34462882 34034941 33184075 33175562 33337995 33466848 33727876 33986038 34205939 34733799 35074618
4453 35074618 35211102 34929373 34804532 35479906 35513485 35713992 35964042 36563519 36956592 36537116
4443 36537116 36770070 37353828 37635843 37639047 37629419 38058051 38672970 38659343 38792819 38744427
4433 38744427 38805209 38639598 38563109 38842498 38943650 39247339 39258275 39306659 39460889 39526005
4423 39526005 39064353 38802340 38612183 38812108 38527231 38356393 38527280 38549087 37826417 37352538
4413 37352538 37370703 37074495 37017271 36724396 36083849 35091719 34657471 33873624 33247585 32674821
4403 32674821 32222133 31769300 31038145 30577599 30677185 29775285 28911112 29291046 28831847 28072843
4393 28072843 27887042 27870721 27573322 27099302 26531123 26320056 26344683 26573259 26272545 26532002
4383 26532002 26675945 26521585 26705402 26127844 26136671 26457305 26719568 26845464 26953141 26839507
4373 26839507 26858003 27165626 27198201 27792607 28436349 28439513 29020772 29219398 29643901 30185689
4363 30185689 30466756 31036075 31302547 31758290 32207761 32435978 33010171 33775183 34607172
4354 34607172 35261510 35616530 36425761 37199492 38036393 39016195 40181381 41141741 42141026
4345 42141026 43382631 43984999 44912041 46190438 47767267 49702407 50778900 51956601
4337 51956601 53119441 54010224 54861924 56522236 57849591 58865270 59993217 60746350 61392134
4328 61392134 62139973 62999965 63796638 64241340 65128666 65722495 66709203 67498929 67915447
4319 67915447 68406125 69122596 69991374 70859468 71435565 72846712 73983606 74847693 76153719
4310 76153719 77353114 78668443 79508764 80839235 82280655 83574967 84747814 86174601
4302 86174601 87786305 89494133 90839761 92625034 94003462 96099413 98278328 100491707
4294 100491707 102185268 103848755 106094048 107935952 109457612 110930027 112356478 113584519
4286 113584519 115196968 116126885 116469544 116255298 115342621 113894855 112409075 110596708 108803067
4277 108803067 106893787 104439994 101965833 99336454 96787790 94454950 91970642 89658540
4269 89658540 88028757 86710535 85299809 83833547 82219094 81066351 80764945 80271379
4261 80271379 79913998 80000016 80431653 80895328 81718723 82142309 82436755 82271008 81412019 80104662
4251 80104662 78554895 76579547 73898974 71499010 69706892 67581330 65251378 63399875
4243 63399875 61647169 59769231 57942999 56374375 55030938 53799873 52761605 52166094
4235 52166094 51774081 51006254 50531045 50310663 50543378 50533344 50274059 50699055 50627564 50866773
4225 50866773 51202350 50964990 50576846 50546810 49861327 48648738 47491213 45966781 44992743
4216 44992743 43771904 42431920 41653587 40456583 39643783 39108206 38599315 37738060 37286123
4207 37286123 36620471 36309611 36313712 36326481 36228246 36165413 36553775 36429681 36445581 36306806
4197 36306806 35878060 35609135 34735481 33520699 32630614 32135055 31742935 31242792 31178919
4188 31178919 30845663 30299964 29695355 29760565 29735747 29692037 29354402 28731519 29011031 29096994
4178 29096994 28516543 28433507 28435810 28490937 28531732 28712803 29029734 29113882 29341221 29033190
4168 29033190 29344300 29814708 29717224 29980349 30061639 30564115 31063305 31642977 32100455 32404406
4158 32404406 33031224 33095892 33524549 33795923 34181367 34364095 34223338 34383475 34662939 34613452
4148 34613452 34786630 35232776 35810301 35536216 35848317 36589511 36850286 37201865 37501692
4139 37501692 38094342 38693024 39711233 40511645 40892638 41540258 42242419 42735975 43557899
4130 43557899 44638959 45937306 46591139 47520380 48741748 49899422 50674547 51378312 52443292
4121 52443292 53117879 53921522 54469785 55304116 56018508 56823221 57711521 58296322 59456250
4112 59456250 60618032 61767559 62745776 64437361 66680363 68582534 70012164 71763183
4104 71763183 74072444 75933291 78127648 80497325 83084175 86689363 89917488 93191477
4096 93191477 97638781 102946008 108337175 114450393 121198835 128422023 136478424 145036008
4088 145036008 154379287 164223385 174478710 186153572 197934915 210960103 227337520
4081 227337520 246759760 270778327 298215593 325403215 343689974 345793072 333218475
4074 333218475 310731622 282983071 254689660 229297376 207816997 189732512 174714688
4067 174714688 161704066 150375436 141264337 133603445 127123557 121525687 116761164 112152463
4059 112152463 107385297 102733851 98869417 94894336 91626239 88548661 85567946 82962207
4051 82962207 80622658 78874154 76793600 74741120 73173479 71546222 70036672 69061695
4043 69061695 68054498 67198735 66556664 66196757 65503062 65761823 65938885 66410012 66688365
4034 66688365 66980026 67828187 68019693 68207566 68176148 68046764 68225591 68492880 69087402 69854103
4024 69854103 71034637 72366349 73815190 75743188 77125013 79018803 80576406 81888617
4016 81888617 83442502 85459371 87275636 88939760 91335964 93719056 95885644 97899410
4008 97899410 100456204 102747376 105269234 108107007 110975843 113524544 116484747 119960755
4000 119960755 123572191 127081127 130709268 134132369 137279264 140341347 143781675 147868985
3992 147868985 151708864 155481162 159029121 162689181 166090364 169430558 172960628 176153359
3984 176153359 179608308 182560499 185455249 188114224 190742899 193220581 195466830 197188601
3976 197188601 199007319 200612615 202123140 203551391 204666268 205599675 206110690 206480746
3968 206480746 206769918 206946550 206725873 205971588 205032564 203638289 202245667 201440449 199930681
3959 199930681 198393957 196148818 194144722 192233182 190471817 187816957 185223128 183398483
3951 183398483 180856464 178167555 175506436 172966645 170687373 168746686 167207862 165587644
3943 165587644 164458494 163532033 162772620 161909377 161888487 162400130 162918852 163914029 165722429
3934 165722429 167633803 170334927 173518538 177237970 181560566 186793676 192378040 197961544
3926 197961544 203427181 208469805 213775341 218550711 223203793 227429025 231552628 235168308
3918 235168308 238294035 240844233 242393158 243232946 242921016 241447453 239697741 236548758
3910 236548758 233153128 229859159 226037072 222256433 219012135 215857714 213098905 210102258
3902 210102258 207369132 205551244 202732042 200124053 197373609 195190059 194192064 193812278
3894 193812278 193917873 194860878 197357031 201003711 206082398 213043939 221362938 231112862
3886 231112862 241471670 252923658 265073120 277047068 287612390 297195752 304312413
3879 304312413 308005497 309219890 308041634 304671097 300581493 296014808 290692319 286032207
3871 286032207 281028350 276442819 272353283 267608574 261950504 255490895 247412384 238195544
3863 238195544 226579703 213938582 200221962 187101611 174670832 162467154 151332556
3856 151332556 140959491 131989795 124558928 117302045 110766028 105319123 100030908 95784019
3848 95784019 92139675 88535569 85518542 82064654 79093819 77008612 74961636 73306131
3840 73306131 71807489 69705976 68290069 67016051 65707860 64749634 63059148 61659230
3832 61659230 60059645 58656454 57164126 55635897 54154914 53471754 52419371 51370644
3824 51370644 50570301 49582305 48968417 48159493 46950296 45979559 45063685 43877956 42789691
3815 42789691 41850709 40531596 39459957 38978530 38015589 37425591 36561220 36027256 35001333
3806 35001333 34395172 33849593 33359276 33117025 32462269 32038426 31693510 31018658 30726828
3797 30726828 30962368 30408177 29971319 29566314 29468927 28886359 28283616 27995302 27784797 27686725
3787 27686725 27810403 27008256 26859490 26673852 26265940 25902502 24922025 24504382 24185976
3778 24185976 24100567 23708409 23773018 23767503 23582453 23290264 23165386 22659783 22312899 22189546
3768 22189546 21853532 21885357 21473114 21365635 21360018 21058284 21001034 20791815 20941083 20710805
3758 20710805 20681228 20461833 20286193 19943206 19757869 19773624 19514436 19355610 19585864 19524740
3748 19524740 19119971 19372308 19341080 19073339 18895335 19167639 19370385 19392133 19462858 19818910
3738 19818910 19529820 19767487 19780748 20141236 20389365 20147395 20027365 20365555 20230582 20171252
3728 20171252 20319453 20628749 21252997 21212192 20896704 20626436 20946059 21648461 21845308 21678135
3718 21678135 21849918 22164885 22431632 22721026 23239905 22919342 22678446 23525832 24080200
3709 24080200 24305457 24737827 25429986 25348808 25928672 26648969 26742801 27281883 27854290 28168674
3699 28168674 28340372 29006497 29745132 30237079 30960429 31939502 32788756 33137793 33977212
3690 33977212 34743971 35968496 36662563 37243545 38260979 39158455 39995046 40564842 41595817
3681 41595817 42851600 43798549 44533518 45552732 46274802 46974385 48376413 49749221 50996576
3672 50996576 52122058 52874316 53986012 55246171 56539153 57510162 58614065 60167319
3664 60167319 61820935 62986953 64394048 65707937 67220171 68657242 70699602 72574532
3656 72574532 74278619 76156133 78425090 80937114 83799307 86336704 89127930 92195857
3648 92195857 95679103 99604371 103339343 108191047 113371057 119024118 125064044 131116680
3640 131116680 138039864 145034713 153086121 161002067 169281945 178330486 186671432 195477846
3632 195477846 204555270 214114813 224529769 235187138 246394846 258221519 270691186
3625 270691186 283701505 296531978 309604555 322477498 336131171 349399942 361804739
3618 361804739 373620381 384477654 394001188 401484269 407093547 410947537 413995507 416501285
3610 416501285 419029553 421700842 424493415 427270856 429938869 431935693 432838452 431312633
3602 431312633 427262049 420859415 411922633 400153854 386568633 371946640 357635897
3595 357635897 343397179 329659936 317104194 305542795 295377343 285645681 275768800
3588 275768800 265043257 254401809 242883064 230612526 217362045 204275884 191489813
3581 191489813 179900520 169359889 159459006 151232829 143046566 135889275 129477935 123812316
3573 123812316 118582026 113701118 109267450 104495910 100277988 96498033 93381760 90570772
3565 90570772 87682583 84623097 82067640 80108867 77766330 75395039 73083785 71333361
3557 71333361 69759464 68008284 66010055 64506043 63199030 61310005 60126007 59165131
3549 59165131 57914930 56814550 55625283 54290657 53224830 52185840 51459602 50036717
3541 50036717 48755312 47704534 46782893 46178325 45469062 44616333 43821713 42840766 41553746
3532 41553746 41012093 40261053 39470509 38870093 38060780 37218613 36624249 35693251 34841668
3523 34841668 33786103 33340681 32932122 32164747 31647878 30520025 29693230 29083868 29227250
3514 29227250 28215928 27333646 27191685 27196748 26569325 26143010 25668943 25471007 25438868 24844348
3504 24844348 24487110 23673666 22964129 23072399 22744629 22256555 21390347 21112175 21019815 20383566
3494 20383566 19881615 19765296 19554346 19056614 19026742 19151544 18748550 18469394 17927728 17706650
3484 17706650 17470208 17287784 17148238 16921843 17112705 16889153 16708304 16511065 16173704
3475 16173704 15797792 15611356 15464528 15179113 14898125 15089137 15028383 14759793 14848622 14860513
3465 14860513 14455208 14520677 13975599 14062079 14190128 13919120 13720345 13772410 13346273 13462411
3455 13462411 13623136 13319535 12966153 12933085 12732452 12620166 12762584 12809153 12688393 12527436
3445 12527436 12302361 12196909 11817606 11798835 11671649 11653059 11754362 11655267 11506987 11473302
3435 11473302 11286270 11015349 10922818 10989880 10787259 10930021 10955126 10678774 10728853 10684001
3425 10684001 10555322 10881592 10547409 10560515 10650329 10434150 10786828 10596591 10566888 10205726
3415 10205726 9881206 9494223 9854840 9895587 9529651 9670619 9888550 10087777 9963860 9752625
3405 9752625 9969626 9646099 9767806 9795005 9769781 9453518 9426406 9491578 9585280 9783621
3395 9783621 9368636 9149369 9417936 9625794 9514275 9320415 9320333 9237867 9503281 9590112 9384344
3384 9384344 9582671 9308606 9416062 9504448 9566472 9620826 9545431 9904631 9717505 9769888
3374 9769888 9759438 10356393 10680563 10186348 10560469 10687507 10579299 10521808 10814642 10873192
3364 10873192 11113422 11047015 11400974 10977083 11281640 11493181 11269693 11488104 11842700 11804289
3354 11804289 11641458 11850546 11973256 12544610 12830799 13001453 12893660 13173527 13607747
3345 13607747 14025728 14313776 14202903 14615085 14731887 14759550 15256974 15770867 16262609 16150792
3335 16150792 16347721 16697352 17511677 17521893 17717845 18271299 18687445 18848593 19440736 19784273
3325 19784273 20226068 20643053 20444098 20905434 21715643 22360682 22763973 23100156 23677658
3316 23677658 23848314 24203823 24766808 25566776 26106961 26568828 26909091 26854191 27346250 27973389
3306 27973389 28303833 28777801 29410085 30181618 31218560 31778650 31935555 32981665 33520856
3297 33520856 34178038 35039757 35689266 36403497 37157604 37711741 38971199 39953545 40551486
3288 40551486 41588485 41942116 42553925 43366246 44414650 45566402 46946764 47876186 48600991
3279 48600991 49514563 50592072 51762694 53163429 54446588 55468716 56430905 58001805
3271 58001805 59138651 60333532 61545807 62517171 63473266 65072547 66932477 68633651
3263 68633651 70652478 72417390 74374901 77191847 80077891 82958234 85934923 89524685
3255 89524685 93292641 97306123 101622447 106242210 111288150 116428164 122287631 128858501
3247 128858501 135838221 143191846 151235945 159190511 166743178 173733921 179572387 184394071
3239 184394071 187080685 187825432 186428611 181996400 175137484 166078999 154944871 143117660
3231 143117660 130701252 118790210 107935125 98660466 90456926 82952217 77161958 71778773
3223 71778773 67261824 62837298 58871864 55392536 52541632 49353049 47210267 44750139
3215 44750139 42502411 41247018 39518143 37189333 35585569 34421999 32690377 31330697
3207 31330697 30132231 28780042 27443831 26300054 25007232 24261972 23101814 22657865
3199 22657865 21774959 20973990 20247239 19826042 19443348 19014036 18369799 17617440 17064873
3190 17064873 16848813 16467275 15815798 14982036 14743068 14096650 13663497 13342600 12668060
3181 12668060 12762252 12899912 12232402 11716960 11635976 11350041 11221665 11082260 10942422 10750827
3171 10750827 10303208 10003378 9837397 9386972 9416760 9342375 9217806 9089968 8861382 8734003
3161 8734003 8450828 8310103 8331335 8036839 7802936 7784787 7763423 7566161 8132268 7757405
3151 7757405 7308437 7256882 6765264 6637804 6747511 6625741 6625161 6801970 7159361 7086467
3141 7086467 6410545 6051246 6247054 6232954 5830876 5579808 5501407 6024298 6253448 6066374
3131 6066374 5735530 5616872 5188971 5036961 5095161 5003550 5199720 5306424 5017687 5074615
3121 5074615 5445891 5278985 5284463 4774157 4705384 4860017 4671575 4421371 4607349 4059776
3111 4059776 4031158 4312276 4402226 4780488 4719142 4297401 3653160 4110892 3998882 4335397
3101 4335397 4452109 3859263 3840986 3775989 3747746 3401105 3722146 3765167 3419552 3477146
3091 3477146 3707336 3634245 3470182 3368689 3726476 3482589 3486333 3744899 3804376 3864949
3081 3864949 3572431 3109775 3278408 3215057 3520033 3272431 3435165 3137667 2741131 3339795
3071 3339795 3440278 3234882 3175333 3236071 2998597 2873082 2942629 2877947 3022612 2941794
3061 2941794 2740661 2492903 2611484 2712003 2701291 2788598 2675839 2967236 2941710 3187191
3051 3187191 2721556 2396750 2082833 2034434 2286140 3068440 3439993 2831941 2374189 2713728
3041 2713728 2788009 3206814 2836680 2709712 2321926 2503609 2393872 2308657 2379580 2581339
3031 2581339 2450484 2489722 2742576 2561868 2673664 2640798 2510882 2274561 2441984 2562013
3021 2562013 2575607 2514101 2548279 2448013 2252464 2260792 2049613 1947354 2293781 2174511
3011 2174511 2230274 2357350 2338588 2482742 2586688 2430605 2413798 2774356 2947808 2972449
3001 2972449 2935637 2658690 2692295 2427462 2537269 2623306 2674138 2837852 3076336 3041979
2991 3041979 2961773 2783474 2860895 3446823 3565754 3393752 3208386 3209637 3277583 3633323
2981 3633323 3867252 3257190 3592999 4017526 3675685 3524942 3329048 3502279 3741980 3806379
2971 3806379 3651178 3364600 3302916 3500948 3593320 3638435 3940948 3813363 4043548 3767254
2961 3767254 3717125 4449910 4775031 4857617 4844433 4562376 4667225 5027974 4902140 4788894
2951 4788894 4876998 5265761 5604370 5928223 5425931 5543814 6098409 6184426 6426131 6744595
2941 6744595 7163746 7991048 8387916 8229786 8454549 8638684 8935147 9650694 10164708 10751444
2931 10751444 10968298 11389951 11410085 11611264 11976206 11735632 11615003 11601472 11929989 11964665
2921 11964665 11742680 11769211 11552754 11872874 12273741 12299042 12488637 13072417 13279301 13280477
2911 13280477 13954173 14379443 14820523 15268876 15684619 16127240 17396938 18757895 19819401
2902 19819401 21155447 22185661 22254268 21441259 19939683 18220229 16029207 14648360 14181133
2893 14181133 13046598 12430718 12012188 11323291 11457002 11193275 11068414 11020537 10706940
2884 10706940 10774781 10809597 10504453 10114762 10125920 10748630 10856844 11165957 11019152 10912069
2874 10912069 11185227 11197022 11497150 11628245 10838631 10301169 10322195 9929520 9479554 9412494
2864 9412494 8704919 8411144 8188151 7332322 6807259 6256404 5923621 5873816 5716481 5868750
2854 5868750 5648145 5086289 5378156 5088284 5148683 5144050 4569950 4421570 4369219 4311693
2844 4311693 4163582 3753515 3695679 3522944 3384021 3301721 3079701 2992907 2799536 2486207
2834 2486207 2753312 2779408 2420188 2157224 2185583 2624997 2535445 2400928 2283223 2228512
2824 2228512 2353457 2238599 2231548 2343429 1998582 1660896 1605234 1641518 1598484 1616533 1431710
2813 1431710 1627588 1724364 1534319 1811345 1371998 1107043 1059474 1259179 1539879 1549032
2803 1549032 1617803 1692992 1814212 1831245 1347389 1094528 990116 1083465 947716 1244340
2793 1244340 1376841 1095563 883317 1002366 1197289 1008634 1202230 1188890 1459246 1170725
2783 1170725 638839 599494 923210 987944 789941 929290 1145300 1079462 871107 705887
2773 705887 932242 1197492 1227593 1233139 767005 883180 910558 1156740 1135555 971691 711283
2762 711283 854038 582256 359472 744429 690910 641468 763373 1136687 906911 790078
2752 790078 733945 733715 1140594 1121020 659049 701145 608190 521551 582663 869740 776296
2741 776296 771225 949819 834777 763176 859231 1042028 1122864 729244 287049 387048 22620
2730 22620 -36701 41228 285177 720973 764095 991162 1136047 902841 782224 399858
2720 399858 652218 489425 561251 730720 496392 390837 648126 846564 418578 625176
2710 625176 681785 1079576 583747 251189 6387 234895 554596 251114 524063 194382
2700 194382 197594 484596 588964 736938 504570 395665 568263 715387 520111 212243
2690 212243 533689 530557 457855 361760 239214 -90386 202710 465581 306592 298778 130467
2679 130467 269953 158487 349580 245278 525234 697050 605101 457123 648376 710979
2669 710979 480510 522315 660680 345998 177962 -74842 306547 48550 -284487 -37178
2659 -37178 118242 352664 554966 632276 193094 -16814 123958 230440 65504 270753
2649 270753 225753 324441 150514 109628 324611 376993 683007 692773 415838 365122 181566
2638 181566 372127 366390 130808 216113 283939 -77127 188614 419441 201294 339315
2628 339315 291053 523909 538429 853791 703092 744973 764058 246148 -38234 44117 29749
2617 29749 -185680 -31702 320141 449139 514356 319676 238378 340890 333762 357288 419535
2606 419535 558247 458339 336584 326628 237129 56785 283363 116636 -131590 107411
2596 107411 -113457 2447 76947 184322 120463 284863 530737 -28207 46435 481161
2586 481161 511028 521981 273451 210054 232909 148670 420051 382440 190966 -56971 249411
2575 249411 232379 533487 404786 292386 197553 280993 299616 336682 355798 71113 -2005
2564 -2005 258939 547137 479864 289135 132181 513517 617969 260128 446917 203538
2554 203538 -262231 -545884 164278 195612 38840 -147322 -427879 -250630 70660 -31868
2544 -31868 -441227 -462419 -360294 -13357 -58086 -58711 -386270 98949 217748 -61645 208891
2533 208891 91510 24819 46396 371468 432157 317238 133870 77546 139526 -45503 238899
2522 238899 376978 145340 73481 310726 383394 -142400 101021 163758 -32147 33780
2512 33780 -154126 -316033 -161368 -218419 39350 632555 378859 84940 291915 -18548
2502 -18548 -68285 156155 234520 58235 -157427 77294 -93496 59395 243090 146685
2492 146685 111347 184853 -206485 134808 509042 390630 337164 66956 -148936 83944
2482 83944 75010 429018 53002 156460 -274192 -44846 -104134 -81462 147642 130289 238672
2471 238672 -32425 -263938 -91089 196475 145903 54609 -72467 -78131 10074 -101773 31534
2460 31534 -153270 -129850 208614 288905 513841 378664 402048 173576 204380 381310 227356
2449 227356 76756 -76592 267558 110596 -141545 -28401 -265472 192389 129450 46422
2439 46422 -283659 -176551 -67586 177810 146859 -382131 -176716 225521 455234 559174
2429 559174 -70448 33846 -103806 -240422 138038 349723 335138 88751 -113203 -169496
2419 -169496 -231364 -288361 150300 218324 -192750 -110626 540325 158544 182479 604054 387805
2408 387805 104082 162953 404414 381187 -55475 -34183 63623 153525 207914 83215 -19137
2397 -19137 -34838 162804 116034 107120 -157112 -257323 139471 641765 734091 350430 292404
2386 292404 365141 244376 552528 685361 483665 653867 749199 659105 246353 22195
2376 22195 85502 -1664 203826 249044 406129 807381 1027493 915936 699193 389592
2366 389592 402777 383450 649102 607553 602346 297206 325483 241667 527541 343218 150587
2355 150587 -168317 17954 181336 18939 254339 453075 361896 205959 372618 294292
2345 294292 471885 240415 109103 47657 5330 -111425 29334 -120546 -216493 -178702
2335 -178702 197598 -19409 -103971 105290 339992 322710 279547 109893 70361 158265 -161157
2324 -161157 -326799 -487839 -373380 -60872 387022 254304 187710 128558 62139 -133462
2314 -133462 -96191 525694 580790 700865 676075 272185 251080 414058 171956 115178 181080
2303 181080 25554 5100 -247922 -92911 281828 61338 -46279 -89489 -187205 -379191
2293 -379191 -502728 -195384 93079 305024 302894 12222 266650 92780 225475 198209
2283 198209 81768 6710 105643 182795 188581 -229752 -23256 104271 51962 272335 197428
2272 197428 164163 467044 29716 -44330 403442 326162 252447 341573 244846 221130 18118
2261 18118 279027 576036 310583 351144 318967 279879 -35493 214056 470029 418236 413603
2250 413603 397801 351503 392200 273479 318325 224049 114204 85493 669723 1002036 934749
2239 934749 527441 280033 549928 543384 466772 396884 620870 683869 355898 150444 60116
2228 60116 113305 139083 22744 284349 583267 467099 321409 56990 40498 -80680
2218 -80680 103467 191330 384688 235302 813951 992528 923035 957477 680205 641983 311280
2207 311280 305929 668953 904377 895395 444784 567992 545036 787909 337457 572694 945243
2196 945243 1000132 978894 687806 1182233 914153 987042 1105372 1357755 1896000 1846936
2186 1846936 2016564 1885806 1496095 1684009 1554612 2041572 2196453 1980253 2252691 2567328
2176 2567328 2193675 2237637 2322248 2104112 2177444 2689284 2873653 2690405 2748959 3040125
2166 3040125 3034556 3134026 3419790 3106500 3279432 3535758 3486891 3389568 3699435 4121289
2156 4121289 3826028 4111816 4706217 4971046 4949010 5053219 4996846 5095006 5265350 5200789
2146 5200789 5087266 4902454 5200802 5661897 5640340 5772565 5840708 6314185 6875154 6923011
2136 6923011 7450281 7552496 7975338 8348334 8627468 8614250 8341746 8958136 9679445 10334316
2126 10334316 10967791 11276255 11648411 12619300 14042513 15487937 16635701 18762626 20854311
2117 20854311 22781965 24814465 27141969 29400000 32478664 36032638 40296795 45169739
2109 45169739 50982731 58236218 69327074 85196483 108186966 133556360 147670761
2102 147670761 141387952 122394712 100752419 80234199 65070002 53516430 44844567
2095 44844567 38345397 33274382 29433336 26705908 24565405 23447580 22903491 22770769
2087 22770769 21748830 20302953 19276708 17667453 16559134 15819362 14771450 14001328
2079 14001328 13091169 12502571 11826748 11328889 10756226 9910471 9495510 9178104 8719752
2070 8719752 8375490 7952183 7881782 7064852 6835767 6261779 5715455 5398288 5655233 5237717
2060 5237717 4927148 4732136 4725619 4438690 3829834 3909238 4098189 3927619 3532796 3641485
2050 3641485 4001536 3566355 3057742 3187307 3090239 3288421 3301556 3114424 3165260 3132964
2040 3132964 2620411 2307588 2439939 2853747 2725539 2635646 2686317 2790446 2763317 2363619
2030 2363619 2209511 2161760 2299828 2185417 2091373 2448093 2009874 1651597 1709139 1832973
2020 1832973 1828894 1664436 1445910 1519345 1746423 1903393 1620749 1465684 1348035 1449144
2010 1449144 1678105 1688794 1663967 1160323 985017 1163683 982353 834115 918586 943036
2000 943036 933183 1256202 1441494 1172498 1210634 1361366 1153509 1077473 1217548 1032994
1990 1032994 984824 1409665 1101881 775738 1049561 869022 753171 879431 521969 800381
1980 800381 815695 1015872 1067371 1149084 1148504 940924 456492 751777 909141 707846 779810
1969 779810 811573 438026 569225 548056 92005 433385 443976 1078118 834548 824782 868516
1958 868516 983189 1128182 1043907 1113521 1043788 846441 611425 631604 489547 591244
1948 591244 793458 924215 780639 668272 523718 693723 336108 575477 561474 831447
1938 831447 1184467 736968 493411 478024 539442 335283 651371 904681 814937 700799
1928 700799 749904 625752 407914 868697 998153 1030664 974867 616006 758821 638792
1918 638792 77695 92314 467131 359956 264903 211661 314191 344533 469736 664607
1908 664607 717798 563430 423399 307778 764519 746901 621353 392951 273570 -7405
1898 -7405 99849 322471 250740 398195 921593 839667 912611 1031022 559026 668116 731630
1887 731630 250009 299493 674916 289213 246920 310289 342815 455844 722051 933578
1877 933578 1024502 907629 581937 204818 8097 465223 214732 149557 278727 68510
1867 68510 337867 469619 215954 595530 263514 184766 360320 814853 646158 33609
1857 33609 451474 444714 638036 504919 340213 475355 361374 194540 126011 110874 397331
1846 397331 520136 489824 378284 -2653 273015 470929 337769 163600 703189 1094146
1836 1094146 1258129 1102089 1298234 1114445 989900 1146801 799273 632088 83644 7197
1826 7197 112294 746994 706561 570752 320482 398882 367392 475721 424093 352433 631468
1815 631468 295998 36327 522987 322431 413665 464387 295932 210654 392595 72147
1805 72147 -17344 12151 182777 525823 180254 127574 -102967 34152 -171618 133496
1795 133496 454307 39068 30705 -42120 -31580 458015 315320 203178 334377 427302 574242
1784 574242 20362 -109296 -44360 -82312 130863 467415 204846 263350 386988 226429
1774 226429 311026 118342 342576 418781 58848 -199626 133387 307799 31904 187660
1764 187660 369611 432561 474321 565451 860358 874292 330273 -64766 -164852 -100374 153445
1753 153445 87592 -159653 -139101 -1804 250948 117382 25489 219424 376105 192345
1743 192345 -300156 -436281 -295096 68664 66061 63502 -1212 186947 32955 215381 355418
1732 355418 411411 381360 76723 87466 456872 291373 -51162 184636 440394 228515
1722 228515 119713 -163321 -244340 -339965 8600 9506 4418 -406070 -699707 -254295 -254087
1711 -254087 2206 132738 262196 -352653 -269914 -197252 -23514 71730 -68826 101127
1701 101127 -219747 -276831 215283 116115 -295064 -450232 -180119 151615 391675 254007
1691 254007 -98868 -207066 195902 146299 320385 201780 223008 422862 -156003 163595
1681 163595 456291 163152 336395 465482 174257 -133560 -130831 -117623 -73094 368109
1671 368109 384421 -235618 -286170 188230 254929 254229 -230818 -153092 -186970 -72917 147213
1660 147213 -41529 108357 -10248 -46878 -130070 220327 389800 -11857 87102 181047
1650 181047 449714 400605 505019 121672 122068 246765 121577 -71899 -320138 -91373
1640 -91373 101503 108661 64819 578924 262023 449832 643965 205544 -203617 -266072 -296057
1629 -296057 -226905 -75576 -134618 -227809 82490 638407 338092 154509 2314 25922
1619 25922 208666 -240171 6897 321523 347562 422938 266245 265010 -59165 -89159 -19347
1608 -19347 197863 -64666 -378513 -163080 -236099 353844 313944 -162741 -181331 -79995
1598 -79995 208907 152942 -74355 -36266 84349 -474905 -458270 -348457 -231205 -247411 -249336
1587 -249336 -379874 -412481 -97798 226269 366970 180728 127615 -9292 80969 -96148
1577 -96148 8491 26968 -28983 -106434 -554380 -124499 129828 -358204 -544769 -417530
1567 -417530 -210456 218640 636891 365849 91720 43022 -623126 -248574 -28676 -80514
1557 -80514 38634 31337 8224 -130337 -62834 187123 309105 261443 352030 333351 170953
1546 170953 203043 693308 438671 10954 -244908 180617 442985 -148451 -202557 -242368
1536 -242368 -364854 -167522 -310940 -95343 175693 168117 -66620 59293 -288617 -125520
1526 -125520 -122040 173439 25006 -215350 -109328 3182 -196908 -318110 -221360 337129
1516 337129 173582 -110476 108729 -21052 -151237 -332589 51167 -227968 -137262 57355
1506 57355 294971 116185 -388950 -140540 -105145 -83222 -63339 66230 245376 111678
1496 111678 -23890 -364362 -235163 148074 -324873 102091 252923 -33497 55187 -214981
1486 -214981 -213326 -405058 -48827 240330 399010 328470 277657 212116 -71611 -293919 148060
1475 148060 499268 283817 181382 375185 281819 424741 78170 -24831 180696 -222956
1465 -222956 -412476 142177 -58297 -27243 100606 -76494 430932 732205 66829 256817
1455 256817 450308 200479 313234 465626 284412 489125 742057 541033 314055 412694
1445 412694 685893 512873 -7257 -294954 -1121 -455964 -77559 126593 -257688 -356591
1435 -356591 191486 297871 146935 87148 -470440 -110658 91946 -169533 -184615 -123028
1425 -123028 -20599 145552 36022 -126833 -316881 35667 292222 405480 -119779 -303108
1415 -303108 211610 213209 34768 117500 111477 -400910 -108056 -84763 -136137 -108144 232864
1404 232864 132599 192020 127642 -70521 -102871 -123834 60736 400016 354705 334168 84360
1393 84360 56571 -75723 -181115 126048 -77640 -195421 -24485 29403 338238 318293
1383 318293 288344 147609 -190527 -14206 229498 340640 201283 430137 278231 62816
1373 62816 -50433 -295734 -455478 -219044 -118307 -43120 -75022 35390 -31713 254899
1363 254899 162524 198143 208060 562202 347353 128001 255868 -108751 106605 101303 86781
1352 86781 -69347 -166159 -324078 -259989 111315 37797 -94931 213416 308801 598977 512784
1341 512784 138566 311418 -83820 -540714 -321564 3343 325434 309198 -23148 -185987
1331 -185987 -308704 -306945 -115760 -311453 -227702 -33755 95582 189829 -201429 46763
1321 46763 29571 -237154 -232448 -28650 202107 322678 511384 338948 -236753 -762724
1311 -762724 -125883 8537 88933 196046 -78314 -202710 -60633 -37432 159749 10472
1301 10472 -315780 -106890 413875 235822 91347 336859 213573 317570 471324 -496978
1291 -496978 -157503 41145 -700926 -621633 -481250 -203807 -402023 -310854 85049 361129
1281 361129 586475 419566 228418 -262475 -287872 -84218 87511 109242 -262220 -172765
1271 -172765 -157032 -276495 -90710 -77548 -116546 -224272 90361 285682 593518 939310
1261 939310 492750 155636 -91602 589030 323606 -208649 -392645 -59722 -251093 -201782
1251 -201782 -59596 -213819 -405880 -276363 -28551 -180513 -80817 324905 306062 -121043
1241 -121043 -24302 295210 -171382 -158796 147287 -35860 143153 63158 179758 137970
1231 137970 212408 149764 133697 127098 337932 298608 209815 144321 160743 -126361 -466625
1220 -466625 -628945 -550934 -742903 -956178 -510100 -576943 -548800 -107840 115929 -259326
1210 -259326 -64709 -269947 -238619 -212537 -126055 133215 260009 369259 86511 61736
1200 61736 285966 191408 229158 2738 4259 -338241 -7084 113646 454259 108788 -2755
1189 -2755 332140 64930 -161999 -139040 180034 341300 279254 42400 167064 -5073
1179 -5073 228233 310847 -30549 -204252 -264988 119280 164664 -154003 42420 169007 390271
1168 390271 60217 105400 -154931 -240881 -80054 -67329 -263465 -264754 -308899 -269354 -93582
1157 -93582 -38099 -524324 -410507 -89187 -42455 -281110 -442155 -232729 -350441 -101871
1147 -101871 -69231 16227 278858 -195963 -73531 181512 194758 38977 188661 36833
1137 36833 -44149 -329966 -465544 -141518 -54233 -139129 -344425 -313820 18481 -46279 -306091
1126 -306091 -394105 -480594 -309710 -238103 -161538 68300 139755 -306575 -270862 28584 837658
1115 837658 569883 32333 229074 191276 271659 229582 307305 46270 30268 -138018 -145916
1104 -145916 -450212 -596140 -426732 -182813 -64454 60467 481881 15302 159401 267420
1094 267420 -317939 -381556 -247124 -52623 -234474 -266582 -508322 -578527 -242645 81871
1084 81871 661 -330922 108601 -108141 -145495 340575 412792 -35239 -75018 -272344 -302947
1073 -302947 156522 58850 -102757 -59117 -8944 -109146 155374 -200200 -380923 24873
1063 24873 101788 24647 170776 9855 -53081 -385430 -549974 146536 117943 95553 -236777
1052 -236777 -48949 160688 93690 -359105 41470 -52184 257336 189083 142068 314283
1042 314283 140271 187673 324160 211826 -62621 -163677 -6878 -7380 -511892 -450777 -273687
1031 -273687 -621324 -676968 -454522 -241929 -153670 9587 -106368 296833 109820 -319252
1021 -319252 -151590 -91946 -424583 -680852 -359929 -480426 21912 -113550 63522 -220089
1011 -220089 -514699 -243408 7129 -34259 -150249 61764 -36060 -155628 214679 133786
1001 133786 66501 120465 134264 10321 -277709 -325337 -91263 -327125 -395340 -200952 62861
990 62861 -78895 -7865 204095 4883 -26232 -495185 -441510 -369859 212151 417832 45972
979 45972 -452817 -215526 248990 3297 285888 167085 -241168 8728 276491 171711
969 171711 351788 -22561 317412 486804 265575 152229 317393 22451 203732 -12030
959 -12030 101585 372730 326529 351750 -70259 -4251 226649 220437 -325115 -411625 -79071
948 -79071 -68828 -133559 -628530 -913108 -1095298 -448493 -211461 20782 72487 86129 161635
937 161635 148904 168223 -174310 41352 -59216 174195 -10523 52071 -312436 71377
927 71377 -163850 99379 -157120 -576675 -462851 81876 67765 -75182 -36908 -40974 -54067
916 -54067 -227847 -252429 -193277 -196707 200348 484737 389082 541705 34184 73287 60990
905 60990 -145311 -373451 -42710 134191 231727 -235342 -382076 193797 91338 231753
895 231753 -36729 -175156 17391 -85353 292445 197702 -364906 -220026 -181719 -526888
885 -526888 22860 264593 474786 340063 40780 246982 449540 351176 179769 249615
875 249615 14446 -24098 -262208 -205838 -204707 152870 148297 37680 -79406 193074 115830
864 115830 -172505 123322 -239906 -582409 -193912 132494 99259 378210 10070 244019
854 244019 108053 148930 -278168 -420760 -125231 -276566 11961 -195648 -15924 442992
844 442992 586215 428501 500099 199733 -161179 -268351 10974 -8465 64650 -5283 -173611
833 -173611 -246596 -504639 -190383 -211589 -198571 -249281 -188787 -160023 -341193 -930577 -459790
822 -459790 -100847 -388607 -374649 -155291 113983 582605 271462 22756 219713 128932
812 128932 -280918 -255889 -207133 228784 417635 329922 361125 267122 490654 376939 184519
801 184519 107579 29393 -230221 -312073 -361175 -246969 -70062 50015 147194 -39363 182459
790 182459 446455 261241 81038 -299290 -459895 -459986 -74612 -431346 -253197 -421004 -380409
779 -380409 -143491 -265298 -186954 137972 312374 311272 482719 -53718 -340811 -70538
769 -70538 107140 -10992 -310939 -445116 25404 -119869 -279986 -296364 -40839 -59438
759 -59438 -379189 -110936 -138488 260520 188958 -135764 25922 136945 115674 220061 -326327
748 -326327 -467124 -304915 -75729 -229602 -319788 -207798 118960 167319 12857 -54038
738 -54038 -189367 -56439 68727 -234410 49385 115652 -142499 9366 103255 230593
728 230593 615741 410330 349181 264497 156621 120426 -457078 -350222 -157813 -519634
718 -519634 -653025 -55888 -103845 -616393 -109066 136851 -30521 646590 -96373 -344371
708 -344371 167579 213686 -45251 65255 -154400 -206596 180186 243100 -374412 -459094 -558612
697 -558612 -210001 -80847 -137926 -37361 39297 -71433 -95842 -213422 -279945 265611 239717
686 239717 165112 -22585 11562 -195078 -73426 -16955 -357519 -521809 -922050 -1054357
676 -1054357 -567049 -19055 65783 179408 373009 395357 125623 -13064 -205786 78790
666 78790 171099 -450676 -248316 -108672 28589 -143615 -365254 -280431 -81377 30271
656 30271 13768 180355 209209 368192 -90660 -75330 236320 405391 -162328 -180775 118424
645 118424 -99394 -257742 -627934 -626491 -425853 -204542 -396287 -285316 159530 269781
635 269781 480543 62509 -259444 57579 -160507 -258424 180673 128472 14395 -82404
625 -82404 -278129 -28752 -68251 -209632 -154011 83681 -158324 -252046 -344897 3992 47825
614 47825 237570 126832 228482 -174669 -361713 -275126 -529209 -676372 -142826 225886
604 225886 -73281 26794 -99884 -354595 -726761 -122836 -7082 -13039 -239231 -349050
594 -349050 -241185 -431234 -591585 -347472 -94554 -31524 441113 -296480 -669165 -390128
584 -390128 197213 -142542 -370835 -163611 -269864 -61860 101354 -209399 -492672 -229986
574 -229986 -81957 85321 29968 -328735 -470704 -388873 -172658 -87072 -167600 -40491 -34315
563 -34315 -225320 196019 -7654 -472314 -164572 -416842 -519914 -208149 -101339 -407252
553 -407252 -449102 -109667 221973 381151 109795 -200726 -123335 -405043 -651529 -582360
543 -582360 -650157 -333201 -52127 -225641 -388794 -492613 -204869 -148687 -478425 -588384
533 -588384 -798692 -474351 146243 166447 377267 8675 -127861 -392890 -188790 34726
523 34726 90162 -24370 -184336 -172219 -165178 379011 582388 10390 -87042 -356982 -442985
512 -442985 -365624 -223404 31742 -237644 -304339 -220640 206705 31049 -290991 -267829 -711165
501 -711165 -908825 -567742 -273655 -430918 -296076 63298 41009 -202951 -77965 17435
491 17435 -75732 157257 394585 9717 -118522 -283091 -72730 -144535 14474 -117306
481 -117306 -265017 -502927 -485454 -384869 -223224 474911 321847 37318 -211249 -64214
471 -64214 88193 314988 -209048 -68292 -238982 -715426 -858528 -570815 -282758 -418679
461 -418679 -450899 -360346 -272189 -105274 -104765 237161 204935 366239 -125317 -88187 82190
450 82190 529077 241050 162384 -182516 -462256 -366399 -104745 -143081 -280825 -206017 -156733
439 -156733 -110215 -262062 210712 460263 231066 -201449 -283454 -107961 -127051 83757
429 83757 -245600 -566432 -439809 -447110 -172811 -254370 -106571 111508 -104102 -511797 -513595
418 -513595 -301081 -4120 -82299 -37405 -212665 -331823 -551312 -256867 -466924 -612732
408 -612732 -695268 -167931 -94498 -175424 -12676 -78801 -164122 -556653 -496399 -6787 -108980
397 -108980 -241631 -332194 -422974 -375366 -396126 -427293 -738790 -788356 -558645 -421648 -251771
386 -251771 -239731 -170939 -102723 -306540 -247525 -162322 181733 -98856 -288457 165567 254596
375 254596 -20867 -164945 -469941 -547005 -270669 -651618 -546886 -597248 -399934 -270284
365 -270284 -299038 -216073 -401608 -248754 -32910 -92445 50103 -65387 -104507 -237896 -490722
354 -490722 -549861 -426003 -559398 -579819 -508455 -232617 -202446 -334693 -440391 -243039 -576584
343 -576584 -349517 56919 -151158 -129521 -42778 -171771 -426033 -82093 157142 178843
333 178843 -73024 -491741 -643762 -518986 -240855 -550999 -808749 -571270 -495613 -510107
323 -510107 -666538 -361245 -271125 -122340 -206239 -284011 -298879 -311096 -484525 -680265 -638450
312 -638450 -764138 -526293 -17828 -40499 -78487 -21855 350909 41386 48145 -369825 -411617
301 -411617 -845463 -936460 -785596 -432718 -523202 -475809 -415396 -322190 -447728 -343433 -543633
290 -543633 -625020 -446103 -298820 -214257 -426719 -627629 -280082 -32602 -289744 51401
280 51401 -363775 -219225 -325412 -31101 184443 -48072 -350937 -44335 -288313 -752209
270 -752209 -372782 -260386 -167800 -176142 -296846 -334129 -367677 -338011 -686940 -356203 -147480
259 -147480 8834 -207652 -616265 -740811 -490626 -563244 -827550 -562961 -329087 330038
249 330038 159906 -80608 -423022 -244757 -455509 -581792 -155183 -50176 71817 -386425
239 -386425 -851698 -756837 -477662 -537636 -492771 -600457 -670905 -859265 -663903 -179077 -468351
228 -468351 -397387 -581988 -221262 -311668 -701584 -577848 -224697 -176458 -251906 -329123 -740585
217 -740585 -548667 -506472 -118391 -82401 -485621 -264322 311761 -123582 -271056 -184707
207 -184707 -260007 -468256 -320919 -560594 -700632 -645316 -188173 -258163 -114576 -357202
197 -357202 -549389 -601195 -681300 -381215 129397 -84204 -121047 -266251 -351791 -414686 -540585
186 -540585 -656021 -790697 -293405 -41706 -387611 -830001 -378224 -463696 -324449 -51491
176 -51491 -66356 -145364 -64480 -80773 -210752 -282262 -101166 57215 -489377 -619196 -370319
165 -370319 -432144 -865837 -772144 -288914 -129904 250979 -78639 -557429 -187958 -228829
155 -228829 -147189 -128837 -340941 -554143 -444432 -179258 -348936 -373114 -900381 -918802 -748637
144 -748637 -628033 -927305 -444110 -432984 -547618 -367545 -587848 -202109 -370462 -513186
134 -513186 -323961 -550194 -932510 -689515 -616131 -611450 -286171 -436529 -291766 -459551
124 -459551 -225554 -60135 -274112 -400024 -505541 -603127 -272717 -336866 -290955 -316319 -550176
113 -550176 -683423 -734913 -803012 -559871 -591261 -529794 -656675 -541674 -594055 -504949 -217036
102 -217036 -521317 -397274 -469974 -388105 -344545 -594973 -362512 -90873 -366872 -380591 -459224
91 -459224 -506152 -372126 -474115 -298286 -371816 -363346 -89907 -163153 -205048 -149003 -110659
80 -110659 -212981 -593659 -891517 -600766 -677379 -533757 -606488 -501830 -232815 -44576
70 -44576 -215083 -143172 -54825 -300134 -371754 -204878 -397710 -459608 -447372 -665591 -268254
59 -268254 -255409 -563181 -412023 -507801 -348599 -367872 -525067 -318452 -254565 -442105 -735662
48 -735662 -844616 -516660 -421071 -644941 -326870 -176733 -25264 -201699 -481425 -622054
38 -622054 -597049 -531156 -517461 -513935 -644186 -707756 -693610 -614429 -429194 -633295 -525144
27 -525144 -545230 -588467 -685653 -759602 -600488 -569146 -622831 -702385 -588896 -587662 -303855 -309076
15 -309076 -370660 -480232 -243502 -155007 -420083 -432343 -278207 -327518 -476890 -523481 -349935
4 -349935 -230144 -492717 -508633 -428325
0 -428325
$$ Imaginary data points
##PAGE= N=2
##DATA TABLE= (X++(I..I)), XYDATA
16383 -2824446 -3043121 -2837564 -2529612 -2359919 -2716781 -2585860 -2297742 -2339206 -2285818 -2280152
16373 -2280152 -2489911 -2330428 -2160059 -2100975 -1876578 -2142548 -2125112 -2052433 -2266457 -2086577
16363 -2086577 -2020352 -2022591 -1960431 -1912749 -1965306 -1737980 -1458599 -1587200 -1712062 -1671513 -1257457
16352 -1257457 -1644155 -1286213 -1069713 -1317123 -1134615 -1468635 -1496757 -1259955 -1239991 -1076333
16342 -1076333 -1190025 -1009082 -827457 -938927 -651301 -704995 -786135 -564782 -530905 -476633
16332 -476633 -397216 -255127 -537441 -314901 -17220 -413535 -463928 -671815 -367639 -160591
16322 -160591 -205827 -20528 -185083 -128149 118050 117974 96230 251352 -35647 107540 48130
16311 48130 -77656 346689 478940 608990 624881 717638 812940 470213 365220 480436
16301 480436 341537 445714 933559 778431 1009133 534079 332247 402418 599878 843222
16291 843222 882081 1108623 997104 919220 1257572 1241752 1067039 1180831 1367885 1101348
16281 1101348 1071404 1517798 1513442 1905816 1582371 1080156 979320 1081758 1128662 1421972
16271 1421972 1474604 1376559 1439233 1403446 1435255 1854489 1887897 1654766 1863792 2041660
16261 2041660 1853417 1981055 2100707 1793650 1578147 1555897 1834310 2103190 2377496 2412981
16251 2412981 2509996 2321086 2291313 2711327 2594540 2406908 2192746 2312776 2714842 2324413
16241 2324413 2291309 2192109 2230247 2481702 2951006 2667973 2300873 2339787 2333177 2433145 2618678
16230 2618678 2934949 2864925 3419433 3252037 3107371 2571719 2276850 2367496 2781129 2836306
16220 2836306 2783267 2752788 2784019 2771181 2607728 2833284 3037759 2934842 2859148 2941700
16210 2941700 3121002 2847579 2927562 2796844 3001773 3034418 3174507 3165423 2956194 3023443
16200 3023443 3130990 3358693 3123351 2913123 2718953 3378580 3270792 3661552 3553899
16191 3553899 3583422 3206604 3278654 3079886 3075734 2955692 2856889 3308278 2985107 2902534
16181 2902534 2773962 3063983 3496767 3772050 3476563 3720558 3673149 3774788 3492319 3482095
16171 3482095 3660829 3544768 3894837 3992797 3732830 3656581 3598333 3770412 3884270 3904513
16161 3904513 3720212 3816041 3877615 4054059 3989284 4124910 3546673 3417405 4161246 3952765
16151 3952765 3816896 3710567 4005534 4000069 3423845 3660875 3846967 3752260 3741173 3870306
16141 3870306 3648158 3754922 3791058 3701098 4127530 3536724 3583526 3578297 3405474 3415426 3595905
16130 3595905 3866895 4756920 4539555 4019985 4232651 4226191 3979331 4123047 4123528 3752392
16120 3752392 3659072 3528897 3338137 3276535 3569010 4257052 4220163 3807142 3883888 3868174
16110 3868174 3828846 3629137 3952051 3777460 3679993 3785928 3736720 3639439 3429900 3881797
16100 3881797 3755107 3595706 3638587 3616890 3607970 3255423 3256929 3609760 3756410 3692185 3830397
16089 3830397 3630732 3455436 3901927 3791039 3963240 4076941 3902734 3795613 3941681
16080 3941681 4041113 4033221 3947214 3987657 4227608 4010976 3656783 3847425 4061693 4139147
16070 4139147 4319816 4048717 3969407 4373223 4407886 4569671 4424241 4447233 4186839 4268430
16060 4268430 4428760 3987434 3733147 4276699 4747215 4614861 4360857 4233723 3985531
16051 3985531 4075926 4261952 4097085 3903575 4202676 4252737 4097255 4572681 4614664 4247329
16041 4247329 4078886 4175912 4076241 3908766 3997277 4150062 3982983 3982850 3994893 3899089 3910343
16030 3910343 4583676 4339349 4137601 4145123 4329096 4206542 4002639 3852429 3718689 3941726
16020 3941726 3932359 3569917 4024366 3759822 3472185 3759703 3954546 3767146 3724714 3745144
16010 3745144 3805878 3790928 4096471 4235869 4360987 4192601 4028435 4037348 4121828 4120384 4182532
15999 4182532 4248950 4260279 3853062 3662992 4111465 3931176 3870553 3938705 4104891 4191443
15989 4191443 4198800 3816102 3900082 3635327 3801077 4179752 4483925 4225206 4407813 4847332
15979 4847332 4644620 4448710 3982937 3812475 3946256 3865079 4073711 4067371 4114057 3973135
15969 3973135 3876517 4006551 3842516 4276355 4613126 4371399 4550177 4613844 4384960 4206180
15959 4206180 4323503 4316677 4023224 4509957 4371294 4627593 4700167 4348250 4053220 3974055
15949 3974055 4116709 4458676 4632387 4404165 4468100 4365229 4545832 4535660 4278705 3837445
15939 3837445 4028015 4432982 4482965 4108950 4225912 4439537 4364937 4239205 4096640 4306061
15929 4306061 4442447 4007145 3888374 4043118 3849417 3777060 4311936 4646127 4466092 4285665
15919 4285665 4391509 4356474 4349303 4468178 4629936 4683756 4495495 4538889 4522718 4342110
15909 4342110 4085643 4514315 4160493 3806922 4237187 4356041 4410683 4457678 4285081 3813720
15899 3813720 3745248 3897333 4130687 4247518 3987646 4199362 4220572 4131765 4262701 4384001
15889 4384001 4468390 4419975 4299184 4397893 4126526 4271744 4613576 4384295 4086787 4365205
15879 4365205 4461027 4084482 4328651 4264518 4105910 4314928 4547017 4164374 4102727 4250277
15869 4250277 4330290 3945868 3622189 3733928 4082750 4047398 4154426 4293512 4249680 3938636
15859 3938636 4019137 4250014 4363756 4371438 4514313 4430427 4123558 4432939 4306456 4158688
15849 4158688 4157345 4196270 3820697 4081420 4363963 4132016 3807873 3561858 3481476 3672448
15839 3672448 4310736 4207523 3868528 4227872 4693843 4843886 4635189 4321289 4165262
15830 4165262 4069186 4036413 4233160 4348143 4505732 4426340 4445920 4269701 4365025 4531414
15820 4531414 4241690 3792026 3888850 4031780 3957923 4151804 4312125 4374179 4350998 4481566
15810 4481566 4575320 4715652 4788599 4445158 4476444 4721974 4654585 4581808 4659934 4445114
15800 4445114 4471759 4468245 4690619 4979676 4605581 4463523 4460335 4865704 4651067 4661831
15790 4661831 5029290 5075862 4898740 4468114 4232073 4116311 4345899 4771223 4643394 4828802
15780 4828802 4930514 4708246 4611592 4706627 4461639 4052714 4065974 3860599 4046798 4262551
15770 4262551 4463739 4352635 4079525 4495557 4404895 4337779 3939780 3791713 3744551 3683672
15760 3683672 4027254 4271124 4378210 4345745 4557014 4718216 4592510 4425834 4656657 4718116
15750 4718116 4753129 4427041 4596372 4410789 4425216 4123825 4040221 4074911 4381661 4435503
15740 4435503 4074805 4174571 3860780 4020857 4431320 4466849 4774906 4566534 4338813 4034577
15730 4034577 3965163 4291848 4213157 4164924 4320216 4740045 3974672 4113134 4369075 4490949
15720 4490949 4438716 4370897 4505560 4344323 4505806 3933347 3983803 4071141 4136348 4289867
15710 4289867 4360775 4549691 4373403 4575543 4492777 4355800 4247403 4244728 4353885 4417467
15700 4417467 4744789 4865458 4711155 4991698 4832347 4992083 4649767 4790533 5233759
15691 5233759 5040703 4396843 3971323 4551137 4700528 4975373 4574204 4059040 4188254
15682 4188254 4108758 3872872 3943409 4242669 4405642 4675203 4741139 4560388 4070595 4055869
15672 4055869 4491636 4850072 4723654 4601198 4381845 4119439 4254635 4199596 4310291 4117273
15662 4117273 4224733 4395136 4662211 4508865 4427833 4635889 4780295 4739128 4504040 4580761
15652 4580761 4988026 4748178 4588586 4457920 4527813 4630894 4808464 4892878 4636632 4538957
15642 4538957 4297598 4492588 4660561 4244190 4054248 4488154 4743899 4391522 4475666 4126466
15632 4126466 3859852 4207971 4362134 4388149 4435761 4472412 4110734 4107754 4322141 4678416
15622 4678416 4504353 4195882 4034005 4547626 4863010 4892042 4985248 4642784 4449909 4711640
15612 4711640 4641238 4606865 4698492 5112392 4724793 4564587 4604822 4621378 4403477 4186861
15602 4186861 4414618 4411441 4246807 4146735 4373163 4322675 4406446 4475851 4449958 4582108
15592 4582108 4470824 4362883 4286504 4470404 4276839 4599504 4343734 4118849 4175600 4405076
15582 4405076 4626270 4532535 4787978 4445110 3939763 3862167 4378366 4539264 4770823 4508752
15572 4508752 4388163 4365158 4280661 4284500 4338340 4413269 4415578 4273527 4149557 4157021 4142187
15561 4142187 4013350 4124874 4388935 4236170 4117436 4162264 4202288 4318017 4404439 4325214
15551 4325214 4474157 4561317 4599629 4588305 4642354 4962342 4463293 4518627 4547795 4317926
15541 4317926 4474593 4616569 4339594 4299101 4475406 4382870 4346404 4114040 4194892 4470798
15531 4470798 4686633 4860641 4280601 4364887 4528345 4426097 4811592 4635745 4263030 4705455
15521 4705455 4605997 4994451 4534010 4421993 4662700 4129048 4219976 4648879 4356189 4417588
15511 4417588 4719243 4790274 4829095 4913457 4902379 4513594 4370230 4470914 4457033 4314506
15501 4314506 4472994 4612619 4392083 4520721 4359571 4454113 4717103 4649986 4899459 4416966
15491 4416966 4578181 4702799 4978431 4983093 4898979 4909048 4671586 4378566 4259859 4348704
15481 4348704 4466930 4769583 4876646 4769501 5102413 4833564 4654409 4332778 4485238
15472 4485238 4935189 5005718 4549529 4151720 3931724 4268180 4915644 4519983 4600707 5116321
15462 5116321 4874068 4655222 4424516 4313401 4354022 4510587 4610270 4757177 4918074 4670555
15452 4670555 4710452 4909675 4948568 4822774 4711399 4654377 4778086 4563379 4416135 4242772
15442 4242772 4312665 4603488 4277813 4847809 4437300 4360516 4405333 4194918 4359050 4618917
15432 4618917 4640950 4529575 4278962 4300320 4676058 4768764 4957636 4687642 4929054 4977639
15422 4977639 4758917 4079520 4130102 4421390 4342630 4544268 4628349 4661607 4202360 4170150
15412 4170150 4410500 4276410 4239551 4233529 4496386 4445206 4385474 4303812 4699170 4665867 4415151
15401 4415151 4460574 4203932 4106237 4231476 4206108 4089210 4213518 4219493 4244970 4152695 4079139
15390 4079139 4088149 4114292 4410811 4193615 4322925 4622189 4774975 4824285 4418078 4283440
15380 4283440 4343033 4257839 4035165 4134813 4269448 4457350 4454515 4438498 4323709 4632937
15370 4632937 4659678 4647641 4111701 4297115 4352856 4217789 4269951 4159877 4163643 4332479
15360 4332479 4099316 4080257 4298278 4258016 4279872 4357969 4532318 4522928 4378579 4067386
15350 4067386 4232438 4255260 4664422 4592381 4568753 4332156 4572364 4341594 4475568 4643676
15340 4643676 4848453 4461707 4712197 4831159 4681937 4539698 4547359 4270965 4210218 4397822
15330 4397822 3988417 4369404 4785489 4653795 4494884 4461378 4245486 4361107 4393749 4515949
15320 4515949 5013435 4750144 4270374 4395999 4780886 4643369 4564578 4887603 5079781 4388139
15310 4388139 3994825 4477649 4371816 4029551 3855107 4189578 4282671 4288925 4287773 4620687
15300 4620687 4840122 4927568 4854946 4359193 4370199 4683149 4606263 4756215 4770505 4568833
15290 4568833 4230548 4212656 4434283 4748134 4791539 4644552 4656987 4953754 4836896 4649163
15280 4649163 4884415 4521594 4557305 4670933 4670113 4888486 4527449 4766915 5031404 4978781
15270 4978781 4806167 5004218 4684845 4572579 4944625 4961824 4397607 4448794 4903358 4943286
15260 4943286 4441279 4356712 4369743 4536005 4679390 4643162 4592373 4761464 4813068 4900661
15250 4900661 4789949 4575458 4660485 4494561 4441893 4624655 4686682 4169580 4141720 4150823
15240 4150823 4802242 4917676 4519817 4407954 4475160 4547662 4475609 4496751 4550464 4237903
15230 4237903 4261945 4609609 4661429 4629492 4727968 4770527 4602061 4139269 4060793 4316596
15220 4316596 4381037 4232562 4590619 4775026 4661835 4424181 4020453 4332859 4502527 4609284
15210 4609284 4465711 4613552 4696742 4684333 4612377 4539129 4561658 4588595 4954764 4494595
15200 4494595 4454316 4615078 4329806 4441462 4639295 4741292 4765897 4608647 4424854 4317512
15190 4317512 4584685 4786872 4567234 4480687 4221720 4439468 4274141 3982646 4392971 4400217
15180 4400217 4430863 4550238 4936180 4826229 4758313 4833208 4583394 4924809 4722565 4569691
15170 4569691 4661902 4409893 4605062 4557076 4371563 4333965 4393296 4372960 4301112 4383851 4045324
15159 4045324 4514605 4730921 4518558 4423330 4443108 4472272 4617073 4593312 4372170 4595156
15149 4595156 4372385 4554083 4408896 4952002 5082159 5061442 5116390 4680406 4633894 4561506
15139 4561506 4523714 4877936 4780700 4763498 4636442 4570282 4558956 4404559 4441872 4378017 4309460
15128 4309460 4320402 4383254 4523601 5014946 5015353 5006870 4777967 4666006 5095489 4843970 4687790
15117 4687790 4579240 4617731 4913745 4584201 4488196 4519775 4818841 4638226 4558156 4779811
15107 4779811 4771451 4548858 4800734 4596958 4136868 4136440 3967647 3972059 4157845 4359085 4656376
15096 4656376 4927262 4856452 4510139 4502872 4596110 4600757 4342202 4117824 4498681 4436767 4313588
15085 4313588 4532179 4614719 4717749 4855874 4517183 4255352 4184805 4198740 4644164 4577106
15075 4577106 4593757 4494002 4196713 4510435 4962151 5065606 4888981 4454085 4315027 4467493
15065 4467493 4293100 4351344 4141158 3997906 3925866 4320939 4707869 4622335 4507219 4296456
15055 4296456 4317565 4293424 4566992 4638267 4588148 4744942 4733809 4346774 4623910 4764991
15045 4764991 4764863 4621590 4618789 5015288 5269357 4904371 4420523 4307577 3833662 4058088
15035 4058088 4344708 4050966 4221383 4525885 4252196 4345296 4323076 4527048 4493733 4569634
15025 4569634 4622679 4303776 4038369 4034520 4102001 4420479 4377269 4067385 4330938 4474302
15015 4474302 4636612 4691661 4838290 4495208 4425506 4287928 4540082 4769012 4458254 4382569
15005 4382569 4412610 4303757 4544194 4461056 4487953 5027696 5059845 4962799 4954274 4996435 4802622
14994 4802622 4723198 5059370 5007536 5154662 5244695 4918226 4679838 4760554 5042019 5145097
14984 5145097 4914233 4815527 4938889 4571405 4631783 4315917 4283368 4418002 4731883 4604856
14974 4604856 4478545 4546491 4926301 4824357 4547515 4769637 4795620 4818897 4329068 4323583
14964 4323583 4867914 4704414 4933314 4787259 4596932 4647106 4690954 4780223 4600378 4595776
14954 4595776 5135734 4566093 4564376 5177767 4987025 5101582 4501461 4697192 4573230 4615115
14944 4615115 4988039 4531679 4464952 4608026 4496587 4610461 4719527 4725774 5192556 5004406
14934 5004406 5035424 4973613 4714246 4502879 4293588 5213640 5266039 5258930 5110936 4951958
14924 4951958 4976572 4831408 4953974 4614293 4674081 4807715 4549342 4216083 4464134 4802279
14914 4802279 4588699 5053248 5192671 4470794 3946962 4126288 4436617 4895627 4739818
14905 4739818 4579665 4326720 4496977 4658728 4594411 4208011 4718978 4670001 4299656 4393247
14895 4393247 4404917 4333811 4675170 4883394 4826798 5209067 5124252 4811814 5048871 5083539
14885 5083539 5164382 5044733 5049039 4938663 4945344 4931164 4638780 4629683 4751414 5091419 4833893
14874 4833893 4446235 4561936 4607830 4553537 4921141 4896798 4946863 4745323 4744423 4669587 4857158
14863 4857158 4922524 4869298 4489940 4847863 4818442 4881349 5028308 4528446 4615242 4778585
14853 4778585 4946845 4761782 4759950 4697582 4842509 4997576 4682652 4949840 4561641 4674213
$$ [...]
##END NTUPLES=NMR SPECTRUM
##END=
