##TITLE=1H_EC-3293(IV-3)
 CDCl3
 8 sc, 
 19.4.2023
##JCAMPDX= 6.0         $$ Bruker NMR JCAMP-DX V2.0
##DATA TYPE= NMR SPECTRUM
##DATA CLASS= NTUPLES
##ORIGIN= UXNMR, Bruker Analytische Messtechnik GmbH
##OWNER= root
$$ XWIN-NMR		Version 3.5
$$ Wed Apr 19 13:54:41 2023 Russian Standard Time (UT+4h)  she@DPX200
##.OBSERVE FREQUENCY= 200.13135
##.OBSERVE NUCLEUS= ^1H
##.ACQUISITION MODE= SIMULTANEOUS
##.ACQUISITION SCHEME= undefined
##.AVERAGES= 8
##.DIGITISER RES= 18
##SPECTROMETER/DATA SYSTEM= spect
##.PULSE SEQUENCE= zg30
##.SOLVENT NAME= CDCl3
##.SHIFT REFERENCE= (INTERNAL, CDCl3, 0, 15.7436)
##AUDIT TRAIL= $$ (NUMBER, WHEN, WHO, WHERE, WHAT)
$$ ##TITLE= Audit trail, XWIN-NMR		Version 3.5
$$ ##JCAMPDX= 5.01
$$ ##ORIGIN= Bruker BioSpin GmbH
$$ ##OWNER= she
$$ F:/spectra/data/she/nmr/H-F/1/pdata/1/auditp.txt
$$ ##AUDIT TRAIL=  $$ (NUMBER, WHEN, WHO, WHERE, WHAT)
(   1,<2023-04-19 13:53:22.92 +0400>,<she>,<DPX200>,
      <created by zg, POWCHK disabled, PULCHK disabled
       configuration hash MD5:
       00 E9 B6 7A A2 85 ED C7 34 08 36 98 17 FE 4E 26
       data hash MD5: 16K
       B0 AD 72 85 65 1B BF AE CF 22 63 67 E2 59 A2 86>)
(   2,<2023-04-19 13:53:25.40 +0400>,<she>,<DPX200>,
      <Start of raw data processing
       efp BC_mod = 2 LB = 0.24 FT_mod = 6 PKNL = 1 PHC0 = -19845.7 PHC1 = 31.60081 SI = 16K 
       data hash MD5: 16K
       59 B5 7F FD 2B 87 7A 49 12 4C 01 4B 16 DA 78 A6>)
(   3,<2023-04-19 13:53:46.25 +0400>,<she>,<DPX200>,
      <pk PHC0 = 13.81245 PHC1 = -17 
       data hash MD5: 16K
       5D 1F 71 08 13 1B 29 BB 28 CA BD EE ED DE 9D 7D>)
(   4,<2023-04-19 13:53:49.10 +0400>,<she>,<DPX200>,
      <abs ABSG = 5 
       data hash MD5: 16K
       31 B1 73 82 5C F9 88 D1 41 F3 04 47 08 B9 60 D2>)
$$ ##END=
$$ 
$$ hash MD5
$$ CE E3 AF 11 9E E3 AB 14 3E A1 D1 93 08 B1 53 12
##$RELAX= 
##$RELAX= 
##$RELAX= 
##$RELAX= 
##$RELAX= 
##$RELAX= 
$$ Bruker specific parameters
$$ --------------------------
##$DU= <F:/spectra>
##$EXPNO= 1
##$NAME= <H-F>
##$PROCNO= 1
##$TYPE= <nmr>
##$USER= <she>
##$AMP= (0..31)
100 100 100 100 100 100 100 100 100 100 100 100 100 100 100 100 100 100 
100 100 100 100 100 100 100 100 100 100 100 100 100 100 
##$AQSEQ= 0
##$AQ_mod= 1
##$AUNM= <au_zg>
##$AUTOPOS= <>
##$BF1= 200.13
##$BF2= 200.13
##$BF3= 200.13
##$BF4= 200.13
##$BF5= 200.13
##$BF6= 200.13
##$BF7= 200.13
##$BF8= 200.13
##$BYTORDA= 1
##$CFDGTYP= 0
##$CFRGTYP= 5
##$CHEMSTR= <none>
##$CNST= (0..31)
1 1 145 1 1 1 1 1 1 1 1 1 1 1 1 1 1 1 1 1 1 1 1 1 1 1 1 1 1 1 1 1 
##$CPDPRG= <>
##$CPDPRG1= <>
##$CPDPRG2= <>
##$CPDPRG3= <>
##$CPDPRG4= <mlev>
##$CPDPRG5= <mlev>
##$CPDPRG6= <mlev>
##$CPDPRG7= <mlev>
##$CPDPRG8= <mlev>
##$CPDPRGB= <>
##$CPDPRGT= <>
##$D= (0..31)
0 1.2 0 0 0 0 0 0 0 0.06 0 0.03 0 0 0 0 0.0002 0 0 0 0 0 0 0 0 0 0 0 0 
0 0 0 
##$DATE= 1681898002
##$DBL= (0..7)
120 120 120 120 120 120 120 120 
##$DBP= (0..7)
150 150 150 150 150 150 150 150 
##$DBP07= 0
##$DBPNAM0= <>
##$DBPNAM1= <>
##$DBPNAM2= <>
##$DBPNAM3= <>
##$DBPNAM4= <>
$$ [...]
##$SUBNAM3= <"">
##$SUBNAM4= <"">
##$SUBNAM5= <"">
##$SUBNAM6= <"">
##$SUBNAM7= <"">
##$SUBNAM8= <"">
##$SUBNAM9= <"">
##$SW= 18.05172834244
##$SWIBOX= (0..15)
0 0 2 0 0 0 0 0 0 0 0 0 0 0 0 0 
##$SW_h= 3612.71676300578
##$TD= 16384
##$TD0= 1
##$TE= 0
##$TE2= 300
##$TE3= 300
##$TEG= 300
##$TL= (0..7)
0 120 120 120 120 120 120 120 
##$TP= (0..7)
150 150 150 150 150 150 150 150 
##$TP07= 0
##$TPNAME0= <>
##$TPNAME1= <>
##$TPNAME2= <>
##$TPNAME3= <>
##$TPNAME4= <>
##$TPNAME5= <>
##$TPNAME6= <>
##$TPNAME7= <>
##$TPOAL= (0..7)
0.5 0.5 0.5 0.5 0.5 0.5 0.5 0.5 
##$TPOFFS= (0..7)
0 0 0 0 0 0 0 0 
##$TUNHIN= 0
##$TUNHOUT= 0
##$TUNXOUT= 0
##$USERA1= <user>
##$USERA2= <user>
##$USERA3= <user>
##$USERA4= <user>
##$USERA5= <user>
##$V9= 5
##$VALIST= <valist>
##$VCLIST= <CCCCCCCCCCCCCCC>
##$VD= 0
##$VDLIST= <DDDDDDDDDDDDDDD>
##$VPLIST= <PPPPPPPPPPPPPPP>
##$VTLIST= <TTTTTTTTTTTTTTT>
##$WBST= 1024
##$WBSW= 4
##$XGAIN= (0..3)
0 0 0 0 
##$XL= 0
##$YL= 0
##$YMAX_a= 342027
##$YMIN_a= -427263
##$ZGOPTNS= <>
##$ZL1= 120
##$ZL2= 120
##$ZL3= 120
##$ZL4= 120
##$ABSF1= 15.73588
##$ABSF2= -2.315969
##$ABSG= 5
##$ABSL= 3
##$ALPHA= 0
##$AQORDER= 0
##$ASSFAC= 0
##$ASSFACI= 0
##$ASSFACX= 0
##$ASSWID= 0
##$AUNMP= <proc_1d>
##$AZFE= 0.1
##$AZFW= 0.1
##$BCFW= 0
##$BC_mod= 2
##$BYTORDP= 0
##$COROFFS= 0
##$CY= -3
##$DATMOD= 1
##$DC= 0
##$DFILT= <>
##$DTYPP= 0
##$F1P= 0
##$F2P= 0
##$FCOR= 1
##$FTSIZE= 16384
##$FT_mod= 6
##$GAMMA= 0
##$GB= 0
##$INTBC= 1
##$INTSCL= 3.70164e-10
##$ISEN= 128
##$LB= 0.24
##$LEV0= 0
##$LPBIN= 0
##$MAXI= 10000
##$MC2= 0
##$MEAN= 0
##$ME_mod= 0
##$MI= 1.114404
##$NCOEF= 0
##$NC_proc= -7
##$NLEV= 6
##$NOISF1= 3.799351
##$NOISF2= 2.8
##$NSP= 0
##$NTH_PI= 0
##$NZP= 0
##$OFFSET= 15.74358
##$PC= 1
##$PHC0= -19831.89
##$PHC1= 14.60081
##$PH_mod= 1
##$PKNL= yes
##$PPARMOD= 0
##$PSCAL= 0
##$PSIGN= 0
##$REVERSE= no
##$SF= 200.130005595767
##$SI= 16384
##$SIGF1= 3
##$SIGF2= 2
##$SINO= 5.538805
##$SIOLD= 16384
##$SREGLST= <1H.CDCl3>
##$SSB= 0
##$STSI= 16384
##$STSR= 0
##$SW_p= 3612.71676300578
##$SYMM= 0
##$S_DEV= 0
##$TDeff= 16384
##$TDoff= 0
##$TI= <>
##$TILT= no
##$TM1= 0
##$TM2= 0
##$TOPLEV= 0
##$USERP1= <user>
##$USERP2= <user>
##$USERP3= <user>
##$USERP4= <user>
##$USERP5= <user>
##$WDW= 1
##$XDIM= 16384
##$YMAX_p= 435095362
##$YMIN_p= -1261769
$$ End of Bruker specific parameters
$$ ---------------------------------
##NTUPLES= NMR SPECTRUM
##VAR_NAME=  FREQUENCY,     SPECTRUM/REAL,   SPECTRUM/IMAG
##SYMBOL=    X,             R,               I
##VAR_TYPE=  INDEPENDENT,   DEPENDENT,       DEPENDENT
##VAR_FORM=  AFFN,          ASDF,            ASDF
##VAR_DIM=   16384,         16384,           16384
##UNITS=     HZ,            ARBITRARY UNITS, ARBITRARY UNITS
##FACTOR=    0.220516191357247, 1,           1
##FIRST=     3150.76272638018, 0,            0
##LAST=      -461.9540366256, 0,             0
##MIN=       -461.9540366256, -1261769,      0
##MAX=       3150.76272638018, 435095362,    0
$$ Real data points
##PAGE= N=1
##DATA TABLE= (X++(R..R)), XYDATA
$$ [...]
6488f7582J76461M5936j8164j72895J01315J38294k31279k10632P1118J05922
6478f1506k698o636n2986L3182r6681k48113K40556M574M5864Q5599J17390J28254
6466A86799j28349k53099J19427P1922J8597J07333L3718k48492k11546m8974
6456c52664K06547J41433j74039o9887J69945J43791k41672J3804J89568j08518
6446h1692j16350j1782P3770l955j8934J35662M0055Q2057J4915j83013m9120
6435a18387M3978r730J49794J06496J24927j85217j70069r4644O73m2710J55363
6424c9526n1082J83273R6012j10246j87435J7301P1268J30089K3147n3816k8845
6413E0140K1854r7626J0716J75849j11649k9053Q50l4088P7186j52117m8097N5233
$$ plain form
6488 -67582 108879 154815 136651 -36244 65071 203365 -27914 -238546 -167428 -61506
6478 -61506 -64204 -70840 -123826 -90644 -187325 -435438 -194882 -190308 -144444 -58845 58545 186799
6466 186799 58450 -194649 -75222 -3300 15297 122630 156348 -92144 -303690 -352664
6456 -352664 -146117 -4684 -178723 -248610 -78665 65126 -176546 -162742 26826 -81692
6446 -81692 -198042 -209824 -136054 -140009 -158943 -23281 16774 98831 113746 -69267 -118387
6435 -118387 -74409 -84139 65655 172151 297078 111861 -58208 -152852 -152179 -194889 -39526
6424 -39526 -90608 92665 188677 78431 -109004 -91703 -20435 109654 132801 78985 50140
6413 50140 71994 -25632 -14916 160933 49284 20231 21081 -13007 64179 -87938 -136035 -80802
6401h0802l9447m1366j4529m1966J56658o3413Q6899K9897j70976P3502K2357
6390h3186R430R4420m899j18088j30012J45385J10288j04711k4074O3886J10535
6379F8974j3906L6255n2696J6740k11438J46326l0952j79844J94740O7323j49059
6368a07537m8010J27001J49271n346j85059O9301K2022J62591J41113j11537J29984
6357C43794p0654j72213j97913P3060J11052L8069J05242J7858j72184l1875j36144
6346i1908J0475n8730J40955J40842m4786q1974P8817m7991o739j79137l9817
6335a79993R6972m5194O2578O1681J56371j5424j83532l6326j65803l6429O1772
6324b23327R1964j8524k35162R8701K94909K2498p0950K3488r5835r8053r7915
$$ plain form
6401 -80802 -120249 -161615 -176144 -218110 -61452 -124865 -37966 -8069 -179045 -105543 -83186
6390 -83186 -73756 20664 15765 -102323 -232335 -86950 23338 -81373 -105447 -41561 68974
6379 68974 55068 91323 38627 55367 -156071 -9745 -40697 -220541 -25801 41522 -107537
6368 -107537 -155547 -28546 120725 115379 -69680 -379 21643 184234 325347 213810 343794
6357 343794 273140 100927 -96986 -23926 87126 125195 230437 248295 76111 44236 -91908
6346 -91908 -81433 -140163 792 141634 96848 14874 93691 45700 38961 -140176 -179993
6335 -179993 -83021 -128215 -65637 -3956 152415 136991 -46541 -82867 -248670 -285099 -223327
6324 -223327 -131363 -149887 -385049 -286348 8561 31059 -39891 -16403 -112238 -210291 -308206
6313c08206J65073J4402N9709k6609j95363k8453K6737N3254j6263r066N7840
6302b06945K4615J38017J15p119K0517m5025j65373J0676Q889K12159L386j19322
6290a25410P6585O8017j01004j16656J83773q0114j04762J94658J34942j27951
6280B078J7301J38966k60916l7807P6243k27147J29938J61045l00371J07709j60715
6269c53676K38661j65971j37363m545P4452K57357K032Q122o7096J41471r8477
6258a05033j24186K8570K162q5862j22150p0150K00222O3097M6179O5902j33725
6247b34974j39205K36234m6387r6744n1160J8553J16532J21414k4844O8393n9457
6236i1645p3383J19483l36534p131K05037R1520J1379j43011R1081L5520J452
$$ plain form
6313 -308206 -143133 -128731 -69022 -95631 -290994 -319447 -292710 -239456 -255719 -264785 -206945
6302 -206945 -182330 -44313 -44198 -51317 -30800 -75825 -241198 -230522 -221633 -9474 -6088 -125410
6290 -125410 -48825 19192 -81812 -198468 -14695 -94809 -199571 -4913 130029 2078
6280 2078 19379 158345 -102571 -140378 -64135 -291282 -161344 -299 -300670 -192961 -353676
6269 -353676 -115015 -280986 -418349 -422894 -348442 -91085 -89053 -80931 -148027 -6556 -105033
6258 -105033 -229219 -200649 -198487 -284349 -406499 -476649 -276427 -213330 -167151 -101249 -234974
6247 -234974 -374179 -137945 -184332 -281076 -332236 -313683 -197151 -75737 -100581 -32188 -91645
6236 -91645 -165028 -45545 -382079 -389210 -184173 -92653 -81274 -224285 -133204 -97684 -96232
6225i6232r2430p2999l958M9499J29380o2693O5624R2407O0629k39747k12672
6214c83192K0240j8805Q1934R4673K36252J3236k04936q7081K34581j80871K1887
6203a72082M5172r981o0683j00724J24002j87629Q374J89381O5420O0040J7832
6192b0878J11415K8459r5582j95363q5080K88490j1084j17789J75007q4808j99040
6181b06253K08862Q2645n9963Q799j02691N4070j26315n3118Q5397p1720k2888
6170b03175N3883J2858L3555J22451O5727o4292j84876J23635K4554P7766j73537
6159a11451L5797J97536k59734J68792j41531j16474N4619O5471J05477r2467
6149i3965j32427J87346p8472k58851J62532K05605P6039j24455n4929k10513
$$ plain form
6225 -96232 -188662 -261661 -265619 -216120 -86740 -149433 -83809 8598 69227 -170520 -383192
6214 -383192 -362952 -381757 -299823 -205150 31102 44338 -160598 -247679 -13098 -193969 -172082
6203 -172082 -126910 -136891 -197574 -298298 -174296 -361925 -353551 -164170 -98750 -38710 -20878
6192 -20878 90537 118996 23414 -171949 -257029 31461 20377 -97412 77595 -7213 -206253
6181 -206253 2609 85254 25291 34090 -68601 -14531 -140846 -193964 -108567 -180287 -203175
6170 -203175 -149292 -136434 -102879 19572 85299 21007 -163869 -40234 -15680 62086 -111451
6159 -111451 -75654 121882 -137852 30940 -110591 -227065 -172446 -106975 -1498 -93965
6149 -93965 -226392 -39046 -117518 -376369 -213837 -8232 67807 -56648 -111577 -322090
6139c22090N0191M2028J12977K14816J6247j50648k5464J689K20474K9378j63092
6128B6506r7766o5364J00864p0389L8827j4939J15095J03977k47609m1401o9423
6117b21622j72342m6787K97340l9451Q2835O564m8901j9233j25243J51010J12797
6106b3033O4358l0995k52631n9828L3854k7617M5689j1723K39030K138j12240
6095a32998j83772p893k1582K28348q9758j03600J31955P741N5672l1318k0783
6084a67988K37176j99746k02813J49975j02767N4106M323R7375K40464o7962q6047
6073d3904j60007M6156r0922O2791K66370p5446j07963l783K2372o9690J50495
6062c531k11991R0011J92409j14063k6280L1619L5188m8683n6484Q2735K0170
$$ plain form
6139 -322090 -271899 -229871 -116894 97922 114169 -36479 -61943 -60254 160220 189598 26506
6128 26506 -71260 -136624 -35760 -106149 -67322 -82261 32834 136811 -110798 -152199 -221622
6117 -221622 -393964 -440751 -143411 -182862 -100027 -93463 -142364 -161597 -286840 -135830 -23033
6106 -23033 41325 10330 -242301 -302129 -268275 -295892 -250203 -261926 -22896 -20758 -132998
6095 -132998 -316770 -324663 -346245 -117897 -207655 -311255 -179300 -171559 -115887 -147205 -167988
6084 -167988 69188 -130558 -333371 -183396 -286163 -232057 -227734 -130359 110105 42143 -43904
6073 -43904 -203911 -157755 -248677 -185886 80484 5038 -102925 -106708 -84336 -154026 -3531
6062 -3531 -215522 -125511 66898 -47165 -73445 -41826 -6638 -55321 -111805 -29070 -8900
6051h900J87432r4350k80806J57647N5061O683r6534j0682J609p5537Q8295J11284
6039D1202j33709J1578J34339k23133J03953J4716q0559J37332p0656n1037J49393
6028C3419p6067r9000J95997j03383k12783K2451K46011O3766j49954K9532J8276
6017c1735Q5929m2476M0280j75018J40216J19192j47670n7240j4521R8987K98634
6006C14578J07346l26027r8145m1533K3900M2410j4809n7455J39541k11276R2219
5995b9251N2201O2501M2579j36810J9553j58878k328O313k2260J02937O6255J15048
5983A17860k00101j28174L09561k469o3100K16485k21776k08244J49807P4479
5973D4328P493j19711N7971m019P3534o4593j148O4277P928J53201r6855R8254
$$ plain form
6051 -8900 178532 84182 -196624 -38977 16084 22767 -73767 -84449 -82840 -158377 -70082 41202
6039 41202 -92507 -80929 53410 -169723 -65770 -51054 -131613 5719 -64937 -115974 33419
6028 33419 -42648 -141648 54349 -49034 -261817 -239366 6645 70411 -79543 -50011 -31735
6017 -31735 54194 11718 51998 -123020 17196 136388 -11282 -68522 -83043 15944 314578
6006 314578 421924 95897 -2248 -43781 -19881 22529 7720 -49735 89806 -121470 -29251
5995 -29251 22950 85451 128030 -8780 10773 -148105 -150433 -144120 -166380 -63443 2812 117860
5983 117860 -82241 -210415 99146 96677 33577 250062 28286 -179958 -30151 44328
5973 44328 51821 -67890 -9919 -13938 59596 -4997 -6145 58132 66060 219261 122406 220660
5961B20660K2658J18461j38364j28787J21064k5673j15923j086O1318o4620J23667
5950A93375N0800j04956j27633n0679Q4482J07248m1899J60204J66014j47488
5940B89468j66149j15533l8053J4793J04918Q1819j56191J65388j22404j6872
5930D1184q9647m1557J00091J37088j2263j82963L0281J77697j04110j82392K78981
5919A52390R8881j43499k63544j59470J40426J22611m9488k8512K13732l9299
5909D4228l4220R4524p0539k504n6979j00183Q4783j0586M6463l6359m5519J03424
5897A6533J29476J12793k33967J56766R5034o1125j9852o3455O3906q0295j7774
5886I8040o5659j00889K0132j24284K40185o1310l9771P6873K4363m103Q2083
$$ plain form
5961 220660 243318 361779 223415 94628 215692 190019 74096 73010 134328 69708 193375
5950 193375 244175 139219 11586 -39093 45389 152637 110738 270942 436956 289468
5940 289468 123319 7786 -30267 -15474 89444 171263 15072 180460 58056 41184
5930 41184 -48463 -90020 10071 147159 134896 -48067 -17786 159911 55801 -126591 152390
5919 152390 251271 107772 -155772 -315242 -174816 -52205 -101693 -130205 83527 44228
5909 44228 10008 104532 33993 31489 -25490 -125673 -40890 -51476 -5013 -41372 -86891 16533
5897 16533 146009 258802 24835 181601 276635 215510 195658 132203 196109 115814 98040
5886 98040 32381 -68508 -48376 -172660 67525 6215 -33556 43317 67680 63577 145660
5875A45660J18958J07404P261l3763k22497K20247m9862j60148O4223m4788N8755
5864B11450o7639K7252N46J2214k7337p5148J4826L3106k9187K89602m4166L0248
5852C75767P1494j65281q793m7331j32956Q6615q593K6545o041R949J85250N4090
5840D40715j61462j90488N0440R9487k26673K6141K59210n8865j8899R8312p5610
5829B42308k06024o3939Q0774J12206O8897j03754j83033J44301J6631J64230
5819B72597j01364p5264K9197m4659o9290J52195K0911j00031J36918j72948l5934
5808A2328K24375k8258j94118K13145k63491J89508P2629j13546K7946l8917j6793
5797H4808n6249P8986K39145j18490k55660J20839J3139M8949J03326l4832N61
$$ plain form
5875 145660 264618 372022 379283 345520 123023 343270 293408 133260 197483 152695 211450
5864 211450 143811 171063 171609 183823 156486 81338 96164 129270 100083 389685 345519 375767
5852 375767 447261 281980 273187 225856 92900 179515 170922 197467 191426 201375 386625 440715
5840 440715 279253 88765 139205 238692 12019 38160 297370 238505 219606 317918 242308
5829 242308 36284 -27655 53119 165325 234222 130468 -52565 91736 108367 272597
5819 272597 171233 95969 125166 80507 11217 163412 184323 84292 221210 48262 12328
5808 12328 236703 208445 14327 227472 -36019 153489 226118 112572 140518 101601 84808
5797 84808 28559 107545 346690 228200 -27460 93379 106518 155467 258793 223961 224522
5786B24522j96338J16699M2290J7266m1979J85616K6319Q9031o162k27160J55884
5775C85988j10192J01895q9383P639M0877j4106Q5601j08290p3030J78282R6011
5764E01292o3624l3262m8377j03963K1116J10132O6570q7532n6O7480q1865J0789
5752C58700J08871K346Q6986q4048k02364J86382M0523R586j93625N7627L8499
5741D09483j25587R3643N351R9113k07899J3203k506K19425r1348j37060k1866
5730B53952K85305l8420j71832Q3583Q3478N5165K5803J86399j71626k44376K9397
5719C76828R3735K40914j44486j57186K00362k40252j37976J01151P5903Q1540
5709D90533j14633R3513K88548N7977j73319K6492M6542j22141m3347p5918M8638
$$ plain form
5786 224522 28184 144883 187173 204439 162460 348076 374395 463426 457264 230104 385988
5775 385988 275796 377691 288308 295947 336824 322718 408319 300029 226999 405281 501292
5764 501292 437668 404406 356029 252066 273182 383314 449884 362352 362296 429776 347911 358700
5752 358700 467571 469917 556903 472855 270491 456873 497396 506982 313357 370984 409483
5741 409483 283896 377539 382890 482003 274104 287307 284801 504226 412878 275818 253952
5730 253952 539257 500837 329005 412588 496066 551231 577034 763433 591807 347431 376828
5719 376828 470563 711477 566991 409805 610167 369915 231939 333090 408993 490533
5709 490533 375900 469413 757961 815938 642619 669111 715653 593512 550165 474247 522885
5698E22885j75390n1319J60221l7671n8313o0122n4919J92176N3307J60053m6988
5687F03920j21397k9419j60288J16975j4896m494L4934K550J03270m9850l1590
5676D49715j04269j72797J74034L75Q8281Q2005K6147Q7815O8098j55265k0151
5665E23988R3035O4366q3116m1803j11635j01123P4922J20845J27255k18681K3582
5654D71635P089J91027j33786j46078K04906L8286j95359M8085K30979p0197K1056
5643F67643m8601q9220J00859Q8073k4447p6337J67555l1542J35022m6626q3683
5632G58696J33205l166J0958J43884j22361q4287p51K22050k4157J21230N0650
5621A205951j09397j14457J48973L2800l955K17910O1847j3798K2839J17422l7344
$$ plain form
5698 522885 347495 296176 456397 418726 360413 300291 245372 437548 490855 650908 603920
5687 603920 482523 453104 292816 409791 394895 390401 425335 427885 531155 481305 449715
5676 449715 345446 172649 346683 347058 435339 517344 543491 631306 699404 544139 523988
5665 523988 617023 681389 598273 556470 444835 343712 418634 539479 666734 448053 471635
5654 471635 478724 669751 535965 389887 594793 633079 437720 485805 716784 646587 667643
5643 667643 619042 529822 630681 718754 694307 617970 785525 753983 889005 842379 758696
5632 758696 891901 888735 899693 1043577 921216 836929 836178 1058228 1034071 1155301 1205951
5621 1205951 1096554 982097 1131070 1163870 1159915 1377825 1439672 1425874 1448713 1566135 1528791
5610A528791p0902j61963J79411K09458j25023j64939J33961k5974K43604K6095
5600A772519j22163K63150J39895J0245K3583J49866J13406o4391K15266r4579
5590B406797J686K38981K07923J24050K0079J62289K69235K96520l7187K95318
5580C985691J33049j68923J41188j08176K28586N1151j82144J83146J92130K65005
5570D720703O9142j10874k4476J40660L15060o2750J36291J57442J9614q9597
5560E271215Q4570J25217j89772J65711J34311J04410J86718J27071J17838o0358
5550F066931J5847m244k07400m66085J9616M5330j45439J72668k1979Q790k5445
5539E458590k65721K0550j23085k04412N2574J23848m6223J805P2718j43455m9893
$$ plain form
5610 1528791 1457889 1295926 1475337 1684795 1559772 1394833 1528794 1502820 1746424 1772519
5600 1772519 1650356 1913506 2053401 2063646 2087229 2237095 2350501 2286110 2501376 2406797
5590 2406797 2408483 2647464 2855387 2979437 2999516 3161805 3431040 3727560 3690373 3985691
5580 3985691 4118740 3949817 4091005 3982829 4211415 4262566 4080422 4263568 4455698 4720703
5570 4720703 4789845 4678971 4654495 4795155 5110215 5047465 5183756 5341198 5360812 5271215
5560 5271215 5355785 5481002 5291230 5456941 5591252 5695662 5882380 6009451 6127289 6066931
5550 6066931 6082778 6078534 5871134 5405049 5424665 5469995 5324556 5497224 5475245 5484035 5458590
5539 5458590 5192869 5213419 5090334 4885922 4938496 5062344 5016121 5017926 5090644 4947189 4897296
5528D897296K5071K793j52640k34267q1870N2555P433k6487k17893k05396M6988
5517D113583j71028j96276J40585j37128k93216j71539P2428J35998j65093j2601
5507C315713K28888l6230j5850J5018L09986J14075k7679N8381K13997J80189
5497D356488j12527k98181j03339k57809n3937k28707k42332J32751J53033q2116
5487C263324r5404j87995M8014O0123L4164K40543J3376K76896r6711J70200K63921
5476C990451J49362J95075L79091K57072L21283M32836M05940P53225N19019L61590
5466G764944l3006k59054l00023o57944n27971m02195m81933l72559k6918j22164
5456D581177J0950j86967p1695l0029k7189J19320J54138R0789N7602J48400O00209
$$ plain form
5528 4897296 4922367 4925160 4772520 4538253 4456383 4508938 4516371 4489884 4271991 4066595 4113583
5517 4113583 3942555 3746279 3886864 3749736 3456520 3284981 3357409 3493407 3328314 3315713
5507 3315713 3544601 3508371 3492521 3507539 3817525 3931600 3903921 3962302 4176299 4356488
5497 4356488 4243961 3945780 3842441 3584632 3530695 3301988 3059656 3192407 3345440 3263324
5487 3263324 3167920 2979925 3027939 3088062 3122226 3362769 3376145 3653041 3556330 3726530 3990451
5476 3990451 4139813 4334888 4713979 4971051 5292334 5725170 6131110 6884335 7403354 7764944
5466 7764944 7731938 7472884 7172861 6514917 5986946 5584751 5102818 4730259 4703341 4581177
5456 4581177 4592127 4405160 4333465 4303436 4276247 4395567 4549705 4640494 4698096 4846496 5446705
5445E446705J48957J53552J90679J57661K27066K65074O97891O50485M42372N01890
5435H882332K07580j98501k88122o08543n75888m35892k32914n73270k99580p4322
5425E802880j58704j45269K05881R9458M3582m1791j11260j62234R658J82667
5415E724868J39539J07419j3830k11449r5236R5189q70p0683L23243P3236P6752
5404F148178J15090J2990r8660k95295l29861j39433J44391l71256l96390P653
5394D797407J22533j58014l5386M616l1551k05042j28784O6551M5400j95205j85040
5383D097485J267j88144O6400j13936m1016J65819q0158k77075J00167j67785
5373C563024k26812j8717O4229j58158j29356m0118Q4341K43182K6564k6958k66214
$$ plain form
5445 5446705 5595662 5749214 5939893 6097554 6324620 6589694 7287585 7938070 8380442 8882332
5435 8882332 9089912 8891411 8603289 7994746 7418858 6982966 6750052 6176782 5877202 5802880
5425 5802880 5644176 5498907 5704788 5804246 5847828 5806037 5694777 5532543 5542201 5724868
5415 5724868 5864407 5971826 5957996 5746547 5651311 5746500 5745630 5674947 5998190 6071426 6148178
5404 6148178 6263268 6276258 6177598 5882303 5552442 5413009 5557400 5186144 4789754 4797407
5394 4797407 4919940 4761926 4726540 4731156 4699605 4494563 4365779 4432330 4477730 4282525 4097485
5383 4097485 4098752 3910608 3977008 3863072 3822056 3987875 3907717 3630642 3730809 3563024
5373 3563024 3336212 3317495 3381724 3223566 3094210 3054092 3138433 3381615 3408179 3381221 3115007
5362C115007j29272j01692O0660m9489J1882j36620l244O5647P4272R7782j36087
5351B868846m06755j3197M9229J0343o1089l4973Q6286r0393P3802P8333j01639
5340B458793J86582j48326l3608J3540o2718J4531p2391j34137M7453K22424J2907
5329B505050o432j22330j20098J07302R4983j53240j07227m0245j6819L7668L54282
5318B532894k84620k7691q0469j30365L6699K18179n3024k30744L0231j65580
5308A845510J9577j4025K18548o6498p6157J99428j92370O2081k1067p0299K26741
5297B131469o9560j74854j80078q0536K3105J87339m5730K2631J10371j64113
5287A760044R648J09247j62668j5351K768j74200r5255N2331J24539l1144p2888
$$ plain form
5362 3115007 2985735 2884043 2944703 2895214 2907096 2770476 2767232 2832879 2907151 3004933 2868846
5351 2868846 2462091 2448894 2498123 2508466 2447377 2412404 2498690 2408297 2482099 2560432 2458793
5340 2458793 2645375 2497049 2463441 2476981 2414263 2428794 2356403 2222266 2269719 2492143 2505050
5329 2505050 2498618 2376288 2256190 2363492 2458475 2305235 2198008 2157763 2140944 2178612 2532894
5318 2532894 2248274 2220583 2140114 2009749 2046448 2264627 2211603 1980859 2011090 1845510
5308 1845510 1865087 1851062 2069610 2003112 1926955 2126383 1934013 1996094 1975027 1904728 2131469
5297 2131469 2061909 1887055 1706977 1626441 1649546 1836885 1791155 1813786 1924157 1760044
5287 1760044 1769692 1878939 1716271 1700920 1703688 1529488 1434233 1486564 1611103 1579959 1507071
5276A507071J46137n9596O5288N9000J14322j30680j91789J50435J37446j86482
5266A611152j49558N0922K68536l4973K9253J81140m3361n1376k6502l0678j81324
5255A623231J3910j22688o8879j81127K75116P6346j24304O898l4369O567p8973
5244A391728L6907J2931P2696R3329o6716J96018J47827m0264J04376K20176q1790
5233B087218J5293L88368J91518o2856J73483j23106M5180j10091n0136j35794
5223B419077k61603k68538J5637m6856l10859R3486m2666j08347k13525J94236
5213A470042j35213j58416K93864k2477k25018k8569O0054J54340j38044k40652
5203A029911K6858J86929P7757n6567M457J27637N1892j49330j49461M08735r6028
$$ plain form
5276 1507071 1653208 1593612 1658900 1717900 1832222 1701542 1509753 1660188 1797634 1611152
5266 1611152 1461594 1512516 1781052 1746079 1775332 1956472 1913111 1861735 1835233 1804555 1623231
5255 1623231 1637141 1514453 1445574 1264447 1539563 1615909 1491605 1498503 1464134 1470701 1391728
5244 1391728 1428635 1441566 1514262 1607591 1540875 1736893 1884720 1844456 1948832 2169008 2087218
5233 2087218 2102511 2490879 2682397 2619541 2793024 2669918 2715098 2605007 2554871 2419077
5223 2419077 2157474 1888936 1904573 1857717 1546858 1640344 1597678 1489331 1275806 1470042
5213 1470042 1334829 1176413 1470277 1447800 1222782 1194213 1254267 1408607 1270563 1029911
5203 1029911 1056769 1243698 1321455 1264888 1269345 1396982 1448874 1299544 1150083 1558818 1462790
5192A462790m28770j6968l2538K3161m0258k6709J07677m8276q4906J81766J33990
5181A230959m3496l5808j75897j21609J17875j7496K23729L5906j3186r4570j2254
5170A094153l1078k16723o5262J30531R4287J36640J23302p1424k6369o6927O3628
5159A164758J47248l3198j64985q9995r9942K13456J2445m2278J08765j83775
5149A032499p692L03611o8441m5496L7397J0393P7294J37574J01947j24946J62217
5138A616357J85471l0452k44556Q3981R2649J01006J85858m2444P5236J25397
5128B148503J25874k6694J85031K25867p0076J71341K20650K9263P7801l4442
5118C053118K6378j67061k0036Q618m3238j62437J23080J00160j04722o1311R6885
$$ plain form
5192 1462790 1034020 1017052 984514 1007675 967417 940708 1048385 1000109 915203 1096969 1230959
5181 1230959 1187463 1151655 975758 854149 972024 954528 1178257 1214163 1200977 1106407 1094153
5170 1094153 1063075 846352 781090 911621 1005908 1142548 1265850 1194426 1168057 1101130 1164758
5159 1164758 1312006 1278808 1113823 1023828 923886 1137342 1149787 1107509 1216274 1032499
5149 1032499 1024807 1328418 1259977 1214481 1251878 1262271 1339565 1477139 1579086 1454140 1616357
5138 1616357 1801828 1771376 1526820 1610801 1703450 1804456 1990314 1947870 2023106 2148503
5128 2148503 2274377 2247683 2432714 2658581 2588505 2759846 2980496 3009759 3087560 3053118
5118 3053118 3079496 2912435 2892399 2901017 2857779 2695342 2818422 2918582 2813860 2752549 2849434
5107B849434j57185M9147N06578J96541K532q6546K21948J09231k84092L5098
5097C442686l6526l27168m9369K29233K5361j47511P2004j07902l5191Q2597j12063
5086C036151j22975K06904p467N1319K22441R1976J58859N3692K0679L2909k54900
5075C489588l3793M9511o7184P0939L8065K4007K39325k80221R467j28386M2637
5064C453955j34421j73557j75253M0077M1536R3348L09810k88991j28134j65691
5054B872679j9530r6629j7360j98798k34046p7767o6812l83356r4923j28961J67758
5043A722255j26569J20770J07508j59932K5929j97520J46054M894l86810L01259
5033A557838P025j26324K15091k14512j08395m140M4178J58009j8415q0424J18194
$$ plain form
5107 2849434 2692249 2741396 3247974 3444515 3447047 3360501 3582449 3691680 3407588 3442686
5097 3442686 3406160 3078992 3029623 3258856 3284217 3136706 3208710 3100808 3065617 3148214 3036151
5086 3036151 2913176 3120080 3112613 3163932 3386373 3478349 3637208 3690900 3711579 3744488 3489588
5075 3489588 3455795 3505306 3438122 3509061 3547126 3571133 3810458 3530237 3539704 3411318 3453955
5064 3453955 3319534 3145977 2970724 3010801 3052337 3145685 3455495 3166504 3038370 2872679
5054 2872679 2853149 2756520 2739160 2540362 2306316 2228549 2161737 1778381 1683458 1554497 1722255
5043 1722255 1595686 1716456 1823964 1664032 1689961 1492441 1638495 1643389 1256579 1557838
5033 1557838 1564863 1438539 1653630 1439118 1330723 1326583 1370761 1528770 1510355 1429931 1548125
5022A548125j0958o5793j73778q3457J14145R5448O4724j69759M474Q213R7890
5011A429274J35844J7346J19633p5213J47102j7393l64210J20694J9501N0800
5001A583378K31218k09201J3159j69643M4019J2277o8573P8011n5744j04833J49270
4990A503338k3259R2338q3429n6462j4245j0872J7812P9965Q1048q601Q5045k0299
4978A642379J4402l808N0212K51810J15308J8197P3610K25453m0072k03042Q3462
4967B227911L50809l8510r8442J91437Q8141n1451J7751O0191K3772L5743O0938
4956B868290j21681r7774J99727q861j18886J01744j04583j94267J10384J40787
4946B774880K1061J54828N2368j5057j8919m1813K14247J85584p6603j85914L39207
$$ plain form
5022 1548125 1537167 1471374 1297596 1214139 1328284 1423732 1488456 1318697 1323171 1331384 1429274
5011 1429274 1565118 1582464 1702097 1626884 1773986 1756593 1392383 1513077 1532578 1583378
5001 1583378 1814596 1605395 1618554 1448911 1492930 1505207 1436634 1514645 1458901 1354068 1503338
4990 1503338 1480079 1572417 1488988 1432526 1418281 1407409 1425221 1505186 1586234 1577633 1662678 1642379
4978 1642379 1656781 1652973 1703185 1954995 2070303 2088500 2162110 2387563 2347491 2144449 2227911
4967 2227911 2578720 2540210 2441768 2633205 2721346 2669895 2687646 2747837 2771609 2807352 2868290
4956 2868290 2746609 2648835 2848562 2839701 2720815 2822559 2717976 2523709 2634093 2774880
4946 2774880 2795941 2950769 3003137 2988080 2969161 2927348 3141595 3327179 3250576 3064662 3403869
4935C403869J20124j11311P0039n3050j20181J90035r7373k9438m9118M5146J37869
4924C506611K73369J26834l0908j99254R9302O5366J55544J09631q7186J16505
4914D135814K16517N5266o8295J52438P1026J8727Q5599j01158P4079J01705J06486
4903D848204M2132j18061J94468l1037O6520J28769j36868J6758k28453J80926
4893D963358K12648j09288k76535J54318j27K202j12931M0230m8O6476J38197
4882E078500q8409O4853o5524l32k7768K2639j26597J12254q1752k01807j53685
4871D532372m1374Q7478J52369m0209J67913K15233N8923l32747P1437j56408
4861D714987k3852o0601P8125r3348k39488n170J38207M0357k71357J47034j2592
$$ plain form
4935 3403869 3523993 3412682 3482721 3429671 3309490 3499525 3402152 3372714 3323596 3368742 3506611
4924 3506611 3779980 3906814 3875906 3676652 3775954 3841320 3996864 4106495 4019309 4135814
4914 4135814 4352331 4407597 4339302 4491740 4562766 4581493 4667092 4565934 4640013 4741718 4848204
4903 4848204 4890336 4772275 4966743 4935706 5002226 5130995 4994127 5010885 4782432 4963358
4893 4963358 5176006 5066718 4790183 4944501 4944374 4946576 4833645 4873875 4873827 4940303 5078500
4882 5078500 4990091 5054944 4989420 4989088 4961320 4983959 4857362 4969616 4887864 4686057 4532372
4871 4532372 4490998 4578476 4730845 4690636 4858549 5073782 5132705 4799958 4871395 4714987
4861 4714987 4691135 4630534 4708659 4615311 4375823 4370653 4508860 4549217 4277860 4424894 4412302
4850D412302j37093J98295o5561M5959J1222l160R0578K31120K01874J39571Q6031
4839E211138K01857L83597j0165j03988m4298O0602J16749K01833J75477L6392
4829F229194o2894N2941q2548q0828K0732j4540J3988R5051k67219j06056m599
4818E793222K2937R7923k00894J44187o6095j62258P0000n7778j32608O2190J99236
4807E770062r395j68580N664J07664p7551R4691J60527l8164J9072K40059J65432
4796F269481K6737J88952K05295L58917L33580J95752J25010K22050M90253K86092
4786H702119L67880K24548K87040P12334M49011M26518L23026O42346Q06009O13663
4776A3554494O14319J000523J054420J434327J818963K007913K622585K617141
$$ plain form
4850 4412302 4275209 4473504 4407943 4453902 4465124 4461964 4552542 4783662 4985536 5125107 5211138
4839 5211138 5412995 5796592 5786427 5682439 5638141 5698743 5815492 6017325 6192802 6229194
4829 6229194 6166300 6219241 6136693 6055865 6076597 6062057 6076045 6171096 5903877 5797821 5793222
4818 5793222 5816159 5914082 5713188 5857375 5791280 5629022 5699022 5641244 5508636 5570826 5770062
4807 5770062 5760667 5592087 5597751 5705415 5627864 5722555 5883082 5844918 5863990 6104049 6269481
4796 6269481 6296218 6485170 6690465 7049382 7382962 7578714 7703724 7925774 8416027 8702119
4786 8702119 9069999 9294547 9581587 10293921 10742932 11169450 11492476 12134822 12940831 13554494
4776 13554494 14168813 15169336 16223756 17658083 19477046 21484959 24107544 26724685
4768B6724685L201398L996529N324653O261236P278491P683517N466033J334587
4760F7271129l099015o106714p767378p999530o903944n199965l894343l191809
4752B3108431k337895j717983j546959j286897r31661q11186q13820o45003m59388
4743A2557639m95989n79644m28722l68603l97955j46224j88494J27443j06627
4734I972824r7976n9200L3878N8287J61399J4552j14470J5358l7207N3259r2253
4723I908451J18352J84477M9253J11497J45057J75784M04506M73177L00338L69836
4713A2240728M27565M76345M42126O09866O08921O63592R94881J196342J397858
4704A9058224J656476J683521K365643K892181L466364M423411N213426O220249
$$ plain form
4768 26724685 29926083 33922612 39247265 45508501 52786992 60470509 65936542 67271129
4760 67271129 64172114 58065400 50298022 42298492 35394548 30194583 26300240 23108431
4752 23108431 20770536 19052553 17505594 16218697 15287036 14475850 13662030 13017027 12557639
4743 12557639 12061650 11482006 11053284 10684681 10286726 10140502 9952008 10079451 9972824
4734 9972824 9874848 9815648 9849526 9907813 10069212 10083764 9969294 9984652 9947445 10000704 9908451
4723 9908451 10026803 10211280 10260533 10372030 10517087 10692871 11097377 11570554 11870892 12240728
4713 12240728 12668293 13144638 13586764 14196630 14805551 15469143 16464024 17660366 19058224
4704 19058224 20714700 22398221 24763864 27656045 31122409 35545820 40759246 46979495
4696D6979495O862012O347418M051148N61629l202227n940086o948366p002244
4688D1708779o159792n124578l779573l238019k682736j828560j819479j381382
4680A5694660j209227j066063o67655q83324p92292n64398n24654k75013m24080
4671I287954k40589l28488k44096j5641l33638n38446m01284k41070j11443q6910
4661F746349k44240j03681k50686l91551p6529j70559j80341k04147j40948j66799
4651D816868o4208q7183Q7818m5968m2624j70878j18655r7475k0258j24616J1751
4640D144572q4721O0112o0118n7499j74999k86971J01819p5862k39015L8915q4046
4629C282187n3621O7868L1404m9178M5003j41942J58108j63432k12819j08234
$$ plain form
4696 46979495 53841507 60188925 64240073 64801702 61599475 55659389 48711023 41708779
4688 41708779 35548987 30424409 26644836 23406817 20724081 18895521 17076042 15694660
4680 15694660 14485433 13419370 12751715 11868391 11076099 10511701 9987047 9712034 9287954
4671 9287954 9047365 8718877 8474781 8459140 8125502 7587056 7185772 6944702 6833259 6746349
4661 6746349 6502109 6398428 6147742 5756191 5679662 5509103 5328762 5124615 4983667 4816868
4651 4816868 4752660 4665477 4753295 4707327 4664703 4493825 4375170 4277695 4257437 4132821 4144572
4640 4144572 4059851 4119963 4059845 4002346 3827347 3540376 3642195 3566333 3327318 3366233 3282187
4629 3282187 3228566 3296434 3327838 3278660 3323663 3181721 3339829 3176397 2963578 2855344
4619B855344J54110l3962k04853J02789O6060o9166k44740J06321k4315n1356
4609B656232L837P5318k6012P5124N9825P7700j03929j62515o4004j0411p5293
4598B505872m0160K02120O7274p5434J83871K172N0795j71694N4860q684J06818
4587B877810j22284r574L6515J63284n2254k9108J00721Q0946r9941k21728l2717
4576B691670M0856k3730j46945J94625l4719j27954J48932P1957J2376n0546N659
4565B782181j73863k38m7636L7939J82824L48j05345M1692l2979J43779m4692
4554B784010q5661P8846N7682K63643m4573R798j6299L6592N0442P6841m7535
4543C163786l36457K67286l6263M5832J19304j27888R9127n7779J10975l6097
$$ plain form
4619 2855344 3009454 2975492 2770639 2873428 2939488 2870322 2625582 2731903 2707588 2656232
4609 2656232 2660069 2735387 2709375 2784499 2844324 2922024 2818095 2655580 2591576 2581165 2505872
4598 2505872 2465712 2667832 2735106 2659672 2843543 2845715 2896510 2724816 2779676 2770992 2877810
4587 2877810 2755526 2745952 2782467 2945751 2893497 2864389 2965110 3046056 2946115 2724387 2691670
4576 2691670 2732526 2708796 2561851 2756476 2721757 2593803 2742735 2814692 2827068 2776522 2782181
4565 2782181 2608318 2608080 2560444 2598383 2781207 2781555 2676210 2717902 2684923 2828702 2784010
4554 2784010 2698349 2777195 2834877 3098520 3053947 3063745 3047446 3084038 3134480 3211321 3163786
4543 3163786 2827329 3094615 3058352 3104184 3223488 3095600 3194727 3136948 3247923 3211826
4533C211826J22072J75477o8928J31236R037j31220K5637J03614K4281p168K41493
4522C837357l5547J12260P3837J06288n0004R5577J53308L6660M6894j6578j81538
4511D178514J23781J56562J58989K77369j31628k0185m8449L87881L19435k04954
4501E197315J0319J50545J34108P5678j493J47105J18422K53160M00495K50218
4491F735872J93422M3346L81490K36710J44744J29772K90698K14039P15023L90016
4481I475132Q4446O32009M16353J72780O35924O14410K29529M04180K21170M47378
4471A3333311K46224O1217K49290J16138J78559q1592O4239L09703J13653P9676
4461A4670418J47543M29985L21061L57112M96017N31855Q28297O47397Q21889
$$ plain form
4533 3211826 3333898 3509375 3440447 3571683 3580720 3449500 3475137 3578751 3603032 3595864 3837357
4522 3837357 3801810 3914070 3987907 4094195 4044191 4139768 4293076 4329736 4376630 4360052 4178514
4511 4178514 4302295 4458857 4617846 4895215 4763587 4743402 4694953 5082834 5402269 5197315
4501 5197315 5207634 5358179 5492287 5567965 5566472 5713577 5831999 6085159 6485654 6735872
4491 6735872 6929294 6972640 7354130 7590840 7735584 7865356 8156054 8370093 9085116 9475132
4481 9475132 9559578 10191587 10607940 10780720 11416644 12031054 12260583 12664763 12885933 13333311
4471 13333311 13579535 13640752 13890042 14006180 14184739 14103147 14167386 14477089 14590742 14670418
4461 14670418 14817961 15247946 15569007 15926119 16422136 16953991 17782288 18429685 19251574
4452A9251574P85929P20784Q90270R25468P59521O40078P50878L44642K78696
4443B5347840J65156M65688K66012j55784J05461M21608L42960M17369O12172
4434B7988482L88510L05511M46066N39569K37123q6471K7123R2167n8274j5400
4424B9864406k81760o4701n1703l931M9009K8098k34782k17177q287Q7609J92206
4413B9358987J57573M22730L77659L16708O41780P11011P23260M76629Q3906L79753
4403C3649996K42587L27632L07402J74981J10720n251j43326R0211k19057n78519
4393C3957376p04119p34951j237858j139853j186445j260658j217016j146471
4385B5330005j426506j290725j050338q56918p50481q83286p12728m86445m89333
$$ plain form
4452 19251574 20037503 20758287 21648557 22574025 23333546 23973624 24724502 25069144 25347840
4443 25347840 25512996 25978684 26244696 26088912 26194373 26615981 26958941 27376310 27988482
4434 27988482 28376992 28682503 29128569 29668138 29905261 29818790 29845913 29938080 29879806 29864406
4424 29864406 29582646 29517945 29466242 29462311 29511320 29539418 29304636 29087459 29079172 29166781 29358987
4413 29358987 29516560 29939290 30316949 30633657 31275437 31986448 32709708 33186337 33270243 33649996
4403 33649996 33892583 34220215 34527617 34702598 34813318 34808067 34664741 34754952 34535895 33957376
4393 33957376 33253257 32518306 31280448 30140595 28954150 27693492 26476476 25330005
4385 25330005 23903499 22612774 21562436 20705518 19955037 19071751 18359023 17872578 17383245
4376A7383245n99317k79454n08933n95472k93176l04005j78098r4984k04846l12211
4366A4012749j40960m4424q2499j19916M5451p7199k41391j9301l00735j00931
4356A2930844q2740O3480J31386J37402K20928J56290K9924P0649K77305P3820
4346A4009288L1811L81262M68799Q8437L56629L51546K93291K01631K79502N76001
4336A7038197K69293M39901L23941O37308O46196O12541O92968O72344O04819
4327B1937508J136528R23072P86182R41111J276231J041732J276902J487289J233857
4318C2040412J095581Q90517J122360R51578O76124N00933L02001O7971K5967
4309C7673444K1583j69566k15923k88968k44227k72662l18571m22732l43813m51840
$$ plain form
4376 17383245 16783928 16504474 15995541 15400069 15106893 14802888 14624790 14529806 14324960 14012749
4366 14012749 13871789 13827365 13744866 13624950 13670401 13593202 13351811 13332510 13031775 12930844
4356 12930844 12848104 12911584 13042970 13180372 13401300 13557590 13587514 13658163 13935468 14009288
4346 14009288 14041099 14422361 14891160 14979597 15336226 15687772 15981063 16182694 16462196 17038197
4336 17038197 17307490 17747391 18071332 18708640 19354836 19967377 20660345 21332689 21937508
4327 21937508 23074036 23997108 24783290 25724401 27000632 28042364 29319266 30806555 32040412
4318 32040412 33135993 34026510 35148870 36100448 36776572 37277505 37579506 37647477 37673444
4309 37673444 37695027 37525461 37309538 37020570 36776343 36503681 36185110 35762378 35418565 34966725
4299C4966725m98003l59261l95784l40931k53826O1819O5469J34477J89012K81737
4289C3851434M65678M31465J23402J41166L1406J91238Q3840J99405k44065j32409
4279C5142560l11587k5548j68581r34121m89989n09244m90363m79916q24126n24056
4269C0385029m75583n90864k28021k89477l68583k80901k37917q8545m62856m00453
4259B6961829m47273k62854l91360p23255l86481n50673o75098n67040m19641
4250B2538154n23067m55954m73606m43628l93433j70839l38092l20694k53598
4241A9165243k87706j72159j03582r4255m5178J4748m7730J7214K95555N9399
4231A8801549L90762M37255O2784K38511M15365K51139L38181J76495l85L36379
$$ plain form
4299 34966725 34468722 34109461 33713677 33372746 33118920 33180739 33246208 33380685 33569697 33851434
4289 33851434 34317112 34748577 34871979 35013145 35044551 35235789 35319629 35519034 35274969 35142560
4279 35142560 34830973 34805425 34636844 33702723 33212734 32703490 32213127 31733211 30909085 30385029
4269 30385029 29909446 29318582 29090561 28801084 28432501 28151600 27913683 27825138 27362282 26961829
4259 26961829 26514556 26251702 25860342 25137087 24750606 24199933 23524835 22957795 22538154
4250 22538154 22015087 21559133 21085527 20641899 20248466 20077627 19739535 19418841 19165243
4241 19165243 18877537 18705378 18601796 18507541 18462363 18477111 18429381 18446595 18742150 18801549
4231 18801549 19192311 19629566 19692350 19930861 20346226 20597365 20935546 21112041 21111656 21448035
4221B1448035P7814r5649J36629l3353k47874L5354j15468m390J98865J183O517
4210B1407663J00719K44304J69958J51934L18067K85532K42630L70452o9082J26145
4200B3348322R2798P8342J75675r6984M4340m3828k9911q9472j88608J61554n4561
4189B3397667k88629O6477Q3766k72090k21315N0808m125l2405k17295j54895
4179B2407964o9561J47955o4701L3561J38531o2495j06907P5884J13815J20007
4169B2734053p09j48936N5840R254l806j1320j05007Q5221J08614L34517K5071
4158B3082792J16413K89046J66851L03388J95208M06038M47710K03914Q8832J57398
4148B5457590L95038J60043r238J11262K70700K10775M09443J78321q4242P4956
$$ plain form
4221 21448035 21525849 21430200 21566829 21533476 21285602 21320956 21205488 21201098 21399963 21401146 21407663
4210 21407663 21508382 21752686 21922644 22074578 22392645 22678177 22920807 23291259 23222177 23348322
4200 23348322 23441120 23519462 23695137 23598153 23642493 23598665 23568754 23479282 23290674 23452228 23397667
4189 23397667 23109038 23175515 23259281 22987191 22765876 22816684 22812559 22780154 22562859 22407964
4179 22407964 22338403 22486358 22421657 22455218 22593749 22531254 22424347 22500231 22614046 22734053
4169 22734053 22733344 22584408 22640248 22649502 22645696 22634376 22529369 22614590 22723204 23057721 23082792
4158 23082792 23199205 23488251 23655102 23958490 24153698 24559736 25007446 25211360 25300192 25457590
4148 25457590 25852628 26012671 26003433 26114695 26385395 26596170 27005613 27183934 27099692 27174648
4138B7174648L26988L06069J30544L71817L67625J70177J5789M5168P6747J05653
4128B9091225j33349j02066O1910m0347J44543R9917P5510L01821K02098L1458
4118B9732720Q5758K11373J14558J51856J90278L29720L40781J88152J78660M23700
4108C1947556L34982N50689P58739N44723N88726P41196O48670P95536J002530
4099C7913347Q43206Q31299J087965Q26279J151198J219819J244162Q95291R26219
4090D6938785R37660J042289Q68783R55209J284882J254735J608101J670308J609357
4081E8170109J694335J755521J677568J536668J386554J657503J767226K101324
4073G1746808K225802K668786L178137L570978M368532N097888O089920P232052
$$ plain form
4138 27174648 27501636 27807705 27938249 28310066 28677691 28847868 28863657 28908825 28985572 29091225
4128 29091225 28957876 28855810 28917720 28877373 29021916 29121833 29197343 29499164 29701262 29732720
4118 29732720 29818478 30029851 30144409 30296265 30486543 30816263 31157044 31345196 31523856 31947556
4108 31947556 32282538 32833227 33591966 34136689 34725415 35466611 36115281 36910817 37913347
4099 37913347 38756553 39587852 40675817 41502096 42653294 43873113 45117275 46012566 46938785
4090 46938785 47876445 48918734 49787517 50742726 52027608 53282343 54890444 56560752 58170109
4081 58170109 59864444 61619965 63297533 64834201 66220755 67878258 69645484 71746808
4073 71746808 73972610 76641396 79819533 83390511 87759043 92856931 98946851 106178903
4065A06178903Q189655Q964622R325702R721409R537358R390976R402653R490074
4057A80201352R146509P107328L548383o21539m324774p122922q119137p753531
4049A72061669n790282l240160n62857J420673J942160l50503m400430p091177
4041A53989093q572538q929309q210946o520352n011952l520470k292120j428702
4033A09502704o56787L88625J108252J695610K525969L168972L995187M639207
4025A26367739N977121P687911R323570J1213181J2333366J1929071P615675N27545
4017A92975179o542917j0635687j2638366j2270423j0360322q316548o207339
4010A26003577m645356l564338k344352j568380j114936p35146l60668o3757L99345
$$ plain form
4065 106178903 114368558 123333180 132658882 142380291 151917649 161308625 170711278 180201352
4057 180201352 189347861 196455189 200003572 199382033 195057259 187934337 179815200 172061669
4049 172061669 166271387 163031227 162468370 163889043 165831203 165480700 161080270 153989093
4041 153989093 145416555 136487246 128276300 121755948 116743996 113223526 110931406 109502704
4033 109502704 108845917 109234542 110342794 112038404 114564373 117733345 121728532 126367739
4025 126367739 132344860 140032771 149356341 160569522 172902888 184831959 192447634 192975179
4017 192975179 186432262 175796575 163158209 150887786 140527464 132210916 126003577
4010 126003577 121358221 117793883 115449531 113881151 112766215 112031069 111670401 111606644 112005989
4001A12005989O23623P22009Q16854Q98353J064807J212338J258016J303158J710378
3992A21615525K075537J975355K206213K750249K626232K510388K617258K787578
3984A41164335K622440K550133K600542K452673K363053K306911K191939K146529
3976A60398555J939624K270675K157248K637820K593097K836462L142966L386881
3968A81363328L680220L678876M108912L932918L996687M022838L799287L618209
3960B12201275L238017L415006L002910K979623K861491K604829K558530K103383
3952B34965064J784680J469801J013076R90242P11924M64162L70479M32230L38272
3943B42539930K03708M04069J29484j34183o61780j101465j631507k403245k826133
$$ plain form
4001 112005989 112629612 113351621 114168475 115066828 116131635 117343973 118601989 119905147 121615525
3992 121615525 123691062 125666417 127872630 130622879 133249111 135759499 138376757 141164335
3984 141164335 143786775 146336908 148937450 151390123 153753176 156060087 158252026 160398555
3976 160398555 162338179 164608854 166766102 169403922 171997019 174833481 177976447 181363328
3968 181363328 185043548 188722424 192831336 196764254 200760941 204783779 208583066 212201275
3960 212201275 215439292 218854298 221857208 224836831 227698322 230303151 232861681 234965064
3952 234965064 236749744 238219545 239232621 240222863 240934787 241398949 241769428 242201658 242539930
3943 242539930 242743638 243147707 243277191 243143008 242481228 241379763 239748256 237345011 234518878
3934B34518878l236093l541866l418929l314782l439979l045881k987620k836935
3926B08696793k707660k436916k365166k557829k237799k162412k134152j846415
3918A90248444j464029j156499q33700l19657j10707L47606O27488J037093J654302
3909A90030341J986649K808182L455698M031262L663955L994331L590692L089257
3901B16650367K232027J407264O42522o5919p8808p4952n22826j408N66524K25786
3891B20980577L05549J33355p9845l19217j156703j717410k259565k609304l121871
3882B10155566l020199k817183k611704j945222j403680p78380l25192L71355
3874A97625361Q87997J513024K135692K890697L295699L945918M500190N294514
$$ plain form
3934 234518878 231282785 227740919 224321990 221007208 217567229 214521348 211533728 208696793
3926 208696793 205989133 203552217 201187051 198629222 196391423 194229011 192094859 190248444
3918 190248444 188784415 187627916 186794216 186474559 186363852 186711458 187338946 188376039 190030341
3909 190030341 192016990 194825172 198280870 202312132 205976087 209970418 213561110 216650367
3901 216650367 218882394 220289658 220932180 220866261 220787453 220712501 220189675 220188267 220754791 220980577
3891 220980577 221286126 221419481 221339636 221020419 219863716 218146306 215886741 213277437 210155566
3882 210155566 207135367 204318184 201706480 199761258 198357578 197579198 197254006 197625361
3874 197625361 198513358 200026382 202162074 205052771 208348470 212294388 216794578 222089092
3866B22089092N636896N592887N426174N093447L935108K755885J722096N46331
3858B52797916k38713q68975j113748j456831j464930j074207q82959j323129
3850B44374424j227513j808019k740037l285265m424907m682547n177394n397550
3842B15631192n149527m424887l461876k516919j305869J86747J638016L113988
3834B03710865M552082O283971Q041474R870203J1768634J3235405J4498217J5054593
3826B87015444J4681985J3574084J1021377P455974M013473O87403k143200m018287
3818C32288253m677220m941104m836102l952120l551745l434653l488085m085233
3810B99321991n039816o749891q873897j1131210j3015324j4463434j4804143
$$ plain form
3866 222089092 227725988 233318875 238745049 243838496 247773604 250529489 252251585 252797916
3858 252797916 252559203 251690228 250576480 249119649 247654719 246580512 245697553 244374424
3850 244374424 243146911 241338892 238598855 235313590 230888683 226206136 221028742 215631192
3842 215631192 210481665 206056778 202594902 200077983 198772114 198958861 200596877 203710865
3834 203710865 208262947 214546918 222588392 232458595 244227229 257462634 271960851 287015444
3826 287015444 301697429 315271513 326292890 333748864 337762337 338449740 336306540 332288253
3818 332288253 327611033 322669929 317833827 313881707 310329962 306895309 303407224 299321991
3810 299321991 294282175 287532284 278658387 267527177 254511853 240048419 225244276
3803B25244276j5144968j4782810j3230401j2153329j1012261r475525q322781
3796A41122201p191364o039331n466204m755108m030202l385947k828329k577567
3788A04848149j972274k128231j781853j963612k350794k155755k176947k423114
3780H7895569k615829k579540k518386k476114k321273k327628k053586j959741
3772F9043472j768763j512342j651965j403061j243138r25211j003043p35438
3764E8800511p46748p57091k62919p0264j16036k78834k4482J95075J32860K9989
3754E6902061K5685M28811j9246l01546j02783r1366l16049o00487m06426o89646
3744E4829008j245913j359602j526971j673818j476857j289051j301738j067513
$$ plain form
3803 225244276 210099308 195316498 182086097 169932768 158920507 149444982 141122201
3796 141122201 133930837 127891506 122425302 117670194 113639992 110254045 107425716 104848149
3788 104848149 102875875 100747644 98965791 97002179 94651385 92495630 90318683 87895569
3780 87895569 85279740 82700200 80181814 77705700 75384427 73056799 71003213 69043472
3772 69043472 67274709 65762367 64110402 62707341 61464203 60538992 59535949 58800511
3764 58800511 58053763 57296672 57033753 56963489 56847453 56568619 56544137 56739212 56872072 56902061
3754 56902061 56927746 57356557 57337311 57035765 56932982 56841616 56525567 55925080 55518654 54829008
3744 54829008 53583095 52223493 50696522 49022704 47545847 46256796 44955058 43887545
3736D3887545r86374j141724o85191o63913m56050m67120j17332n2310j4733K20924
3726C9523722r8115L88498M85783J67920j02375J50942j39891l37784k30267j43352
3716C9665081q9500r1390q7319o4622l31958k24602n16898n68715o12385l76952
3706C6700740m00587m87275k39106k71113l32979m63924j48605o2471q3679K1616
3696C4232617J10788K50134K55140K16278L31911J05937l4136o0649N4727J5082
3686C5477829k05687N9347L09315N11337L49446J31614O44375N15611L67972L24199
3676C8485358K26278Q5697J28826q09P0216K14810K38918M53765M67235M76032
3666D0846326M40099M39089P70481O02413N83634O66258O75642R45985R36393
$$ plain form
3736 43887545 42901171 41759447 41074256 40410343 39954293 39487173 39369841 39317531 39302798 39523722
3726 39523722 39425607 39814105 40299888 40467808 40365433 40516375 40376484 40038700 39808433 39665081
3716 39665081 39575581 39484191 39396872 39332250 39000292 38775690 38258792 37690077 37077692 36700740
3706 36700740 36300153 35812878 35573772 35302659 34969680 34505756 34357151 34294680 34211001 34232617
3696 34232617 34343405 34593539 34848679 35064957 35396868 35502805 35468669 35408020 35462747 35477829
3686 35477829 35272142 35331489 35640804 36152141 36501587 36633201 37277576 37793187 38161159 38485358
3676 38485358 38711636 38797333 38926159 38925350 38995566 39210376 39449294 39903059 40370294 40846326
3666 40846326 41286425 41725514 42495995 43098408 43682042 44348300 45023942 45969927 46906320
3657D6906320J004473J068373J256744J129619J110270J476422J472475J433182
3649E6857878J413918J609254J615947J700739J496988J622598J975837J856495
3641G0149654J953046K027908K482444K740208K982284L328998L528916L946581
3633I3140039M029362M423079M567500N288537N721707O163523O667314O605827
3625A36606888O570979O658917O746464O563892O576503O670321P001668P172236
3617A90567868P414300P805744Q142169Q471163Q932875Q759808Q413904Q171504
3609B56679335P944619P636647P683892P865388Q347439Q750167Q919240R453738
3601C23280465R174991R195254R342123R096428R051588Q852976Q945256R192461
$$ plain form
3657 46906320 47910793 48979166 50235910 51365529 52475799 53952221 55424696 56857878
3649 56857878 58271796 59881050 61496997 63197736 64694724 66317322 68293159 70149654
3641 70149654 72102700 74130608 76613052 79353260 82335544 85664542 89193458 93140039
3633 93140039 97169401 101592480 106159980 111448517 117170224 123333747 130001061 136606888
3625 136606888 143177867 149836784 156583248 163147140 169723643 176393964 183395632 190567868
3617 190567868 197982168 205787912 213930081 222401244 231334119 240093927 248507831 256679335
3609 256679335 264623954 272260601 279944493 287809881 296157320 304907487 313826727 323280465
3601 323280465 332455456 341650710 350992833 360089261 369140849 377993825 386939081 396131542
3593C96131542Q791005P769293O718938N213632M288924K800487J833689J121126
3585D34668636K13535K13191q4966o05470j178319j656274k895104m830323o644959
3576D17199947q871412j1141475j2737600j3735336j4587561j4581574j4517676
3569C27027313j3856150j3335261j2992891j2340324j2005549j1662752j1755048
3562B39079338j2285212j2578462j3049246j3160827j2465839j1691050j0815343
3555A53033359r783525q932178p819802o959863o547834n720791n161615m635712
3547I7472039m240409m011108l638291l243459l143948l024547k375276k492018
3539G1302983k364359j868256k057474j785133k173675j828107j495861j319107
$$ plain form
3593 396131542 404922547 412691840 419410778 424624410 428913334 431713821 433547510 434668636
3585 434668636 434882171 435095362 435010396 434404926 433226607 431570333 428675229 423844906 417199947
3576 417199947 408328535 397187060 384449460 370714124 356126563 341544989 327027313
3569 327027313 313171163 299835902 286843011 274502687 262497138 250834386 239079338
3562 239079338 226794126 214215664 201166418 188005591 175539752 163848702 153033359
3555 153033359 143249834 134317656 126497854 119537991 112990157 107269366 102107751 97472039
3547 97472039 93231630 89220522 85582231 82338772 79194824 76170277 73795001 71302983
3539 71302983 68938624 67070368 65012894 63227761 61054086 59225979 57730118 56411011
3531E6411011j639450j390941j482998j320819r54450j205116j359220r81673
3523D6076344r68613j018178r56171j073202j082814q75746r95505p69003q39317
3514C7497795r30564p26601r25751r71419p51640p52599n78767o00032p17915
3505C0542507n67668q36764m90150p52743o10070o19938n63755n12502m73939
3496B5114978m89206m24575k46953l87220m77238m34499m68975l45550m63435
3487B1377327k65015m80974l86959l09576k53155n40329j76592j69046l49599
3478A8446082l63140l32699l11251l71793l37612j65796j16183l56690k60209
3469A5830709o9306k80050l28073j51619l91612j06176k91399k92302k33320j24024
$$ plain form
3531 56411011 54771561 53380620 51897622 50576803 49622353 48417237 47058017 46076344
3523 46076344 45107731 44089553 43133382 42060180 40977366 40101620 39106115 38337112 37497795
3514 37497795 36567231 35840630 34914879 33943460 33191820 32439221 31860454 31260422 30542507
3505 30542507 29974839 29138075 28647925 27895182 27285112 26665174 26101419 25588917 25114978
3496 25114978 24625772 24201197 23954244 23567024 23089786 22655287 22186312 21840762 21377327
3487 21377327 21112312 20631338 20244379 19934803 19681648 19141319 18964727 18795681 18446082
3478 18446082 18082942 17750243 17438992 17067199 16729587 16563791 16447608 16090918 15830709
3469 15830709 15761403 15481353 15153280 15001661 14610049 14503873 14212474 13920172 13686852 13562828
3459A3562828Q241k45543l04015k28370j88750q3285j52929k79680j83201j20592
3449A1784704k14351q9275j11096j79842j60842j32808l5950k89624k14161M1256
3439A0398011o9824k47207l70189p6872j58797m3117r169N3073n929j45804l82379
3428H941797r2913L4706P0864j00585k71326n7435k57936j03504K31593o5623
3418H329638r9933K69938r1250j46750K7286j5682l7613k95578k812j86451P06
3407G751499j20503k1997R4828j26628J04217j10978Q182j31017J9138p7246j79533
3396G209962N7771K1158j24565k23998n2048Q4583J01177N0908m8145j05198j42593
3385F829012j37739J7136o5022p0464M3754j21933J6055j01691J19449N1473l7469
$$ plain form
3459 13562828 13571069 13325526 13021511 12793141 12604391 12521106 12368177 12088497 11905296 11784704
3449 11784704 11570353 11481078 11369982 11190140 11029298 10896490 10860540 10570916 10356755 10398011
3439 10398011 10328187 10080980 9710791 9633919 9475122 9432005 9422836 9475909 9469980 9324176 8941797
3428 8941797 8848884 8883590 8954454 8853869 8582543 8525108 8267172 8163668 8395261 8329638
3418 8329638 8229705 8499643 8408393 8261643 8288929 8273247 8235634 7940056 7937244 7750793 7751499
3407 7751499 7630996 7608999 7703827 7577199 7681416 7570438 7578620 7447603 7466741 7389495 7209962
3396 7209962 7267733 7288891 7164326 6940328 6888280 6972863 7074040 7124948 7076803 6971605 6829012
3385 6829012 6691273 6708409 6643387 6572923 6616677 6494744 6510799 6409108 6528557 6580030 6542561
3374F542561j50558o5066M9450j23255L564M8402l3064m1651r7365k3925J56066
3363F265159k47242j42397K13618L7835j48133J0730Q2535J4929J3678L7203o711
3352F131204K6255K63600j95265r5337j2861Q8116K72251j11618k75080P882K31057
3341F330204J33459k13696Q0269J89101l4403m8967J18475J20368Q7744M0921
3331F803475J04295J65030N6606P580J06191K15233R2280J57287K23445Q5243
3321H016665J20100J81644l2459j29546R2949K95393J06595Q032K14160J69458
3311I042991P3410J82368J14463J47047Q8192K0920L42899K55696l3295P0150
3301A0304841N8029K31776J7450J84259M9588L50132J34894J44004J46725P8508
$$ plain form
3374 6542561 6392003 6326937 6376387 6253132 6256696 6305098 6272034 6230383 6133018 6109093 6265159
3363 6265159 6017917 5875520 6089138 6126973 5978840 5989570 6072105 6087034 6100712 6137915 6131204
3352 6131204 6157459 6421059 6225794 6130457 6117596 6205712 6477963 6366345 6091265 6099147 6330204
3341 6330204 6463663 6249967 6330236 6519337 6484934 6435967 6554442 6674810 6762554 6803475
3331 6803475 6907770 7072800 7129406 7136986 7243177 7458410 7550690 7707977 7931422 8016665
3321 8016665 8136765 8318409 8285950 8156404 8249353 8544746 8651341 8659373 8873533 9042991
3311 9042991 9116401 9298769 9413232 9560279 9648471 9669391 10012290 10267986 10234691 10304841
3301 10304841 10362870 10594646 10612096 10796355 10845943 11196075 11330969 11474973 11621698 11700206
3291A1700206J88749K01117n0241K30510L09224J28243L42742L59381j96364k5665
3281A3187902K91745J33445K76829P5385J8545L68003M28899J65538K63658L47682
3271A5557631M39389L72699K87112K54861L97363M20097M99735L37384N40377
3262A9106648O87149L30561M42397N58403O62574P51286P31232P77924R69341
3253B5017515J122030R15165J119887J418508J263313J547703K034632J964149
3245C6402902K202198K442290K920056L425058L500781L873418M160786L721024
3237F2648513L562603K895684K029661Q90769J59837j506886l000909m274815
3229F3404457m610785m963284m910317m431501l873552l312749l100251k646504
$$ plain form
3291 11700206 11888955 12090072 12039831 12270341 12579565 12707808 13050550 13409931 13213567 13187902
3281 13187902 13479647 13613092 13889921 13965306 13983851 14351854 14780753 14946291 15209949 15557631
3271 15557631 15997020 16369719 16656831 16911692 17309055 17729152 18228887 18566271 19106648
3262 19106648 19793797 20124358 20566755 21125158 21787732 22539018 23270250 24048174 25017515
3253 25017515 26139545 27054710 28174597 29593105 30856418 32404121 34438753 36402902
3245 36402902 38605100 41047390 43967446 47392504 50893285 54766703 58927489 62648513
3237 62648513 66211116 69106800 71136461 72027230 72187067 70680181 67679272 63404457
3229 63404457 58793672 53830388 48920071 44488570 40615018 37302269 34202018 31555514
3221C1555514k266473j818298j722239j188232q96607q56872p69825l22402j77914
3212B1536652k52282K97532N20613O69696J000415Q40467k61180j177922j704858
3203B1469133j864018j583469j593876j026043r42921p75451o84828m23161n03181
3194A2072185l66568k88734m69793l51682m01519k24386j11097l14024p7068j08442
3184I358872j36852J53523J46R4598K26724M14045L76062M61748N40631l1665
3174A1457832M8159m77416j014121o27546p08164o37474n22111n09310m69050
3165F540799k86884l69017k09887j35150l80408n5742j19962m5056k00394l2182
3155D706117k64373j71075j62704K41457K6376j44140k30207l9150k13041k26686
$$ plain form
3221 31555514 29289041 27470743 25748504 24560272 23663665 22806793 22036968 21714566 21536652
3212 21536652 21284370 21581902 22102515 22772211 23772626 24613093 24351913 23173991 21469133
3203 21469133 19605115 18021646 16427770 15401727 14458806 13683355 12998527 12575366 12072185
3194 12072185 11705617 11416883 10947090 10595408 10193889 9969503 9858406 9544382 9467314 9358872
3184 9358872 9222020 9375543 9375689 9470287 9697011 10111056 10487118 10948866 11489497 11457832
3174 11457832 11505991 11028575 10014454 9386908 8678744 8041270 7519159 7009849 6540799
3165 6540799 6253915 5884898 5675011 5539861 5159453 5103711 4983749 4938693 4738299 4706117
3155 4706117 4441744 4270669 4107965 4349422 4375798 4231658 4001451 3962301 3749260 3522574
3145C522574O3315R7320q5250l05658j56265J23481L6554j90811Q8334m6662M2950
3134C189882L2179n5352k35528q8783j06103O1721p7572J68665l9627o2370j14724
3123B672388j20716o796m9207J69402J2971k31425Q9288J901j11091o068J57048
3112B577695j53474k59334r5021P9497J48324r8453j07188N197K9265m4259l2796
3101B049453n7281j37822n0545K37863l5285j70153M1903M6304J1025j68383R304
3090A776383L7438j2294m1158O5506k4874j11374p7055k2128J0817J81277j8108
3079A764430n580j01860j38599k3681Q4790L0939j94330O1281J57292j18852n6994
3068A458836J44054m4833K0899K8435n9423J34207O973k86722O9136K29593l971
$$ plain form
3145 3522574 3585889 3683209 3597959 3292301 3136036 3259517 3296071 3105260 3193594 3146932 3189882
3134 3189882 3222061 3166709 2931181 2842398 2736295 2798016 2720444 2889109 2849482 2787112 2672388
3123 2672388 2551672 2544876 2495669 2665071 2678042 2446617 2535905 2537806 2426715 2420647 2577695
3112 2577695 2424221 2164887 2069866 2149363 2297687 2199234 2092046 2097243 2126508 2082249 2049453
3101 2049453 1992172 1854350 1803805 2041668 2006383 1836230 1878133 1924437 1935462 1767079 1776383
3090 1776383 1813821 1801527 1760369 1825875 1801001 1689627 1612572 1590444 1601261 1782538 1764430
3079 1764430 1758850 1656990 1518391 1494710 1579500 1610439 1416109 1477390 1634682 1515830 1458836
3068 1458836 1602890 1558057 1578956 1607391 1547968 1682175 1689148 1402426 1471562 1701155 1697184
3057A697184j66256R9368q5279j6804P9770n966L1289j70951L9754J13639r0559
3046A525189k52813k2890J23502m8160j10466R936k8763j33374J28950K0492R2355
3035A303958o7329L7140J8092l3515k08878j7386R5258R0149N3290n601j86924
3024A078254J29837j21793P2975J38522k68290J45276k083p584k61029J82984
3014A087069Q176j9712p0143l6666J77717r8820j5627j14444Q2732o7284K07920
3003A140918J58635j68037o8284q5292N6986Q5261J04859j14705J02124j79347
2993A033118n6725J69457L0692p0941q9332J43397J12949j40707k12717J27903
2983A047094J96571p1338m9024O4423j0439R1710J0541j06720j05435N5839N4782
$$ plain form
3057 1697184 1530928 1630296 1545017 1528213 1607983 1602017 1633306 1462355 1502109 1615748 1525189
3046 1525189 1272376 1249486 1372988 1324828 1214362 1224298 1195535 1062161 1191111 1211603 1303958
3035 1303958 1236629 1273769 1291861 1258346 1049468 1032082 1127340 1217489 1270779 1265178 1078254
3024 1078254 1208091 1086298 1159273 1297795 1029505 1174781 1172698 1165114 904085 1087069
3014 1087069 1095245 1075533 1005390 968724 1146441 1047621 1031994 917550 1000282 932998 1140918
3003 1140918 1299553 1131516 1063232 977940 1034926 1120187 1225046 1110341 1212465 1033118
2993 1033118 976393 1145850 1176542 1105601 1016269 1159666 1272615 1131908 919191 1047094
2983 1047094 1243665 1172327 1123303 1187726 1177287 1268997 1279538 1172818 1067383 1123222 1178004
2972A178004J15101k7431J4816m0367Q217j04459j3877J29979J27060l1938j84104
2961A171001M4716m599O9822P2369l5964l2198O8325J52532J18251r91K210j05485
2949A519989q1214j08678m5826J87285K18984P2498J07899J73522l6403k7961
2939A980095m3703L7754J45885R0742J13592N4242N6793R4647N6708J171K56530
2928B844456K00320j19571p955J71101L54663K34093j5530Q7596m3085j7392r6900
2917C591796P200J50499o901j3715l9423k04440L8845J924J07334J85409Q3750
2906C902278j07862J44284M1918N3268K98761K29371J15398J94684L70188K28261
2896E470549K76226J65194L18205J68618j24213l56731n07685k26141l75497m31757
$$ plain form
2972 1178004 1293105 1265674 1280490 1240123 1248340 1143881 1130004 1259983 1387043 1355105 1171001
2961 1171001 1215717 1211118 1280940 1353309 1317345 1285147 1353472 1506004 1624255 1623264 1625474 1519989
2949 1519989 1438775 1330097 1284271 1471556 1690540 1763038 1870937 2044459 2008056 1980095
2939 1980095 1936392 1974146 2120031 2210773 2324365 2378607 2435400 2530047 2586755 2587926 2844456
2928 2844456 3044776 2925205 2917250 3088351 3443014 3677107 3661577 3749173 3706088 3688696 3591796
2917 3591796 3598996 3749495 3742594 3728879 3689456 3485016 3523861 3525785 3633119 3818528 3902278
2906 3902278 3794416 3938700 3980618 4033886 4332647 4562018 4677416 4872100 5242288 5470549
2896 5470549 5746775 5911969 6230174 6398792 6274579 5917848 5410163 5184022 4808525 4376768
2886D376768l43201k77833j05889l74160j51279J34640K9343k6441k50671k5136
2876B986141Q6133k3339P3491q5564p0150M7974J26112K1202J56921K9668M3695
2865C392284m3095N9837j49243J2351j12825j09618q0855l60228k8779r9736k25387
2854B254706j02455r4512l78790j1030K61422K03255k61578j06461j49161l30633
2844A284763j55873q0141K26706K02167K8546l54580n7613j08595m6075J59699
2834A099004K7407Q6569k335K3317m1294k53413j03908q6284j29262K25000O6529
2823I11330j42387o0195m8388j03070r4388L1347J71451j7708O0264n3116O0397
2812G15537J0199r7083l0633j53238j17542O2833J84235J39824j1638k08460q0111
$$ plain form
2886 4376768 4033567 3755734 3649845 3275685 3124406 3259046 3288389 3261948 3011277 2986141
2876 2986141 3072274 3048935 3122426 3036862 2966712 3014686 3140798 3162000 3318921 3348589 3392284
2865 3392284 3349189 3409026 3259783 3272134 3159309 3049691 2968836 2608608 2579829 2480093 2254706
2854 2254706 2152251 2057739 1678949 1667919 1929341 2132596 1871018 1764557 1615396 1284763
2844 1284763 1128890 1048749 1275455 1477622 1506168 1151588 1093975 985380 939305 1099004
2834 1099004 1126411 1212980 1210645 1233962 1192668 939255 835347 749063 619801 844801 911330
2823 911330 768943 708748 660360 557290 462902 494249 665700 647992 708256 655140 715537
2812 715537 725736 628653 598020 444782 327240 390073 574308 714132 702494 494034 413923
2801D13923J47778q0325r2434J51263j50685J33658J76691m665j76033j61529
2791C57642J30485o3848o6050L91366n1288k44941R918J30488o9164j08241r302
2780D07065K078J21240j1855j07373j25753P6933J53247j20608J0649l7735J9656
2769C87544J59725Q352j8368k31129K21742J9470M5347j17431j76448J16590R9288
2758E14682K0764j46318k33810J23894O4233k9717J20550j98849L3602J19670
2748C88701o817o2312j16143J261P8748K7550l5117j99932Q9982J13114j39830
2737A39205o8244l957J59322j24765p2127R0614q6860K17090J09409j19120L0913
2726B71480p7344p0470L07650o2253j68626K1660J074m9734n3503O9590K4855
$$ plain form
2801 413923 561701 481376 388942 540205 389520 523178 699869 695204 519171 357642
2791 357642 488127 424279 358229 749595 698307 453366 463284 593772 524608 416367 407065
2780 407065 409143 530383 518528 411155 285402 362335 515582 394974 405623 367888 387544
2769 387544 547269 555621 537253 306124 527866 547336 592683 475252 298804 415394 514682
2758 514682 535446 389128 155318 279212 343445 313728 434278 235429 269031 388701
2748 388701 381884 319572 203429 204690 283438 310988 275871 75939 165921 279035 139205
2737 139205 70961 67004 226326 101561 29434 120048 33188 250278 359687 240567 271480
2726 271480 194136 123666 431316 369063 200437 222097 223171 173437 119934 189524 214379
2715B14379J07874J19864K6486k92399J09400M1520j06772K662J57578j10032
2705B70560j64364j2639L9009K43286j37473J70740k3313J5396M8629K3624o3408
2694D10047k15980q823k5497n094O1197K4449r8163J27980p1036j30398R7792
2683A66474O9358P4385L0574j31545k54472Q0796P7296o290L8805l3721o6485
2672D5175j9421j27111K02511m3450n9730P0046J02286m6127K234n2225M254R2847
2660A71289p133J13139n3667N7623o0978r6232j82158O3284q9943j5875N2449
2649d8202Q545Q6069L31026j41721p9966j42829j22228L0327k0308O5519J14076
2638H0308j7097k4920K068Q1885p0048k08818J74557J03963k5132j80274J06823
$$ plain form
2715 214379 322253 442117 468603 176204 285604 327124 220352 223014 380592 270560
2705 270560 106196 93557 132566 375852 238379 409119 385806 401202 449831 473455 410047
2694 410047 194067 185244 159747 154653 215850 240299 142136 270116 199080 68682 166474
2683 166474 235832 310217 340791 209246 -45226 35570 112866 106576 145381 111660 45175
2672 45175 25754 -101357 101154 57704 -2026 68020 170306 124179 126413 74188 78442 171289
2660 171289 164156 277295 223628 281251 220273 124041 -58117 5167 -84776 -100651 -48202
2649 -48202 -39657 46412 377438 235717 155751 12922 -109306 -78979 -99287 -33768 80308
2638 80308 63211 38291 40359 122244 52196 -156622 17935 121898 96766 -83508 23315
2627B3315J23801P7201j64045j2356Q0228j05818l2112k0905l665L1212k8609
2616c1753J52494L1725j4329R6467j60511j4084J03491R6763k17408j9352m3925
2605b0422j1344N7097m7903J27187N9675o6827J17993O8518q5724j67735N6443
2594H6958J6843p6987k18968K4532L42327L7104p9316j20579J14550P641k2001
2583A12104j7898n6496q9475j3718J4503J64060j40357r6378Q2755q5452N6544
2572f9808J63131j25633J39572K30185j74350K2780R5514j77813J23196J48492
2562C75266N0781j5290j61130j79503J1489J46483L9858k8484p2377n0229j49245
2551c2381J35541P496N5818M4088j24567p7102K4760k4080l08J02124j59588o0456
$$ plain form
2627 23315 147116 224317 60272 47916 128144 22326 -9786 -30691 -34356 -3144 -31753
2616 -31753 120741 152466 138137 234604 74093 60009 163500 260263 42855 23503 -20422
2605 -20422 -31766 25331 -22572 104615 164290 97463 215456 283974 198250 30515 86958
2594 86958 103801 26814 -192154 -167622 174705 211809 132493 11914 126464 134105 112104
2583 112104 94206 37710 -51765 -65483 -50980 113080 -27277 -123655 -40900 -126352 -69808
2572 -69808 93323 -32310 107262 337447 163097 185877 281391 103578 226774 375266
2562 375266 426047 410757 249627 70124 81613 228096 267954 239470 167093 116864 -32381
2551 -32381 103160 110656 166474 210562 85995 8893 33653 9573 9265 111389 -48199 -108655
2539a08655J60950k3730r2319J45654J58645r9392j22672J79715o0598o8107J34330
2528B03821K0950k27075K7892j41651q7137j61728J37195K23509P4520M132l6374
2517C8054j59864J8327q669j151N3016k3597q0089J00052J21015j31379l3234
2506a07519Q3851R2706L173r9791k8036m343l9443J80838o3352r6438n7191m3539
2494a79084j1103L8065j58792Q7667O5710K26246J24257j4310j07054p2630L8768
2483C7740j26134N993K55025J3614l4295j65208j92935P0749N778j5135J25767
2472a9041j7258j07159o4877J81674J51997k6562k16010j5367O5141j0923K19312
2461A40927r9323o6389J22126J6900j37858p3328J46184P766q5503j10071J81785
$$ plain form
2539 -108655 52295 28565 -63754 81900 240545 141153 18481 198196 137598 69491 203821
2528 203821 224771 -2304 25588 -116063 -203200 -364928 -227733 -4224 70296 74428 38054
2517 38054 -121810 -103483 -112152 -113303 -60287 -83884 -163973 -63921 57094 -74285 -107519
2506 -107519 -23668 69038 72211 -27580 -55616 -59959 -99402 81436 18084 -78354 -135545 -179084
2494 -179084 -190187 -152122 -310914 -223247 -157537 68709 192966 178656 71602 -1028 37740
2483 37740 -88394 -82401 172624 186238 151943 -13265 -206200 -135451 -129673 -144808 -19041
2472 -19041 -36299 -143458 -208335 -26661 125336 98774 -117236 -132603 -67462 -78385 140927
2461 140927 41604 -24785 97341 114241 -23617 -96945 49239 57005 -28498 -138569 43216
2450D3216j59869M5608k40954J25940J73067R3741J17501k09405j23885L0122
2440a04918K7150O1449l9047P2560m4050J16827J62641j79782j44833q719K9763
2429e0959R0083j32434j14009L07596J07756q9136r6020m3886O2432L5358Q481
2418H5262p1596j55882L3341K18367J40973M0274o7734r8110L3475o3646Q211
2407A02935j72757P3250k26761j3668p2727J3555K73907J22751j00556O0152k50418
2396a90337M4674J91335N7824k68184l2225J61438L6940j21315q4010L4431K33084
2385F3655j1889L0454n939l4687J85362J01497q6431q8267p0073K3655l0645m8896
2373B7796Q9422N2176l5125Q4846N1762l5813j37944J03499k8822J08173p7756
$$ plain form
2450 43216 -116653 -71045 -311999 -186059 -12992 80749 198250 -11155 -135040 -104918
2440 -104918 -77768 -16319 -55366 17194 -26856 89971 252612 72830 -72003 -80722 -50959
2429 -50959 39124 -93310 -207319 100277 208033 118897 22877 -21009 41423 76781 85262
2418 85262 13666 -142216 -108875 109492 250465 290739 223005 124895 158370 94724 102935
2407 102935 -69822 3428 -223333 -237001 -309728 -296173 -22266 100485 -71 60081 -190337
2396 -190337 -145663 45672 103496 -164688 -196913 -35475 1465 -119850 -203860 -169429 63655
2385 63655 51766 82220 76281 41594 226956 328453 242022 153755 83682 107337 76692 27796
2373 27796 117218 169394 134269 219115 270877 235064 97120 200619 171797 279970 202214
2362B02214J19081N0697k19533m1882j7009k2825L7959L1281m3388J46182j7192
2351B25585r2312j49986J37656N0417L04888k61293j8494j60104l0905J50131
2341A55583J42067l181q7766l5447m3582k07095J30056K65614k0123k27968q6617
2330a8459k4028j21345J39211J21809q6931m5074M5683N7741K2874m3234M9335
2319I7582m4823n8677j28703P2240m3183J6988L88127l273k67734k6967n9903
2308e8326m381J25552m382J56397j951p6185M2341j72006j84081n1352K57778
2297B9404J95884r9713k9567j5591k7583J30372m8795O117O1278k10591j11082
2286a19867j36699L8132J08084J28375J35669j45538r7502J82785j19059m698
$$ plain form
2362 202214 321295 371992 152459 110577 93568 70743 108702 139983 96595 242777 225585
2351 225585 133273 -16713 120943 171360 476248 214955 196461 36357 5452 155583
2341 155583 297650 294469 206703 171256 127674 -79421 50635 316249 296126 68158 -18459
2330 -18459 -42487 -163832 -24621 97188 10257 -34817 10866 68607 91481 48247 97582
2319 97582 52759 -5918 -134621 -62381 -105564 -88576 299551 296278 28544 1577 -58326
2308 -58326 -62707 62845 58463 214860 212909 136724 179065 7059 -177022 -228374 29404
2297 29404 225288 125575 96008 80417 52834 183206 134411 140528 201806 -8785 -119867
2286 -119867 -256566 -218434 -110350 18025 153694 8156 -89346 93439 -25620 -30318
2276c0318l5331j41762n5386K37440L9688o5791j8255K590L1819K77666o6945
2265A75415k56315K71503M932k86964j21079J9881J53254O4508K8481J19699J51243
2254C24558o92j24238K64237j61275j9055n2984K4827Q369J92920n3462j08911
2243B94294q7169o7498L3245J03572J2356j81534k3169P5J41324K8428j14983
2232A38941l4985P8489j81977J6208J61847M351m5425j15602J14266J68658j86673
2221A18098n8943j2072Q5693o9208P9585N9477P9032K02726R227j15522j07818
2210B70275J25295O2479p0910l32390Q582J36926M8294J32188J79002j57212j94074
2199B08455J1928j2017P7597J14759N709j35471J06687J69243k14219J58396r4020
$$ plain form
2276 -30318 -65649 -207411 -262797 -25357 14331 -51460 -69715 -67125 -35306 242360 175415
2265 175415 -80900 190603 195535 -91429 -212508 -192627 -39373 25135 53616 173315 324558
2254 324558 323866 199628 463865 302590 283535 230551 255378 263747 456667 403205 294294
2243 294294 207125 139627 172872 276444 288800 107266 84097 84172 225496 253924 138941
2232 138941 103956 182445 468 16676 178523 182874 137449 21847 136113 304771 118098
2221 118098 59155 47083 132776 63568 143153 202630 281662 484388 493615 378093 270275
2210 270275 395570 458049 387139 54749 63331 200257 248551 380739 559741 402529 208455
2199 208455 220383 208366 285963 400722 406431 270960 377647 546890 332671 491067 397047
2188C97047j49486L01876M205R112J39148l7769k31499J20257m496J33538J01566
2177G83499m9697n2081K2766j02652Q7331R9424O543J09575J62028n0702j01137
2166I14897K38283M335o4452q3482K10424J26440J58604O2223k33856N9101P9461
2155A471978j35445r6311R6876n1990J01727K34759M474J34452n8434J68663j28381
2144A742368J32430J58241O5629J45667q9883J30977J34889q308J7600P0900L96013
2133B896523q6784n8444M12995K21695J07500Q8660K58012L19427L41021P7470
2123D578075Q203K82527L31896J79084M38070N28351L69162L58714L59347O72453
2113H105882O44840N71297Q63636R16136O19199R43396J293889J390344J689294
$$ plain form
2188 397047 247561 549437 553642 562754 701902 664133 432634 552891 548395 681933 783499
2177 783499 733802 681721 704487 601835 689166 788590 795133 904708 1066736 1016034 914897
2166 914897 1153180 1157515 1093063 1009581 1220005 1346445 1505049 1567272 1333416 1392517 1471978
2155 1471978 1336533 1240222 1337098 1285108 1386835 1621594 1626068 1760520 1702086 1870749 1742368
2144 1742368 1874798 2033039 2098668 2244335 2154452 2285429 2420318 2412010 2429610 2500510 2896523
2133 2896523 2809739 2751295 3164290 3385985 3493485 3582145 3840157 4159584 4500605 4578075
2123 4578075 4586278 4868805 5200701 5379785 5817855 6346206 6715368 7074082 7433429 8105882
2113 8105882 8750722 9322019 10185655 11101791 11720990 12664386 13958275 15348619 17037913
2104A7037913K187005K837508L364761M173068N654620P146429R344254J1792828
2096F3538386Q096750k360918q431985j0277269j0572735q211589n893049l953533
2088B1934058l179264k265530j821296j295726q49603n67478p41473m65215q61029
2079I887444q03490o93278p48828n55094l32262n82044m07633k24246m15443q8028
2069E037098k25777l49314j78201j33131j03803j18718j01453k36135j17391q3275
2059C389900l74621j07071j90736n7148M7014o2557l76935j54504K1534j839O1515
2048B194552j53847k19945P1629R5973j25889Q1250j38381j29630k8873j00882
2038A545957l3124k17041M5568J90023j49201L1154K60j50569k21111P1057R3750
$$ plain form
2104 17037913 19224918 22062426 25427187 29600255 35254875 42401304 51745558 63538386
2096 63538386 71635136 69274218 60842233 50564964 39992229 31780640 25887591 21934058
2088 21934058 18754794 16489264 14667968 13372242 12522639 11955161 11213688 10748473 9887444
2079 9887444 9083954 8390676 7641848 7086754 6754492 6172448 5764815 5540569 5125126 5037098
2069 5037098 4811321 4462007 4283806 4150675 4046872 3928154 3826701 3590566 3473175 3389900
2059 3389900 3015279 2908208 2717472 2660324 2707338 2644781 2267846 2113342 2134876 2133037 2194552
2048 2194552 2040705 1820760 1892389 1988362 1862473 1943723 1805342 1675712 1646839 1545957
2038 1545957 1512833 1295792 1341360 1531383 1382182 1413336 1413596 1263027 1041916 1112973 1206723
2027A206723Q8488j25478p4241K3572M8049m193j77020j49964P4734J37316p724
2016A040262K28880k03003m84537l1032n6362J71565Q5434k17552J39423j64483
2006E08595O5512R3367k27656q0323J38232J66922L0225j16469N7822Q073p5655
1995E68645q4861J70989J20814l7873j83246K380M8912J34679m78k19764j07647
1984D12550j04718k2433l2568M2602J61263j6478q0044M6615J09606K1658k31210
1973C06843j27080R5310Q6480L6601j71374k7820J91486N1204j97392l5434J16271
1962C25095L8654j01217l0102K5535J11600j80885q4470L6562K8432N6611r47
1951B24868m5343J12390p0565r7100J0924l7831j03101l7515J51955j67856R1544
$$ plain form
2027 1206723 1295211 1169733 1095492 1119064 1167113 1162920 985900 835936 910670 1047986 1040262
2016 1040262 1269142 1066139 581602 550570 494208 665773 751207 533655 673078 508595
2006 508595 574107 667474 439818 359495 497727 664649 694874 578405 636227 644300 568645
1995 568645 483784 654773 775587 737714 554468 556848 605760 740439 739961 520197 412550
1984 412550 307832 285399 252831 295433 456696 440218 360174 406789 516395 538053 306843
1973 306843 179763 275073 361553 398154 226780 198960 390446 441650 244258 208824 325095
1962 325095 363749 262532 232430 257965 369565 188680 104210 140772 169204 225815 224868
1951 224868 179525 291915 221350 124250 135174 97343 -5758 -43273 108682 -59174 32370
1940C2370J32597q7283R5798J3064O0279j83747N3207J54274M9180j07397r0445
1929A21897j93342L9135K34153J02185J71039k62645j46375N132J88096k17220
1919D2055r696M8561K02591k6791r0992R03J68757k36767k0173J25146p3165L726
1907A34155r2605r1446J23649N9913K030r3546j27157Q0691N9491j3863k0333
1896B0979J25929j694j91491K5161q7966J7307K11540j33100J05729O3442q4609
1885G1227r2499p8598M1050L3827r9103M0115J42455Q2528j59842J03643M0765
1874A25568j79116N254J60175n4895o0398m0384J26180J4188j08502O8343R1514
1863A47927j2202k47093j02541J02894J05365r7498J04177M8005P262j9559J0268
$$ plain form
1940 32370 164967 77684 173482 186546 246825 63078 116285 270559 319739 212342 121897
1929 121897 -71445 -32310 201843 304028 475067 212422 66047 71179 259275 42055
1919 42055 32359 80920 283511 256720 165728 166631 335388 98621 78448 203594 130429 134155
1907 134155 41550 -49896 73753 133666 135696 42150 -85007 -4316 55175 41312 20979
1896 20979 146908 145214 -46277 -21116 -109082 -91775 119765 -13335 92394 155836 71227
1885 71227 -21272 -99870 -58820 -24993 -124096 -83981 58474 141002 -18840 84803 125568
1874 125568 -53548 -48294 111881 56986 -3412 -43796 82384 96572 -11930 56413 147927
1863 147927 135725 -111368 -213909 -111015 -5650 -103148 1029 49034 56296 36737 47005
1852D7005J26089k6854l8414j26065K22892J81307j66325k17432J44023R8302
1842B44528j19497j38347J07517J6405r6598R6754J05741J0437j05937j8557q4326
1831A8120q329J09776N5525n6270J65277R9365K6805K4710j2133p0149O2707j99677
1819B15727k75263K1405R9592J2173r0792q0667J01642J553Q8019j69821N162
1808g1270J16678J35408N6474j19879k3026l4294M5624j87153L3857L7011o5421
1797g5991P3108l6348L0408O3426j07449K7435K0950J18980j31981L8369K22574
1786B43481M4012k17664o1240L1980k06784N1671J74800M5548l0139k6667q403
1775D0595o0992j31151N8656N0452k7886M3M3394J02407J38375k80880k20337
$$ plain form
1852 47005 173094 146240 107826 -18239 204653 385960 219635 2203 146226 244528
1842 244528 125031 -13316 94201 110606 14008 110762 216503 226940 121003 102446 18120
1831 18120 9791 119567 175092 118822 284099 383464 410269 434979 422846 352697 415404 215727
1819 215727 -59536 -38131 61461 73634 -17158 -97825 3817 5370 93389 -76432 -71270
1808 -71270 45408 180816 237290 117411 94385 60091 105715 -81438 -47581 -10570 -75991
1797 -75991 -2883 -39231 -8823 54603 -52846 -25411 -4461 114519 -17462 20907 243481
1786 243481 287493 69829 8589 40569 -166215 -114544 60256 105804 75665 48998 40595
1775 40595 -20397 -151548 -92892 -42440 -70326 -70283 -26889 75518 213893 -66987 -287324
1764b87324J85716J15590k56795J08352J95897j87545J57959j9656J27753o4862
1754G5085k68672J19436P4414j94323J65455M7840p4454l7552O7366K0917j00460
1743a04948k6929J6797K6184r7652J70678M211M3021J8282n6580j00270o1148
1732a68354K6911J47303q1955k7467J54494j56299m2451K11068l0627P6844j2578
1721I6889J03171n8626j15514j48215J1819K0004j58834M3659J6488R4105m4621
1710a39675K34313J47241j11225n7877R0489l08579q2663N5075Q0974J1622q3396
1699a63701K6794J09334p8113J87089l8461q9488J262k154O7440M8522j73467
1688a04943j91587J15209J31204o9450K7188R6370l7716n5968j9190J67781P4191
$$ plain form
1764 -287324 -101608 13982 -242813 -134461 61436 -126109 31850 12194 139947 75085
1754 75085 -193587 -74151 263 -194060 -28605 19235 -55219 -92771 -25405 -4488 -104948
1743 -104948 -131877 -115080 -88896 -186548 -15870 -11659 31362 49644 -6936 -107206 -168354
1732 -168354 -141443 5860 -76095 -103562 50932 -105367 -147818 63250 32623 109467 96889
1721 96889 200060 141434 25920 -122295 -110476 -90472 -249306 -205647 -189159 -95054 -139675
1710 -139675 94638 241879 130654 72777 163266 -145313 -227976 -172901 -91927 -80305 -163701
1699 -163701 -136907 -27573 -105686 81403 42942 -46546 -45284 -47438 20002 68524 -104943
1688 -104943 -296530 -181321 -50117 -119567 -92379 3991 -33725 -89693 -108883 58898 133089
1677A33089r7835j27059m7279R7759M9284j34684L3087J18201j594q2230j81201
1666b40462q8913Q4678J55279o341j07643O9437O5948K4875o8462r4785P9959
1655a26430j29642O876J6447k5518P2483P8299J74952Q3166N3740l3018J11576
1644B82931k06909k42655K9833O535J47835N9582j87359K47412j42350l4388R9777
1633F0244J34689k64268j25945l8730n7883K65960M1609Q1229k2982k48054k04039
1622c78170K34203j653L6945j09282j0307J04898p6232J4273p1444J37662J4048
1611a05059Q7704K5031R6978L5056r3573j92146O5151n8497P6368o6767N6624
1600g3130J62020l5755R6343j2535k83483J75152k15304K8136K67844l5744n2880
$$ plain form
1677 133089 35254 -91805 -139084 -41325 7959 -126725 -93638 24563 22969 -59261 -240462
1666 -240462 -329375 -244697 -89418 -95759 -203402 -133965 -68017 -43142 -111604 -206389 -126430
1655 -126430 -256072 -249196 -232749 -258267 -185784 -107485 67467 150633 204373 171355 282931
1644 282931 76022 -166633 -136800 -130265 17570 77152 -110207 137205 -5145 -39533 60244
1633 60244 194933 -69335 -195280 -234010 -291893 -25933 15676 96905 73923 -174131 -378170
1622 -378170 -143967 -145620 -108675 -217957 -228264 -123366 -199598 -185325 -256769 -119107 -105059
1611 -105059 -17355 7676 104654 139710 46137 -146009 -80858 -139355 -62987 -129754 -73130
1600 -73130 88890 53135 149478 136943 -146540 28612 -186692 -158556 109288 73544 20664
1589B0664k08021J74372l8702K8491n8665Q6170n2557j65573P0397J64795k57525
1578b36154O9951O2353j53351K01072O0610N7723Q5983r371k63863n7747J68883
1567a3911Q2315p8254j02574J32008j04362R631Q7228M3378j19117l949n2110
1556a19717p6837K1528N5539J7416r421J12642m6193n6915K00835j24102l19946
1545c45171M6715J63621J64678r5137j8345J60033k7067l1362j9873J09089o5719
1534D1462Q0368j11387q0855k12586k3544J02327J47068j46005J61635J76364
1524A34847k19013L9161R146j32465J7237J53212p4653J37346K0938L1547n5782
1513F1521r566J23145p1955n4177K6620K5685k02444p9757l8317r680K20247k049
$$ plain form
1589 20664 -187357 -12985 -51687 -23196 -81861 4309 -48248 -213821 -143424 21371 -236154
1578 -236154 -166203 -103850 -257201 -56129 4481 62204 148187 138816 -125047 -182794 -13911
1567 -13911 68404 -9850 -112424 19584 -84778 -75147 12081 55459 -63658 -67607 -119717
1556 -119717 -196554 -175026 -119487 -102071 -111492 1150 -45043 -101958 98877 -25225 -345171
1545 -345171 -298456 -134835 29843 -65294 -83639 76394 49327 17965 -1908 107181 41462
1534 41462 121830 10443 -70412 -282998 -306542 -204215 -57147 -203152 -41517 134847
1524 134847 -84166 -45005 -35859 -168324 -151087 2125 -72528 64818 85756 117303 61521
1513 61521 51955 175100 103145 48968 75588 101273 -101171 -180928 -219245 -228925 -8678 -10727
1501a0727j08164k51597j2075O8060O208Q0648N9413K10768o8719o6002J58044
1490F5857j6885K2081J0715q1585n6981j00368j01680L8233J96784J03305P1908
1479A51384k26187k8345M7918o455l1197l2180L3239O2640N5758N6371l2882k23707
1467a73643J02371q9142l6149R105K8666j16273n4052J10937O4448k55758L14590
1456i4900K75317j71171j47162p5583P6826J56138L4093r7998J36163j62033J05933
1445C5623q1369l52591J86296J93807j42931k14784K7530M5634J38311J16023
1435d8451n6904j62304O1497K74520j27059m3298N1501Q2378j63944k19558J11859
1424b39763K3932J27796O8931r6086J36178J23383m1995j51087q2575j1085l08186
$$ plain form
1501 -10727 -118891 -370488 -382563 -314503 -308295 -227647 -168234 42534 -26185 -92187 65857
1490 65857 48972 71053 81768 183 -56798 -157166 -258846 -220613 -23829 79476 151384
1479 151384 -74803 -103148 -55230 -61685 -92882 -125062 -91823 -29183 26575 82946 50064 -173643
1467 -173643 -71272 -160414 -196563 -187458 -158792 -275065 -329117 -218180 -153732 -409490 -94900
1456 -94900 180417 9246 -137916 -213499 -136673 19465 53558 -44440 91723 -70310 35623
1445 35623 -45746 -398337 -212041 -18234 -161165 -375949 -348419 -302785 -164474 -48451
1435 -48451 -105355 -267659 -206162 68358 -58701 -101999 -50498 31880 -132064 -351622 -239763
1424 -239763 -215831 -88035 -19104 -115190 20988 144371 102376 -48711 -131286 -142371 -450557
1413d50557R6067J24718K23536J987J12169j03500q4506J60164n9212k03601l1789
1402b14524K27615m7229j02017L38072j28305k62346k626P797o0470l09K21059
1391b3283J03456O9384m7697k22557R3014M4701k44174j2835J3332L11642Q080
1380I3063j34645p2197j63206o8208J31057J25762p75N0798J10608m3291p3949
1369d4983j10703j57453K73341J97651K6397l8208K4227j01931j00755N8762o5390
1358c9045J28939L8984P338o6208m3100n8507J02129j17454j0154Q0286Q2172
1347A05380j25712K1713k0525l038n9578r1059q739k8790J11877J44959j7492
1336B8996K0319M4234j43221J3147M0702J22193K3682P8042L4044k54821p1706
$$ plain form
1413 -450557 -354490 -229772 -6236 -4249 107920 4420 -80086 80078 20866 -182735 -214524
1402 -214524 13091 -34138 -136155 201917 73612 -188734 -191360 -183563 -244033 -244342 -23283
1391 -23283 80173 149557 101860 -120697 -27683 17018 -227156 -239991 -226659 84983 93063
1380 93063 -41582 -113779 -276985 -345193 -214136 -88374 -89149 -38351 72257 28966 -44983
1369 -44983 -155686 -313139 -39798 157853 184250 146042 170269 68338 -32417 26345 -39045
1358 -39045 89894 128878 136216 70008 26908 -31599 70530 -46924 -57078 23208 105380
1347 105380 -20332 1381 -19144 -22182 -81760 -172819 -181558 -210348 -98471 46488 28996
1336 28996 49315 93549 -49672 -36525 4177 126370 150052 228094 262138 7317 -64389
1325f4389o1608o9431J42001l7182r6100K85203j20190k233O150J23529j06491
1314g41r5549J06596O5670q3087k74726J23515q0521J61321J65246K768O3416
1303A53908k01395P6588j00582q247J39552n747j3955j57959l643P5944J22054
1292G6518K0088m2428j88576K3096j17635J516Q6535q5862K9322M7040Q7397K58423
1280A95434o4812J0023j16193J772l9932k0055q4360N044N0032P0228O4580O9870
1268A41631p2965j56767j1928p2194J01989J6581p7384J10609J50992K4145L3394
1257A88103K5436j70824j03161K8139K8794K02988j43638l15384J38827J70786
1247E0066j73294J10399Q4603j01982m1012K35897o71j09183j81941j04559J91619
$$ plain form
1325 -64389 -125997 -195428 -53427 -90609 -186709 98494 -21696 -23929 -17779 105750 -741
1314 -741 -96290 10306 75976 -7111 -281837 -158322 -238843 -77522 87724 90492 153908
1303 153908 -47487 29101 -71481 -79728 59824 54077 40122 -117837 -121480 -45536 76518
1292 76518 96606 54178 -134398 -111302 -228937 -227421 -140886 -226748 -197426 -150386 -62989 195434
1280 195434 130622 140645 24452 26224 -13708 -33763 -118123 -113079 -63047 7181 71761 141631
1268 141631 68666 -88101 -100029 -172223 -70234 -53653 -131037 -20428 130564 154709 188103
1257 188103 213539 42715 -60446 -32307 -3513 199475 55837 -259547 -120720 50066
1247 50066 -123228 -12829 71774 -30208 -71220 164677 164006 54823 -127118 -231677 -40058
1236d0058l2001j04710J16172j6309p6100R9091j09781o0876R6758P8682p1405
1225a20537r6585K3021J68308j2428j13480l5686N9955O3967j49094k5460M3187
1214a94832J776m4009R23L5988j4147J58264P4058J71035j49353L6276M9986k04808
1202g8843o5730N952K7676l3857j78643L31050J11160k74261J0032J46122P7880
1191G8538J10596L8761n3428M6810m6760l27644p3620J39322j81175l2385L5130
1180b65855R2801O3305k1925L3945P2776P3807p3379o5244J97350j4300n1990
1169D1291k07832k7774J15392K53642n1949r1206P922j98794O4040L3779P1318
1158I829P7123j06858J10742l1068J72107M5208j6455k11007k6883K49539j63072
$$ plain form
1236 -40058 -72059 -176769 -60597 -76906 -153006 -53915 -163696 -224572 -127814 -49132 -120537
1225 -120537 -217122 -194101 -25793 -38221 -151701 -187387 -127432 -63465 -212559 -238019 -194832
1214 -194832 -193056 -237065 -236142 -200154 -214301 -56037 18021 189056 39703 75979 125965 -78843
1202 -78843 -144573 -138621 -110945 -144802 -323445 7605 118765 -155496 -145464 658 78538
1191 78538 189134 227895 174467 221277 174517 -153127 -226747 -87425 -268600 -300985 -265855
1180 -265855 -173054 -109749 -131674 -97729 -24953 48854 -24525 -89769 107581 93281 41291
1169 41291 -166541 -194315 -78923 174719 122770 31564 39486 -159308 -95268 -61489 9829
1158 9829 86952 -19906 90836 59768 231875 277083 260628 49621 22738 272277 109205
1147A09205j50732L4160o5904k6806k5395J44350P2433j51070j16862l3755J9450
1136a90926J76808m1840k3114R069O1310j56979O274Q7064l0723j49700R3930
1125a58827J37384P8047k599j33895N1204q8360J92835k0483J27632k68261J5916
1114f9407J07737j61551m3774M7613l3620K3783L8591j99145J74331J42142j30823
1103a04123P3721P5565J52038J14149q0497p6924j5964M6954L4158q4793M590
1092A38874M0790j69192L6474j09649q4090J84151k1701l3742L0782j89144k8234
1081b04681K47632N9208Q087j87576O744p9493o7403Q3642M2141J6459O2174j33911
1069a46977J49829J05741l5538K9294N2655r491j7998j11450J83121j39849n5155
$$ plain form
1147 109205 -41527 -7367 -73271 -100077 -125472 18878 91311 -59759 -176621 -210376 -190926
1136 -190926 -14118 -55958 -79072 -70003 -8693 -165672 -159398 -72334 -103057 -252757 -158827
1125 -158827 -21443 56604 54005 -79890 -28686 -117046 75789 55306 182938 -85323 -69407
1114 -69407 38330 -123221 -166995 -119382 -153002 -129219 -90628 -289773 -115442 26700 -104123
1103 -104123 -30402 45163 197201 311350 230853 153929 137965 184919 219077 134284 138874
1092 138874 179664 10472 46946 -62703 -146793 37358 15657 -18085 12697 -176447 -204681
1081 -204681 42951 102159 110246 -77330 -70586 -150079 -217482 -133840 -91699 -75240 -13066 -146977
1069 -146977 2852 108593 73055 102349 155004 145513 127515 16065 199186 59337 4182
1058D182k16924m6556K57843O1457k28416P3918J64161j42464j58974K01321J53430
1047A22978j27657R5484J2503l9435L8745j54518o2539J85363M9220j28344p4600
1036h2800Q1604o6177J19123M2656p4384k07886k7416J03406M3361P9978J21859
1025A33324M1338q8985j79549M5060j5275q5652k15518L28421o1210O6661k70157
1014c01542P9374J17417J58409K652p6083Q2646R6120N456j04210m3844n6941
1003d0546j06082J87460J20860j58794Q4832Q9987l9418n6684J6986p7789N4785
992G5597K49086q6284p1675j53299K4172M4395m1384J66887q7276l08087r6031
981b83899J66576r62K6234J2026J87943J09888j39342r4153q787J81977k02396
$$ plain form
1058 4182 -212742 -259298 -1455 60002 -168414 -94496 69665 -72799 -231773 -30452 122978
1047 122978 -4679 90805 103308 63873 102618 -51900 -114439 70924 120144 -8200 -82800
1036 -82800 -1196 -67373 51750 94406 20022 -187864 -215280 -111874 -68513 11465 133324
1025 133324 174662 85677 -93872 -48812 -64087 -149739 -365257 -36836 -98046 -31385 -301542
1014 -301542 -222168 -104751 53658 56310 -19773 62873 158993 164449 60239 16395 -40546
1003 -40546 -146628 40832 161692 2898 87730 177717 138299 81615 98601 20812 75597
992 75597 324683 238399 166724 13425 37597 81992 40608 207495 120219 -187868 -283899
981 -283899 -117323 -118285 -92051 -80025 107918 217806 78464 -15689 -24476 157501 -44895
970d4895r3199J53601J5055j10300q4838Q7797j89264J52547P7907J06868l62102
959b90823J4721J32490K38869Q86j65548K0124J70992o7425k44277J67488J2392
948a0111k21618r9354K694Q5391J77499l3126k281J0660k28853J97629J75274
937E3804r1248p8388J24789M1820o7710j98801J74957Q9848l2675j05255P2448
926a6411O1487J38792N7856j84705n2406p0781O2325J26495j48096J52709o5261
915F2004Q0290J30575j64209j2357q8537J63111j35590p1027j18078J72151M5630
904F3963q7644k19326J9820q0357K4034N8977j2098k8864J78605l1699q5997K12644
892A2058j05522j74673K55023J34568o6649O6804j0525j58513m7244j9148O5554
$$ plain form
970 -44895 -138094 15507 30562 -79738 -164576 -76779 -266043 -113496 -35589 71279 -290823
959 -290823 -276102 -143612 95257 96143 -69405 -49281 121711 54286 -189991 -22503 -10111
948 -10111 -231729 -331083 -328389 -242998 -65499 -98625 -100906 -90246 -319099 -121470 53804
937 53804 -37444 -115832 8957 50777 -16933 -215734 -40777 49071 16396 -88859 -16411
926 -16411 45076 183868 241724 57019 4613 -66168 -3843 122652 -25444 127265 62004
915 62004 142294 272869 108660 96303 7766 170877 35287 -35740 -153818 18333 63963
904 63963 -23681 -243007 -223187 -303544 -279510 -220533 -232631 -261495 -82890 -114589 -200586 12058
892 12058 -93464 -268137 -13114 121454 54805 121609 111084 -47429 -94673 -113821 -48267
881d8267L00739k09046l6005M8186j21897J51526J21613k7549n0018j89353O4741
870D670K0752k56197K22264Q4950l9627j1758O842L8618r868j03894j78021j2307
858b33576K82872j89036j25296q8036n0749K15394Q9903k7559j68618m6605m2139
847c83445J17901N8840J02705p4558J20159N0432k8639J96412j15361j53628j84446
836b93628J89823O5844m3015N1264P660Q3487m2397K20688j43631J17557j49495
825F4157k29432k3877K38976K5961m4362K6702o2772N5524J7481K29715M6150
814C44223j35578k02267K9160L0688J61741n5316k65358j15361N5186l2144K07197
803B2171o2502n420J47511j5267o11l237l6066J88674j1838j69902k52712M2147
$$ plain form
881 -48267 252472 43426 7421 55607 -66290 85236 206849 179300 129282 -60071 4670
870 4670 25422 -230775 -8511 76439 36812 25054 31896 70514 60646 -43248 -221269 -233576
858 -233576 49296 -139740 -265036 -353072 -403821 -188427 -98524 -126083 -294701 -341306 -383445
847 -383445 -265544 -206704 -103999 -178557 -58398 -7966 -36605 159807 44446 -109182 -293628
836 -293628 -103805 -37961 -80976 -29712 -22052 61435 19038 239726 96095 213652 64157
825 64157 -165275 -189152 49824 75785 31423 58125 -4647 50877 68358 298073 344223
814 344223 208645 6378 35538 66226 227967 172651 -92707 -208068 -152882 -185026 22171
803 22171 -40331 -45751 101760 86493 85882 82645 46579 235253 223415 53513 -199199 -157052
791a57052L43657k06240l2235J35370O9905j09796L1998n2365l6932q3366Q3528
780a3528L3611N7087j01059o7025O6657L4403j51872j366O1077K43318N5735m8772
768A68266K25757k53758J12691j05473m5230j41241Q1018K75367j18474k15406
758a6483N5966k4402k5934m7573j06345r8879J43054J25293L5196N811j5456j72950
746a42702p0875R781J00752O8487n8731o6196J97983q819j08951Q4584p302m5431
734d7420j4415j35038Q1761J10928N0911J63355k59669P1746k1004m3315P9546
723C7386p8787j1874J39310j98352J69576K2140j04497R3037J88553j18326q9223
712D8943Q1766J32286j91211j47641K763R8492N4038P02n7758J49052q2190q6110
$$ plain form
791 -157052 186605 -19635 -51870 83500 153405 43609 75607 23242 -13690 -97056 -13528
780 -13528 20083 77170 -23889 -90914 -24257 10146 -141726 -143092 -82015 161303 217038 168266
768 168266 394023 140265 252956 147483 102253 -38988 42030 317397 198923 -16483
758 -16483 39483 15081 -10853 -58426 -164771 -263650 -120596 4697 39893 45704 30248 -142702
746 -142702 -213577 -203796 -103044 -34557 -93288 -159484 38499 29680 -79271 5313 -1989 -47420
734 -47420 -61835 -196873 -115112 -4184 46727 210082 -49587 22159 1155 -42160 37386
723 37386 -41401 -53275 86035 -112317 57259 79399 -25098 67939 256492 138166 48943
712 48943 130709 262995 71784 -75857 -73094 25398 79436 80138 22380 171432 89242 3132
700C132N0910J9977K7222P8998j84496j77401K09560N0529l1367j38002J46339
689E5401o7951r4310p5905K24918K84262k43698r642O1385k02425N4990J80760
678A67785o888n9157j8406o2663Q0688L6349J39004r9094j05780k0216K4534q2324
666f168j14116r5560p5321Q6081J05314K36630r090n9639M1682K9832J5359j53818
654A186R2022j1782N949P3741o4925J48529L6982j31518m4527k1658o7679k08423
642a92103l8094J2962M4534J52605Q6127M3766K6080K920P1201m693k05135M9699
630D9869j58528M9891J2153q1600J63997j74614J08862P6611j73419L5838M3252
619d7688j14531J7312J04147q4848L4162J84319J1728R1835j95222j01653Q6623
$$ plain form
700 3132 54042 74019 101241 180239 -4257 -181658 27902 78431 47064 -90938 55401
689 55401 -12550 -106860 -182765 42153 326415 82717 73075 134460 -67965 -12975 167785
678 167785 160897 101740 83334 20671 101359 137708 276712 177618 71838 51622 76156 -6168
666 -6168 -120284 -215844 -291165 -205084 -99770 136860 127770 68131 109813 139645 155004 1186
654 1186 93208 81426 87375 161116 96191 244720 281702 150184 105657 83999 16320 -192103
642 -192103 -230197 -217235 -172701 -20096 66031 109797 135877 138797 209998 205305 170 49869
630 49869 -108659 -58768 -46615 -128215 35782 -138832 -29970 46641 -126778 -90940 -47688
619 -47688 -162219 -144907 -40760 -125608 -91446 92873 104601 196436 1214 -100439 -13816
608a3816j6978Q3021m4186N1307M7504P9430l37829M9309K03446l9464p0701P1649
596F2692M0737m5244j03131k877J26801L3903n2555L8873O5818k05512J46288
585A05793q9656q9312J36492l0504J71502L7459j93218r8703p3110K6641m8323
574a44939K81470L2019J37418N8050j19085k03071k72711n4K24927O9331j22783
563e9428J48799M919k9081K5926p7105j7530K1585j01985M4944l4592J08219K1860
551E6531o3659J68757j48016k7849J07671l4428j34660P4852m288K35831k40120
540i378k20208L9072L6944J61035N2992j7562Q1328o7448j91390J62273j16274
529h8616o5205K6942J30158j93628J51822J17393j5409j10506J02015J65247j06783
$$ plain form
608 -13816 -30794 52227 8041 59348 106852 186282 -151547 -102238 101208 61744 -8957 62692
596 62692 103429 58185 -44946 -47823 78978 112881 60326 99199 165017 -40495 105793
585 105793 16137 -73175 63317 32813 204315 241774 48556 -50147 -123257 -96616 -144939
574 -144939 136531 168550 305968 364018 244933 41862 -230849 -230903 -5976 63355 -59428
563 -59428 89371 94290 65209 91135 14030 -3500 18085 -83900 -38956 -73548 34671 56531
551 56531 -7128 161629 13613 -14236 93435 59007 -75653 -801 -5089 230742 -9378
540 -9378 -229586 -190514 -153570 7465 60457 42895 124223 56775 -134615 27658 -88616
529 -88616 -153821 -126879 3279 -190349 -38527 78866 63457 -47049 54966 220213 113430
518A13430N1334l21070J79351J14624k3458P9958j88415m2070K4930J227O7218
507E7059j48857Q030K09550j12875Q4121K9015M1287O6766j05300J6848j63281
496a7637n0498K44682m8137m4117o7989Q8675R9290j30962M5460k6955k8671J00234
$$ plain form
518 113430 164764 -156306 23045 137669 114211 194169 5754 -36316 -11386 -10159 57059
507 57059 -91798 -83768 125782 12907 97028 126043 167330 234096 128796 145644 -17637
496 -17637 -68135 176547 128410 84293 16304 104979 204269 73307 118767 91812 63141 163375
$$ [...]
##END NTUPLES=NMR SPECTRUM
##END=
