##TITLE=1H_EC-3293(III-3)
 CDCl3
 8 sc, 
 13.4.2023
##JCAMPDX= 6.0         $$ Bruker NMR JCAMP-DX V2.0
##DATA TYPE= NMR SPECTRUM
##DATA CLASS= NTUPLES
##ORIGIN= UXNMR, Bruker Analytische Messtechnik GmbH
##OWNER= root
$$ XWIN-NMR		Version 3.5
$$ Thu Apr 13 14:34:53 2023 Russian Standard Time (UT+4h)  she@DPX200
##.OBSERVE FREQUENCY= 200.13135
##.OBSERVE NUCLEUS= ^1H
##.ACQUISITION MODE= SIMULTANEOUS
##.ACQUISITION SCHEME= undefined
##.AVERAGES= 8
##.DIGITISER RES= 18
##SPECTROMETER/DATA SYSTEM= spect
##.PULSE SEQUENCE= zg30
##.SOLVENT NAME= DMSO
##.SHIFT REFERENCE= (INTERNAL, DMSO, 0, 15.737)
##AUDIT TRAIL= $$ (NUMBER, WHEN, WHO, WHERE, WHAT)
$$ ##TITLE= Audit trail, XWIN-NMR		Version 3.5
$$ ##JCAMPDX= 5.01
$$ ##ORIGIN= Bruker BioSpin GmbH
$$ ##OWNER= she
$$ F:/spectra/data/she/nmr/H-F/1/pdata/1/auditp.txt
$$ ##AUDIT TRAIL=  $$ (NUMBER, WHEN, WHO, WHERE, WHAT)
(   1,<2023-04-13 14:33:32.37 +0400>,<she>,<DPX200>,
      <created by zg, POWCHK disabled, PULCHK disabled
       configuration hash MD5:
       00 E9 B6 7A A2 85 ED C7 34 08 36 98 17 FE 4E 26
       data hash MD5: 16K
       C3 20 05 27 60 D2 D4 21 71 8F 60 AF 6E B1 F3 89>)
(   2,<2023-04-13 14:33:34.85 +0400>,<she>,<DPX200>,
      <Start of raw data processing
       efp BC_mod = 2 LB = 0.24 FT_mod = 6 PKNL = 1 PHC0 = -19630.52 PHC1 = 12.20081 SI = 16K 
       data hash MD5: 16K
       B4 DD EB D1 71 46 74 FA C4 CD C9 C3 BA 79 DF 07>)
(   3,<2023-04-13 14:33:57.68 +0400>,<she>,<DPX200>,
      <pk PHC0 = -210.2001 PHC1 = 9 
       data hash MD5: 16K
       16 DD 9B AA 9A 5E 64 ED 44 8B 4D 6A 09 F4 43 4B>)
(   4,<2023-04-13 14:34:02.21 +0400>,<she>,<DPX200>,
      <abs ABSG = 5 
       data hash MD5: 16K
       68 16 16 04 21 D5 2D 4D A9 9F 53 6F 36 57 F8 0F>)
$$ ##END=
$$ 
$$ hash MD5
$$ FE 7E A7 0D 97 09 DD CE C6 F1 E1 94 DD 01 2C 05
##$RELAX= 
##$RELAX= 
##$RELAX= 
##$RELAX= 
##$RELAX= 
##$RELAX= 
$$ Bruker specific parameters
$$ --------------------------
##$DU= <F:/spectra>
##$EXPNO= 1
##$NAME= <H-F>
##$PROCNO= 1
##$TYPE= <nmr>
##$USER= <she>
##$AMP= (0..31)
100 100 100 100 100 100 100 100 100 100 100 100 100 100 100 100 100 100 
100 100 100 100 100 100 100 100 100 100 100 100 100 100 
##$AQSEQ= 0
##$AQ_mod= 1
##$AUNM= <au_zg>
##$AUTOPOS= <>
##$BF1= 200.13
##$BF2= 200.13
##$BF3= 200.13
##$BF4= 200.13
##$BF5= 200.13
##$BF6= 200.13
##$BF7= 200.13
##$BF8= 200.13
##$BYTORDA= 1
##$CFDGTYP= 0
##$CFRGTYP= 5
##$CHEMSTR= <none>
##$CNST= (0..31)
1 1 145 1 1 1 1 1 1 1 1 1 1 1 1 1 1 1 1 1 1 1 1 1 1 1 1 1 1 1 1 1 
##$CPDPRG= <>
##$CPDPRG1= <>
##$CPDPRG2= <>
##$CPDPRG3= <>
##$CPDPRG4= <mlev>
##$CPDPRG5= <mlev>
##$CPDPRG6= <mlev>
##$CPDPRG7= <mlev>
##$CPDPRG8= <mlev>
##$CPDPRGB= <>
##$CPDPRGT= <>
##$D= (0..31)
0 1.2 0 0 0 0 0 0 0 0.06 0 0.03 0 0 0 0 0.0002 0 0 0 0 0 0 0 0 0 0 0 0 
0 0 0 
##$DATE= 1681382011
##$DBL= (0..7)
120 120 120 120 120 120 120 120 
##$DBP= (0..7)
150 150 150 150 150 150 150 150 
##$DBP07= 0
##$DBPNAM0= <>
##$DBPNAM1= <>
##$DBPNAM2= <>
##$DBPNAM3= <>
##$DBPNAM4= <>
$$ [...]
##$SUBNAM3= <"">
##$SUBNAM4= <"">
##$SUBNAM5= <"">
##$SUBNAM6= <"">
##$SUBNAM7= <"">
##$SUBNAM8= <"">
##$SUBNAM9= <"">
##$SW= 18.05172834244
##$SWIBOX= (0..15)
0 0 2 0 0 0 0 0 0 0 0 0 0 0 0 0 
##$SW_h= 3612.71676300578
##$TD= 16384
##$TD0= 1
##$TE= 0
##$TE2= 300
##$TE3= 300
##$TEG= 300
##$TL= (0..7)
0 120 120 120 120 120 120 120 
##$TP= (0..7)
150 150 150 150 150 150 150 150 
##$TP07= 0
##$TPNAME0= <>
##$TPNAME1= <>
##$TPNAME2= <>
##$TPNAME3= <>
##$TPNAME4= <>
##$TPNAME5= <>
##$TPNAME6= <>
##$TPNAME7= <>
##$TPOAL= (0..7)
0.5 0.5 0.5 0.5 0.5 0.5 0.5 0.5 
##$TPOFFS= (0..7)
0 0 0 0 0 0 0 0 
##$TUNHIN= 0
##$TUNHOUT= 0
##$TUNXOUT= 0
##$USERA1= <user>
##$USERA2= <user>
##$USERA3= <user>
##$USERA4= <user>
##$USERA5= <user>
##$V9= 5
##$VALIST= <valist>
##$VCLIST= <CCCCCCCCCCCCCCC>
##$VD= 0
##$VDLIST= <DDDDDDDDDDDDDDD>
##$VPLIST= <PPPPPPPPPPPPPPP>
##$VTLIST= <TTTTTTTTTTTTTTT>
##$WBST= 1024
##$WBSW= 4
##$XGAIN= (0..3)
0 0 0 0 
##$XL= 0
##$YL= 0
##$YMAX_a= 219553
##$YMIN_a= -287947
##$ZGOPTNS= <>
##$ZL1= 120
##$ZL2= 120
##$ZL3= 120
##$ZL4= 120
##$ABSF1= 15.72926
##$ABSF2= -2.322589
##$ABSG= 5
##$ABSL= 3
##$ALPHA= 0
##$AQORDER= 0
##$ASSFAC= 0
##$ASSFACI= 0
##$ASSFACX= 0
##$ASSWID= 0
##$AUNMP= <proc_1d>
##$AZFE= 0.1
##$AZFW= 0.1
##$BCFW= 0
##$BC_mod= 2
##$BYTORDP= 0
##$COROFFS= 0
##$CY= -3
##$DATMOD= 1
##$DC= 0
##$DFILT= <>
##$DTYPP= 0
##$F1P= 0
##$F2P= 0
##$FCOR= 1
##$FTSIZE= 16384
##$FT_mod= 6
##$GAMMA= 0
##$GB= 0
##$INTBC= 1
##$INTSCL= 3.70164e-10
##$ISEN= 128
##$LB= 0.24
##$LEV0= 0
##$LPBIN= 0
##$MAXI= 10000
##$MC2= 0
##$MEAN= 0
##$ME_mod= 0
##$MI= 1.114404
##$NCOEF= 0
##$NC_proc= -7
##$NLEV= 6
##$NOISF1= 3.799351
##$NOISF2= 2.8
##$NSP= 0
##$NTH_PI= 0
##$NZP= 0
##$OFFSET= 15.73697
##$PC= 1
##$PHC0= -19840.72
##$PHC1= 21.20081
##$PH_mod= 1
##$PKNL= yes
##$PPARMOD= 0
##$PSCAL= 0
##$PSIGN= 0
##$REVERSE= no
##$SF= 200.130006918367
##$SI= 16384
##$SIGF1= 3
##$SIGF2= 2
##$SINO= 5.538805
##$SIOLD= 16384
##$SREGLST= <1H.CDCl3>
##$SSB= 0
##$STSI= 16384
##$STSR= 0
##$SW_p= 3612.71676300578
##$SYMM= 0
##$S_DEV= 0
##$TDeff= 16384
##$TDoff= 0
##$TI= <>
##$TILT= no
##$TM1= 0
##$TM2= 0
##$TOPLEV= 0
##$USERP1= <user>
##$USERP2= <user>
##$USERP3= <user>
##$USERP4= <user>
##$USERP5= <user>
##$WDW= 1
##$XDIM= 16384
##$YMAX_p= 256541386
##$YMIN_p= -1941035
$$ End of Bruker specific parameters
$$ ---------------------------------
##NTUPLES= NMR SPECTRUM
##VAR_NAME=  FREQUENCY,     SPECTRUM/REAL,   SPECTRUM/IMAG
##SYMBOL=    X,             R,               I
##VAR_TYPE=  INDEPENDENT,   DEPENDENT,       DEPENDENT
##VAR_FORM=  AFFN,          ASDF,            ASDF
##VAR_DIM=   16384,         16384,           16384
##UNITS=     HZ,            ARBITRARY UNITS, ARBITRARY UNITS
##FACTOR=    0.220516191357247, 1,           1
##FIRST=     3149.43990453034, 0,            0
##LAST=      -463.276858475442, 0,           0
##MIN=       -463.276858475442, -1941035,    0
##MAX=       3149.43990453034, 256541386,    0
$$ Real data points
##PAGE= N=1
##DATA TABLE= (X++(R..R)), XYDATA
$$ [...]
8781 36011947 35034549 34332383 33622640 33081716 32436154 32028489 31831896 31365423 31373258 31754723
8771 31754723 32189971 32874488 33712437 34497389 35788198 36761754 37610082 38534695 39254460
8762 39254460 39667848 39782781 39876748 39450122 38404130 36660624 34754828 32586508 30192983
8753 30192983 28101159 26601663 25140134 24147666 23226834 22352779 21778753 21159162 20574549
8744 20574549 20259325 19925703 19692049 19298685 19072295 19088269 19202554 19017909 19199971 19098165
8734 19098165 19272804 19384687 19589756 19836818 20160507 20364309 20681796 21274435 21997358
8725 21997358 22710800 23159200 23404440 24065095 24791642 25408440 26321507 27321912 28270316
8716 28270316 29417585 30635526 31988160 33777621 36320342 39247407 42803521 47153887
8708 47153887 52239783 58071062 65541024 74829275 87714273 105436896 125972312 144231687
8700 144231687 156742945 157383136 135246382 108151169 85662366 68461450 56227743
8693 56227743 47938188 42126783 37661117 34137680 30935287 28433071 26486524 24793235
8685 24793235 23391159 22432678 21457234 20869636 20124747 19613807 19189929 18994723 18639347
8676 18639347 18380912 18417579 18480939 18140034 18276955 18399276 18661064 18897650 19075453 19201459
8666 19201459 19387970 19674486 19777806 19885973 20100001 20152230 20482177 20547738 20803009 20949538
8656 20949538 21141021 21565326 21863613 22212523 22519642 22925965 23270550 23556188 23685410
8647 23685410 23678452 23533991 23324315 23344969 22944110 22534236 22682023 22906532 23108103 23593117
8637 23593117 24141132 24695655 25297949 26242890 27031885 27901713 28557753 28818453 28440942
8628 28440942 27833829 27222895 26578416 25906828 25703428 25387978 25377186 25286263 25316991 25528868
8618 25528868 25478603 25689338 25467403 25356000 25138909 24750310 24062749 23243189 22504209 21861518
8608 21861518 21616259 21387846 20977614 21042713 21305476 21533569 21816520 22304971 23038968 23391092
8598 23391092 23528886 23303997 22626556 21561551 20276928 19104799 18174386 17479746 16773824
8589 16773824 16110031 15464499 14906323 14393480 13802592 13211830 13139103 12911619 12566585 12395101
8579 12395101 11869230 11173359 10836932 10598180 10156368 9975098 9602905 9068922 9107006 9238115
8569 9238115 9196529 9169344 9009570 8892804 9011128 9062807 8727685 8131681 7688673 7180065
8559 7180065 6835071 6378897 5839777 5584240 5192208 4667699 4244826 3988485 4002516 3872901
8549 3872901 3668946 3701359 3413379 3424803 3209981 2965121 2909124 2741256 2943790 2652585
8539 2652585 2423664 2509644 2357150 2175899 2255202 2432656 2448176 2258789 2169624 2051272
8529 2051272 1803568 1913847 2048960 1924661 2010122 1881822 1598679 1791658 1864800 1749771
8519 1749771 1537474 1515783 1683807 1650201 1547614 1453411 1500982 1513177 1498300 1594558 1661229
8508 1661229 1311171 1157344 1227302 1140719 1140091 1307241 1374544 1300414 1158706 926326 990495
8497 990495 951541 936957 1017586 1100974 1043292 1062359 1203032 1085932 1240288 1154718 1009336
8486 1009336 838317 954023 954145 805251 892522 719568 818931 932234 956711 1001575 948595
8475 948595 862763 962944 848851 828830 1024349 1004644 892397 717816 804671 753830 654743
8464 654743 900698 821733 689176 745739 802027 832486 770286 625754 663440 404686 392212
8453 392212 732992 849024 655195 611203 800297 836466 734449 657162 682041 540437
8443 540437 480658 523950 503158 474753 393901 426855 610023 779104 670986 423721 547589
8432 547589 516031 684849 688996 457950 516480 497897 391385 366846 366575 427042 538942
8421 538942 441744 392371 392087 431128 382011 313948 208794 273943 339661 275887 233595 113999
8409 113999 91366 183072 215439 97857 10547 237369 349349 280295 313607 250452 321884
8398 321884 266738 200160 243518 30849 -20523 66219 63216 25998 49210 40156 33962 223966
8386 223966 161215 12982 70440 -41958 -71252 2840 59298 138280 1022 135153 -11452
8375 -11452 41807 104527 115800 44038 109202 56303 -107807 -44787 -20564 173507 242984
8364 242984 128309 711 22110 -208770 -71705 -191105 -275356 -214416 -152899 -285928
8354 -285928 -289049 -287806 -190564 -76216 -132239 -60003 -222753 -197100 -269935 -158867 -82303
8343 -82303 20065 49287 -7575 270253 210056 171099 170001 37896 183276 -97318 -13211
8332 -13211 120712 155674 -23862 20450 191494 105687 -115291 -243253 -219945 -122052 -56577
8321 -56577 -144037 -206153 -108556 25322 -68630 -124011 -248873 -166587 -247194 -158264 -243933
8310 -243933 -169589 -41438 17154 -5735 -141954 -218688 -154606 -113310 -275348 -249511 -265037
8299 -265037 -226547 -193462 -199067 -203735 -215639 2897 -3281 -22567 -119908 -149143 -318092 -312485
8287 -312485 -245013 -349979 -215498 -135675 -134996 -210898 -120731 -111697 64131 20030 -43800 2929
8275 2929 31916 72020 10911 90130 118482 46184 -19769 -9784 -5310 -12786 94627 5754
8263 5754 -83906 -99213 -89613 -71833 19944 -42291 -301003 -252691 -378323 -355810 -362368 -237412
8251 -237412 -52529 -135043 -168354 -64766 -91902 -240665 -279380 -195317 -22141 42640 97748
8240 97748 75841 46293 -154596 -121095 -185515 -133064 65770 12302 14738 60435 182836
8229 182836 122913 -84619 119431 390679 447559 550199 507553 554878 436888 376525 265734
8218 265734 56021 -128021 71555 180995 82197 10729 -230334 -377155 -338849 -481944
8208 -481944 -408645 -225819 -260350 -348189 -413958 -483053 -616811 -484461 -56334 -349106 -539648
8197 -539648 -844691 -770628 -943422 -823780 -1170872 -1941035 -269228 -470930 -250886 -104914
8187 -104914 -307087 -278275 -395733 -335997 -135238 14848 -150003 -181149 -321370 -196719
8177 -196719 -171768 -333154 -415827 -321414 -221440 -49876 -101447 -272210 -396416 -463997 -437269
8166 -437269 -272665 -336521 -484000 -437836 -290633 -289506 -323953 -295773 -242774 -511458 -410235
8155 -410235 -402293 -388755 -432895 -366557 -387993 -294431 -310053 -418518 -341863 -249878 -286863 -369673
8143 -369673 -342050 -371145 -394974 -107035 -152762 -326907 -212977 -448781 -297176 -242137 -252194
8132 -252194 -357135 -334222 -552143 -504363 -544448 -596882 -468308 -490849 -351709 -506745 -308964
8121 -308964 -323017 -397705 -402350 -220761 -341106 -388706 -369173 -422233 -555152 -423210 -319541
8110 -319541 -395705 -295471 -249476 23710 -199374 -330363 -304991 -406627 -483548 -459406 -615762
8099 -615762 -525599 -497903 -420740 -474245 -455492 -445435 -430649 -549983 -424117 -275499 -201720
8088 -201720 -162154 -391949 -533077 -554670 -351315 -271637 -190533 -36047 -139788 -370938
8078 -370938 -487873 -479768 -589814 -543048 -364042 -351010 -404349 -354245 -283750 -395397 -680710
8067 -680710 -487054 -321414 -385888 -330983 -232842 -369437 -236785 -205814 -574659 -390751
8057 -390751 -329613 -221239 -417730 -424029 -395305 -563536 -503459 -376282 -561082 -729192 -638397
8046 -638397 -388337 -343968 -238251 -299900 -185907 -438405 -444398 -371207 -301428 -378758 -399250
8035 -399250 -525744 -439551 -241036 -152075 -183409 -135289 -230029 -386429 -428953 -547318 -539658
8024 -539658 -563821 -530416 -453536 -358359 -541912 -423656 -215306 -67975 -96914 -307911 -290611
8013 -290611 -179108 -205587 -201134 -212240 -192594 -339221 -577738 -714305 -560117 -701488 -465869
8002 -465869 -417691 -327939 -376708 -467474 -506957 -326958 -491608 -454972 -383939 -515405 -478502
7991 -478502 -343976 -360049 -439847 -439590 -515014 -292279 -221342 -342623 -453586 -457746 -481726
7980 -481726 -476700 -455927 -426008 -317913 -321127 -191764 -144290 -218716 -326459 -466472 -243988
7969 -243988 -201577 -205546 -308356 -225238 -308305 -193648 -198540 -292350 -316697 -511605 -435945
7958 -435945 -435393 -470696 -275867 -145985 -184008 -236592 -231086 -190397 -356737 -337189 -207105
7947 -207105 -247441 -238180 -167111 -173679 -290526 -430196 -243605 -343667 -331157 -119502 -59626
7936 -59626 -48340 -175254 -7990 -76435 -184686 -263453 -214886 -205014 -334851 -293803 -186986
7925 -186986 -158151 -218449 -125532 -503226 -598194 -277213 -62840 -231535 -299613 -92754 -230608
7914 -230608 -164838 -110902 -45111 -217484 -388618 -488262 -423338 -270559 -350133 -118224 -191805
7903 -191805 -402801 -289377 -324951 -339093 -427339 -536831 -462881 -474464 -512220 -440735 -198789
7892 -198789 -246852 -390081 -507706 -571785 -355391 -348433 -312006 -156079 -153501 -134307 -258121
7881 -258121 -313434 -258472 -451905 -240577 -222487 -241880 -155754 -189609 -331411 -342033 -379970
7870 -379970 -409038 -329395 -337806 -349291 -198201 -162552 -334796 -516253 -403993 -138637 -217647
7859 -217647 -110671 -51538 -208444 -173656 -194446 -264201 -366259 -274904 -345050 -293498 -158923
7848 -158923 -362532 -432173 -335779 -347119 -209954 -199864 -342382 -209148 -201266 -220416 -207516
7837 -207516 -170988 -293977 -182521 -100365 -104281 -168506 -149267 -210949 -248498 -51399 -15858
7826 -15858 -224728 -247177 -317714 -260592 -202821 -301814 -271089 -100185 -205842 -224251 -340642
7815 -340642 -248088 -350020 -155611 -14631 -156978 -293287 -358288 -262790 -147893 -220821
7805 -220821 -134319 -205935 -80380 -139641 -219410 -525537 -759165 -99336 -34497 271140 195714
7794 195714 144137 92246 229291 312017 133558 132887 281640 374091 511442 498211 458044
7783 458044 519591 425476 299284 561036 732680 857265 971566 1061975 874599 752941
7773 752941 711205 702589 733971 956446 940908 918673 821239 750905 698525 531740 532515 503476
7761 503476 343839 92539 171761 128136 120665 115644 -12126 -109708 33803 11324 29743
7750 29743 -37877 123425 12128 230802 255709 170324 255232 -111036 -99878 -36762 -109350
7739 -109350 12490 240147 162315 268734 47150 -85440 186526 283093 273615 246962 168172
7728 168172 419856 463549 363041 250692 356770 193461 256056 304839 298091 495875 462622
7717 462622 430832 338856 504020 648888 605742 643969 633733 653636 619483 838877 969102
7706 969102 1190814 1542472 1720182 1926375 2115022 2189660 2007193 2165446 2111122 1930598
7696 1930598 1852977 2074021 2239660 2220353 1962227 1794802 1709678 1624991 1605577 1395787
7686 1395787 1026816 1004058 659623 482499 580874 673206 498225 426203 160016 356130
7676 356130 436631 235991 300389 330237 94743 -4598 226468 163873 256818 332691 321587
7665 321587 375800 305940 120252 128477 185538 284563 405279 259772 134033 160741 89749
7654 89749 234349 340000 227111 204249 195698 77460 -115200 64249 311931 257020 303535
7643 303535 331658 426245 386192 302906 79122 59737 121091 128035 370207 244703 104579
7632 104579 410567 339987 405379 458541 367564 441021 666222 406651 315479 386780 588169
7621 588169 813562 713760 706022 704091 728975 837676 922766 1086943 1287832 1332769 1446002
7610 1446002 1388014 1497169 1550781 1483391 1285557 1158872 1041878 925368 744611 660473
7600 660473 568710 581558 376015 278292 391916 382139 519976 537169 494012 472161 573497
7589 573497 533943 409477 430772 435210 291176 304248 469685 524263 386494 585987 679628
7578 679628 614572 521100 551606 597643 714843 714146 652027 900113 1069923 966685 1033931
7567 1033931 1044874 1177971 1489344 1630574 1705222 1530574 1321909 1364186 1318139 1128154
7557 1128154 984822 852819 711253 646256 744667 732124 542474 488311 627274 396844
7547 396844 366551 401484 369743 413544 307401 444801 678347 648747 637509 518256 548054
7536 548054 769996 711732 622719 732792 752251 651022 689209 718208 647095 542173 526754
7525 526754 403781 431216 381767 288665 329396 335156 255751 373399 328108 509316 498562
7514 498562 379397 419016 287693 245405 343137 381770 169804 199346 388309 615954 489718
7503 489718 453157 433741 561145 553916 491828 448210 576474 552731 565638 645951 588552
7492 588552 704986 650963 700453 855066 894598 862942 800142 957072 1084991 826569 762946
7481 762946 564328 407141 389571 494544 457065 481288 685278 530064 571165 650338 574512
7470 574512 332248 286636 440569 616575 547508 410529 395108 320259 311427 193671 188914
7459 188914 349084 302445 270074 207246 102283 154833 248528 330427 413346 379779 249413
7448 249413 339768 506507 620388 498830 474992 292421 228275 327381 317917 221017 236151
7437 236151 448950 504163 628275 394103 209721 41483 100800 245864 200771 191884 196730
7426 196730 314301 455741 490561 413875 421304 487436 468137 256253 50870 265014 238138
7415 238138 143187 321241 361014 255188 190853 152800 257586 192843 183698 64494 197806
7404 197806 292255 316448 341622 180421 282518 282607 262818 200874 -9931 75812 180236
7393 180236 279439 382775 277571 348334 262829 573251 575106 398086 351583 236704 442986
7382 442986 437040 463282 400103 244373 258961 249061 463574 531206 429790 313658 315195
7371 315195 288071 184371 194572 368901 500149 499846 638783 573334 385133 410656 482737
7360 482737 486597 517690 625126 561917 611165 630811 550261 591867 556606 576177 554429 584294
7348 584294 631924 543471 508707 272796 705400 879546 812786 707554 663237 731685 598556
7337 598556 732265 888258 769045 632603 566611 453710 594838 994021 1123469 889425
7327 889425 822470 776841 711114 967353 861741 786696 610053 732585 919850 827908 742258
7316 742258 817155 799061 542735 598957 798444 1008165 1145065 1062722 1031477 921441 986724
7305 986724 1144794 1173328 1083065 1184770 1224367 1211464 1311069 1198749 1232320 1233230 1214237
7294 1214237 1222486 1253204 1200007 1270001 1213914 1092987 1276329 1300182 1251419 1583952 1469654
7283 1469654 1504170 1574764 1563614 1652521 1815438 1810409 1732509 1782019 1901362 1952024 1744732
7272 1744732 1778619 1927101 1781511 1720302 1705657 1900535 1729684 1718835 1796864 1979414
7262 1979414 2096865 2047820 2045514 2298654 2454319 2537242 2454320 2374217 2448485 2452256 2617331
7251 2617331 2718444 2681429 2890019 2940316 2829359 2828761 2933396 3355510 3588214 3498648 3554585
7240 3554585 3588753 3612090 3719550 3758931 3971237 4004676 3791840 3965451 4062572 4122186 4147695
7229 4147695 4189453 4209002 4114297 4274188 4352420 4130939 3937715 3789177 3697802 3859860
7219 3859860 3763145 3724276 3851410 3926393 3792848 3714612 3816779 3631069 3656141 3810051
7209 3810051 3592239 3407128 3530420 3609352 3577873 3825722 3849882 3799699 3768578 3707791 3708527
7198 3708527 3986512 4029860 4042919 4331916 4529200 4594465 4612838 4736094 4916268 4823366
7188 4823366 4820054 5002850 5094227 5285466 5505114 5595566 5712818 5911579 6066766 6278365
7178 6278365 6553242 6791227 7013310 7284023 7618070 7739274 8156392 8731073 9230437 9569144
7168 9569144 10009136 10589782 11143322 11531739 11904479 12423468 12586382 12824893 13261329 13401640
7158 13401640 13664106 13743958 13975066 14201961 14386664 14324188 14225471 14126069 13835340 13833853
7148 13833853 13627773 13172935 12998408 12901757 12697351 12380010 12069374 11918898 11572409 11252196
7138 11252196 10939260 10473835 10403694 9965694 9553037 9464816 9136278 9198601 9341780 9068302
7128 9068302 8941026 8925855 8891006 8792359 8785394 8978977 8952375 8954402 9117119 9121442 9173050
7117 9173050 9281084 9280913 9300165 9174135 9450480 9516663 9418211 9475945 9120818 9196798 9123968
7106 9123968 9021557 9118317 9067558 9117466 9199523 9242526 9307168 9405663 9293275 9517938 9673270
7095 9673270 9821696 9788140 9951100 9973744 10210618 10408665 10335404 10328303 10196555 10305714
7085 10305714 10521826 10442391 10378943 10213149 10127114 10027994 10021597 9863830 9646732 9484608
7075 9484608 9441084 9528298 9218034 9123794 9012728 8892484 8756623 8624609 8508777 8254316
7065 8254316 8210410 7844839 7581719 7361369 7138020 6952325 6781621 6703796 6433906 6249607
7055 6249607 6333070 6141304 5806353 5740078 5522309 5424231 5285724 5172680 5083111 4839673
7045 4839673 4812725 4823372 4617233 4587262 4421971 4211875 4083871 3842062 3706232 3674924
7035 3674924 3540146 3524996 3772012 3734165 3362993 3227496 3416637 3192236 2962755 3059494
7025 3059494 3001864 2810292 2806860 2953521 3071531 2804577 2795168 2794349 2551836 2654167 2667683
7014 2667683 2571389 2436001 2451403 2306328 2330596 2453380 2353875 2482815 2407669 2422383 2466563
7003 2466563 2307341 2183933 2256787 2199105 1997725 2089160 1966735 2051115 1936271 1932639 1961078
6992 1961078 1915915 1865458 1750999 1938547 2146969 2031821 1981980 2000006 1908933 1838678 1737415
6981 1737415 1629195 1688756 1633881 1805616 1740548 1742682 1828667 1987711 1983615 1819973 1667440
6970 1667440 1723550 1686823 1664791 1836786 1768015 1660419 1711451 1870590 1823769 1921051 1628401
6959 1628401 1651286 1778066 1975750 1999438 1768718 1788669 1917186 1917450 2082524 1926105 1881582
6948 1881582 1854501 1991838 2013182 1993971 2131254 2105809 2083156 2103112 2207938 2041726 1955485
6937 1955485 2035596 2046046 2099183 2177713 2194108 2113593 2153640 2293395 2306765 2495886 2390769
6926 2390769 2197163 2301268 2159538 2089680 2102188 2081705 2300754 2176840 2088591 2046338
6916 2046338 2027691 2196640 2128573 2042778 2236183 2166347 2243543 2349801 2403853 2101393 2056852
6905 2056852 2256502 2256645 2207145 2034713 2007090 2038484 1955054 1720190 1788105 1970416 1935827
6894 1935827 1817640 1755320 1883393 1906989 1806707 1783618 1712282 1727086 1679758 1781938 1627759
6883 1627759 1606363 1777481 1847367 1744733 1686203 1754997 1468211 1509446 1552878 1457129 1496697
6872 1496697 1423354 1521545 1658011 1494560 1584749 1524574 1205736 1398542 1547316 1366046
6862 1366046 1401962 1513767 1518575 1365808 1284193 1318108 1336954 1339106 1376957 1174727 1215580
6851 1215580 1159019 1253370 1360700 1221346 1444069 1355186 1212337 1096231 1057024 1070217
6841 1070217 1164031 1106546 1074462 1145099 1146497 1147458 1184543 1122420 1014975 873263 982185
6830 982185 818234 731232 907232 976309 834706 793698 1053153 962433 1099975 1151906 1016043
6819 1016043 988032 850186 852677 1152377 1199319 1004158 1068357 1066271 1052678 1101849 928412
6808 928412 908012 1179491 1117713 1091595 1137641 973498 972244 963653 904494 1061877 990432
6797 990432 1117118 1155216 1098359 1149841 1167423 1344491 1409461 1207054 1257667 1443551 1527024
6786 1527024 1586162 1717448 1607851 1524829 1464896 1451955 1546359 1506112 1377845 1495553 1405054
6775 1405054 1356949 1494432 1562112 1687522 1643501 1637983 1790561 1868480 1764086 1844397 1767492
6764 1767492 1823086 2008131 2129326 2019348 2060928 1988134 2281075 2276326 2380626 2550405
6754 2550405 2313181 2413924 2692120 2793086 3036653 3079448 3101632 3322397 3463181 3444312
6744 3444312 3608157 3629185 3966668 4208099 4353752 4521639 4625745 4950888 4993764 5256733
6734 5256733 5593967 6021713 6248298 6601889 6650037 6968947 7467516 8028945 8537682 8876577
6724 8876577 9319289 9992129 10712126 11292276 11906660 12333124 12664430 13082243 13373515 13546587
6714 13546587 13756362 13817357 13646725 13471002 13192993 12723217 12406708 12061265 11524688 10806543
6704 10806543 10217555 9640110 9073887 8411902 7955727 7445526 6895553 6505025 6045416
6695 6045416 5488619 5196638 5070337 4693455 4520209 4123679 3945243 3747972 3408718 3341655
6685 3341655 3289664 3269507 3126590 3063800 2744452 2507663 2349164 2320247 2295806 2178002
6675 2178002 1978690 1910181 1841003 1836008 1763694 1648026 1592290 1499518 1369571 1317302 1375176
6664 1375176 1358930 1324083 1320041 1371753 1371579 1330384 996160 1030901 982363 923284 1009488 1008766
6652 1008766 868588 729632 817130 845004 749988 908009 956825 916861 754640 793665 781452
6641 781452 683369 558597 654573 732829 668217 729049 766366 545568 625704 637226 386546
6630 386546 279300 404835 566410 402691 410076 507654 521068 337436 358376 374775 520462
6619 520462 407027 308687 206620 109198 57254 20173 308303 345813 224316 242101 438017
6608 438017 323789 -978 -63502 265286 392424 302743 400068 227373 -129724 -264961
6598 -264961 77746 199504 238399 188796 222557 179976 207133 259266 262926 185228 135729
6587 135729 126822 38046 45033 90482 121559 90058 232661 212722 85820 108282 175781 143948
6575 143948 -93422 36616 -70558 -78504 155621 281468 61307 -59983 121582 -9279
6565 -9279 22494 -31008 -64920 -168071 21201 40504 50596 200149 130778 101187 151020
6554 151020 30328 72933 -65346 -97558 -107939 -61337 -164160 -87993 -7794 96932 203383
6543 203383 73432 90888 139305 -47581 -96149 81703 113963 87545 -119616 -60164 -68283
6532 -68283 -41891 -31913 -200354 -239946 -40968 17298 -17694 23548 -67186 -13321 17006 -118337
6520 -118337 12121 15360 -105488 -44025 -41683 -124221 104673 -31676 69078 -87782 -174396
6509 -174396 -35847 -177471 -30660 -362622 -339672 -49751 -93760 -28722 199994 33740
6499 33740 36777 78549 22742 -13896 -28302 -712 -96331 60463 38509 11814 29654 -11315
6487 -11315 -79279 -46917 -6465 -30376 -10790 4561 73277 168125 113957 47012 -146700 -183482
6475 -183482 -41727 -70390 32562 -63991 78296 109708 -80759 -216628 -200592 151447
6465 151447 -179642 -163294 -132239 -291630 -228517 -195482 -168073 -125202 41521 178933 90996
6454 90996 96323 66780 69804 105557 42405 165967 183873 168734 63935 -7032 -72160 -185215
6442 -185215 -42591 94508 -174937 -242031 -226702 -17443 134444 128816 101067 -47026 -93261
6431 -93261 -107068 -65159 58211 11046 -93577 -204119 -232362 -192210 -62716 81876 104154
6420 104154 -35954 26880 -44828 2745 38160 -146935 -105820 -89277 -61648 -76911 79332
6409 79332 90180 196386 -4545 -305185 -363124 -364489 -144869 112030 -147079 -51795 55350
6398 55350 -10777 -104710 -152704 -50466 -135784 -254858 -13328 -45939 -32659 27905 116252
6387 116252 85054 -107453 -43976 -280252 -300951 -185227 -51353 -72354 19920 -30465 20773
6376 20773 73081 194069 43424 -93399 -43683 70207 87290 113730 -21931 96867 -59638
6365 -59638 -76731 112458 71288 62509 118913 346874 45594 -117380 -46292 -23217 87423
6354 87423 -27934 -77621 -10672 33363 -113336 -86428 -81336 -123988 -6630 35779 52277
6343 52277 -106545 154023 162149 -34877 -175956 -84955 -81082 23794 171456 66595 74988
6332 74988 87980 159355 241208 264945 50284 57464 -84504 -87177 -113338 -89016 24899 -120897
6320 -120897 -135987 -47279 166915 45113 -277987 -408699 -82081 -15252 -113052 -71962 19283
6309 19283 -38824 -63039 -108304 -105842 -281771 -288405 -97600 61035 152232 23615 22938 -73634
6297 -73634 -41633 9948 215451 138846 9732 85346 46225 -90737 -222062 -17303 218996
6286 218996 150741 131309 4838 -25810 61849 209747 311854 156716 240962 211100 -32034
6275 -32034 -125294 34400 -21378 -994 77845 3999 7752 90439 32603 134891 151527 172484
6263 172484 350207 151377 164214 245146 8022 -42767 -40880 -49079 -69583 -85941 -49716
6252 -49716 -113066 -203683 -60409 100866 118312 23949 -125824 -45853 -9553 -32088 174029
6241 174029 -47 -242373 -222564 39367 92676 99586 10313 -51586 52132 6988 -181813
6230 -181813 -348751 1669 127084 104417 -64338 54394 119435 100742 150466 208891 101812
6219 101812 25525 -36595 -31908 26355 -96884 82889 111058 -58171 212510 250301 82392
6208 82392 195995 152937 224505 227244 31763 17196 68100 137389 -65596 -166952 -38779
6197 -38779 -3091 -24544 164875 259196 145836 186692 111118 -82434 -71807 -137957 -79088
6186 -79088 125254 12780 -71963 119218 168725 112326 199364 54779 104070 -130021 -163058
6175 -163058 31539 -54663 -164848 -35340 15762 -107266 -215310 -147368 -24151 115419
6165 115419 171741 97397 -36372 -64862 -142006 -201493 -98684 -268433 44683 154770 -120797
6154 -120797 -86146 119384 175034 266633 209282 135506 44805 53964 -108929 -73402 -164894
6143 -164894 -183700 94530 126682 32932 57312 144137 8277 169004 60287 150671 280061
6132 280061 148441 96933 -55671 -19798 97304 101207 223559 46673 101226 128693 46872
6121 46872 185953 78872 124111 104382 -40230 44051 204152 200115 122075 133978 327749
6110 327749 371485 191096 106753 129831 -42558 68634 198815 239494 116721 -12860
6100 -12860 -27453 105990 133651 32639 -144625 -143798 157289 250774 274411 142418 56285
6089 56285 88955 184239 157617 177038 122460 254521 218709 205046 89102 21508 -32673
6078 -32673 2255 153755 117860 147364 285316 406711 117500 -237233 102364 100051 180313
6067 180313 313595 342820 279258 156058 317065 333155 241181 217910 180319 229164 281312
6056 281312 431 26971 178912 111202 109186 128033 -17285 28290 75827 115045 97757
6045 97757 12873 158011 23354 -82491 60414 119313 161682 367912 428232 298805 50372
6034 50372 84411 159284 70768 -102596 -213533 308154 259112 267974 248438 137828 -15171
6023 -15171 26105 162747 337244 201841 83508 183038 145221 239956 403606 426418 361784
6012 361784 169902 100529 53442 156625 226888 215873 351100 330256 211450 170140 68287
6001 68287 99252 151653 427792 487197 268287 44025 -54961 -90887 -18803 96066 360050
5990 360050 441118 226065 189920 201233 196113 317520 275673 229570 484959 375005 310514
5979 310514 302655 266821 201253 211208 58658 190441 121738 21326 89833 106564 200761
5968 200761 289596 412248 510920 415984 307766 226522 172764 267121 170331 237593 222098
5957 222098 59310 266072 222511 201637 97481 404299 398086 208411 230805 365455 139768
5946 139768 118038 177459 300700 177810 203913 217576 224200 256386 370881 389517 279564
5935 279564 207865 45243 -31059 124249 347512 246040 437929 443240 283739 208760 174404
5924 174404 278882 414660 451896 444342 444395 322874 296763 449276 410402 416949 319616 273814
5912 273814 -9754 248593 231413 113822 323613 366544 229923 251626 401782 434615
5902 434615 415713 541717 580869 719390 545035 442444 427733 335219 455585 483233 304666
5891 304666 491138 516183 354483 430698 288786 342898 202845 184140 419293 452329 472119
5880 472119 613478 608161 556803 474065 341867 314655 403277 461049 493386 465335 420974
5869 420974 444111 414750 523249 369846 339170 270887 238292 284413 381895 586335 560902
5858 560902 540305 555897 299676 315946 324933 334945 542281 573853 532902 488839 438305
5847 438305 447993 484226 447395 408964 459848 506679 416179 310167 274391 395617 426177
5836 426177 529030 454504 389787 460332 453051 308702 364500 604223 587573 546146 414201
5825 414201 402767 511322 278551 119468 414319 497123 379042 407566 417764 372001 223227
5814 223227 364210 388618 505830 400888 344238 381691 380143 223509 486475 688390 760797
5803 760797 516824 446622 595648 535214 435891 345781 527895 501356 488874 289758 487893
5792 487893 792414 751075 748542 758028 605766 625294 588791 771163 786299 587698 474777
5781 474777 426925 458688 485686 486064 448186 401272 405064 346941 289953 210082 508879 540467
5769 540467 389737 628886 597609 561072 515127 468602 583152 545776 541357 608143 518477
5758 518477 436712 392227 486226 501951 635642 624339 399093 410547 379490 541570 619820
5747 619820 535685 623438 474902 721973 840232 861847 675789 527914 508238 441625 505505
5736 505505 470420 540974 645818 774932 869752 785027 743210 712766 930626 830961 850698
5725 850698 891408 490015 430655 525068 509375 582176 692820 673960 752890 913788 840209
5714 840209 711087 782845 865197 856918 825573 698620 680794 771596 690009 730202 725708 610536
5702 610536 666528 761436 514412 464595 542531 601990 581990 853904 764846 679305 881685
5691 881685 828080 1068786 941771 745376 530492 607267 757101 605906 728989 672217
5681 672217 660169 717637 689824 634633 691544 533224 636244 713486 664233 698682 715219
5670 715219 759059 734102 694003 949958 1144629 1018388 975830 912940 730738 644098 836380
5659 836380 881076 782671 1203625 1239725 1111028 901320 804152 889945 888287 849575 894651
5648 894651 853324 972531 1001118 1008827 982107 897564 891988 902636 980585 981676 1193606 1065030
5636 1065030 1085723 1405079 1548505 1264108 1090061 1222773 1320444 1258119 1388182 1282184
5626 1282184 1384426 1396087 1223376 1221547 1517585 1598524 1438375 1475592 1559945 1663691 1493195
5615 1493195 1480222 1714238 1737748 1633247 1769154 1850142 1848516 1888817 1899493 1949805 2022496
5604 2022496 2145854 2246919 2231448 2255107 2415377 2573497 2580303 2555266 2715494 2773510 2877471
5593 2877471 3162019 3176477 3171859 3106616 3153105 3160214 3351754 3532768 3211909 3285042 3484650
5582 3484650 3534548 3567474 3534229 3289067 3444806 3476388 3481305 3488783 3656878 3802399 3855716
5571 3855716 3751704 3615187 3744319 3853946 3888132 3752106 3840542 3936467 3906502 4003263
5561 4003263 3829986 3794384 3748986 3698960 3680280 3880742 3775867 3592346 3486380 3436221
5551 3436221 3535913 3533146 3665149 3598524 3429117 3547359 3542591 3371633 3022134 2898765 3142690
5540 3142690 3123950 3208621 3326291 3258259 2972669 3088134 2959393 2900513 2756775 2635918
5530 2635918 2558934 2412238 2280646 2343493 2367657 2586119 2476023 2424399 2528474 2555149
5520 2555149 2580941 2481409 2299367 2563114 2654853 2771836 2717123 2537929 2651598 2716301
5510 2716301 2815496 2868814 2670623 2492157 2390175 2306308 2409153 2484783 2494518 2355120 2253573
5499 2253573 2245345 2285221 2285764 2478363 2383215 2272406 2322984 2445696 2649078 2722917 2782918
5488 2782918 2771144 2967759 3425563 3634019 3827524 4167565 4257641 4334514 4440125 4313502
5478 4313502 4333612 4029397 4017133 3688573 3493978 3486651 3362255 3279458 3157292 2972077
5468 2972077 2989806 2804808 2895437 3001440 2835016 2838127 2906453 3089634 3040126 2938766 3054248
5457 3054248 3315996 3495998 3665510 3958563 4184519 4303477 4607728 4691144 5027207 4995223
5447 4995223 4832523 4750190 4549938 4252184 4023294 3842688 3831103 3461077 3288121 3294166
5437 3294166 3281709 3224920 2946493 2798040 2903951 3150126 3191656 3192623 3149812 3311675 3375649
5426 3375649 3297208 3124923 3274381 3382038 3572557 3593856 3611050 3595107 3771472 3977141
5416 3977141 3808995 3608251 3502805 3566387 3448852 3284739 3107779 2916155 2946659 3128812
5406 3128812 3055749 3023944 3091311 2911204 2791694 2819756 2965601 2898085 2945100 3064558 2953368
5395 2953368 2761165 2759481 2835799 2882450 2837382 2734309 2641310 2714693 2737812 2543987 2608552
5384 2608552 2847776 3036714 3069507 3076019 3005781 2757598 2429777 2459911 2555399 2603036 2670579
5373 2670579 2911686 2750385 2572699 2424841 2378404 2404216 2305220 2417017 2717603 2734091
5363 2734091 2640928 2517306 2552232 2699407 2671601 2566949 2492154 2464545 2473714 2441286 2356849
5352 2356849 2334266 2354572 2443624 2357803 2282267 2393248 2422871 2448905 2401182 2448888 2546187
5341 2546187 2336860 2472251 2354080 2273568 2309725 2197205 2231828 2383048 2497146 2234370
5331 2234370 2375959 2476416 2326612 2410519 2357861 2314143 2189595 2054146 1948797 1953867
5321 1953867 2054132 2013669 1890368 2195318 2175277 2110092 2100042 2014101 2028150 1900083 1989536
5310 1989536 1959977 2087220 2095362 2137636 1988129 2058672 2235651 2178858 1991864 1915891 1973551
5299 1973551 1940823 1921840 1883921 1851169 1908297 1843186 1853353 2013376 1902345 1939362 1879369
5288 1879369 1870019 1952921 1927729 1736593 1810822 1798340 1633868 1655908 1805106 1690534 1678807
5277 1678807 1733275 1809304 1925109 1857383 1976068 1842450 1703660 1756391 1870447 1760831
5267 1760831 1862057 1778359 1925262 2017357 1700360 1867845 1921062 1838301 1688211 1805094
5257 1805094 1731275 1691406 1808020 1836396 1954831 2178090 1940387 1759571 1896028 2014634
5247 2014634 2123411 2027007 1966638 2258352 2308090 2109817 2059014 1910225 1931326 2075690
5237 2075690 2024107 2007179 1787804 1645724 1649653 1805161 1697771 1672952 1646433 1587051 1392946
5226 1392946 1520357 1488143 1506386 1455457 1398938 1443169 1422966 1580894 1667768 1698095 1458801
5215 1458801 1582905 1580054 1551413 1574209 1545072 1392114 1482144 1495346 1439221 1447683 1608242
5204 1608242 1654006 1683290 1502283 1422112 1169399 1237510 1513034 1452224 1388890 1434479 1191011
5193 1191011 1209786 1319883 1364192 1311172 1313445 1371552 1467344 1598783 1556446 1534554 1538310
5182 1538310 1472903 1421543 1381193 1584724 1705788 1759175 1558039 1419494 1667159 1723821
5172 1723821 1639749 1603458 1599466 1733961 1566512 1381713 1500474 1621248 1475829 1536768
5162 1536768 1696998 1709647 1818856 2031938 1868834 1566645 1789843 1870167 1852876 1857276
5152 1857276 1840800 1977531 2085326 2091601 1933484 1981054 2161784 2021250 2088390 1927020
5142 1927020 1889227 1950652 2030853 1952076 2159309 2223856 2263247 2324257 2434774 2514278 2515242
5131 2515242 2714875 2808328 2745062 2903346 3153452 3206270 3194341 3136395 3010139 3002305 3000895
5120 3000895 2891076 3046486 3100085 3194632 3230620 3335234 3453416 3485585 3475303 3476641 3785757
5109 3785757 3841666 3767993 3910904 3875271 3832362 3893948 3753192 3938301 3948753 3935179 3991408
5098 3991408 3915997 3827441 3762437 3695031 3805226 3887751 3923152 4007126 4127584 4177056 4284802
5087 4284802 4457116 4342554 4474564 4580656 4596923 4823825 4904083 4902143 4844130 5044825
5077 5044825 5201340 5260800 5161758 5076611 4899089 4822840 4852408 4785646 4698832 4730312 4697595
5066 4697595 4793526 4828179 4735813 4805068 4611331 4455063 4591316 4546784 4700200 4710898 4776567
5055 4776567 5034935 4836837 5086680 5322535 5580382 5682737 5867443 6137247 5992226 5920396
5045 5920396 6010889 5761138 5847711 5845414 5850330 5919661 5798234 5782772 5714905 5468902 5154924
5034 5154924 5310647 5402182 5353503 5358996 5160487 5026764 5233839 5308279 5254308 5596952 5535736
5023 5535736 5708868 5689641 5608366 5791417 5628273 5509313 5361811 5562036 5491070 5222827
5013 5222827 5349784 5322360 5542370 5451300 5351732 5310994 5393529 5348880 5159208 5345163 5193063
5002 5193063 5294185 5336841 5141513 5167145 5149514 5016505 4894660 5024234 5082993 5048122
4992 5048122 5013384 4882398 4861756 4925041 4883275 4866788 5044455 5207584 5386503 5329002 5321015
4981 5321015 5383843 5590631 5870554 5972264 6165193 5915933 5767725 6029996 6130231 6087620
4971 6087620 6165299 5998117 5944504 6214434 6253867 6187752 6267827 6166574 6316637 6399411 6452626
4960 6452626 6563918 6536366 6638602 6679553 6746802 6597325 6444341 6582457 6601560 6623034
4950 6623034 6833040 6580544 6511657 6253221 6174910 6209627 6329426 6559598 6349418 6323608
4940 6323608 6293950 6478616 6549976 6229205 6123107 6217048 6192608 6096729 6213228 6198617 6157071
4929 6157071 6135687 6064923 6018069 6075903 6158888 6116404 6061398 5958868 6000893 6275864 6495917
4918 6495917 6446960 6290847 6338620 6436948 6511043 6425184 6536814 6956481 6859539 6720335 6799480
4907 6799480 6880122 6710574 6635974 6473186 6501400 6461575 6592897 6608213 6552865 6738398 6721273
4896 6721273 6773072 6895078 7043158 6894132 6789304 6637627 6620597 6519372 6345618 6082680
4886 6082680 6035676 6069463 5897717 5603204 5666623 5610381 5579740 5312842 5555723 5758986
4876 5758986 5708771 5568486 5323907 4873213 4653498 4459447 4483578 4442325 4398388 4276909
4866 4276909 4367447 4380416 4544374 4792441 4731609 4852909 4525142 4365078 4061053 3992292
4856 3992292 3818322 3779120 3724275 3653985 3514237 3507557 3517667 3530974 3478022 3537285 3687453
4845 3687453 3538700 3473111 3635070 3608723 3777862 3738996 3521212 3590013 3809749 3768439
4835 3768439 3852551 3894952 4023071 4098578 4088097 4087611 4086775 3963939 3962116 4122095 4396498 4573394
4823 4573394 4597836 4766267 4880662 4999816 5046329 4812705 4920024 4888050 4774116 4862927
4813 4862927 4819154 4754883 4792632 4999543 5098095 5138834 5268522 5448069 5435644 5696074 5921089
4802 5921089 6074738 6097345 6066561 6214251 6191014 6132106 6204681 6069048 6104219 6099682 6001928
4791 6001928 6309479 6593986 6844039 7018655 7072119 7232604 7471546 7584822 7982466 8197066
4781 8197066 8495990 8726205 8855637 9340546 9917091 10893428 11790322 13395918 14974095
4772 14974095 16295816 17313314 17357071 16450031 15050875 13508798 11707793 10362081 9284496
4763 9284496 8486000 7615721 7113369 6796378 6431422 6290149 6025863 5837384 5666116 5504675
4753 5504675 5544468 5422220 5378510 5297197 5013959 5144634 5116334 5066824 5066058 5196948 5235010
4742 5235010 5084391 5289682 5465232 5740748 5912141 5846274 5857713 5568460 5376266 5359832
4732 5359832 5313540 5213481 5201082 5216718 5333968 5377141 5456564 5551430 5460348 5414684 5524411
4721 5524411 5657385 5815777 5948500 6046283 6122890 6425915 6733416 7065489 7267140 7800827
4711 7800827 8342270 9197404 10333250 11333904 12544323 13997426 15335728 15955579 16349303
4702 16349303 16065884 14952631 13331456 11955056 10926200 9794144 8809441 8057307 7446778
4693 7446778 7088934 6632818 6291430 6090723 6026676 5797785 5632156 5581526 5437435 5345499
4683 5345499 5454725 5581702 5750002 5822652 5853669 5850137 5627663 5370897 5177528 4968312
4673 4968312 4656225 4443714 4256159 4252138 4089027 3857257 3763485 3816016 3561800 3572364
4663 3572364 3502895 3436953 3565463 3128710 3118161 3216235 3226303 3135918 3304148 3328924 3116992
4652 3116992 3336353 3187352 3135115 3129342 3306276 3394719 2978703 2987676 3179897 2915890 2843482
4641 2843482 2904877 2934924 2831319 2766429 2719891 2563410 2745323 3005005 2976955 2689825
4631 2689825 2737783 2576231 2559401 2548462 2694451 2890039 2888097 2895232 2716376 2723838 2730545
4620 2730545 2665753 2681016 2545539 2642178 2849820 2757804 2709429 2805925 2879065 2787238 2769882
4609 2769882 2849550 2643248 2644182 2800940 2763786 2694814 2768041 2748016 2624760 2784867 2830343
4598 2830343 2892856 2831327 2722653 2966528 2924657 2801610 2805588 2891314 2889437 2886181 2574983
4587 2574983 2618002 2886120 2690090 2644263 2712897 2857593 2783077 2900329 2888439 2881623 2791910
4576 2791910 2822917 3077496 3034930 3023719 2973695 2987114 3101545 3074372 3141886 3337358 3291621
4565 3291621 3203962 3211940 3349191 3449169 3418997 3319124 3050055 3118691 3157027 2973433 3177316
4554 3177316 3364955 3237714 3116921 3186098 3265502 3360409 3487448 3496413 3361080 3449342 3531152
4543 3531152 3366032 3574211 3560758 3599181 3690167 3776806 3829377 3895683 3933631 3982747 4132734
4532 4132734 4349849 4454570 4385133 4151606 4306079 4445101 4281233 4325386 4363064 4341450
4522 4341450 4422017 4669982 4808609 4977940 4933305 4974853 4964914 5022180 5068656 5099496 5124158
4511 5124158 5151880 5432028 5591546 5712068 5841293 5784595 5814790 6120717 6336487 6525559
4501 6525559 6628447 6821857 7043687 7166673 7416618 7646277 8101801 8412767 8886645 9204027
4491 9204027 9326292 9520754 9846743 10069539 10344605 10964231 11605500 12108952 12275383 12531222
4481 12531222 12734252 12824335 12921996 13028490 12957017 12945403 12885845 13047107 13275275 13410884
4471 13410884 13491482 13495421 13708666 13846286 13951864 14133622 14561492 14940194 15415070 15916378
4461 15916378 16301355 16455487 16758310 17492040 17874523 18029041 18355713 18450957 18513647 18589060
4451 18589060 18601975 18883664 18853526 18839856 19081065 19163840 19134543 19286861 19614529 19751981
4441 19751981 20067369 20325162 20277787 20367042 20351990 20350427 20452364 20496262 20437930 20552537 20772505
4430 20772505 20519174 20408228 20465424 20470495 20572120 20484540 20279394 20343271 20458608 20882760
4420 20882760 21168956 21427282 21501196 21752349 22246920 22542896 22766952 22870057 23216984 23335847
4410 23335847 23250656 23556137 23592795 23395066 23387398 23452241 23195349 22907238 22493990 21927343
4400 21927343 21410575 20719789 19821265 19097365 18711608 17924228 17260164 16714476 15742780
4391 15742780 15208220 15067382 14598542 14020372 13668395 13217657 12625015 12458759 12393538 12186865
4381 12186865 12116115 11961355 11788937 11664314 11614318 11732579 11533811 11507507 11420628 11407918
4371 11407918 11211571 11107088 11116951 11087732 10831648 10773713 10745872 11059100 11137260 11143297 11312545
4360 11312545 11417507 11500124 11647376 11776538 11819288 11915605 12021367 12457633 12698462 12925389
4350 12925389 13226563 13457122 13620281 13762232 13804271 13905957 14210467 14397478 14426197 14645484
4340 14645484 14917390 15234353 15893361 16225116 16695703 17331879 17754804 18276099 19142949
4331 19142949 19896526 20561953 21142299 21661997 22409746 23229553 23807264 24234154 24840298
4322 24840298 25379999 25728823 25828592 25967321 26296276 26418174 26173254 25882367 25949966 25700883
4312 25700883 25193762 25075328 24914904 24670901 24376127 24092786 24080500 24078882 23824816 23699120
4302 23699120 23541697 23791440 23576969 23932682 24160593 24251127 24641015 24869786 24795743 24479135
4292 24479135 24590989 24543229 24419818 24558530 24547675 24425492 24222658 23965242 23496197 23266000
4282 23266000 23181205 22933490 22679837 22397864 22043404 21862210 21606249 21411111 21183652 21118505
4272 21118505 20664855 20361089 20206033 20119069 20042385 19686329 19369688 19100312 18953416 18560237
4262 18560237 18169970 17853442 17619746 17352111 17008446 16883278 16612202 16531163 16455206 16150773
4252 16150773 15906478 15963744 15962810 15735843 15832947 16016847 16328848 16460459 16788445 16889832
4242 16889832 17117418 17327928 17567781 17698300 17972357 18269765 18569276 18646287 18639932 18637378
4232 18637378 18688875 18520997 18342447 18483206 18542367 18541932 18570320 18589144 18778641 18942544 18978539
4221 18978539 18972174 18922221 18899435 19139286 19163650 19024079 19231153 19427426 19676187 19777392
4211 19777392 19882629 19934005 20153198 20114322 20058970 20068225 19969217 19849252 19782535 19644950 19562915
4200 19562915 19464051 19465519 19293363 19262595 19401438 19171214 19366062 19294699 19508517 19582550
4190 19582550 19759098 19857006 20087806 20221614 20363968 20489278 20576900 20917562 21175842 21352451
4180 21352451 21584623 21783039 21771127 21957141 22051097 22403330 22485089 22584900 22918640 23263289
4170 23263289 23557401 24230965 24783298 24958088 25114857 25385386 25747885 26176352 26284342
4161 26284342 26371268 26281558 26181548 26068208 25976116 26113250 25768370 25617030 25589022 25782525
4151 25782525 25901142 26022957 26467581 26825088 26892646 27205207 27368703 27903064 28446816 28592385
4141 28592385 28465791 28089145 27766244 27551466 27170686 27007418 26870769 26829662 26706330 26742216
4131 26742216 26872936 26689555 26981729 27044710 27130305 27131739 27193263 27306963 27612267 28000512
4121 28000512 28432567 28861328 28916619 29291042 29790164 30243140 30897488 31412921 32030843 32865019
4111 32865019 33720263 34272952 34940324 35544637 36221843 36751334 37499351 38026594 38519483
4102 38519483 39237650 39833156 40624179 41447679 42217954 42957831 43893014 44807316 45758912
4093 45758912 46809698 47760093 49063062 50309462 51443981 52548942 53503454 54526855
4085 54526855 55597726 56986311 58258981 59553853 61351252 63630320 66063723 68769898
4077 68769898 72329985 76226708 80757118 86343937 92644109 99509711 106805432 114698132
4069 114698132 122611446 130011111 136983465 142459186 146998056 150076472 151316843 151832590
4061 151832590 152734483 154670713 158349424 163335729 167381278 167413639 161652798 151807126
4053 151807126 139771025 127170155 115405854 105351745 97466572 91347853 86625515
4046 86625515 82610289 79611179 77409598 75635726 74207167 73343646 72817028 72444772 72526834
4037 72526834 72700477 73124014 73787555 75076630 76529240 78648152 81289685 84795849 88781116
4028 88781116 93068727 96930816 99195643 98676035 96267136 92506495 88356765 84834654
4020 84834654 81709910 79388202 78019883 77149726 76574410 76468459 76810478 77208722 77772862
4011 77772862 78697456 79706144 80843011 82005436 83193270 84673938 86136647 87600575
4003 87600575 89109172 90756835 92427290 94361561 96283626 98035932 100078247 102070313
3995 102070313 104184493 106077753 108035688 109952709 111921267 113865466 115612124 117200543
3987 117200543 118861794 120409524 121874978 123296627 124935533 126406482 127597202 128967554
3979 128967554 130572048 131992795 133576511 135234050 136929082 138666691 140240466 141706668
3971 141706668 143148471 144642211 145896474 147105667 148393329 149543446 150490571 151344086
3963 151344086 152261924 153238192 153832651 154434059 154861417 155425537 156037951 156549555 157061485
3954 157061485 157586438 158157769 158871466 159688011 160148293 160562231 160845399 160416242 159720669
3945 159720669 158930178 157551974 156004942 154244213 152154128 150354500 148691459 147021322
3937 147021322 145305643 143810760 142539650 141316565 140195892 139226020 138419294 137715713
3929 137715713 136960728 136648765 136546045 136842523 137520360 138748827 140702444 142960133 145914559
3920 145914559 149305272 153589442 158223817 163489106 168985568 174344133 179214487 183311856
3912 183311856 186592266 188962518 190361772 190765089 190654117 190417286 189971655 189519736 189091214
3903 189091214 188711975 188530228 188315751 188027069 187501216 186294381 184379630 182170635 179620821
3894 179620821 176445182 172776540 169242312 165720792 162327706 159056942 156354050 154024318
3886 154024318 152166332 150531128 149474418 149013909 148732343 148566033 149016559 150034076 151275178
3877 151275178 152661559 154348399 156443685 158586347 160893821 162656114 164191949 165310822
3869 165310822 165680591 165546562 164895549 163754789 162010047 160171850 158405205 156723347
3861 156723347 154539156 152570989 150810733 148646973 146375792 143668417 140584236 136967205
3853 136967205 133258502 129180856 124846693 120631147 116682427 112860681 109329844 106544261
3845 106544261 104351583 102342053 101068216 100407983 100172575 100724323 101851140 103795306
3837 103795306 106516488 109897217 113800706 118143440 123012273 127759537 132227688 136025774
3829 136025774 138743241 140087123 140270813 139379439 137803652 135716800 133696137 131703139
3821 131703139 129759533 127908567 126206038 124921618 123349265 121078105 118591440 115302160
3813 115302160 111236040 106539240 101286172 95699412 89933981 84589241 79572096 74863918
3805 74863918 70619594 67102884 63689408 60786989 58576100 56475022 54541604 52864501
3797 52864501 51457952 50210227 49243182 48832916 48254861 47384762 46757980 45873797 45023180
3788 45023180 44338052 43097449 42167001 41508042 40784094 39981418 39140432 38202901 37416518
3779 37416518 36931259 36517750 36139801 35731487 35090731 34627891 34141546 33639741 33000276
3770 33000276 32449655 32041723 31771946 31532987 31393249 31300604 31247661 31160440 31266073 31376124
3760 31376124 31530627 31559851 31655829 31504251 31322904 31277272 30912204 30615632 30069445 29463133
3750 29463133 28860303 28366892 27705307 27093725 26699064 26304203 25961127 25589795 25291680
3741 25291680 25071417 25103810 25224070 25107341 24944121 24876751 24537388 24386786 24230062 24051947
3731 24051947 24216111 24348908 24485508 24288688 24214580 24028936 24217130 24300910 24409230 24505504
3721 24505504 24692834 24930059 24810497 24612489 24341252 24150788 24009933 23759285 23664560 23626118
3711 23626118 23615097 23579096 23650243 24002402 23915666 24017006 24266026 24261023 24442260 24531368 24625218
3700 24625218 24712485 24824103 24804858 25142821 25142491 25073115 25407914 25914748 26353348 26626214
3690 26626214 27108109 27268726 27599137 28083320 28211914 28475180 28820586 28969326 29106125
3681 29106125 29321113 29632463 30002518 30401415 30655056 31316738 31928211 32274364 32839315
3672 32839315 33504899 34174801 34881069 35504366 36241952 36786538 37677368 38599343 39458451
3663 39458451 40360741 41240835 42029824 43042563 44187404 45600267 46753515 48213024 49681191
3654 49681191 51224115 53112228 54885405 56774079 59130409 61420919 64035912 66718114
3646 66718114 69825910 73023641 76496163 80540969 84642759 89360543 93954548 99047747
3638 99047747 104513553 110197888 116063934 122526623 129049157 135361769 141250293 146962907
3630 146962907 152449977 158127688 163783267 169457031 175216535 181150560 187541781 193688205
3622 193688205 199838800 205967356 211577454 216811545 221082799 224685380 227643552 230116038
3614 230116038 232556826 234910600 237218957 239905338 242483048 245278155 247934292 250329121
3606 250329121 252199602 253446603 254348177 254963252 255300483 255620672 256101387 256541386 256506274
3597 256506274 256395650 255713770 254207735 251857123 248920169 245499376 241782450 237949979
3589 237949979 234128058 230446878 226756785 222978831 218963458 214701447 209915660 204249430
3581 204249430 197795952 190634722 182928046 174913511 166631593 158586989 150942531 143891040
3573 143891040 137275778 131266060 125250667 119740652 114125859 108530748 102608379 96727805
3565 96727805 91190465 85741240 80797896 76154301 71773228 67923751 64308437 61110578
3557 61110578 58497566 55997675 53467657 51356587 49444785 47412032 45636811 44106372
3549 44106372 42470227 41195039 39954324 38594059 37531750 36521940 35673164 34410149
3541 34410149 33432941 32615564 31619990 30993274 30268369 29484911 28693993 27983492 27391006
3532 27391006 26840973 26265755 25618555 24731690 24198154 23843346 23255059 22576382 21958513
3523 21958513 21448388 21115607 20808327 20280487 19528823 19228227 18994249 18582447 18203421
3514 18203421 17752964 17460008 17024866 16556460 16142635 15823163 15432324 15014165 14755022
3505 14755022 14397776 14114692 13993507 13604538 13176441 12880357 12675406 12410664 12273452
3496 12273452 12191508 12096758 11699576 11339541 11195984 11046523 10836651 10451067 10289213 10164339
3486 10164339 9893825 9753406 9706946 9470962 9375243 9081097 8870076 8674129 8544149 8443862
3476 8443862 8266324 8055743 8094028 7974811 7698146 7672914 7769325 7695319 7257326 7019607
3466 7019607 6968972 6936144 6834397 6869031 6622765 6486586 6405643 6190861 6145321 6140181 6155354
3455 6155354 6068696 5973303 5813725 5746694 5755127 5533854 5500719 5522385 5207110 5250625 5204414
3444 5204414 5269989 5354360 5210902 4998266 5179808 4947449 4775632 4830452 4915005 4895743
3434 4895743 4832802 4615847 4293896 4501176 4464525 4669249 4677975 4478043 4397789 4511725
3424 4511725 4505743 4320646 4042266 4042156 4143234 4335469 4266061 4228020 4107463 3973559 3938400
3413 3938400 4108562 4045298 3958566 3857682 3835830 3850006 3694775 3720029 3757576 3835200 3870214
3402 3870214 3622848 3712863 3737601 3652979 3540938 3614776 3449635 3295204 3380361 3393568 3630288
3391 3630288 3551834 3316133 3405785 3494274 3547144 3324230 3393811 3316743 3454739 3473306 3465642
3380 3465642 3470537 3291109 3416143 3597973 3556452 3517691 3530642 3303267 3223215 3061214 3372960
3369 3372960 3514519 3546567 3589539 3353047 3222692 3182050 3200164 3274857 3438450 3574764
3359 3574764 3545510 3359081 3259916 3555758 3573308 3569940 3566070 3578035 3645772 3555298 3630406
3348 3630406 3888377 3701348 3676003 3785710 3884156 3984700 3939847 3879063 3952997 4020425 4117226
3337 4117226 4395224 4357292 4343947 4373240 4364237 4430863 4386055 4621152 4649845 4712190 4828407
3326 4828407 4825774 4924788 4880373 4898495 5135190 5368706 5561824 5622256 5561892 5427685 5566582
3315 5566582 5548103 5440844 5579926 5643592 5855119 6035112 5888974 5932194 5863805 6002303
3305 6002303 6345827 6239318 6315142 6431803 6405818 6457371 6578217 6687462 6594173 6630928
3295 6630928 6717780 6675539 6861103 7050744 7023454 7163655 7136372 7149815 7456609 7748899
3285 7748899 7901500 8126204 8114276 8194436 8312967 8511233 8428331 8485118 8774433 9033252
3275 9033252 9175533 9264193 9481783 9784712 9932731 10074573 10157634 10551109 10867812 11221152
3265 11221152 11558716 11871376 12032373 12414356 12870651 13147203 13405303 14039288 14816977
3256 14816977 15456456 16066724 16828622 17751559 18838035 19806763 20799211 21893641 22676663
3247 22676663 23451695 24177150 25120415 25873511 26854951 27910139 29043850 29814602 30033648
3238 30033648 29913006 29404647 28409175 26979170 25099890 23361164 21704342 20237061 18659303
3229 18659303 17437132 16336576 15572970 14772085 13951983 13633855 13545964 13505672 13634121
3220 13634121 13756843 14177334 14271103 14092113 13369119 12441175 11302899 10258483 9470521
3211 9470521 8930738 8313239 7930656 7845828 7385643 6941806 6824550 6382421 6181452 6015473
3201 6015473 5697422 5685644 5948124 5813235 5590880 5451951 5391227 5437231 5456637 5544389
3191 5544389 5701265 5499590 5679029 6016835 6167218 6319404 6229873 6140833 5742920 5152420
3181 5152420 4776253 4495033 4159024 3892006 3664644 3677791 3585094 3327995 3240472 3127236
3171 3127236 3048705 3115350 2964312 3018183 2726869 2533539 2579758 2535092 2427007 2296634
3161 2296634 2189506 2245763 1999798 1943477 2017259 1879982 1984920 1886161 1902659 2148155
3151 2148155 1984262 2064408 1993251 1860514 1786677 1735579 1817558 1889199 1947440 1842547 1919992
3140 1919992 1716978 1616950 1577732 1402254 1467066 1385331 1386979 1344174 1418906 1487635 1511877
3129 1511877 1373308 1312426 1319660 1346783 1286058 1223232 1040047 969092 980338 1079656 1288789
3118 1288789 1341518 1194725 1059008 919515 1065758 1165331 1141818 1078177 1195785 1171519
3108 1171519 1221927 1256598 979547 1104838 1095876 825519 916247 713401 730737 876158 1124910
3097 1124910 1041083 952255 935383 1050472 1141411 1115078 1010382 925983 973236 1000109 873341
3086 873341 865024 838966 810959 661616 743631 989111 784018 820653 796691 890765 1019122
3075 1019122 833254 823719 809170 900780 937432 634124 811608 1008239 1045415 938327 900428
3064 900428 796703 596805 733968 682871 624012 760756 627189 768670 803771 665143
3054 665143 395349 446825 463133 697874 774816 708842 576585 404836 673323 778229
3044 778229 773323 778267 576854 562250 520775 595611 573977 456498 579336 580618 511085 454176
3032 454176 429385 812243 762531 599164 569423 523904 814489 702296 527245 596197 475715
3021 475715 339055 418589 322092 409945 673446 459224 538961 589774 630100 677226 734414
3010 734414 649959 399357 663631 738320 605962 510017 429378 688180 720104 662775 438354
2999 438354 469522 569740 484539 397394 382554 334241 397134 496187 674017 598862 593396
2988 593396 634056 642087 514974 511561 519749 735850 802971 678054 913348 794134 905488
2977 905488 796414 886344 814109 654882 671721 930058 978394 820322 778352 700301 740077
2966 740077 680965 705253 707172 805833 902692 885980 828290 795980 711536 996693 1042658 1087374
2954 1087374 1096384 1060087 874762 903075 1139879 1363026 1379669 1220407 1326731 1309580 1330575
2943 1330575 1344122 1414401 1545099 1562362 1585784 1645198 1642758 1630737 1609585 1616117 1701461 1923145
2931 1923145 1774737 1852598 1925834 2136171 2169968 2206669 2324264 2230046 1904428 2057756
2921 2057756 2121177 2107514 2274948 2375296 2377829 2292330 2422706 2574267 2570743 2706600 2719984
2910 2719984 2720506 2654583 2699284 2598485 2647109 2637388 2891624 3160507 3103717 3195285 3485343
2899 3485343 3787324 3861369 3701309 3475621 3284320 3016821 2686980 2514152 2296321 2095764
2889 2095764 2086947 2035121 1959034 1873636 1799570 2078210 2122043 2025416 1922281 2078079 2060958
2878 2060958 1962821 1992595 2222949 2228616 2109187 2383806 2332026 2169041 2017920 2293425
2868 2293425 2269335 2078106 2064541 1871710 1855183 1734409 1633036 1731767 1601117 1515181
2858 1515181 1497146 1437216 1266691 1215673 1382136 1384483 1182922 1190607 1203319 1139493 1285401
2847 1285401 1405882 1389642 1090032 873201 937856 900507 942988 1024182 990662 1035358 1005649
2836 1005649 728374 946207 829199 726669 829857 922977 735341 863184 912683 711710
2826 711710 532223 626879 551803 514093 605480 728765 692280 632355 562335 552535 694620
2815 694620 869065 596267 288444 408657 487943 283726 283274 433465 540913 612012 477294
2804 477294 439207 463485 465574 550190 365689 101644 328054 265454 114342 119822 169669
2793 169669 280871 126944 64009 144680 295106 369243 271572 173523 181814 269244 375610
2782 375610 168453 166333 256793 237387 156535 45133 15607 -44748 94171 132382 322137
2771 322137 273833 66149 139352 122438 -24205 -249290 -97378 290986 160308 208243
2761 208243 13355 -111697 53902 136484 184724 79802 113632 86617 -131068 84055
2751 84055 54964 9708 -85032 -257036 -59419 24447 -85791 -52822 -26210 -48605 54122
2740 54122 78394 -68966 4823 71283 242292 27723 53673 -123505 -170452 -148940 -104638
2729 -104638 -82831 -253780 -1357 30928 -70358 5907 -102232 -332991 -74580 49409
2719 49409 -40077 -106847 -152320 -173113 28433 -78900 -154369 -139809 -153104 -210973 -216273 -207836
2707 -207836 -180022 -132374 -29643 40485 62722 -91040 -60892 -246752 -204566 24437 18853
2696 18853 -38511 -302064 -186997 -29783 143714 57319 46640 168028 175308 121833 125386
2685 125386 -1324 32458 -23787 -71220 -83190 -160732 -108789 6694 -96002 74975 284072
2674 284072 266682 -94564 -71262 64346 -184994 -217513 -34411 21324 -151084 -296901
2664 -296901 -404401 -240688 -173955 28989 -26442 -177861 -38706 -83077 27049 -26399
2654 -26399 -78362 -81319 -267218 -151575 -24932 35189 -34104 -113150 -35592 -14160 -289621
2643 -289621 -203540 -136082 -201036 -381153 -362094 -63381 -67563 -39354 -32918 -263413 -214324
2632 -214324 -176480 -6696 50929 11813 -60327 19058 -150577 -130223 6440 58736 132244
2621 132244 -108022 -163074 -133936 -227115 -202944 -103300 -85944 -89521 -122901 -104965 -92677 -173177
2609 -173177 -240855 -383448 -328948 -47165 127898 -12810 -141392 -60842 -161113 -96764
2599 -96764 -55470 -88422 -43252 -24484 -49526 90159 -97230 -113082 -38623 -89967 -74763
2588 -74763 -167309 -146386 -47428 -1258 126162 135161 77099 145090 -69021 -189819 -12136
2577 -12136 117836 -167093 -441338 -275075 -39052 -81291 -170712 -73394 -169330 -89906 -156078
2566 -156078 -231468 -269391 -134264 -210668 -367709 -122327 -129959 -355308 -205837 -134143 -240885
2555 -240885 -313836 -101288 -57574 -208985 -139149 -72950 -255031 -302498 -51626 -75791 -94184
2544 -94184 -82422 -205356 -138592 -213688 -21319 81381 -142337 -250775 -354079 -333078 -277673
2533 -277673 -266767 -394077 -319638 -287226 -84694 -208516 -245805 -71855 -145350 -379631 -134686
2522 -134686 208501 -132712 -166049 -317074 -418273 -45928 4113 101493 8589 14193 99941
2511 99941 -91152 -320442 -205312 -134768 -158824 -158335 -104805 -229464 -254895 -150639 -117717
2500 -117717 -139145 -211057 -200513 -282129 -291436 -193403 -165320 -338691 -538275 -177539 -244261
2489 -244261 -165829 -185563 -241637 -202550 -112768 -5052 -102762 -112186 -249765 -108021 46616
2478 46616 -97532 -211575 -242580 -216781 -214219 -231909 -18358 -22373 -210524 -218482 -118122
2467 -118122 -146881 -141252 -310365 -206776 -140871 -73823 95388 65898 154835 81410 -139332
2456 -139332 -38500 -82996 -46076 -69989 -179600 28462 169463 -149669 -168456 -249702 27096
2445 27096 21220 -185714 -184202 -185054 -125268 -127416 -266746 -224956 -101388 -83908 -85183 -125088
2433 -125088 -55997 -190321 -217959 -284513 -382018 -294251 -228025 -64625 162194 91356 -54432
2422 -54432 -76585 -73861 -3822 -105822 -165815 -291604 -225381 -163492 -257554 -47241 -86807
2411 -86807 -87247 -48871 84783 33684 120602 148190 43637 -24585 -119953 -91355 -89626 -91165
2399 -91165 -128710 -88919 -314222 -104780 -65463 -167167 -95941 -8913 94876 63778 -68233
2388 -68233 -192547 -151304 -130047 -174685 151236 184257 86586 -3035 -175190 161512 377528
2377 377528 229047 56494 66363 50583 22329 48679 129983 302899 299974 386733 86456
2366 86456 -46324 59022 171724 197233 80628 -86409 -197125 -75134 -63675 -24390
2356 -24390 -167459 150124 34572 -144053 -137816 -114083 -25751 18092 -131018 -181195 -72700
2345 -72700 -80389 -165461 -80892 67220 87014 -150494 -143470 -70553 -45842 -42604 -63715 -106097
2333 -106097 126315 52584 -75868 42427 -154851 -256275 -142699 -266845 -158851 4128
2323 4128 35659 -30179 -133929 -138129 -231850 -72018 -80328 -143934 26050 110150 343144 42452
2311 42452 1567 -35304 -144528 8489 37056 56198 -70037 -44275 16180 -136574 -172679
2300 -172679 -67402 -183299 -115713 27805 -6499 -76130 -94731 -105004 -123354 -77088 -79284
2289 -79284 -110027 -24849 -252297 -154305 234822 -82156 -58291 165146 49921 -3995 -116489
2278 -116489 -23728 47197 114762 -98918 -87931 -130723 -274033 -101568 -50405 122579 71722
2267 71722 -29161 71957 52291 -29394 -107400 -137653 -254057 -155239 75237 190894 137455
2256 137455 69103 123398 84347 -87200 118594 67224 -2644 246937 223479 213301 219086
2245 219086 33520 160171 248843 185549 165688 200293 88689 204970 245477 230201 200690
2234 200690 265568 291724 313971 130199 159029 268245 385899 297882 145702 228411 382125
2223 382125 210920 250911 266102 192733 419856 448528 224738 94368 18489 314119 370379
2212 370379 303066 440618 340632 309926 275472 462845 367132 303778 134245 52797 211417
2201 211417 223809 198844 186493 226767 188637 264227 510651 589024 508784 475726 512738
2190 512738 410743 374610 524777 384816 344324 423064 602917 685983 462501 483481 668950
2179 668950 771959 621612 744930 895322 803606 822133 1073415 1006502 873702 906101
2169 906101 1106248 978000 1102267 1174872 1186239 1115622 1216083 1304102 1390942 1298584 1432947
2158 1432947 1584894 1586386 1634823 1704556 1700955 1588056 1637850 1703572 1920382 2041622 2078016
2147 2078016 2014995 2167231 2122372 2224864 2473810 2336487 2466692 2715218 2910354 3090571
2137 3090571 3192299 3311848 3481952 3787776 4100876 4216531 4194960 4571401 4843307 5013122
2127 5013122 5107154 5406237 5913589 6388275 6665071 6994719 7637383 8232464 8904278 9564985
2117 9564985 10379933 10893187 11421778 11968102 12799608 13820543 15544476 17615614 19933064
2108 19933064 22634635 26376938 30940389 37456282 46249587 56801363 66950356 73894479
2100 73894479 70573479 58714201 47401618 37789913 30428386 25138472 21414415 18504945
2092 18504945 16149047 14599817 13316301 12013619 11264324 10789318 10140691 9418869 8720980
2083 8720980 7920056 7362814 6430440 6095375 5743729 5518500 5297127 5143976 4815942 4532113
2073 4532113 4309595 4141568 3965260 3934999 3727366 3511050 3343739 3218240 3000886 2933076
2063 2933076 2818929 2789408 2731222 2470713 2427154 2412752 2248868 2219815 1911849 1653796
2053 1653796 1736412 1999387 2213113 1907357 1601948 1534571 1473734 1410742 1413315 1393509 1280758
2042 1280758 1385225 1348146 1234550 1377703 1345879 1368313 1333015 1284329 1196414 1174551 1175948
2031 1175948 1144937 1192762 1195539 1077323 1055850 963824 1167230 1071008 762417 803747 1030332
2020 1030332 993732 857244 814220 742188 663378 660430 608525 685942 679781 702624 648543 444960
2008 444960 485562 521227 640952 397036 382337 657770 505537 292553 315302 291373 344988
1997 344988 266695 259711 428764 661229 629267 525500 593054 561746 488664 305144 444379
1986 444379 409383 350726 227585 300502 461293 258289 231644 194785 139072 378453 216292
1975 216292 116388 368758 304098 172511 110656 199238 177709 -19286 248045 249551 98639
1964 98639 104401 188803 272462 236317 346588 280757 304911 272520 248332 225069 308362 512719
1952 512719 344326 230243 221974 255128 149620 253914 369674 347451 138093 84653 70217
1941 70217 347648 430147 358180 200745 2854 -53008 -100311 -45139 -9624 -130246 -178847
1930 -178847 60154 136270 286806 280383 258915 195603 144597 115834 87218 -101315 4538
1919 4538 269339 312621 302509 274971 167373 136257 97041 -34595 172230 361765 244296
1908 244296 128163 13429 43526 72476 149329 212149 201024 196797 54313 66935 41231
1897 41231 199365 375816 444327 409296 199972 -16731 -12636 88619 61277 83582 7098
1886 7098 -136481 14717 -52206 -106301 91940 -26539 71423 158233 53987 -3892 124597
1875 124597 62584 -59324 30058 -3707 -100476 -93431 40751 52895 160683 164237 145999
1864 145999 -106838 -99633 57945 64175 31120 48850 267635 124067 -79778 56274 242977
1853 242977 162414 191846 246043 -23250 -95281 82619 115161 191102 198631 277597 140384
1842 140384 -85365 14084 155384 12596 307757 271850 259796 285609 308601 325526 358425
1831 358425 447693 441618 531087 270518 116640 271473 166122 198638 78098 137828 256260
1820 256260 192912 -23332 -47485 8363 -64184 74079 -51263 -7752 -55354 -200759 -20828
1809 -20828 10265 128782 148920 -10813 94426 243392 53417 -31933 108175 -6189
1799 -6189 -145809 27096 77846 -40610 -61269 91835 35539 -86463 -108688 -16435 125250
1788 125250 37390 -20876 -61330 -71231 -207868 -39894 1873 -118153 -145162 -44336 -61706
1777 -61706 136504 100936 113374 311273 380595 178545 218848 81682 56118 21432 -15852
1766 -15852 -4052 11594 71191 106740 106792 67162 -128214 -47839 109212 256049 190886 150177
1754 150177 -35768 26863 56811 -132111 114645 -84799 -129887 194682 405112 191929
1744 191929 185319 266537 181506 91664 85279 108995 61633 -86273 -257632 -37707 68428
1733 68428 -81433 -79085 -9279 -52465 -150541 -96830 -64384 189748 106722 -47395 -169138
1722 -169138 -204350 7218 -116993 31610 -73540 -127623 -165855 -158794 125631 -107838 -13161
1711 -13161 -141779 -129684 -37924 -144358 -167790 -90260 -104719 -19819 -5781 -58151 123134
1700 123134 84960 -73862 33957 64371 26562 47947 105627 -4497 -27890 39496 103104
1689 103104 44420 131500 108191 115055 87334 -110829 160873 76476 17981 -10674 49684
1678 49684 -74372 112244 133400 114367 100779 53563 37260 162396 181789 89069 106350
1667 106350 -190288 -150132 -7484 64606 42204 218127 129069 117031 75935 140632 12816
1656 12816 61262 -168274 -229284 -46246 -25744 -75705 -186417 5957 -296970 -343734 -2896
1645 -2896 281411 189203 22516 -66038 -158892 -54376 -59970 6157 128906 -5772 -237721
1634 -237721 -280578 -35788 264844 229599 22241 -160847 -77794 107763 35924 -95769
1624 -95769 -142227 -243320 -261772 -233943 -72041 -291669 -329426 -243730 -55574 21094 68547
1613 68547 -20449 -22910 172991 -11013 -124557 -93633 -180583 -263095 -178281 -89204 55054
1602 55054 35733 -13574 -96179 -7912 -196965 -178968 -137417 78943 134673 59057 -174456
1591 -174456 -127841 -101466 -14131 22980 17357 114324 20593 -183563 -223424 -210768 -166610 -100523
1579 -100523 -13748 -195092 -307071 -145005 -89173 -133948 -26781 106261 218497 162258
1569 162258 48729 65526 -45048 -173862 -105725 112132 -33278 -146383 -50358 135288
1559 135288 123424 -10150 7291 128327 -29386 176632 202891 32854 165988 58600
1549 58600 -112397 -202542 -190661 -229961 -59492 -185170 -270645 -70977 -133117 -106021 -121643
1538 -121643 -81001 -197521 -296794 -273589 -243114 -327532 -318463 -175074 -149156 -92934 44650
1527 44650 -79419 -38012 -35537 -34371 -84120 -70427 -29606 58165 89165 53570 -15471 -85111
1515 -85111 -105310 -183254 -335587 -204888 -69206 -77926 96789 281545 352431 235964 138326
1504 138326 128190 7058 -210505 -49367 -110360 -217820 -160608 -134944 -39229 -144768 -275601
1493 -275601 -179779 -200431 -110480 -109185 -173823 -146657 -165912 -61353 119496 -33442 -50119
1482 -50119 -34223 -107074 91081 241971 -15285 -104627 -39844 2107 31657 230372 146047
1471 146047 56772 -100695 -136103 119032 200589 224526 169630 4622 14855 64631 157320
1460 157320 144844 -93808 -54869 -90673 -230176 -205750 -60340 -23086 49390 40729 224722
1449 224722 11809 50563 -210693 -167481 -197843 -235988 -109974 -54773 123947 112799 135642
1438 135642 116486 119626 72408 -35716 -103815 -69722 -2086 -226113 -148518 -103288 -243727
1427 -243727 -192708 57033 154147 -15061 75027 115637 -93484 -54684 -31337 -95452 19630
1416 19630 -72985 -112354 -19588 13865 -91876 -48995 -103732 31367 32312 55291 -25323 -28526
1404 -28526 -68542 -23896 -7447 96975 -126310 -371088 -236613 -4175 -90385 -238028 -156670
1393 -156670 -147045 -109451 -156351 115572 104594 212816 166598 189705 134759 114703 115384 -19246
1381 -19246 114686 33115 93998 4806 94209 110788 -136620 -100986 50140 58790 11084
1370 11084 -100229 -72459 -56531 -29121 -60222 -118064 16700 -23426 -17139 15767 41542 113344
1358 113344 88102 359925 166402 -45033 -8780 -74953 -98044 -82803 -99389 -85830 -169994
1347 -169994 -332750 -227477 -151772 -45975 55311 33634 -35206 -146782 -61912 -186479
1337 -186479 -212107 -121238 -154858 -204556 19271 -189475 -103679 -132265 -271585 94344 71986
1326 71986 146243 152574 50570 -218057 24655 45035 -634 30803 48785 205093 -15093
1315 -15093 -240171 -54034 47301 212320 123685 70575 146068 155480 51233 -13494 277046
1304 277046 450659 282562 240944 130869 93786 -659 -200428 -290926 -194388 19124 51275
1293 51275 -117834 -265429 -239485 -99636 -16843 64044 101261 155921 154634 129980 205435
1282 205435 64484 52302 22327 14908 -134172 -168634 -164119 5540 -32498 -55805 -56496 119861
1270 119861 -10597 -87737 111493 97310 -67024 -115911 -175608 -416510 -441481 -70921 246539
1259 246539 142727 187972 9927 127785 114370 63656 -71603 -97173 -78080 -60608 -122548
1248 -122548 -83045 -44225 111694 3884 -50386 -54198 1755 90592 -65513 -25721 -12408
1237 -12408 27776 60712 183505 205384 13810 -59659 4277 -12633 64697 11544 -85570
1226 -85570 -133687 104654 81259 -16303 63733 19193 -23317 155970 -46517 -237451 -18928
1215 -18928 3215 -28300 25817 50777 -167292 -99886 -86792 -198067 -268850 -43000 -164202
1204 -164202 -17240 -28172 -15756 60110 4403 117589 172551 143861 -104689 87229 129293
1193 129293 136131 107007 69601 84892 256504 75490 -65556 -158636 -138887 185483 150110
1182 150110 123868 266143 199211 245626 58768 -39286 25960 -54763 -125005 -34044 -215783
1171 -215783 -343671 -131389 -68730 -142808 -99185 -222585 -242495 -91352 74990 -28916
1161 -28916 -61777 -140823 -43562 161618 139700 -39817 -222847 -133157 -36547 10297 125373
1150 125373 -39692 5546 135059 48707 3704 37653 16940 71612 -17716 -13954 -55220
1139 -55220 135582 57478 -57517 118115 -28466 -91571 -77082 -113366 75145 177705 -95726
1128 -95726 153468 169830 39012 198950 111783 -26995 -116307 -68572 124539 4726 77502
1117 77502 -201226 -121904 -55892 113451 120198 39984 -106317 -202417 -109685 93124 -18092
1106 -18092 -137396 -107653 -48676 -32847 -183596 -116165 7287 -4593 97874 169160 194566
1095 194566 86566 115164 -31728 -152365 -24193 -7074 18153 67342 -182194 -107917 97282
1084 97282 68376 -57080 -187783 -176309 -202066 -65566 12452 58645 -27579 30049 -8923
1073 -8923 130402 101264 38083 72938 -18741 -314531 -263100 -250459 -53567 -37228 -28355 -40098
1061 -40098 -127340 -28652 -47651 32947 25296 61836 -53450 -210777 -236738 -12690 125336
1050 125336 110160 -29914 -61238 -19798 45124 34697 -138668 -100215 134901 135417 43874
1039 43874 64454 140015 74769 66814 377002 260216 264158 58736 -176084 -151706 -47807
1028 -47807 -31120 -55010 107969 -8412 -232774 -113929 29264 -171371 -102780 -84074 -191814
1017 -191814 -241566 -154775 -151360 9652 24898 -13113 -78166 -201083 -175346 -296734 -164380
1006 -164380 -45898 16412 113052 83356 113488 15393 -1945 65710 76632 -3234 -5295 14859
994 14859 42025 77947 -199551 -199485 -231287 -140006 -106527 -180402 -48634 75709 81445 77431
982 77431 -30938 24815 97523 -28748 -23451 15186 105458 86828 -68639 12331 76241 53314
970 53314 -4172 14973 126759 35758 233366 190384 53277 106436 -31129 115569 141137
959 141137 248203 37360 -161929 -67828 -114589 -61070 116863 -20037 154659 142386 -101036
948 -101036 -145174 -171897 -180531 -191167 -282317 -205811 -101703 -84415 43546 -232206 -103622
937 -103622 89301 -47795 -137445 -169341 -106575 16779 160324 243498 134046 97087 173427
926 173427 307286 158776 163964 79839 309253 226018 101495 97743 91883 113677 85403 -5887
914 -5887 -160588 -24381 165483 120890 210652 221130 -13699 2448 -166315 -184768 -272373
903 -272373 -239548 -62483 -156498 -21511 171574 31430 -94797 60649 -27894 -10006 120381
892 120381 185215 254006 111375 137073 -69808 -146034 11963 -34481 41607 62175 97910
881 97910 -48502 -2090 -50924 52604 -5645 -75370 -46687 -12996 -16779 -61148 -97735 -70931
869 -70931 464 -192329 63985 108743 61444 9995 -45959 -73895 -165097 -328655 -175283
858 -175283 62194 139620 138754 210466 151355 181651 -109308 -111370 -61638 -22257 -46978 -112198
846 -112198 -83247 -79901 -101080 -113172 10430 27563 75394 144050 18126 8130 19419 175814
834 175814 85354 -86540 -16408 170133 75970 180925 355152 112990 26663 170023 256507
823 256507 104037 -23612 -53022 74386 125932 222626 177119 182618 83893 -26900 -62153
812 -62153 98327 38975 -137837 -28520 -181687 -318765 -49489 2225 173625 59126
802 59126 -28204 -62984 -13329 23916 12926 -97239 -263081 -77256 132432 -57495 -102108
791 -102108 -172526 -79158 -40992 75613 91364 107641 -26781 -295679 141201 118330 9974
780 9974 -10481 -111565 -28812 -76546 -122095 13238 78351 -132184 -188991 -41773 -147616
769 -147616 -261165 -157327 -54227 -85313 85907 -11059 -119307 -81519 25546 -260871
759 -260871 -347509 -144913 -174395 -231417 -315964 -142621 -73470 -53477 -161409 -268882 -160873
748 -160873 34727 200046 133161 69515 -18489 -48912 -85469 -107761 -176076 -167543 29220
737 29220 112275 98327 -84800 -41093 -101237 -80832 -128000 1144 -73301 -103482 111724
726 111724 -33324 6498 153458 264083 242105 282794 231788 294156 215176 110240 -79124
715 -79124 9319 148127 94637 78418 -89184 -47514 55165 -90847 1056 14465 20168
704 20168 -188835 -156464 41822 23148 50355 -163179 -159470 -125859 36980 6224 243801
693 243801 73096 20706 226826 120732 112922 85381 174616 58661 -127735 -12619 108244
682 108244 -7579 42203 -4330 192937 260654 161435 230230 211858 -16880 78718 157938
671 157938 93081 -64137 -52135 92716 130293 64078 -74299 -254126 -111119 170934 126026
660 126026 -30140 -156171 -142520 -34855 -15815 69434 246329 339726 173496 -42063 -46106
649 -46106 -86414 -127548 -65159 101642 43115 -21658 -35816 9913 -115713 -184338 -169517 -57636
637 -57636 -19574 49221 46915 -76241 -12454 52120 -64512 -16335 108446 178049 388048
626 388048 123736 -94479 -199322 -315329 -365844 -229435 -179739 -67196 4870 -37664 165496
615 165496 141407 -179443 -255383 -133272 -239077 -96160 27897 -50868 -257551 -348068 -240763
604 -240763 -222926 -113224 118548 86808 183410 -68717 -136960 -5135 -105435 -142400 83188
593 83188 91277 44133 -21756 -125287 -7863 29558 -42186 132920 105838 91248 -33281
582 -33281 96675 148937 138850 97581 -7639 -68915 -65893 -237207 -147550 60646 209275
571 209275 107990 -228972 -106132 -234545 -287820 -194180 35343 -26665 78329 29009 14466
560 14466 -21078 229686 203665 67022 -73168 -143297 -176315 -190557 -282042 -131119 -71528
549 -71528 -284053 -117847 -33661 65008 184483 212997 56722 85073 140242 66091 99169
538 99169 137385 164216 16789 -102470 -18622 -112903 -220898 -73978 181450 199805 5282
527 5282 25053 71157 7675 -120304 -282838 -106599 -62669 -100307 -150996 -224763 -284281 -384501
515 -384501 -53888 70477 116624 -53077 -70157 -23777 -143387 45375 156743 77486 25463
504 25463 35596 97290 115626 -69639 -178728 11688 89560 271426 307538 169653 -5600
493 -5600 76614 240095 220170 41572 -12523 41798 99664 105522 115474 89947 27880 150443
481 150443 2846 46054 211155 145976 -86571 -116030 -123805 -43099 41609 -82652 -51279
470 -51279 92584 88115 54018 164208 267889 180348 157470 30224 75649 12918 -149025
459 -149025 -15700 -4739 -307748 -146278 -4841 102567 51993 217926 200953 237814 222815
448 222815 42060 -57371 -297173 -287536 -236699 -135975 -124610 46495 122398 250248 110541
437 110541 123763 117604 74133 -19056 -80790 -130412 -88546 -84576 -61139 115587 207841 41577
425 41577 -11143 120132 -135284 -208035 -268845 -177193 -98507 -72052 -278567 -171862 -3535
414 -3535 -122128 -165056 -3952 273415 213500 221 -84231 126734 17394 -3732 -92464
403 -92464 -377120 -213100 -56337 -85537 -63024 -78929 -234454 -314464 -156865 18229 -88269
392 -88269 -260942 -298618 -218008 -218769 -105478 -75303 -98613 -120636 -2071 -32454 -163232 27560
380 27560 166337 132420 -105939 -123990 -247655 -124294 -79247 -181064 -156568 -263025 -132311
369 -132311 -9006 14957 -120816 -25709 -31023 -3145 -203960 -386311 -324518 -299594 -236114
358 -236114 -85028 -85399 -204505 -86826 -150866 -228518 -20208 -96427 -62541 83057 -166636
347 -166636 -385916 -198340 -86096 -204344 -155074 -300951 -210671 -21298 -9216 -32258 -156502
336 -156502 -191039 2472 -79873 -104035 -183405 -66683 -50414 19217 -126954 3613 7776
325 7776 25379 85112 34910 -31148 28376 -80915 -146107 -168362 -229495 85794 -65681 15187
313 15187 -4786 -55028 43110 2948 -101052 -347732 -188949 -54493 -88447 -70508 10743
302 10743 -90089 -259830 -217996 -197342 -224844 -166192 -71322 -11356 146470 18176 -9008
291 -9008 32485 10573 -160700 -6899 65887 -30216 -110285 -229942 -361235 -353196 -191919
280 -191919 -272758 -81726 -12351 -159944 -169794 -113078 28081 88580 135105 -171377 -185699
269 -185699 -43149 -66760 -268243 -341706 -317901 -276378 -210235 -157690 -131180 -779 77589
258 77589 70086 23085 51972 90606 10828 25342 46533 39762 -31054 47831 -214101 -370456
246 -370456 -130306 -133806 -320650 -299495 -22613 -12412 72568 -103202 -100824 -156273 -204079
235 -204079 -234765 -201978 -107156 -61343 -186650 -159839 182 -157051 71792 -13308 -91668
224 -91668 -186617 -133783 -88165 -36931 -131404 -308585 -165618 -190993 -170020 -96091 -120698 -206820
212 -206820 -241492 -153193 -226299 -229920 -77722 -228760 -124328 -47917 -267681 -150833 -130094
201 -130094 -60427 -70739 -104771 -101325 101820 63246 -178758 -99683 -29025 -43201 -87588 -239595
189 -239595 -149944 -222093 -381909 -270264 17129 175248 88484 42928 40404 -65401 -178350
178 -178350 -237228 -63527 -121076 -121906 7996 -121140 -77824 38957 71896 -70165 -97574
167 -97574 -35678 -208411 -208414 -65749 -268752 -399836 -307091 -114555 54510 -34408 -68139 28773
155 28773 41633 -3398 -81978 -49030 -214007 -202345 99623 100536 22251 -21816 -127741 -187201
143 -187201 -201568 -67790 -89280 -37864 -57336 -161055 -160530 -210207 -94817 -35605 16390 75444
131 75444 23874 -127054 -129465 -263489 -107900 -46807 32281 15792 -175240 -188446 -146346
120 -146346 -128268 27180 140600 79867 122663 -51610 9743 -218230 -256519 -67622 36210
109 36210 5977 -176870 -155364 40733 33181 -42017 97019 210877 -133755 -119848 -189058
98 -189058 -145891 -54610 -162943 -206797 -193718 -95046 -13548 -25959 -33187 -40117 -32870 10207
86 10207 -12907 -145389 -145426 -153585 -158744 7192 -6944 32451 -137828 -170160 -127890 -251453
74 -251453 -124286 -88797 -205280 -192669 -247898 -289495 -161145 -14321 -60299 13822 -34664
63 -34664 -76729 -110721 -195576 -176921 -120578 -181241 -173098 -154149 -2314 -52283 -29613 -74947
51 -74947 -57270 -23366 -31151 -81996 27316 57117 -96931 -156912 -225717 -112463 -136697 -60557
39 -60557 7322 -19299 -163212 -143444 -124729 -77506 -53252 -59421 -32402 -234774 -211779 -191421
27 -191421 -232147 -220241 -112694 -114992 -84561 -216358 -198379 -84642 -22608 61924 152303 34613
15 34613 -31278 -6755 -26748 23140 19897 -949 -70560 48061 7068 -82331 -95300 -148877
3 -148877 -223252 -107868 -132830
0 -132830
$$ Imaginary data points
##PAGE= N=2
##DATA TABLE= (X++(I..I)), XYDATA
16383 -1874566 -1772781 -1734034 -1659862 -1816031 -1914758 -1829356 -1864665 -1832488 -1766606 -1727995 -1588858
16372 -1588858 -1452636 -1506758 -1382140 -1424716 -1343470 -1398955 -1342133 -1350557 -1282698 -1290136 -1092374
16361 -1092374 -1087354 -1156943 -1144592 -1132812 -1087424 -933888 -801460 -838263 -736230 -821977 -913161
16350 -913161 -820145 -846157 -874654 -756324 -579112 -589111 -595509 -636574 -646399 -788294 -706929
16339 -706929 -598417 -456818 -454769 -572650 -577936 -551051 -508025 -404352 -221823 -236387 -193689
16328 -193689 -242632 -258383 -212353 -195579 -77210 63398 64472 -35885 87129 121165 113852
16317 113852 109300 67253 -1999 20351 208205 366604 366525 207633 321570 343936 433842
16306 433842 545551 544304 538682 540138 451557 486458 532776 509724 538223 584216 702322 771342
16294 771342 665164 679276 701493 791349 865634 851357 902402 800506 805677 847862 877203
16283 877203 816369 816019 768356 904417 959513 945920 910294 932965 1125194 1139310 1048080
16272 1048080 1121899 1127120 1266020 1220962 1345230 1382983 1275848 1319034 1383488 1473070 1647406
16261 1647406 1778523 1648728 1666375 1439165 1576299 1498662 1510704 1498551 1510168 1631202
16251 1631202 1638688 1605872 1581977 1710861 1797906 1678762 1579091 1660462 1846130 1870133 1908644
16240 1908644 1861611 1875742 1683191 1904246 1860218 1853348 1974641 1955506 1893923 1864672 1909808
16229 1909808 1899211 1928610 2165659 2247925 2167086 2140420 2050182 2114315 2129977 1860992 1966488
16218 1966488 2033396 1984772 2017003 2056241 1897485 2151193 2165440 1996996 1982347 2022692 2129343
16207 2129343 2057137 2240803 2117747 2184549 2110244 2220771 2184998 2366941 2331707 2281400
16197 2281400 2202906 2296690 2211376 2275605 2238111 2427293 2489206 2526971 2551848 2528051 2403592
16186 2403592 2338599 2403931 2517492 2527870 2297035 2425202 2483952 2534933 2395303 2191029
16176 2191029 2332650 2637024 2752345 2790219 2748594 2544479 2624899 2725730 2758208 2688945
16166 2688945 2653485 2738952 2721385 2624024 2560039 2604693 2556896 2645956 2755209 2822859 2905547
16155 2905547 2831124 2906761 2873673 2720795 2890202 2804366 2757249 2707624 2587013 2647984 2653922
16144 2653922 2761396 2953869 2867293 2685647 2640974 2667858 2970744 2933743 3000334 2929666
16134 2929666 3041968 2962651 2767236 2834994 2756008 2611626 2652007 2707879 2699676 2730285 2892123
16123 2892123 2937459 2789072 2951271 2953461 2939661 3108995 3182425 2886961 2868258 2712167
16113 2712167 2756560 2854538 2848697 2797060 2949828 2944426 2958391 2926010 2938780 2807947 2734116
16102 2734116 2686264 2671778 2901488 2942988 2942024 3039325 3017280 2898385 2970523 2994587 2997448
16091 2997448 3070451 2942778 3098501 3123124 3154601 3297809 3118189 3212079 3140365 3026815
16081 3026815 2834442 2724195 3008318 2765184 2779758 2935672 3022328 3102834 2867569 2900374
16071 2900374 2954965 3010686 3026281 3186413 3091710 2976255 3053640 3080870 2798706 2630382
16061 2630382 2812904 2859616 3031400 3087914 2953280 2879426 2904300 2714296 2713906 2762389 2820690
16050 2820690 2935696 2711981 2584357 2602843 2640785 2829036 2788156 2898186 3054178 2846861
16040 2846861 2929121 3055877 2909059 2922691 3054607 3101118 2986857 3014347 2967220 2880908
16030 2880908 2794022 2833516 3040849 2934368 2858215 2871965 3070254 3068280 2975098 2844394 2770680
16019 2770680 2780987 2639858 2871492 3089783 2870977 2781556 2822213 3005232 3086804 3060565
16009 3060565 3207233 3223371 3078892 3108915 3131666 3112579 3033462 3119650 3149491 2942095 2888198
15998 2888198 2863516 2832201 2865189 2853762 2869797 2988394 2975872 2956049 3015414 3068998 2958945
15987 2958945 2922590 2925322 2998944 2990135 3028482 3117689 3171317 3034849 2957258 3025757 2908343
15976 2908343 2853759 2908561 3044079 2989552 2835391 2879453 2999590 2797886 2817563 3043797
15966 3043797 3208215 3202759 3171515 3121132 3091735 3081722 2863768 2962081 2998385 2867182 2973829
15955 2973829 3071704 3193543 3091893 3084547 3010466 2908523 2968708 3154315 3116128 3086145 3210701
15944 3210701 3166940 2942107 2901770 2959105 2988178 2975256 2994425 3027613 3061643 2916489 2840821
15933 2840821 2877094 2776597 2826877 2869916 2710954 2782710 2707380 2812768 3126990 3005385
15923 3005385 3049454 3155295 3092053 3115165 3187534 3251099 3159689 3101064 3015060 3014358 2889740
15912 2889740 2940451 2827455 2787270 2985689 3205050 3213008 3141567 3109151 2959075 2757176
15902 2757176 2713593 2935590 2884870 2825185 3080350 3183032 3047690 3077827 3014634 3175907
15892 3175907 3079349 3213611 3186360 3218475 3061282 3161942 3003438 3140714 3201667 3113651
15882 3113651 3151372 3135645 3021156 3028835 3222654 3042934 3079768 3066556 3026669 3127571 3149063
15871 3149063 3135217 2916918 2710309 2891626 2824559 2793843 2831477 3060359 3083223 2935930
15861 2935930 3016643 3031855 3122373 2975534 2887563 2942805 3093773 2993170 3108369 3160195
15851 3160195 3196769 3280159 3127312 2982020 2924858 3046662 2980821 2986096 3056189 2961610 3004557
15840 3004557 3190878 3227438 3164227 3054717 3086803 3201380 3123274 3065408 3104842 3168025 3074489
15829 3074489 3063756 3053578 3076431 3145188 2795929 2833872 2785617 2811204 3121645 3307981 3275179
15818 3275179 3182768 3084341 2971435 3094054 3171250 2904306 2840723 2938924 2892560 3061877
15808 3061877 3251927 3239714 3102288 2959943 3166400 3068389 3081275 3106832 2951689 3003993
15798 3003993 3058182 2973783 2967552 2909342 2841705 3110542 3048456 3122198 3255954 2991571 2930764
15787 2930764 2991790 2826452 2898853 2858511 2882593 3042786 3047566 3081809 3277099 3052529 2913926
15776 2913926 2971578 3009342 2971194 2894355 3064288 3083886 2980345 2814468 2815146 2946829 2899547
15765 2899547 2804453 2962834 2986146 3088062 3420522 3413383 3278833 3202992 3017807 2878223
15755 2878223 2782028 2811395 2961582 2933969 2834787 2849237 2719236 3008307 2996824 2917634 2968330
15744 2968330 3046503 3151091 3194338 3085624 2921876 2894014 3206259 3219524 3085957 2919328
15734 2919328 2955724 2907619 2861823 2912204 3008337 3071511 3075083 3163626 3106858 3175778 3210606
15723 3210606 3159539 3135092 3113240 3126595 3120552 3054697 3109855 3255846 3314921 3173865 3170933
15712 3170933 3183867 3054768 3202777 3298701 3127019 3288091 3166831 3128700 3215179 3317841
15702 3317841 3291038 3021209 3075764 3170403 3197346 2943188 2953177 3180035 3229331 3192232 3066408
15691 3066408 3059972 3073207 3058545 2993945 2954476 3018283 3198344 3155631 3103853 3098417 2989120
15680 2989120 2829042 2893019 3166908 3127733 2928198 3019165 3146241 3243582 3024079 3120845
15670 3120845 3212382 3216420 3314418 3085357 3041640 3048907 3111424 3299624 3046126 2896550 2962498
15659 2962498 3098400 3173417 3087102 3006093 2946289 2660006 2852672 3082070 3317042 3145080
15649 3145080 2921864 3071828 3255856 3324549 3264029 3235605 3110275 3140879 2977360 3017559
15639 3017559 3173502 3031610 3137375 3103061 3113320 3063605 2988778 2922348 2905565 3010894
15629 3010894 3021182 3054323 3247725 3149081 3071739 3150329 3241706 3302306 3058116 3186832 3218544
15618 3218544 3004486 2873563 3072787 3143754 3056741 2793225 2794966 2949038 2981653 3032045
15608 3032045 2884189 2775436 3016076 3209039 3053625 3069977 3005065 2966681 3015143 2993662
15598 2993662 3216833 3096274 3120508 3057605 2945127 3040959 3117364 3211491 3130032 3111931 3140431
15587 3140431 3128881 3074522 2953353 2895946 2926357 3054338 3182481 3285342 3126363 2829047
15577 2829047 2893676 3108936 3044847 2840212 2971902 3169413 2852072 2880387 2920120 2897946
15567 2897946 3037608 3136887 3230820 3158809 3148710 3255232 3193341 3226653 3125908 3048010 3140008
15556 3140008 3172424 3262709 3241952 3132392 3277503 3009294 3052634 3042924 3059631 3011346 2869995
15545 2869995 3033800 3098124 3143451 3187885 3191984 3163133 3066274 3064722 3079233 2995383 3175567
15534 3175567 3215369 3221531 3179968 3246529 3333312 3308234 3324124 3287661 3211176 3112978 3093047
15523 3093047 3059152 3113631 3256788 3167613 3329573 3342732 3258388 3191453 3245442 3128899 3219646
15512 3219646 3267801 3242642 3103467 2926872 3123241 3084442 3183926 3231826 3170271 3261044 3256766
15501 3256766 3252308 3183983 3233945 3001739 3056101 3219982 3223219 3230136 3154439 3074738 3171355
15490 3171355 3257718 3219848 3217218 3134708 3149665 3147252 3212453 3214419 3151629 2902427 3005616
15479 3005616 3273855 3190588 3134666 3057789 2964370 3104347 3138076 3063514 3256809 3347509 3298692
15468 3298692 2967942 2986868 3121862 3225944 3208940 2904216 3046385 3287512 3235828 3307517
15458 3307517 3213760 3118462 3341376 3211250 3189830 3216084 3176916 3191506 3249378 3243823 3329779
15447 3329779 3279475 3268997 3049497 3019753 2961653 2737589 3069809 3092876 3011849 3084774 3253168
15436 3253168 3113245 3052248 3124908 3132424 3094749 3147313 3247661 3138319 3268727 3305854 3242221
15425 3242221 3089616 2896741 3022288 2987989 3191837 3445283 3346069 3334360 3382387 3175562
15415 3175562 3142105 3239318 3290402 3210919 3174729 3406683 3175295 3136792 3269571 3314746 3380367
15404 3380367 3194966 3173784 3128449 3176800 3162824 3081709 3117697 3192523 3267349 3254371 3148309
15393 3148309 3122023 3413178 3318062 3369345 3305674 3500663 3336401 3248292 3216426 3145837 3143237
15382 3143237 2836180 2884318 2913963 3023024 3209976 3195349 3167422 3249190 3185203 3421419
15372 3421419 3291226 3134915 3138523 3038566 3069858 3225112 3142218 3130717 3235077 3252601 3181384
15361 3181384 3127378 3196096 3257545 3180472 3201786 3271604 3251532 3149712 3157109 3310397 3418839
15350 3418839 3300470 3142312 3156310 3015192 3094868 3228596 3171795 2942178 3017188 3238414
15340 3238414 3368977 3222506 3015526 3027192 3048356 3251924 3080207 3081601 3244422 3143116
15330 3143116 2980518 3174431 3187579 3361996 3402537 3056196 3250004 3323715 3143251 3059895
15320 3059895 3230171 3251785 3217646 3140774 3094250 3026090 3152647 2993717 3030744 3072554 3069807
15309 3069807 3152205 3195722 3284443 3232053 3191841 3166645 3172555 3153586 3104956 3169190 3186437
15298 3186437 3163150 3415109 3442103 3364831 3370451 3361224 3453000 3503968 3230593 3152709 3251273
15287 3251273 3240864 3204798 3142333 3151625 3096604 3189063 3274663 3329490 3145896 3193421 3354422
15276 3354422 3419546 3387855 3428407 3440291 3284258 3202689 3252038 3220275 3089910 3127594 3113207
15265 3113207 3195441 3200938 3089612 3203894 3206449 3126641 3138601 2839969 2939969 3193767 3297372
15254 3297372 3454597 3452003 3267040 3261312 3188225 3194212 3295539 3377276 3402489 3269179 3281242
15243 3281242 3193902 3062818 3170927 3358307 3432876 3317409 3310535 3258903 3144396 3221531
15233 3221531 3109803 3112431 3119857 3036799 3107234 3383413 3358349 3193586 3250936 3157198 3112537
15222 3112537 3166371 3180476 3228503 3430257 3399108 3381159 3107849 3124143 3099117 3297376 3329905
15211 3329905 3481912 3393816 3433012 3392423 3204656 3394186 3404951 3522772 3758018 3649578
15201 3649578 3338426 3157019 2967158 2977503 3009291 3186838 3280006 3303881 3237628 3077513
15191 3077513 3263708 3242537 3080219 3132935 3245793 3343344 3228769 3389475 3288158 3424975
15181 3424975 3285354 3224461 3209654 3232896 3171543 3386166 3452170 3452327 3295402 3198486 3392602
15170 3392602 3288384 3327962 3437830 3233251 3205495 3269764 3402564 3418794 3345617 3310536
15160 3310536 3267623 3344251 3239793 3257131 3353046 3310708 3209009 3223098 3202133 3197552 3122360
15149 3122360 3178386 3240702 3125483 3312546 3496238 3405067 3470795 3444483 3277097 3135709
15139 3135709 3245524 3352021 3421322 3244437 3311069 3524341 3436686 3433169 3333066 3368881
15129 3368881 3373513 3516711 3431973 3338652 3493293 3150441 3350765 3331603 3409194 3249783
15119 3249783 3376621 3271723 3263003 3451538 3179028 3126146 3257373 3332475 3247987 3336435
15109 3336435 3330328 3124120 3253069 3328629 3297506 3424993 3313410 3283184 3387201 3324926
15099 3324926 3316613 3228157 3184014 3367864 3387500 3334506 3227655 3343007 3313305 3403087 3314310
15088 3314310 3166213 3146405 3181927 3351884 3276773 3194649 3272808 3142165 3159582 3133956 3325903
15077 3325903 3238690 3457855 3417328 3279095 3246480 3366964 3415705 3574915 3475625 3360353
15067 3360353 3216830 3142953 3145776 3255823 3624998 3429835 3225324 3418437 3239881 2925550
15057 2925550 3103183 3285764 3275010 3272225 3270034 3128225 3077618 3096735 3096397 3139631 3111884
15046 3111884 3198530 3557819 3558516 3546456 3309116 3305900 3237627 3239432 3377693 3396353 3263070
15035 3263070 3408276 3448487 3334580 3347898 3279401 3270502 3477576 3412319 3315395 3316936 3348760
15024 3348760 3324199 3233539 3208797 3235980 3381452 3295818 3390298 3426740 3145188 3237093 3332185
15013 3332185 3384897 3259711 3228873 3225418 3355684 3158557 3166381 3265448 3369800 3178475 3005617
15002 3005617 3330418 3519227 3345010 3333648 3362131 3234264 3303924 3334201 3407147 3172785
14992 3172785 3225895 3424852 3503891 3379706 3260672 3397778 3358350 3454537 3567552 3425383
14982 3425383 3285399 3117811 3063385 3203532 3203508 3114348 3312795 3348686 3399106 3288531 3133425
14971 3133425 3193565 3417221 3483436 3578224 3374723 3386980 3402774 3175563 3316817 3281179
14961 3281179 3100275 3137339 3270284 3323975 3239558 3157819 3160510 3241429 3315047 3292339 3413010
14950 3413010 3558864 3438076 3488348 3276744 3252338 3227460 3539713 3389953 3269444 3468720
14940 3468720 3315037 3595594 3664528 3315415 3317598 3548900 3482419 3533053 3460771 3482194 3489464
14929 3489464 3400409 3427636 3490645 3445244 3440186 3391738 3438368 3418759 3297875 3550962 3513662
14918 3513662 3404328 3404618 3343851 3344867 3278651 3366467 3419950 3485708 3422634 3375757 3490627
14907 3490627 3423231 3392412 3444718 3549450 3450317 3316766 3468869 3395229 3549513 3486274
14897 3486274 3268068 3245842 3171376 3171769 3094757 3248851 3415720 3340504 3500150 3355497 3304790
14886 3304790 3428117 3369392 3382049 3448234 3635489 3664924 3572766 3591277 3322650 3396653 3440155
14875 3440155 3275179 3269440 3364608 3360008 3282683 3532441 3651095 3473043 3404832 3567909 3547442
14864 3547442 3512094 3525833 3484388 3369739 3358968 3563669 3595008 3433073 3388847 3653890
14854 3653890 3479302 3374701 3355617 3321785 3561259 3601344 3470427 3281899 3370221 3307308
14844 3307308 3234813 3331706 3397803 3340901 3369900 3262774 3324148 3327995 3435199 3566292 3648695
14833 3648695 3386798 3377224 3467016 3331894 3416590 3308883 3353686 3349562 3275744 3220191 3278883
14822 3278883 3141455 3347411 3444077 3632243 3431904 3224720 3217564 3228472 3379117 3249466
14812 3249466 3314229 3277502 3445235 3516364 3349724 3209325 3384168 3430460 3309535 3275917
14802 3275917 3209700 3356780 3376648 3440141 3344765 3334041 3358164 3221179 3290285 3515764 3453023
14791 3453023 3367616 3221573 3148213 3360524 3271054 3447490 3340296 3240617 3367432 3495548
14781 3495548 3442504 3454355 3475699 3444938 3303137 3270396 3411568 3552256 3513307 3570924 3493952
14770 3493952 3382897 3203525 3362616 3297538 3346558 3459043 3219345 3359450 3662937 3643808
14760 3643808 3692525 3582205 3448743 3516279 3470307 3458933 3530564 3668073 3625754 3547961 3370785
14749 3370785 3201558 3204599 3378648 3406024 3531768 3483943 3573404 3435386 3541652 3615313
14739 3615313 3389185 3329909 3366829 3388433 3380002 3530018 3610470 3385882 3378098 3529101 3640545
14728 3640545 3557527 3585304 3459662 3408025 3343704 3413579 3552960 3529624 3576711 3582046 3497317
14717 3497317 3449855 3261336 3252434 3472686 3474644 3244028 3165103 3015112 3140073 3270667
14707 3270667 3324757 3334417 3202074 3270138 3505016 3581367 3385566 3306672 3402812 3390836 3103328
14696 3103328 3219517 3450232 3396161 3377232 3720416 3538847 3402319 3504557 3552817 3580280
14686 3580280 3528425 3201467 3453829 3740592 3561387 3583191 3420715 3320710 3449021 3685246
14676 3685246 3659808 3630120 3525967 3810275 3685836 3583943 3502416 3381566 3512927 3629147
14666 3629147 3608412 3482381 3537985 3424724 3475027 3433651 3514709 3417443 3361973 3484646 3360571
14655 3360571 3317677 3514851 3587191 3587380 3573224 3509057 3531173 3685155 3714136 3621968 3715502
$$ [...]
##END NTUPLES=NMR SPECTRUM
##END=
