##TITLE=1H_EC-3293(II-33)
 CDCl3
 8 sc, 
 14.4.2023
##JCAMPDX= 6.0         $$ Bruker NMR JCAMP-DX V2.0
##DATA TYPE= NMR SPECTRUM
##DATA CLASS= NTUPLES
##ORIGIN= UXNMR, Bruker Analytische Messtechnik GmbH
##OWNER= root
$$ XWIN-NMR		Version 3.5
$$ Fri Apr 14 14:29:15 2023 Russian Standard Time (UT+4h)  she@DPX200
##.OBSERVE FREQUENCY= 200.13135
##.OBSERVE NUCLEUS= ^1H
##.ACQUISITION MODE= SIMULTANEOUS
##.ACQUISITION SCHEME= undefined
##.AVERAGES= 8
##.DIGITISER RES= 18
##SPECTROMETER/DATA SYSTEM= spect
##.PULSE SEQUENCE= zg30
##.SOLVENT NAME= CDCl3
##.SHIFT REFERENCE= (INTERNAL, CDCl3, 0, 15.7315)
##AUDIT TRAIL= $$ (NUMBER, WHEN, WHO, WHERE, WHAT)
$$ ##TITLE= Audit trail, XWIN-NMR		Version 3.5
$$ ##JCAMPDX= 5.01
$$ ##ORIGIN= Bruker BioSpin GmbH
$$ ##OWNER= she
$$ F:/spectra/data/she/nmr/H-F/1/pdata/1/auditp.txt
$$ ##AUDIT TRAIL=  $$ (NUMBER, WHEN, WHO, WHERE, WHAT)
(   1,<2023-04-14 14:27:58.32 +0400>,<she>,<DPX200>,
      <created by zg, POWCHK disabled, PULCHK disabled
       configuration hash MD5:
       00 E9 B6 7A A2 85 ED C7 34 08 36 98 17 FE 4E 26
       data hash MD5: 16K
       93 A5 9E 40 C6 7D 6F 0B AA 94 4F BF 1D 5F 44 BD>)
(   2,<2023-04-14 14:28:03.34 +0400>,<she>,<DPX200>,
      <Start of raw data processing
       efp BC_mod = 2 LB = 0.24 FT_mod = 6 PKNL = 1 PHC0 = -19837.92 PHC1 = 17.00081 SI = 16K 
       data hash MD5: 16K
       19 46 71 64 F1 F4 A8 1A 2D EA 12 8C A4 B0 FE 76>)
(   3,<2023-04-14 14:28:17.96 +0400>,<she>,<DPX200>,
      <pk PHC0 = 5.857982 PHC1 = -4.8 
       data hash MD5: 16K
       1B 5A CF AB 74 0A 01 8D DC E0 C4 00 BC FD 6C 58>)
(   4,<2023-04-14 14:28:21.28 +0400>,<she>,<DPX200>,
      <abs ABSG = 5 
       data hash MD5: 16K
       D7 CB 02 1E 8A BA FD 2C B5 F3 B9 6E BD 3E 28 7B>)
$$ ##END=
$$ 
$$ hash MD5
$$ E9 5C 5F 2B 86 4C 11 5A 9A 57 35 BC 72 34 A9 E9
##$RELAX= 
##$RELAX= 
##$RELAX= 
##$RELAX= 
##$RELAX= 
##$RELAX= 
$$ Bruker specific parameters
$$ --------------------------
##$DU= <F:/spectra>
##$EXPNO= 1
##$NAME= <H-F>
##$PROCNO= 1
##$TYPE= <nmr>
##$USER= <she>
##$AMP= (0..31)
100 100 100 100 100 100 100 100 100 100 100 100 100 100 100 100 100 100 
100 100 100 100 100 100 100 100 100 100 100 100 100 100 
##$AQSEQ= 0
##$AQ_mod= 1
##$AUNM= <au_zg>
##$AUTOPOS= <>
##$BF1= 200.13
##$BF2= 200.13
##$BF3= 200.13
##$BF4= 200.13
##$BF5= 200.13
##$BF6= 200.13
##$BF7= 200.13
##$BF8= 200.13
##$BYTORDA= 1
##$CFDGTYP= 0
##$CFRGTYP= 5
##$CHEMSTR= <none>
##$CNST= (0..31)
1 1 145 1 1 1 1 1 1 1 1 1 1 1 1 1 1 1 1 1 1 1 1 1 1 1 1 1 1 1 1 1 
##$CPDPRG= <>
##$CPDPRG1= <>
##$CPDPRG2= <>
##$CPDPRG3= <>
##$CPDPRG4= <mlev>
##$CPDPRG5= <mlev>
##$CPDPRG6= <mlev>
##$CPDPRG7= <mlev>
##$CPDPRG8= <mlev>
##$CPDPRGB= <>
##$CPDPRGT= <>
##$D= (0..31)
0 1.2 0 0 0 0 0 0 0 0.06 0 0.03 0 0 0 0 0.0002 0 0 0 0 0 0 0 0 0 0 0 0 
0 0 0 
##$DATE= 1681468077
##$DBL= (0..7)
120 120 120 120 120 120 120 120 
##$DBP= (0..7)
150 150 150 150 150 150 150 150 
##$DBP07= 0
##$DBPNAM0= <>
##$DBPNAM1= <>
##$DBPNAM2= <>
##$DBPNAM3= <>
##$DBPNAM4= <>
$$ [...]
##$SUBNAM3= <"">
##$SUBNAM4= <"">
##$SUBNAM5= <"">
##$SUBNAM6= <"">
##$SUBNAM7= <"">
##$SUBNAM8= <"">
##$SUBNAM9= <"">
##$SW= 18.05172834244
##$SWIBOX= (0..15)
0 0 2 0 0 0 0 0 0 0 0 0 0 0 0 0 
##$SW_h= 3612.71676300578
##$TD= 16384
##$TD0= 1
##$TE= 0
##$TE2= 300
##$TE3= 300
##$TEG= 300
##$TL= (0..7)
0 120 120 120 120 120 120 120 
##$TP= (0..7)
150 150 150 150 150 150 150 150 
##$TP07= 0
##$TPNAME0= <>
##$TPNAME1= <>
##$TPNAME2= <>
##$TPNAME3= <>
##$TPNAME4= <>
##$TPNAME5= <>
##$TPNAME6= <>
##$TPNAME7= <>
##$TPOAL= (0..7)
0.5 0.5 0.5 0.5 0.5 0.5 0.5 0.5 
##$TPOFFS= (0..7)
0 0 0 0 0 0 0 0 
##$TUNHIN= 0
##$TUNHOUT= 0
##$TUNXOUT= 0
##$USERA1= <user>
##$USERA2= <user>
##$USERA3= <user>
##$USERA4= <user>
##$USERA5= <user>
##$V9= 5
##$VALIST= <valist>
##$VCLIST= <CCCCCCCCCCCCCCC>
##$VD= 0
##$VDLIST= <DDDDDDDDDDDDDDD>
##$VPLIST= <PPPPPPPPPPPPPPP>
##$VTLIST= <TTTTTTTTTTTTTTT>
##$WBST= 1024
##$WBSW= 4
##$XGAIN= (0..3)
0 0 0 0 
##$XL= 0
##$YL= 0
##$YMAX_a= 52361
##$YMIN_a= -72930
##$ZGOPTNS= <>
##$ZL1= 120
##$ZL2= 120
##$ZL3= 120
##$ZL4= 120
##$ABSF1= 15.73146
##$ABSF2= -2.32039
##$ABSG= 5
##$ABSL= 3
##$ALPHA= 0
##$AQORDER= 0
##$ASSFAC= 0
##$ASSFACI= 0
##$ASSFACX= 0
##$ASSWID= 0
##$AUNMP= <proc_1d>
##$AZFE= 0.1
##$AZFW= 0.1
##$BCFW= 0
##$BC_mod= 2
##$BYTORDP= 0
##$COROFFS= 0
##$CY= -3
##$DATMOD= 1
##$DC= 0
##$DFILT= <>
##$DTYPP= 0
##$F1P= 0
##$F2P= 0
##$FCOR= 1
##$FTSIZE= 16384
##$FT_mod= 6
##$GAMMA= 0
##$GB= 0
##$INTBC= 1
##$INTSCL= 3.70164e-10
##$ISEN= 128
##$LB= 0.24
##$LEV0= 0
##$LPBIN= 0
##$MAXI= 10000
##$MC2= 0
##$MEAN= 0
##$ME_mod= 0
##$MI= 1.114404
##$NCOEF= 0
##$NC_proc= -9
##$NLEV= 6
##$NOISF1= 3.799351
##$NOISF2= 2.8
##$NSP= 0
##$NTH_PI= 0
##$NZP= 0
##$OFFSET= 15.73146
##$PC= 1
##$PHC0= -19832.06
##$PHC1= 12.20081
##$PH_mod= 1
##$PKNL= yes
##$PPARMOD= 0
##$PSCAL= 0
##$PSIGN= 0
##$REVERSE= no
##$SF= 200.130008020123
##$SI= 16384
##$SIGF1= 3
##$SIGF2= 2
##$SINO= 5.538805
##$SIOLD= 16384
##$SREGLST= <1H.CDCl3>
##$SSB= 0
##$STSI= 16384
##$STSR= 0
##$SW_p= 3612.71676300578
##$SYMM= 0
##$S_DEV= 0
##$TDeff= 16384
##$TDoff= 0
##$TI= <>
##$TILT= no
##$TM1= 0
##$TM2= 0
##$TOPLEV= 0
##$USERP1= <user>
##$USERP2= <user>
##$USERP3= <user>
##$USERP4= <user>
##$USERP5= <user>
##$WDW= 1
##$XDIM= 16384
##$YMAX_p= 473793224
##$YMIN_p= -3247475
$$ End of Bruker specific parameters
$$ ---------------------------------
##NTUPLES= NMR SPECTRUM
##VAR_NAME=  FREQUENCY,     SPECTRUM/REAL,   SPECTRUM/IMAG
##SYMBOL=    X,             R,               I
##VAR_TYPE=  INDEPENDENT,   DEPENDENT,       DEPENDENT
##VAR_FORM=  AFFN,          ASDF,            ASDF
##VAR_DIM=   16384,         16384,           16384
##UNITS=     HZ,            ARBITRARY UNITS, ARBITRARY UNITS
##FACTOR=    0.220516191357247, 1,           1
##FIRST=     3148.33713944148, 0,            0
##LAST=      -464.3796235643, 0,             0
##MIN=       -464.3796235643, -3247475,      0
##MAX=       3148.33713944148, 473793224,    0
$$ Real data points
##PAGE= N=1
##DATA TABLE= (X++(R..R)), XYDATA
$$ [...]
$$ plain form
4844 2160004 2583967 2423405 1600648 1852252 2972744 2584307 2796387 2865667 2342025 3795179
4834 3795179 2842733 2610858 2989354 2768111 3789134 3236297 3533899 3492789 3541776 3487423
4824 3487423 2966507 3576605 4798945 4116088 4896751 5072613 5936742 6402385 7133536
4815 7133536 7238341 7815541 7982725 7373875 6909647 5827457 6029888 5070223 4922623
4806 4922623 3985859 4341428 2443636 2358518 4543253 5497850 5247453 4447791 4849269
4797 4849269 5158509 5896805 4728534 5217676 6241273 6538671 5658132 5988398 3913376
4788 3913376 4275045 5595538 5422478 3894544 3359166 3470727 2662062 2941745 2937317 3270073
4778 3270073 3012915 1880532 2410849 2205339 2231075 2868989 3565883 2840137 3701660 3021470
$$ packed form
4844B160004M23963j60562q22757K51604J120492l88437K12080O9280n23642J453154
4834C795179r52446k31875L78496k21243J021023n52837K97602m1110M8987n4353
4824C487423n20916O10098J222340o82857P80663J75862Q64129M65643P31151
4815G133536J04805N77200J67184o08850m64228j082190K02431r59665j47600
4806D922623r36764L55569j897792q5118K184735R54597k50397p99662M01478
4797D849269L09240P38296j168271M89142J023597K97398q80539L30266k075022
4788C913376L61669J320493j73060j527934n35378J11561q08665K79683m428L32756
4778C270073k57158j132383N30317k05510K5736O37914O96894p25746Q61523o80190
$$ plain form
4768 3021470 3184228 2160323 1769487 1309498 2213074 3021374 2427301 3659809 3462492
4759 3462492 4538024 5589209 5149704 4519623 3457256 2889177 3034617 3150880 3755079
4750 3755079 3223067 1884659 2407354 2682156 3453806 4379350 3354175 2733677 3806004
4741 3806004 5482685 4391286 3265140 3891415 4292789 3214631 4646674 4367493 4532105
4732 4532105 3724709 4539661 6036956 5733189 4374759 5510655 5218781 5027393 6873056
4723 6873056 6861964 5711193 5491743 6334302 6043775 4619295 4907883 5148890 5261946
4714 5261946 5672691 6005370 6122097 6229480 5780356 6023196 6508514 7022770 6197057 4779672
4704 4779672 5345670 6233262 5883517 4833038 5112310 4776476 3862681 3434550 3582500
$$ packed form
4768C021470J62758j023905l90836m59989R03576Q08300n94073J232508j97317
4759C462492J075532J051185m39505o30081j062367n68079J45440J16263O04199
4750C755079n32012j338408N22695K74802P71650R25544j025175o20498J072327
4741C806004J676681j091399j126146O26275M01374j078158J432043k79181J64612
4732D532105q07396Q14952J497295l03767j358430J135896k91874j91388J845663
4723F873056j1092j150771k19450Q42559k90527j424480K88588K41007J13056
4714E261946M10745L32679J16727J07383m49124K42840M85318N14256q25713j417385
4704D779672N65998Q87592l49745j050479K79272l35834r13795m28131J47950
$$ plain form
4695 3582500 3703101 3387149 2599625 2583317 2859535 3377063 4152330 3362757 2094213 2425081
4685 2425081 3376345 4496676 5427050 5098734 3768701 2867833 2647021 3100449 4133317
4676 4133317 4624122 5302919 3860515 3767096 3865093 3985410 4273220 2639786 1709085 1198523
4666 1198523 2177842 3466220 3852316 3365116 3799278 3705591 3135845 4097046 4574280 2953919
4656 2953919 2420349 2873797 2205948 3820287 5093044 3380032 3277268 3551425 4188368
4647 4188368 3466908 3645435 3436244 1942748 1705428 1156836 1655521 1975534 3673292
4638 3673292 4649502 4996972 4386222 4021511 3410694 3014012 3665653 3464334 3470141 3792578
4628 3792578 3653755 2805489 2567797 3772550 3825985 3524528 2970609 3119821 2336534 1778291
$$ packed form
4695C582500J20601l15952p87524j6308K76218N17528P75267p89573j268544L30868
4685B425081R51264J120331R30374l28316j330033r00868k20812M53428J032868
4676D133317M90805O78797j442404r3419R7997J20317K87810j633434r30701n10562
4666A198523R79319J288378L86096m87200M34162r3687n69746R61201M77234j620361
4656B953919n33570M53448o67849J614339J272757j713012j02764K74157O36943
4647D188368p21460J78527k09191j493496k37320n48592M98685L20013J697758
4638C673292R76210L47470o10750l64711o10817l96682O51641k01319N807L22437
4628C792578j38823q48266k37692J204753N3435l01457n53919J49212p83287n58243
$$ plain form
4618 1778291 1571006 2079121 3418612 2481836 2997090 1950361 1319079 3319198 2080451
4609 2080451 1215010 2370436 3671336 3467536 2928207 3317514 2261923 1636495 800687
4600 800687 1585471 2547191 3050844 3844764 3640700 4604890 4572269 4251788 3988973 2398262
4590 2398262 3618210 3680156 3432947 3550048 4799344 3603307 3269010 4201928 2971155
4581 2971155 2532522 4005245 3660513 3323214 4393353 4446256 3841550 3936519 3264029 2008802
4571 2008802 2525243 2421226 2410169 2990645 2148925 3221898 4180200 3837675 3924374 3597512
4561 3597512 3363798 4085742 3720631 2990793 4593849 4865408 4385563 4398539 5794596
4552 5794596 4986886 4336712 4344129 5054497 5429499 5561745 6363532 6075078 4650244 5244882
$$ packed form
4618A778291k07285N08115J339491r36776N15254j046729o31282K000119j238747
4609B080451q65441J155426J300900k03800n39329L89307j055591o25428q35808
4600H00687P84784R61720N03653P93920k04064R64190l2621l20481k62815j590711
4590B398262J219948O1946k47209J17101J249296j196037l34297R32918j230773
4581B971155m38633J472723l44732l37299J070139N2903o04706R4969o72490j255227
4571B008802N16441j04017j1057N80476q41720J072973R58302l42525Q6699l26862
4561C597512k33714P21944l65111p29838J603056K71559m79845J2976J396057
4552E794596q07710o50174P417P10368L75002J32246Q01787k88454j424834N94638
$$ plain form
4542 5244882 6462243 7248557 7196873 5953982 5746390 5597905 6262880 5976294 5308515
4533 5308515 5168427 5072432 5450364 6376004 7035404 7180646 6905084 7652798 6886632 7208200
4523 7208200 8026837 8184868 7301083 7518120 8314013 7986674 7900833 7807016 8685081 8055476
4513 8055476 8585023 10041436 9550120 10557060 10458604 9160947 9112990 9595917 10486822
4504 10486822 11758016 13069006 12990270 12820337 13298287 13976441 13905584 13632645 14160754
4495 14160754 15686250 16483263 17910208 19050555 19368246 21293614 23839436 25512754
4487 25512754 26419649 28610955 30572372 33136576 35944571 39797183 43060583 46290982
4479 46290982 48425504 47867647 47239043 45002875 42338655 40786361 37628056 35434211
$$ packed form
4542E244882J217361P86314n1684j242891k07592j48485O64975k86586o67779
4533E308515j40088r5995L77932R25640O59400J45242k75562P47714p66166L21568
4523G208200Q18637J58031q83785K17037P95893l27339q5841r3817Q78065o29605
4513H055476N29547J456413m91316J006940r8456j297657m7957M82927Q90905
4504A0486822J271194J310990p8736j69933M77950O78154p0857k72939N28109
4495A4160754J525496P97013J426945J140347L17691J925368K545822J673318
4487B5512754R06895K191306J961417K564204K807995L852612L263400L230399
4479D6290982K134522n57857o28604k236168k664220j552294l158305k193845
$$ plain form
4471 35434211 33917501 32711280 32443461 32136207 31953064 31014543 30887441 29573488 29685491
4462 29685491 29710454 28180654 27048552 28158639 27912289 26299190 25832784 25923126 26510785
4453 26510785 26439591 25751158 26233424 26322304 25794270 26051599 27639794 27890203 27803493 27586618
4443 27586618 29237486 30031422 29636664 30873117 30081084 29876081 30291209 30921301 30711659
4434 30711659 30813419 31824663 31024327 29984789 30043774 29941188 29420646 28468531 27515208
4425 27515208 26331328 24025394 22747118 22021534 20294225 18617580 19369204 18350654
4417 18350654 17175335 16272700 16394537 16398719 17393509 16105757 16311858 16901086 15597126
4408 15597126 14168330 14591666 14643903 16441566 18631217 19050020 17865563 17929502 18266350
$$ packed form
4471C5434211j516710j206221k67819l07254j83143r38521j27102j313953J12003
4462B9685491K4963j529800j132102J110087k46350j613099m66406R0342N87659
4453B6510785p1194o88433M82266Q8880n28034K57329J588195K50409q6710k16875
4443B7586618J650868P93936l94758J236453p92033k05003M15128O30092k09642
4434C0711659J01760J011244q00336j039538N8985j02586n20542r52115r53323
4425B7515208j183880k305934j278276p25584j727309j676645P51624j018550
4417A8350654j175319r02635J21837M182R94790j287752K06101N89228j303960
4408A5597126j428796M23336N2237J797663K189651M18803j184457O3939L36848
$$ plain form
4399 18266350 19105756 20646674 22252659 23307100 22490763 22291263 20362860 20760034 21611428
4390 21611428 20287256 17915973 18475791 18152185 16229024 16251994 16983139 15484252 15817706
4381 15817706 15315604 14837016 15130455 14695472 14942224 15543501 15262143 14939713 14764054
4372 14764054 15230494 15692980 17053870 15917843 15952512 16275208 16988991 16882640 17734572
4363 17734572 17879035 17042405 17645161 19150368 19631958 20215638 20984629 22215044 23006395
4354 23006395 24421213 25781754 25685879 27908121 28861302 29609956 30450809 30160006 31780643
4345 31780643 33371420 32949479 33007115 33811102 34764626 33802441 33963514 33598208 32633583
4336 32633583 32642752 32586290 32009889 30611392 30920409 30937232 30781226 30038283 29533763 28214786
$$ packed form
4399A8266350Q39406J540918J605985J054441q16337j99500j928403L97174Q51394
4390B1611428j324172k371283N59818l23606j923161K2970P31145j498887L33454
4381A5817706n02102m78588K93439m34983K46752O01277k81358l22430j75659
4372A4764054M66440M62486J360890j136027L4669L22696P13783j06351Q51932
4363A7734572J44463q36630O02756J505207M81590N83680P68991J230415P91351
4354B3006395J414818J360541r5875K222242R53181P48654Q40853k90803J620637
4345C1780643J590777m21941N7636Q03987R53524r62185J61073l65306r64625
4336C2633583R169n6462n76401j398497L09017J6823j56006p42943n04520j318977
$$ plain form
4326 28214786 28979991 28768004 29192431 29315585 28384977 28307420 29394649 30269409 31058976
4317 31058976 31439531 31281909 32377523 31990667 32045948 30199352 29910563 30571535 30915495
4308 30915495 30966155 30505778 30587186 30132700 29147753 29215519 29998186 29092930 28586412 29323454
4298 29323454 28344213 28264087 28211233 28241753 28865932 28364023 27682525 27559355 26200225 25145361
4288 25145361 23078631 22433426 23222966 22870607 20996902 21304493 21909933 23378723 23295573
4279 23295573 22188114 22214680 22708433 22229037 22025883 22862850 23147741 22908818 23609699
4270 23609699 23448453 23692608 24217771 24700883 24423799 24240545 25639895 25382409 25301272
4261 25301272 26759151 27458976 25802575 26056358 26887966 28263343 28268312 27388218 26507685
$$ packed form
4326B8214786P65205k11987M24427J23154r30608p7557J087229Q74760P89567
4317C1058976L80555j57622J095614l86856N5281j846596k88789O60972L43960
4308C0915495N0660m60377Q1408m54486r84947O7766P82667r05256n06518P37042
4298B9323454r79241q0126n2854L0520O24179n01909o81498j23170j359130j054864
4288B5145361k066730o45205P89540l52359j873705L07591O05440J468790q3150
4279B3295573j107459K6566M93753m79396k03154Q36967K84891k38923P00881
4270B3609699j61246K44155N25163M83112k77084j83254J399350k57486q1137
4261B5301272J457879O99825j656401K53783Q31608J375377M969q80094q80533
$$ plain form
4252 26507685 26858903 26561411 27036290 27390265 27717225 28201292 27941339 27178663 27985437
4243 27985437 28170875 27522494 29087031 29187488 28656683 28672342 28681068 29826575 30083302 30602175
4233 30602175 29900630 29784259 29466086 28246685 27978907 27579690 27935354 27366405 27521174
4224 27521174 27726521 27951178 28089142 26973939 26961843 27150298 27845170 28472728 27931251
4215 27931251 27918384 26801167 26468197 26431092 26130177 25363509 25485798 26233050 25123312
4206 25123312 25360155 25569275 26349253 26160549 25172325 25369816 26118819 26766542 25995387
4197 25995387 25895061 25751994 25599509 24745462 25720348 26189699 26866075 27321132 27636123
4188 27636123 26524471 26721377 27388441 28069672 26719451 26138132 25932282 26162936 24730182
$$ packed form
4252B6507685L51218k97492M74879L53975L26960M84067k59953p62676Q06774
4243B7985437J85438o48381J564537J00457n30805J5659Q726J145507K56727N18873
4233C0602175p01545j16371l18173j219401k67778l99217L55664n68949J54769
4224B7521174K05347K24657J37964j115203j2096J88455O94872O27558n41477
4215B7931251j2867j117217l32970l7105l00915p66668J22289P47252j109738
4206B5123312K36843K09120P79978j88704r88224J97491P49003O47723p71155
4197B5995387j00326j43067j52485q54047R74886M69351O76376M55057L14991
4188B7636123j111652J96906O67064O81231j350221n81319k05850K30654j432754
$$ plain form
4179 24730182 23323121 23538367 23267203 23866152 23052226 23850625 23526326 22707950 21923645
4170 21923645 21960896 23327857 22812329 22586595 22947064 22031071 23841495 24605777 24519505
4161 24519505 23551375 24192673 24741872 22875646 23457969 23849236 23681513 24492608 25507135
4152 25507135 24792421 24150657 23771475 23021487 22753392 23290513 23155649 23417264 23814856
4143 23814856 24043140 25057086 25318544 24751261 23851311 23409742 23776892 23380149 24993050
4134 24993050 24886433 24537374 25597614 25736276 25624882 25203681 26126713 27350965 28071284
4125 28071284 28291888 29189110 29457733 30980394 30392142 31863019 31993555 32256333 32943197
4116 32943197 34031945 35531213 35440095 35947891 36696183 38394730 40614031 41235673 42186654
$$ packed form
4179B4730182j407061K15246k71164N98949q13926P98399l24299q18376p84305
4170B1923645L7251J366961n15528k25734L60469r15993J810424P64282q6272
4161B4519505r68130O41298N49199j866226N82323L91267j67723Q11095J014527
4152B5507135p14714o41764l79182p49988k68095N37121j34864K61615L97592
4143B3814856K28284J013946K61458n67283q99950m41569L67150l96743J612901
4134B4993050j06617l49059J060240J38662j11394m21201R23032J224252P20319
4125B8071284K20604Q97222K68623J522661n88252J470877J30536K62778O86864
4116C2943197J088748J499268r1118N07796P48292J698547K219301O21642R50981
$$ plain form
4107 42186654 42830806 43875515 44310911 45565526 48058161 51638813 53908392 56650110
4099 56650110 60706856 63804826 68272349 72325530 78573012 85524157 92168428 102607035
4091 102607035 113252095 124613679 134612067 143920755 150701270 150462648 145951178 139167095
4083 139167095 132019758 122810922 114692422 106534334 98672090 91613254 82853587 77000924
4075 77000924 71061789 65042232 61277437 59070910 58102411 55271792 52807094 51404267
4067 51404267 49789707 48422849 47535211 46915355 46128849 43821841 43122120 42461282 41554202
4058 41554202 41498500 40720262 39157784 38840931 38154835 38115958 38768493 38769827 38745138 38788537
4048 38788537 39189702 39046716 38642786 38035216 37853517 39713963 40523153 41005192 41465468
$$ packed form
4107D2186654O44152J044709M35396J254615K492635L580652K269579K741718
4099E6650110M056746L097970M467523M053181O247482O951145O644271J0438607
4091A02607035J0645060J1361584R998388R308688O780515k38622m511470o784083
4083A39167095p147337r208836q118500q158088p862244p058836q759667n852663
4075G7000924n939135o019557l764795k206527r68499k830619k464698j402827
4067E1404267j614560j366858q87638o19856p86506k307008o99721o60838r07080
4058D1554202n5702p78238j562478l16853o86096l8877O52535J334k4689M3399
4048C8788537M01165j42986m03930o07570j81699J860446Q09190M82039M60276
$$ plain form
4039 41465468 42881807 43195501 41648486 41309255 41903726 42662270 42467135 43060761 43755930
4030 43755930 44196168 44650848 45720829 47171813 48051717 49444046 48943168 50308159 51639850
4021 51639850 52992995 55675288 56501874 56440667 56394851 58678775 61480718 63518179 65502422
4012 65502422 68160560 69823751 71712324 73103825 74065481 76191533 78548096 81300662
4004 81300662 83251016 85373218 87944605 89884393 93777347 95572271 97132162 100032352
3996 100032352 101869307 104495613 106412750 107751964 108586734 110230644 111415295 112574224
3988 112574224 114025736 115170398 115580059 116731583 117901358 120716695 119637412 119332100
3980 119332100 122655431 123781395 121623993 122267872 123546072 122895478 122548226 122403308 123090607
$$ packed form
4039D1465468J416339L13694j547015l39231N94471P58544j95135N93626O95169
4030D3755930M40238M54680J069981J450984Q79904J392329n00878J364991J331691
4021E1639850J353145K682293Q26586o1207m5816K283924K801943K037461J984243
4012F5502422K658138J663191J888573J391501R61656K126052K356563K752566
4004H1300662J950354K122202K571387J939788L892954J794924J559891K900190
3996A00032352J836955K626306J917137J339214Q34770J643910J184651J158929
3988A12574224J451512J144662M09661J151524J169775K815337j079283l05312
3980A19332100L323331J125964k157402O43879J278200o50594l47252j44918O87299
$$ plain form
3971 123090607 122335343 121748260 120095242 119709968 119689285 119123319 117307352 115121325 113500086
3962 113500086 111566741 110403775 109361412 108962807 107102149 104635511 104343727 104449967
3954 104449967 103229096 102393468 100608635 99365292 98684120 98169094 97838911 97966591 97450101
3945 97450101 97470276 97723184 97715423 99250051 100044741 101098481 102474884 104276946 106409394
3936 106409394 109292243 112464035 114722024 116555596 120712764 121675657 124376118 127688696
3928 127688696 130191254 135257198 140366954 144134167 147916861 149278752 150795760 153236895
3920 153236895 154906259 155278702 155070584 155231072 155623953 156229916 157878280 158579089 160039826
3911 160039826 160081692 160659232 161420467 161846751 162905572 163325710 162269002 161702455 161913529
$$ packed form
3971A23090607p55264n87083j653018l85274k0683n65966j815967k186027j621239
3962A13500086j933345j162966j042363l98605j860658k466638k91784J06240
3954A04449967j220871q35628j784833j243343o81172n15026l30183J27680n16490
3945I7450101K0175K52908p761J534628P94690J053740J376403J802062K132448
3936A06409394K882849L171792K257989J833572M157168R62893K700461L312578
3928A27688696K502558N065944N109756L767213L782694J361891J517008K441135
3920A53236895J669364L72443k08118J60488L92881O05963J648364P00809J460737
3911A60039826M1866N77540P61235M26284J058821M20138j056708n66547K11074
$$ plain form
3902 161913529 160147339 160254307 159800603 159149659 158965626 159913259 161407702 161942666 164826722
3893 164826722 168017051 171805654 175450667 178299759 184341364 186334154 186967810 187658644
3885 187658644 187615299 185253991 180974846 179183933 176459667 173010048 170429520 167526877
3877 167526877 163426741 158556109 155901817 152933038 148403531 144268542 140359800 134345733
3869 134345733 129244164 123957229 117592600 110553564 104233505 98120938 93761323 88421313
3861 88421313 84273608 80933530 76948755 73618739 69940341 66516347 64608590 62841277
3853 62841277 60842481 59667705 57708764 55852516 54064923 53164481 52242063 50187376
3845 50187376 49392009 49952749 48401578 48147298 47578829 48379621 46657998 47132433 46697009
$$ packed form
3902A61913529j766190J06968m53704o50944j84033R47633J494443N34964K884056
3893A64826722L190329L788603L645013K849092O041605J992790O33656O90834
3885A87658644m3345k361308m279145j790913k724266l449619k580528k902643
3877A67526877m100136m870632k654292k968779m529507m134989l908742o014067
3869A34345733n101569n286935o364629p039036o320059o112567m359615n340010
3861H8421313m147705l340078l984775l330016l678398l423994j907757j767313
3853F2841277j998796j174776j958941j856248j787593r00442r22418k054687
3845E0187376p95367N60740j551171k54280n68469Q00792j721623M74435m35424
$$ plain form
3836 46697009 44595822 42438602 40978693 41514134 40541912 40116024 40274903 38595344 38062070
3827 38062070 38529930 36597531 36465179 35922690 34751325 33633617 33261656 32813366 33317448
3818 33317448 32874959 32469436 31883164 30848346 30972259 30894255 29431719 28206577 27268731
3809 27268731 27967893 29775467 29364657 28015424 28039128 28857533 28474755 27786851 26965251
3800 26965251 27839140 27617078 27085583 26099262 26401714 26369443 25866257 25398375 25291635 25567379
3790 25567379 25772130 26017863 25468341 24444746 23407231 22842479 23508155 23172764 22565317
3781 22565317 22567359 21928393 22243818 22413894 22347049 23208023 22371691 22933623 22850430 22034724
3771 22034724 22500295 21755128 21976047 22342340 23323873 23575355 22618171 21793235 22333728
$$ packed form
3836D6697009k101187k157220j459909N35441r72222m25888J58879j679559n33274
3827C8062070M67860j932399j32352n42489j171365j117708l71961m48290N04082
3818C3317448m42489m05523n86272j034818J23913p8004j462536j225142r37846
3809B7268731O99162J807574m10810j349233K3704Q18405l82778o87904q21600
3800B6965251Q73889k22062n31495r86321L02452l2271n03186m67882j06740K75744
3790B5567379K04751K45733n49522j023595j037515n64752O65676l35391o07447
3781B2565317K042o38966L15425J70076o6845Q60974q36332N61932q3193q15706
3771B2034724M65571p45167K20919L66293R81533K51482r57184q24936N40493
$$ plain form
3762 22333728 22503267 22426158 22366375 21676115 20717534 21995739 22549681 21927498 21151623 21950444
3752 21950444 21731762 21369259 21277329 20560107 20280857 21052004 22188537 21476711 21417507 22455680
3742 22455680 21161496 20913849 21043528 21359200 21256468 20966429 21243037 21796660 21465968
3733 21465968 20626384 20177827 20617398 20495188 20190631 20908350 21130646 22209507 21622877
3724 21622877 21437120 21315573 21147051 22600726 22095984 21824144 22570524 22809450 21737630
3715 21737630 21574138 21923285 23217088 23272512 23700823 24760867 24626408 25557307 25127998
3706 25127998 24914835 25618290 26534279 26898811 25679010 25450145 27161293 27296865 27168023
3697 27168023 27295832 27502294 28591389 28422375 27794861 29235440 30043884 30428446 30428052 31234886
$$ packed form
3762B2333728J69539p7109n9783o90260r58581J278205N53942o22183p75875P98821
3752B1950444k18682l62503r1930p17222k79250P71147J136533p11826n9204J038173
3742B2455680j294184k47647J29679L15672j02732k90039K76608N53623l30692
3733B1465968q39584m48557M39571j22210l04557P17719K22296J078861n86630
3724B1622877j85757j21547j68522J453675n04742k71840P46380K38926j071820
3715B1737630j63492L49147J293803N5424M28311J060044j34459R30899m29309
3706B5127998k13163P03455R15989L64532j219801k28865J711148J35572j28842
3697B7168023J27809K06462J089095j69014o27514J440579Q08444L84562l94Q06834
$$ plain form
3687 31234886 30952450 30879811 32999467 32543417 32858739 33365399 33439687 34305182 34669881 35947312
3677 35947312 36971400 37235506 37862609 38837133 40131635 41116797 40544067 41499302 43209707
3668 43209707 43485906 44079236 46034314 46875494 48668062 49422466 50314468 51972611 54200745
3659 54200745 55762959 57547363 60396049 62860601 64350978 67813525 70042817 73376361
3651 73376361 78351965 81836648 85190797 88574934 93890994 99642354 104973974 111598406
3643 111598406 117565104 122017127 127130782 131430814 136292299 141419417 146488379 152346643
3635 152346643 157185663 163373174 171729184 178743599 184323599 189780601 196938245 202310296
3627 202310296 208760739 213629931 217139060 220502737 223191418 225804306 225822848 225239470
$$ packed form
3687C1234886k82436p2639K119656m56050L15322N06660P4288Q65495L64699J277431
3677C5947312J024088K64106O27103R74524J294502R85162n72730R55235J710405
3668D3209707K76199N93330J955078Q41180J792568P54404Q92002J658143K228134
3659E4200745J562214J784404K848686K464552J490377L462547K229292L333544
3651G3376361M975604L484683L354149L384137N316060N751360N331620O624432
3643A11598406N966698M452023N113655M300032M861485N127118N068962N858264
3635A52346643M839020O187511Q356010P014415N580000N457002P157644N372051
3627B02310296O450443M869192L509129L363677K688681K612888J8542n83378
$$ plain form
3619 225239470 226440183 227479411 226397355 225783983 225908667 226016643 225840840 224770088 223184581
3610 223184581 219824006 216632922 212100439 206236606 199546088 192509228 186283912 179117645
3602 179117645 172019032 164716861 159729007 154167997 148870442 144483099 139863428 133980584
3594 133980584 127125836 120162660 114739504 108790798 102089439 96535817 92568908 87346650
3586 87346650 82385545 78939905 76073471 71707304 68150434 66244451 63330771 60966485
3578 60966485 58818493 57463580 54493985 52554329 50979625 49789514 49077774 48349726
3570 48349726 47805575 46310840 43716103 42608550 41609804 40765230 41528428 40599935 40064342
3561 40064342 38673255 37970282 37797033 38156667 36217696 33530516 34938804 35080143 33586430
$$ packed form
3619B25239470J200713J039228j082056o13372J24684J07976j75803j070752j585507
3610B23184581l360575l191084m532483n863833o690518p036860o225316p166267
3602A79117645p098613p302171m987854n561010n297555m387343m619671n882844
3594A33980584o854748o963176n423156n948706o701359n553622l966909n222258
3586H7346650m961105l445640k866434m366167l556870j905983k913680k364286
3578F0966485k147992j354913k969595j939656j574704j190111p11740p28048
3570D8349726n44151j494735k594737j107553r98746q44574P63198r28493n35593
3561D0064342j391087p02973j73249L59634j938971k687180J408288J41339j493713
$$ plain form
3552 33586430 33375374 33037697 32548824 32897470 33283869 32844931 31718907 31118819 30077008
3543 30077008 29581629 29904080 29960404 29757037 29177692 28928244 28898864 29084099 28834860 27904294
3533 27904294 27588255 26915038 26535255 25268500 25198876 25011205 25201073 24030481 23577842
3524 23577842 23963457 23448604 23781923 22984728 23147487 23840171 22683135 23242724 22525705
3515 22525705 22385477 20914660 20210198 20311437 21236296 20676782 19681878 19633113 18423942
3506 18423942 19107991 18479177 18331808 18617240 17470015 16393979 16698534 16784680 16642045
3497 16642045 16077666 16167576 15465861 14591995 14013655 13695702 15474250 15662255 13734442
3488 13734442 12955281 14043407 13304996 12822502 13275465 12388739 12599999 13277483 13200568
$$ packed form
3552C3586430k11056l37677m88873L48646L86399m38938j126024o00088j041811
3543C0077008m95379L22451N6324k03367n79345k49448k9380J85235k49239r30566
3533B7904294l16039o73217l79783j266755o9624j87671J89868j170592m52639
3524B3577842L85615n14853L33319p97195J62759O92684j157036N59589p17019
3515B2525705j40228j470817p04462J01239R24859n59514r94904m8765j209171
3506A8423942O84049o28814j47369K85432j147225j076036L04555Q6146j42635
3497A6642045n64379Q9910p01715q73866n78340l17953J778548J88005j927813
3488A3734442p79161J088126p38411m82494M52963q86726K11260O77484p6915
$$ plain form
3479 13200568 11582825 11417912 11832599 11761917 12036270 11852184 12496604 11816448 10890822
3470 10890822 10519641 10916815 11676680 11787197 10990072 11293502 11621743 10999413 11022711 10427565
3460 10427565 9815750 10491033 11117109 10043232 10049346 10320392 11254934 11489664 10015585
3451 10015585 9416468 9275733 8553166 9342853 10100764 9085814 9419779 8793001 8537226
3442 8537226 8748165 9024297 8743542 8518180 8918893 8937764 8847786 8222760 8619746 8334939
3432 8334939 7539597 7608943 7910334 7889226 9278513 10411110 9956903 8526181 7699179
3423 7699179 7447956 8987685 9142719 8798729 7731204 7444560 7992704 8656524 7521649
3414 7521649 7325682 6790917 6950325 6836821 7257973 7782304 6339135 7472108 7733380
$$ packed form
3479A3200568j617743j64913M14687p0682K74353j84086O44420o80156r25626
3470A0890822l71181L97174P59865J10517p97125L03430L28241o22330K3298n95146
3460A0427565o11815O75283O26076j073877O114K71046R34542K34730j474079
3451A0015585n99117j40735p22567P89687P57911j014950L33965o26778k55775
3442H537226K10939K76132k80755k25362M00713J8871q9978o25026L96986k84807
3432H334939p95342O9346L01391k1108J389287J132597m54207j430722q27002
3423G699179k51223J539729J55034l43990j067525k86644N48144O63820j134875
3414G521649j95967n34765J59408j13504M21152N24331j443169J132973K61272
$$ plain form
3405 7733380 8018300 7743587 8055482 8115068 6972243 8012371 7086638 7207073 7173949 6958968
3395 6958968 6705470 7368934 6931656 7032684 6642030 7212665 7801416 7504010 8044447 8167713
3385 8167713 7345771 6456467 7107158 7157942 5905271 5379051 6663393 6186498 6046535
3376 6046535 5498420 5999340 7744334 7431170 7293827 7323917 6686934 7036706 7833524 7438714
3366 7438714 8100279 8758150 7246509 7677682 7314254 7376785 7152479 7120241 8371498 7408498
3356 7408498 6284951 6928463 7348779 7782436 6814235 7246802 7588420 7392957 8440735
3347 8440735 7985698 7729961 8438839 7741942 6893192 6926518 8029544 7473306 7040452 5976093
3337 5976093 6933995 7789236 7911237 7810115 7261803 6874383 7942835 10426727 10705606
$$ packed form
3405G733380K84920k74713L11895N9586j142825J040128r25733J20435l3124k14981
3395F958968k53498O63464m37278J01028l90654N70635N88751k97406N40437J23266
3385H167713q21942q89304O50691N0784j252671n26220J284342m76895j39963
3376F046535n48115N00920J744994l13164j37343L0090o36983L49772P96818l94810
3366G438714O61565O57871j511641M31173l63428O2531k24306l2238J251257r63000
3356G408498j123547O43512M20316M33657r68201M32567L41618j95463J047778
3347H440735m55037k55737P08878o96897q48750L3326J103026n56238m32854j064359
3337E976093R57902Q55241J22001j01122n48312l87420J068452K483892K78879
$$ plain form
3328 10705606 9100939 8040475 8700096 9599360 8239534 7724625 7558381 7772036 8050198
3319 8050198 9225900 9181240 9596690 8751478 8203102 7253107 7458396 9024875 8462019
3310 8462019 7696189 8639572 9168167 9040565 8430273 8478726 8357594 8281659 9801387 9070254
3300 9070254 8964629 9333254 8769921 8919867 9225418 9149724 9413789 8204631 9224582
3291 9224582 9517121 9535944 10422708 9880704 9111685 9262667 10437338 10731917 9924246 9980668
3281 9980668 10039507 9508405 9997107 11498914 12771368 12476172 10902225 12506699 12529094
3272 12529094 12135910 11696711 13520513 13404582 12638675 11800411 12351915 13835211 14939916
3263 14939916 15573248 15626674 17153051 18207342 19214647 19784510 19594852 19502718 19837101
$$ packed form
3328A0705606j604667j060464O59621Q99264j359826n14909j66244K13655K78162
3319H050198J175702m4660M15450q45212n48376r49995K05289J566479n62856
3310H462019p65830R43383N28595j27602o10292M8453j21132p5935J519728p31133
3300I070254j05625L68625n63333J49946L05551p5694K64065j209158J019951
3291I224582K92539J8823Q86764n42004p69019J50982J174671K94579q07671N6422
3281I980668N8839n31102M88702J501807J272454k95196j573947J604474K2395
3272A2529094l93184m39199J823802j15931p65907q38264N51504J483296J104705
3263A4939916O33332N3426J526377J054291J007305N69863j89658r2134L34383
$$ plain form
3254 19837101 21364498 22839474 24694761 24551641 25896875 27927596 27891332 28001565 29084371
3245 29084371 28808500 28685037 29758425 27558490 24895718 23969573 22363771 21660450 20496109
3236 20496109 20003832 19888849 17515326 15971248 15043894 14812543 13822698 14028029 12978898
3227 12978898 13220317 11910180 10609637 11135778 12138372 12851070 11665793 10374763 10403710
3218 10403710 9078132 9418056 8958462 9350843 9651793 8937924 7956036 8166210 8603193
3209 8603193 8952392 8102623 8205794 8535455 9312237 9771269 9162285 8932301 7174640
3200 7174640 6589733 6078629 6023518 4869894 5535735 5558005 5906527 6519630 6586938 7320012
3190 7320012 7010304 7102364 8223379 7941386 7414575 8561371 7458275 6236958 6907378
$$ packed form
3254A9837101J527397J474976J855287j43120J345234K030721l6264J10233J082806
3245B9084371k75871j23463J073388k199935k662772r26145j605802p03321j164341
3236B0496109m92277j14983k373523j544078r27354k31351r89845K05331j049131
3227A2978898K41419j310137j300543N26141J002594P12698j185277j291030K8947
3218A0403710j325578L39924m59594L92381L00950p13869r81888K10174M36983
3209H603193L49199q49769J03171L29661P76782M59032o08984k29984j757661
3200G174640n84907n11104n5111j153624O65841K2270L48522O13103O7308P33074
3190G320012l09708R2060J121015k81993n26811J146796j103096j221317O70420
$$ plain form
3181 6907378 6655916 6085494 6531330 5757273 5159359 5931980 6372556 7023947 6465026 6199623
3171 6199623 6576752 7289716 7097729 6950204 6710850 6160553 6291391 6340420 6579953 6725053
3161 6725053 6176222 6876780 7295349 7967701 7102172 6982232 7582927 8001950 7315588 6964377
3151 6964377 7126264 6939661 7220423 7123743 6508676 5920261 6600355 6467827 5579211 6085260
3141 6085260 5956029 6591456 7107215 7497394 6415589 5741634 5632254 5312234 6552572
3132 6552572 6532436 5753731 5601467 5053679 5031710 6139287 6408900 6313434 6108370 6952859
3122 6952859 6348238 5174045 6060376 4228713 3487917 4528536 4258962 4308879 5321766
3113 5321766 5224777 4542419 4699930 4470103 3901726 4291642 4307158 4059111 4878210 4077760
$$ packed form
3181F907378k51462n70422M45836p74057n97914P72621M40576O51391n58921k65403
3171F199623L77129P12964j91987j47525k39354n50297J30838M9029K39533J45100
3161F725053n48831P00558M18569O72352q65529j19940O00695M19023o86362l51211
3151F964377J61887j86603K80762r6680o15067n88415O80094j32528q88616N06049
3141F085260j29231O35427N15759L90179j081805o73955j09380l20020J240338
3132F552572k0136p78705j52264n47788k1969J107577K69613r5466k05064Q44489
3122F952859o04621j174193Q86331j831663p40796J040619k69574M9917J012887
3113E321766r6989o82358J57511k29827n68377L89916J5516k48047Q19099q00450
$$ plain form
3103 4077760 4245911 3895566 3781941 4231599 4426094 3962953 4055067 3078056 2095418 1553446
3093 1553446 1887858 2536352 2576020 2632078 3074430 2624392 1293511 600109 1634841 2098979
3083 2098979 1709040 2367411 3433931 3525324 2446271 2654505 2570372 2688070 2114088 2011411
3073 2011411 1551627 734469 1318155 1491792 1441662 1635091 1959891 806371 496980 2161516
3063 2161516 2511816 2159795 2804798 2498261 1787757 875283 -405977 472460 2343750
3054 2343750 1613293 1767695 950401 2204407 3352161 2782784 2582487 1828859 955651
3045 955651 1178131 905162 439693 1727699 2263503 2384106 3395482 3276312 2797355
3036 2797355 1576889 1487224 1903240 776097 1056978 1395519 1664230 2547912 2226207
$$ packed form
3103D077760J68151l50345j13625M49658J94495m63141R2114r77011r82638n41972
3093A553446L34412O48494L9668N6058M42352m50038j330881o93402J034732M64138
3083B098979l89939O58371J066520R1393j079053K08234q4133J17698n73982j02677
3073B011411m59784q17158N83686J73637n0130J93429L24800j153520l09391J664536
3063B161516L50300l52021O45003l06537p10504r12474j281260Q78437J871290
3054B343750p30457J54402q17294J254006J147754n69377k00297p53628q73208
3045I55651K22480k72969m65469J288006N35804J20603J011376j19170m78957
3036B797355j220466q9665M16016j127143K80881L38541K68711Q83682l21705
$$ plain form
3027 2226207 2444782 1989799 2134789 2181183 1872590 2189037 1863857 2493882 1754058 866492
3017 866492 1065285 2277372 1990992 947163 1477005 438977 1153504 1017412 193811
3008 193811 507610 1886101 2072211 1541334 1990748 726786 1094237 787375 718405 188693
2998 188693 740349 421145 18846 195684 -4359 -772888 -1177723 228376 559826 836872
2988 836872 190796 349759 690217 809428 1591609 1929450 1731093 564311 769613 1192533
2978 1192533 1432988 1948832 1915651 2314809 2435000 1666759 1591997 1542009 1944187 1994998
2968 1994998 2574184 1494969 2007004 3256112 3182868 3461946 1728693 1706960 2694082
2959 2694082 2720657 2653764 2808029 3005779 2527986 1628625 1350984 2389017 2558073 3338314
$$ packed form
3027B226207K18575m54983J44990M6394l08593L16447l25180O30025p39824q87566
3017H66492J98793J212087k86380j043829N29842j038028P14527j36092q23601
3008A93811L13799J378491J86110n30877M49414j263962L67451l06862o8970n29712
2998A88693N51656l19204m02299J76838k00043p68529m04835J406099L31450K77046
2988H36872o46076J58963L40458J19211P82181L37841j98357j166782K05302M22920
2978A192533K40455N15844l3181L99158J20191p68241p4762m9988M02178N0811
2968A994998N79186j079215N12035J249108p3244K79078j733253k1733R87122
2959B694082K6575o6893J54265J97750m77793q99361k77641J038033J69056P80241
$$ plain form
2949 3338314 3252157 3811463 3937717 3231606 1812523 1617576 1862256 3075842 4129461
2940 4129461 4847656 4702026 3860781 3259121 4408295 4091008 3137143 3617444 2638358
2931 2638358 2872360 3203575 2622721 3332121 2873969 3625374 3696563 3737018 4142538 3969003
2921 3969003 3161924 4825700 5201719 5719018 5433556 4405025 4859990 5643611 5894312
2912 5894312 6107376 6399026 5949046 5153126 5134056 5872607 6373456 7391068 6603720 5834795
2902 5834795 4005963 4455371 3248318 3652253 3415671 2744300 3018468 4063820 2720138
2893 2720138 2652262 3425382 3985003 4228008 5060263 5338232 4868782 5063801 5692947 5017154
2883 5017154 5780969 5064300 4805401 5647345 4873273 4874201 5107636 5218368 5196076 4584082
$$ packed form
2949C338314q6157N59306J26254p06111j419083j94947K44680J213586J053619
2940D129461P18195j45630q41245o01660J149174l17287r53865M80301r79086
2931B638358K34002L31215n80854P09400m58152P51405P1189M0455M05520j73535
2921C969003q07079J663776L76019N17299k85462j028531M54965P83621K50701
2912E894312K13064K91650m49980p95920j9070P38551N00849J017612p87348p68925
2902E834795j828832M49408j207053M03935k36582o71371K74168J045352j343682
2893B720138o7876P73120N59621K43005Q32255K77969m69450J95019O29146o75793
2883E017154P63815p16669k58899Q41944p74072R28K33435J10732k2292o11994
$$ plain form
2873 4584082 5713623 5782102 4461060 5073734 4242904 3311524 3335017 3313919 4618151 3732095
2863 3732095 2531198 2232182 3194377 3488356 3617862 4135062 3752456 3876262 3924342 3467668
2853 3467668 3408185 4264650 4858533 5156390 4286581 4529429 3797505 2774383 2647267 2137430
2843 2137430 2284280 2313686 1922616 2339431 1778867 1580007 832979 1315758 1363487 481560
2833 481560 1755997 1208063 1081143 1227364 1798227 1338093 83189 845759 1204567
2824 1204567 1728591 1438042 1058301 822071 943537 606607 1402649 1021099 367295 855894
2814 855894 39494 384149 1237601 1664020 1966962 1048498 1533322 975351 162092 -89081
2804 -89081 613715 1534451 1536479 2188272 1026487 -1273133 -798166 186325 259459 1421212
$$ packed form
2873D584082J129541O8479j321042O12674q30830r31380K3493k1098J304232q86056
2863C732095j200897k99016R62195K93979J29506N17200l82606J23806M8080m56674
2853C467668n9483Q56465N93883K97857q69809K42848p31924j023122j27116n09837
2843B137430J46850K9406l91070M16815n60564j98860p47028M82779M7729q81927
2833D81560J274437n47934j26920J46221N70863m60134j254904P62570L58808
2824A204567N24024k90549l79741k36230J21466l36930P96042l81550o53804M88599
2814H55894q16400L44655Q53452M26419L02942r18464M84824n57971q13259k51173
2804h9081P02796R20736K028O51793j161785k299620M74967R84491P3134J161753
$$ plain form
2794 1421212 688988 558326 -339975 266216 826367 -355020 -128410 419781 882964
2785 882964 -113915 -225767 390418 609006 924069 558713 786518 -152633 -702545 330502
2775 330502 78375 -511486 -31685 431253 652206 165943 -650726 -466192 393129 1015785
2765 1015785 223377 -543492 -99416 -456290 -833559 -508671 1124142 1098302 -19695
2756 -19695 409363 987149 443858 -700190 541668 679944 890413 421759 911670 1271643
2746 1271643 931000 1258537 203542 -535814 -294656 -833759 -319654 1345417 444913
2737 444913 -758474 -373961 442454 -79585 -296516 -1388866 -1171503 -1120030 -1291889 -949846
2727 -949846 -810213 -209199 -1324193 -1303880 -1836280 -1371440 -1325268 6653 538334 1099001
$$ packed form
2794A421212p32224j30662q98301O06191N60151j181387K26610N48191M63183
2785H82964r96879j11852O16185K18588L15063l65356K27805r39151n49912J033047
2775C30502k52127n89861M79801M62938K20953m86263q16669J84534Q59321O22656
2765A015785p92408p66869M44076l56874l77269L24888J632813k5840j117997
2756a9695M29058N77786n43291j144048J241858J38276K10469m68654M89911L59973
2746A271643l40643L27537j054995p39356K41158n39103N14105J665071r00504
2737D44913j203387L84513Q16415n22039k16931j092350K17363N1473j71859L42043
2727i49846J39633O01014j114994K0313n32400M64840M6172J331921N31681N60667
$$ plain form
2717 1099001 -447009 -1408073 -1249224 -656013 377888 -178964 -1275184 -828834 -539029
2708 -539029 -303971 -291655 -575757 -1128222 -1871147 -644267 -459491 -546641 -102515 916698
2698 916698 1612181 -468802 -1820260 -1226302 -80977 -88813 -531077 -378487 219420 -382583
2688 -382583 -1010687 -555339 -324830 -763237 -1675412 -639278 426235 -510019 -894263
2679 -894263 -395586 20410 78729 192718 -668201 -466399 -210729 -1237588 -1340112 -1864691
2669 -1864691 -988949 -1594605 -1253976 -739968 344565 -15382 -331589 274993 1173849
2660 1173849 879222 290915 -298671 -635712 325112 395142 -647664 164253 -1104668
2651 -1104668 -1418657 -1823290 -1895525 -725708 -1384472 -654047 -1168377 -921498 -930195 -632275
$$ packed form
2717A099001j546010r61064J58849N93211J033901n56852j096220M46350K89805
2708e39029K35058J2316k84102n52465p42925J226880J84776q7150M44126J019213
2698I16698O95483k080983j351458N93958J145325p836m42264J52590N97907o02003
2688c82583o28104M55348K30509m38407r12175J036134J065513r36254l84244
2679h94263M98677M15996N8319J13989q60919K01802K55670j026859j02524n24579
2669a864691Q75742o05656L40629N14008J084533l59947l16207O06582Q98856
2660A173849k94627n88307n89586l37041R60824P0030j042806Q11917j268921
2651a104668l13989m04633p2235J169817o58764P30425n14330K46879q697K97920
$$ plain form
2641 -632275 -1404859 -404616 393336 172785 667644 -656584 -463498 -1202191 -698702
2632 -698702 416595 301530 -1308203 -666071 -347760 -2680475 -2176537 -1104834 -1042399
2623 -1042399 -531385 -1662057 -1091358 -847931 -1544123 -1016392 -1896529 -1917257 -1769133 -1850202
2613 -1850202 36622 -871342 -1194768 -1238199 -433547 558647 879422 -365822 -676700
2604 -676700 -474342 -658436 -555645 -487588 161003 334253 506990 -1266315 -1522895 -23018
2594 -23018 355736 105375 1287483 1231024 -752121 -1145160 -452774 -42577 -686595 -317875
2584 -317875 -829952 -449289 -114139 -1046590 -1144988 -1025409 61724 530045 419371 -967557
2574 -967557 -1344354 -1811004 -1601809 -1814821 -1209552 -470339 51370 637889 189221 -679322
$$ packed form
2641f32275p72584J000243P97952k20551M94859j324228J93086p38693N03489
2632f98702J115297j15065j609733O42132L18311k332715N03938J071703O2435
2623a042399N11014j130672N70699K43427o96192N27731q80137k0728J48124q1069
2613a850202J886824r07964l23426m3431Q04652R92194L20775j245244l10878
2604f76700K02358j84094J02791O8057O48591J73250J72737j773305k56580J499877
2594b3018L78754k50361J182108n6459j983145l93039O92386M10197o44018L68720
2584c17875n12077L80663L35150r32451r8398J19579J087133M68321j10674j386928
2574i67557l76797m66650K09195k13012O05269P39213N21709N86519m48668q68543
$$ plain form
2564 -679322 -880802 -52261 138717 -855543 -370602 -867976 -174006 346072 -400416 -1059431
2554 -1059431 568088 190790 -1113444 -1020258 -739217 -1687998 -1680852 -477609 -144186 -624334
2544 -624334 -1680861 -401485 42286 930028 -490570 -683999 -1242088 -1096374 -206473
2535 -206473 -1487772 -803492 253698 -361754 -781553 -454470 -101371 -543650 -1890671
2526 -1890671 -1952295 -766102 -115851 257511 630156 -773860 -108838 -1287800 -1577904
2517 -1577904 -236584 -640726 124059 120442 -978104 -987684 -754339 -642921 571526 531647
2507 531647 -881552 -293009 -189218 520139 -746957 -953467 -1466240 -1552840 -1032121 -622639
2497 -622639 516162 750081 247118 214567 360950 732052 -231218 226008 -199961 -18950
$$ packed form
2564f79322k01480Q28541J90978r94260M84941m97374O93970N20078p46488o59015
2554a059431J627519l77298j304234R3186K81041r48781P146J203243L33423m80148
2544f24334j056527J279376M43771Q87742j420598j93429n58089J45714Q89901
2535b06473j281299O84280J057190o15452m19799L27083L53099m42279j347021
2526a890671o1624J186193O50251L73362L72645j404016O65022j178962k90104
2517a577904J341320m04142P64785l617j098546r580K33345J11418J214447l9879
2507E31647j413199N88543J03791P09357j267096k06510n12773q6600N20719M09482
2497f22639J138801K33919n02963l2551J46383L71102r63270M57226m25969J81011
$$ plain form
2487 -18950 322285 1070156 -312053 -105398 856397 -1942254 -1485616 -1855523 -412458
2478 -412458 6986 111773 -290758 328691 -1515732 -2413043 -1208416 -1051540 -804035
2469 -804035 -1191418 -1299460 -1223322 -117848 -1184307 -1776859 105929 -258588 -1048614
2460 -1048614 -49880 362235 151337 -143035 -1158149 85438 523685 -363528 -71706
2451 -71706 344416 -306236 -1049032 -117056 745058 -384498 -572012 -393258 -1216104 -1545285
2441 -1545285 626793 1247273 151887 549377 671949 -189021 -372258 -599289 -751234
2432 -751234 -1085519 -1489793 -1467525 -1095434 -792150 -390558 -85523 -513931 -1622337 -2046805
2422 -2046805 -1594995 -847307 -673156 98137 520856 -556646 -735882 451730 995906
$$ packed form
2487a8950L41235P47871j382209K06655R61795k798651M56638l69907J443065
2478d12458M19444J04787m02531O19449j844423q97311J204627J56876K47505
2469h04035l87383j08042P6138J105474j066459n92552J882788l64517p90026
2460a048614R98734M12115k10898k94372j015114J243587M38247q87213K91822
2451g1706M16122o50652p42796R31976Q62114j129556j87514J78754q22846l29181
2441a545285K172078O20480j095386L97490J22572q60970j83237k27031j51945
2432g51234l34285m04274K2268L72091L03284M01592L05035m28408j108406m24468
2422b046805M51810P47688J74151P71293M22719j077502j79236J187612N44176
$$ plain form
2413 995906 733171 295287 1439497 1513042 616028 66383 -21306 379965 380552 -899003
2403 -899003 -190702 271690 -90245 -207588 -173952 266213 677505 314989 -470482 212669
2393 212669 -799029 -418603 1436480 1023616 704482 -1209094 302628 82693 -609549
2384 -609549 -329879 -342782 892641 439457 840321 853768 567210 1046885 1884932 359782
2374 359782 388111 1287132 1249010 1079696 2111398 957883 -65795 312262 -721865
2365 -721865 -564004 -630211 432877 -164858 431442 1640373 990974 -463512 -1555018
2356 -1555018 -1236314 -303637 199612 -508000 -273419 -376324 612321 415881 347931 777749
2346 777749 988960 -503633 1164388 74181 101405 594920 492894 -344684 -1109157
$$ packed form
2413I95906k62735m37884J144210P3545q97014n49645q7689M01271N87j279555
2403h99003P08301M62392l61935j17343L3636M40165M11292l62516p85471O83151
2393B12669j011698L80426J855083m12864l19134j913576J511722k19935o92242
2384f09549K79670j2903J235423m53184M00864J3447k86558M79675Q38047j525150
2374C59782K8329Q99021l8122j69314J031702j153515j023678L78057j034127
2365g21865J57861o6207J063088n97735N96300J208931o49399j454486j091506
2356a555018L18704R32677N03249p07612K34581j02905R88645j96440o7950M29818
2346G77749K11211j492593J668021j090207K7224M93515j02026q37578p64473
$$ plain form
2337 -1109157 -120173 -604400 -1164509 -1134397 -201245 662513 366520 51063 51102 -54303
2327 -54303 -732384 -329051 -1193273 -218484 -947928 -1388948 -1886824 -3004689 -2690614 -2021485
2317 -2021485 -2225763 -895855 -467475 652430 983355 481336 2088242 999141 99042
2308 99042 -1544545 -459908 611745 814519 18627 -91539 157446 618517 764418
2299 764418 1283315 1255797 232108 -297120 -697572 -1566093 -298786 -500243 576776
2290 576776 240277 94344 1600987 1576823 -933975 -459835 551620 1587572 1788689
2281 1788689 1113452 250904 -19762 -678774 -213036 392723 250236 -37365 534440 1735714
2271 1735714 671712 141050 -137307 -396570 -1342705 -210144 478039 1242067 1368549
$$ packed form
2337a109157R88984m84227n60109L0112R33152Q63758k95993l15457L9j05405
2327e4303o78081M03333q64222R74789p29444m41020m97876j117865L14075O69129
2317b021485k04278J329908M28380J119905L30925n02019J606906j089101r00099
2308I9042j643587J084637J071653K02774p95892j10166K48985M61071J45901
2299G64418N18897k7518j023689n29228m00452q68521J267307k01457J077019
2290E76776l36499j45933J506643k4164k510798M74140J011455J035952K01117
2281A788689o75237q62548k70666o59012M65738O05759j42487k87601N71805J201274
2271A735714j064002n30662k78357k59263r46135J132561O88183P64028J26482
$$ plain form
2262 1368549 1173521 243884 905485 1008027 618610 701511 2596741 1252023 24825
2253 24825 815271 517266 380335 560758 1240737 1710544 1067729 -394742 1094141 1988631
2243 1988631 2155370 2593330 2983498 2362921 1727861 2740872 3947375 3570120 2350455
2234 2350455 2372885 3272206 2692089 1642942 2686196 3007746 1445296 2204324 2690274
2225 2690274 2773186 2302214 2111822 2672716 2815081 1845876 1643751 2990226 3187380 2171589
2215 2171589 1929257 2175525 2098211 2201618 2071149 3280009 3409516 3619245 3596073 3788382
2205 3788382 4182371 5541927 4731263 4607981 5278019 4122306 4866444 5897654 5655143
2196 5655143 5223623 3810754 4168813 5225570 5261357 5526090 6542639 6507394 6066076
$$ packed form
2262A368549j95028r29637O61601J02542l89417Q2901J895230j344718j227198
2253B4825P90446k98005j36931J80423O79979M69807o42815j462471J488883Q94490
2243A988631J66739M37960L90168o20577o35060J013011J206503l77255j219665
2234B350455K2430Q99321n80117j049147J043254L21550j562450P59028M85950
2225B690274Q2912m70972j90392N60894J42365r69205k02125J346475J97154j015791
2215B171589k42332K46268p7314J03407j30469J208860J29507K09729k3172J92309
2205C788382L93989J359556q10664j23282O70038j155713P44138J031210k42511
2196E655143m31520j412869L58059J056757L5787K64733J016549l5245m41318
$$ plain form
2187 6066076 6478010 7002994 7576081 6838493 8192655 8333249 7123346 6854601 7275830
2178 7275830 7752163 7957813 8258604 8391869 9627499 11086413 11157199 10510930 11062674
2169 11062674 11517282 12777886 13093935 11331110 11740225 12381994 12559219 13856578 13855567
2160 13855567 13376229 13832633 13074525 13549902 13268401 14010478 15377214 15380970 16108170 16252488
2150 16252488 15702023 17920735 19163542 18478526 19357987 20490479 21784115 22692522 24260995
2141 24260995 24862855 25400301 27837782 29849909 30660983 31807888 32195361 34225950 35970448
2132 35970448 37316989 40276472 41804247 43526027 45468313 48403268 52340043 56518719
2124 56518719 61039515 66049190 71559383 77473155 82699899 89440268 98352332 110214712
$$ packed form
2187F066076M11934N24984N73087p37588J354162J40594j209903k68745M21229
2178G275830M76333K05650L00791J33265J235630J458914P0786o46269N51744
2169A1062674M54608J260604L16049j762825M09115O41769J77225J297359j011
2160A3855567m79338M56404p58108M75377k81501P42077J366736L756P27200J44318
2150A6252488n50465K218712J242807o85016Q79461J132492J293636R08407J568473
2141B4260995O01860N37446K437481K012127Q11074J146905L87473K030589J744498
2132C5970448J346541K959483J527775J721780J942286K934955L936775M178676
2124E6518719M520796N009675N510193N913772N226744O740369Q912064J1862380
$$ plain form
2116 110214712 120896057 132859313 149392744 171552749 201397122 245414344 303076605
2109 303076605 371368901 425691062 473793224 467486374 391485299 314192759 249441361
2102 249441361 204400365 171599481 145960566 123218032 108365705 96671932 88529806
2095 88529806 82000667 75986171 72332055 70084223 65435439 58570570 54197491 50081748
2087 50081748 46771364 43767027 40201289 38399621 36669214 34392046 31768213 29695580
2079 29695580 29192096 28624615 26535545 26884706 25722854 25264227 23996894 22330039 22135964
2070 22135964 20715245 19752633 19693463 19163344 17799335 16296032 15342831 16135606 14616846
2061 14616846 14196175 13085528 12828298 12692390 11562672 11796976 11704709 11387539 11638684
$$ packed form
2116A10214712J0681345J1963256J6533431K2160005K9844373M4017222N7662261
2109C03076605O8292296N4322161M8102162o306850p6001075p7292540o4751398
2102B49441361m5040996l2800884k5638915k2742534j4852327j1693773q142126
2095H8529806o529139o014496l654116k247832m648784o864869m373079m115743
2087E0081748l310384l004337l565738j801668j730407k277168k623833k072633
2079B9695580n03484n67481k089070L49161j161852m58627j267333j666855j94075
2070B2135964j420719r62612n9170n30119j364009j503303r53201P92775j518760
2061A4616846m20671j110647k57230j35908j129718K34304r2267l17170K51145
$$ plain form
2052 11638684 11712101 11969146 9737978 9613853 9084819 8561746 9699980 8723702 9355515
2043 9355515 8920540 8644557 8515903 8033849 7833964 7703326 6648854 6581295 7016654 6714146
2033 6714146 5256816 6377261 5628996 5344750 5102471 4476176 4505414 5630090 5252979
2024 5252979 3876087 4499773 4584299 5525346 4056928 3917817 4425080 3766203 2063728
2015 2063728 1893700 2058712 1953832 2857316 3570713 3266005 2393673 2520102 3654412
2006 3654412 2785183 2143516 2562861 3396990 3982223 3648279 2453215 1640229 1828042
1997 1828042 2763378 2744535 3194907 2985709 2379194 1607233 1467722 986658 592547 1422327
1987 1422327 1614745 2436262 907935 1234450 1932409 1292370 853839 1863076 1806035
$$ packed form
2052A1638684P3417K57045k231168j24125n29034n23073J138234r76278O31813
2043I355515m34975k75983j28654m82054j99885j30638j054472o7559M35359l02508
2033F714146j457330J120445p48265k84246k42279o26295K9238J124676l77111
2024E252979j376892O23686Q4526R41047j468418j39111N07263o58877j702475
2015B063728j70028J65012j04880R03484P13397l04708q72332J26429J134310
2006C654412q69229o41667M19345Q34129N85233l33944j195064q12986J87813
1997A828042R35336j8843M50372k09198o06515p71961j39511m81064l94111Q29780
1987A422327J92418Q21517j528327L26515O97959o40039m38531J009237n7041
$$ plain form
1978 1806035 2950849 1935790 1528888 1578624 1726313 1789400 1713478 1249685 1425502 1254956
1968 1254956 361133 1126493 1319112 321775 -410392 664917 450532 159638 -161816
1959 -161816 65145 -100312 1012768 -175865 208860 1186515 2218796 933806 331874
1950 331874 1341940 833168 1246160 1292896 1313660 987802 1803273 596870 -89891 496785
1940 496785 165450 1407814 8268 -295371 -690762 -718556 136150 230444 443127 6274
1930 6274 -686449 -521848 191436 854441 43205 565475 952617 444487 583692 -239956
1920 -239956 -219163 -36074 491140 54114 -659079 422693 -41435 -684127 -390119 -606237
1910 -606237 -664386 -569398 1166789 14387 -858838 493457 158292 389985 1431480
$$ packed form
1978A806035J144814j015059m06902M9736J47689O3087p5922m63793J75817j70546
1968A254956q93823P65360J92619r97337p32167J075309k14385k90894l21454
1959a61816K26961j65457J113080j188633L84725R77655J032281j284990o01932
1950C31874J010066n08772M12992M6736K0764l25858Q15471j206403o86761N86676
1940D96785l31335J242364j399546l03639l95391k7794Q54706R4294K12683m36853
1930F274o92723J64601P13284O63005q11236N22270L87142n08130J39205q23648
1920b39956K0793J83089N27214m37026p13193J081772m64128o42692K94008k16118
1910f06237n8149R4988J736187j152402q73225J352295l35165K31693J041495
$$ plain form
1901 1431480 1507211 1218576 902546 643948 -6242 -181729 -197278 29287 234411 -121960
1891 -121960 -1068744 -1747894 -656779 -1691754 -1073708 -1010978 -593883 159012 306058 -137249
1881 -137249 -262474 -10271 -966052 -781311 -303169 -612166 18252 6955 1118697 1634934
1871 1634934 1232279 1153552 -915261 -469623 -457594 329185 13583 -102746 -177207 -160719
1861 -160719 -1248280 -467885 970435 867118 1765748 1704915 461795 -286548 220598
1852 220598 -175001 -467969 -1357694 119836 -309198 -98747 691088 895309 680144 1381868
1842 1381868 1109211 1191895 2262776 2367992 3471865 2048571 1215207 745833 1110363
1833 1110363 1246001 319966 878298 225308 127622 1185324 379147 -308854 -550066 -770947
$$ packed form
1901A431480P5731k88635l16030k58598o50190j75487j5549K26565K05124l56371
1891a21960r46784o79150J091115j034975O18046O2730M17095P52895J47046m43307
1881a37249j25225K52203r55781J84741M78142l08997O30418j1297J111742N16237
1871A634934m02655p8727k068813M45638J2029P86779l15602j16329p4461J6488
1861a60719j087561P80395J438320j03317Q98630o0833j243120p48343N07146
1852B20598l95599k92968q89725J477530m29034K10451P89835K04221k15165P01724
1842A381868k72657Q2684J070881J05216J103873j423294q33364m69374L64530
1833A110363J35638r26035N58332o52990r7686J057702q06177o88001k41212k20881
$$ plain form
1823 -770947 -677190 639988 -235670 -621719 -1198665 -597837 -789154 447426 502045 674507
1813 674507 1404642 508408 -521506 214569 -335139 -1462665 -474659 -1133630 -1483902
1804 -1483902 -1475205 -2176476 -886858 -656803 -1170574 -1017525 72263 -244460 -806982 -382464
1794 -382464 251572 -507917 -314821 -911644 -1180771 103896 215520 -762300 316550
1785 316550 -34184 151636 40610 259596 762467 -63780 784115 1584253 305572 528305
1775 528305 523914 -1080863 -392855 16914 221143 -171688 101301 155340 -354913 -1543209
1765 -1543209 -1008849 -380613 1245254 819813 -154362 277451 -573936 -525876 -1515808 -1604547
1755 -1604547 316634 -252958 811258 624368 -362677 278190 744422 -502949 -1056521
$$ packed form
1823g70947R3757J317178q75658l86049n76946O00828j91317J236580N4619J72462
1813F74507P30135q96234j029914P36075n49708j127526R88006o58971l50272
1804a483902Q697p01271J289618K30055n13771J53049J089788l16723n62522M24518
1794c82464O34036p59489J93096n96823k69127J284667J11624r77820J078850
1785C16550l50734J85820j11026K18986N02871q26247Q47895Q00138j278681K22733
1775E28305m391j604777O88008M09769K04229l92831K72989N4039n10253j188296
1765a543209N34360O28236J625867m25441r74175M31813q51387M8060r89932q8739
1755a604547J921181n69592J064216j86890r87045O40867M66232j247371n53572
$$ plain form
1746 -1056521 -902639 -827768 -424293 -7057 -853371 -1508649 -1485189 -223829 301456 438137
1736 438137 501382 1140682 370567 474860 1248482 1162471 721488 101100 -843979 -268683
1726 -268683 -59804 489506 -341226 210504 8723 38533 -1314748 -1012577 -727127 -2118470
1716 -2118470 -1015198 -409015 -781429 -169426 -1395771 -1048356 259220 -305233 -754128
1707 -754128 -405596 272121 -240964 -759469 323561 790116 -98213 -894466 -285622 328635
1697 328635 1174695 717043 -875825 -197396 -1654847 -1774636 -759542 -546622 -137424
1688 -137424 -1169283 -1546191 -444084 -54351 -5304 -952988 -94390 -166237 318563 1058805
1678 1058805 87488 -862752 -813688 767560 1140150 17708 -329430 -859706 -393665
$$ packed form
1746a056521J53882P4871M03475M17236q46314o55278K3460J261360N25285J36681
1736D38137O3245O39300p70115J04293P73622q6011m40983o20388r45079N75296
1726b68683K08879N49310q30732N51730k01781K9810j353281L02171K85450j391343
1716b118470J103272O06183l72414O12003j226345L47415J307576n64453m48895
1707g54128L48532O77717n13085n18505J083030M66555q88329p96253O08844O14257
1697C28635Q46060m57652j592868O78429j457451j19789J015094K12920M09198
1688a37424j031859l76908J102107L89733M9047r47684Q58598p1847M84800P40242
1678A058805r71317r50240M9064J581248L72590j122442l47138n30276M66041
$$ plain form
1669 -393665 126760 -332672 -1027651 -637593 -123452 589270 -245799 -694378 -510700 454158
1659 454158 821182 -177178 -616294 -172456 -639050 329548 946508 311476 -331538 -832332
1649 -832332 -799338 180948 -164136 349633 -528528 -1429729 -104729 389251 803731 727188
1639 727188 41128 -1004095 -1598169 -690193 744384 320107 -170482 672389 602589 404884
1629 404884 -28999 -242028 694712 -102550 62668 1214845 -17637 -159077 -5216
1620 -5216 462919 -267819 -877656 189594 872147 730887 -330554 -889750 292479 -561701
1610 -561701 -257481 484112 204423 -63201 -55580 810059 548635 -51599 4928 -339829
1600 -339829 -171960 -675022 -1419306 -291347 -1559560 -1143220 -850748 -371382 1281119
$$ packed form
1669c93665N20425m59432o94979L90058N14141P12722q35069m48579J83678R64858
1659D54158L67024r98360m39116M43838m66594R68598O16960o35032o43014n00794
1649h32332L2994R80286l45084N13769q78161r01201J325000M93980M14480p6543
1639G27188o86060j045223n94074R07976J434577m24277m90589Q42871o9800j97705
1629D04884m33883k13029R36740p97262J65218J152177j232482j41440J53861
1620e216M68135p30738o09837J067250O82553j41260j061441n59196J182229q54180
1610e61701L04220P41593k79689k67624P621Q65639k61424o00234N6527l44757
1600c39829J67869n03062p44284J127959j268213M16340K92472M79366J652501
$$ plain form
1591 1281119 303175 226442 1025260 1631085 760017 245673 -1252616 -946807 -38736 -448346
1581 -448346 -61408 -404311 616639 -412128 80886 785751 -931270 -1334538 -1941023
1572 -1941023 -1445685 -408076 298277 -1267193 -967637 -1198208 587340 1379376 475325
1563 475325 -330206 -1338922 -468357 -694142 176204 -438999 -1281685 -528940 97376 34373
1553 34373 296685 -663295 -145124 -743136 -385293 26530 271361 410457 156541 -656034
1543 -656034 -878608 -1775904 -1186725 -359225 -2615 -566227 -583321 -375627 -786649 -761220
1533 -761220 653970 786927 289241 179237 422131 -37449 435952 -277344 -1317105
1524 -1317105 -380299 -654606 -1319189 -289888 -252827 293613 178714 -942472 -538217
$$ packed form
1591A281119r77944p6733P98818O05825q71068n14344j498289L05809R08071m09610
1581d48346L86938l42903J020950j028767M93014P04865j717021m03268o06485
1572a941023M95338J037609P06353j565470K99556k30571J785548P92036r04051
1563D75325q05531j008716Q70565k25785Q70346o15203q42686P52745O26316o3003
1553C4373K62312r59980N18171n98012L57843M11823K44831J39096k53916q12575
1543f56034k22574q97296N89179Q27500L56610n63612j7094K07694m11022K5429
1533g61220J415190J32957m97686j10004K42894m59580M73401p13296j039761
1524a317105R36806k74307o64583J029301L7061N46440j14899j121186M04255
$$ plain form
1515 -538217 -378551 22410 -277468 -135312 -1813788 -1700243 279837 262756 -1157892
1506 -1157892 -1306625 -106068 35915 293975 627501 75525 -109942 -578893 -881623
1497 -881623 -1733720 -987284 395317 390206 495947 -75216 2456 892160 438555 -452474
1487 -452474 -264352 -455173 -944466 -420882 -650761 246920 420969 46154 13400 -350564
1477 -350564 117891 -330854 -212394 111760 -428711 -2376185 -1221721 -1180151 -1537559 -1265718
1467 -1265718 -1081613 -1553582 -1197789 -2149402 -2169348 -1262316 -1049106 403089 814785 483825
1457 483825 -571828 -947293 -732736 428367 582900 -405320 -1369719 -985278 -1263054
1448 -1263054 -923742 -1095593 -274460 -159507 -84656 -715765 440235 1513891 1399124
$$ packed form
1515e38217J59666M00961k99878J42156j678476J13545J980080j7081j420648
1506a157892j48733J200557J41983K58060L33526n51976j85467m68951l02730
1497h81623q52097P46436J382601n111J05741n71163P7672Q89704m53605q91029
1487d52474J88122j90821m89293N23584k29879Q97681J74049l74815l2754l63964
1477c50564M68455m48745J18460L24154n40471j947474J154464M1570l57408K71841
1467a265718J84105m71969L55793r51613j9946R07032K13210J452195M11696l30960
1457D83825j055653l75465K14557J161103J54533r88220r64399L84441k77776
1448a263054L39312j71851Q21133J14953P4851o31109J156000J073656j14767
$$ plain form
1439 1399124 268156 -273396 556711 -1134114 161681 855573 -10737 1152714 1122356
1430 1122356 -581974 -1129748 375648 528031 521767 1038212 395602 -530719 -626842 -373070
1420 -373070 -134935 -759021 -467054 672992 -481987 -1219616 -761323 -1404907 -1331832 -1445420
1410 -1445420 -1086909 -347988 -472625 -1107847 -649014 -439923 -430105 -1460063 -1480602 -1225907
1400 -1225907 -431409 -1843940 -2867350 -1992210 -811795 -612313 -1500324 -1619963 -1305995
1391 -1305995 113580 687390 545446 1079157 695263 -215902 -1057268 -1328984 -1494422
1382 -1494422 -846791 880326 1254004 -26715 -441408 -812603 -1074107 -1046246 -1768347
1373 -1768347 -461989 448035 60463 13815 47861 1456011 270775 -1134226 -444268
$$ packed form
1439A399124j130968n41552Q30107j690825J295795O93892q66310J163451l0358
1430A122356j704330n47774J505396J52383o264N16445o42610r26321r6123K53772
1420c73070K38135o24086K91967J140046j154979p37629M58293o43584P3075j13588
1410a445420L58511P38921j24637o35222M58833K09091R818j029958k0539K54695
1400a225907P94498j412531j023410Q75140J180415J99482q88011j19639L13968
1391a305995J419575N73810j41944N33711l83894r11165q41366k71716j65438
1382a494422O47631J727117L73678j280719m14693l71195k61504K7861p22101
1373a768347J306358R10024l87572m6648L4046J408150j185236j405001O89958
$$ plain form
1364 -444268 -243811 -539704 -1835464 -1822581 -1160108 21441 -89354 -1062168 -1614298 -917253
1354 -917253 -1366087 -715342 -1107222 -1506453 -1277527 -515656 734971 147409 -698304 -1113488
1344 -1113488 -734071 -940943 -938523 -273565 -238553 -583657 36953 1128624 -391820 -798846
1334 -798846 -493391 -1249978 -1083996 445127 383219 -526607 -1046515 -426562 409862 225405
1324 225405 336362 -585619 -114469 302289 -42777 1236927 243148 -294036 75740 683594
1314 683594 -1411597 -1586566 -600960 278440 838760 -94655 -147800 -165636 115582 -518268
1304 -518268 -319227 516179 584669 830966 -136778 -940169 -569779 -759798 269654 837130
1294 837130 1431879 2027927 303863 -396017 -314180 -592755 -147485 -1116646 -839036 -397177
$$ packed form
1364d44268K00457k95893j295760J2883O62473J181549j10795r72814n52130O97045
1354i17253m48834O50745l91880l99231K28926P61871J250627n87562q45713m15184
1344a113488L79417k06872K420O64958L5012l45104O20610J091671j520444m07026
1334g98846L05455p56587J65982J529123o1908r09826n19908O19953Q36424j84457
1324B25405J10957r21981M71150M16758l45066J279704r93779n37184L69776O07854
1314F83594k095191j74969R85606Q79400N60320r33415n3145j7836K81218o33850
1304e18268J99041Q35406O8490K46297r67744q03391L70390j90019J029452N67476
1294H37130N94749N96048j724064o99880Q1837k78575M45270r69161K77610M41859
$$ plain form
1284 -397177 -204363 -198145 118514 339681 765757 184089 -50461 474206 -222246 -656202
1274 -656202 -700870 120673 -782840 -1463280 -416763 -112200 -282950 -417857 -687017 -170768
1264 -170768 357846 162687 745921 837586 99302 -478825 -26018 -41861 -756900 -1750781
1254 -1750781 -1528718 -453078 -716098 -948129 -850976 149352 330811 936709 405721
1245 405721 -1017329 -570894 -279256 -1718309 -929373 -953054 -464915 -898137 -637969 635637
1235 635637 528842 129238 -271476 -116987 662170 574939 682509 524249 -269494 33272
1225 33272 55025 812602 -652900 -721293 -1342863 -622632 -127449 1134129 1492732 -335838
1215 -335838 207256 -65197 783267 992526 -220830 -784585 -1072096 528068 -578568
$$ packed form
1284c97177J92814O218L16659K21167M26076n81668k34550N24667o96452m33956
1274f56202m4668Q21543r03513o80440J046517L04563j70750j34907k69160N16249
1264a70768N28614j95159N83234R1665p38284n78127M52807j5843p15039r93881
1254a750781K22063J075640k63020k32031R7153J000328J81459O05898n30988
1245D05721j423050M46435K91638j439053P88936k3681M88139m33222K60168J273606
1235F35637j06795l99604m00714J54489P79157q7231J07570j58260p93743L02766
1225C3272K1753P57577j465502o8393o21570P20231M95183J261578L58603j828570
1215c35838N43094k72453Q48464K09259j213356n63755k87511J600164j106636
$$ plain form
1206 -578568 -1750586 -1152820 -1528301 -884613 -545567 -758451 -1093402 -1047644 -698593 251731
1196 251731 434713 -130605 511465 -762958 -1723150 -1320584 -157994 258489 6564
1187 6564 -454066 612995 605785 1746940 1342909 169521 -246793 241334 743547 1073698
1177 1073698 282087 -349255 -401632 -1196376 -191208 1045394 1109887 224182 -225508 -660798
1167 -660798 -23764 18352 -802494 -1285872 -989546 363508 -652169 -300363 793781
1158 793781 130595 257599 51740 684964 615641 790330 469713 -127867 -839790 -754918
1148 -754918 364113 239380 -960225 -214105 -225989 -1349008 -322920 183529 -356063
1139 -356063 -1471474 -563614 -436442 893299 1467432 -579844 -1430318 -1225720 -264147
$$ packed form
1206e78568j172018N97766l75481O43688L39046k12884l34951M5758L49051R50324
1196B51731J82982n65318O42070j274423r60192M02566J162590M16483k51925
1187F564m60630J067061p210J141155m04031j173388m16314M88127N02213L30151
1177A073698p91611o31342n2377p94744J005168J236602O4493q85705m49690m35290
1167f60798O37034M2116q20846m83378K96326J353054j015677L51806J094144
1158G93781o63186J27004k05859O33224o9323J74689l20617n97580p11923Q4872
1148g54918J119031j24733j199605P46120j1884j123019J026088N06449n39592
1139c56063j115411R07860J27172J329741N74133k047276q50474K04598R61573
$$ plain form
1130 -264147 -544508 600693 316241 413753 565134 578793 277559 476010 -19484 507424
1120 507424 567539 308436 193020 495052 -338710 -686241 -638395 22658 621978 874978
1110 874978 786645 -157600 -203898 -655650 -980899 -667176 -493924 -8386 196585 -9998
1100 -9998 -294080 -712397 -508758 -1543830 -725143 -924374 -242952 -1444562 -842724 -665424
1090 -665424 -343778 426366 882925 1022443 339379 371596 -1341357 -736579 -24002 -102235
1080 -102235 -446701 -141049 913269 -487575 -395896 -361826 -1554177 -817164 -786448 -1109568
1070 -1109568 -1994844 -661373 602307 1044484 140254 -153023 572810 1201529 454747
1061 454747 1252109 889462 458405 1952726 20975 296134 546180 -229417 -1048585
$$ packed form
1130b64147k80361J145201k84452R7512J51381J3659l01234J98451m95494N26908
1120E07424O0115k59103j15416L02032q33762l47531M7846O61053N99320K53000
1110H74978q8333r44245m6298m51752l25249L13723J73252M85538K04971k06583
1100i998k84082m18317K03639j035072Q18687j99231O81422j201610O01838J77300
1090f65424L21646P70144M56559J39518o83064L2217j712953O04778P12577p8233
1080a02235l44466L05652J054318j400844R1679L4070j192351P37013L0716l23120
1070a109568q85276J333471J263680M42177r04230k93277P25833O28719p46782
1061D54747P97362l62647m31057J494321j931751K75159K50046p75597q19168
$$ plain form
1052 -1048585 -1044672 -633056 -651613 -265544 -1773911 -154682 466619 677395 925079 -997587
1042 -997587 -335482 -251545 -925711 -641198 -220653 40597 -197120 678458 800361 881132
1032 881132 901776 36231 -689194 -310033 21235 -54104 -17452 374632 363305 988
1022 988 949049 1828091 346517 -21427 -267343 -176943 73943 612444 -199866 -950602
1012 -950602 -1088814 -1220803 -283561 -853965 8963 -344842 -637284 -566491 -942659 -92250
1002 -92250 -112673 299529 961267 953850 855011 821017 1184247 -279903 -1218425 -1419950 -1278817
991 -1278817 -704945 -1154837 -1306955 -401015 -299973 1081165 463996 -670631 -1724273
982 -1724273 -728690 -700544 -667343 -127114 -605371 -1595866 -1190733 123470 -698224 -1232674
$$ packed form
1052a048585L913M11616j8557L86069j508367J619229O21301K10776K47684j922666
1042i97587O62105Q3937o74166K84513M20545K61250k37717Q75578J21903Q0771
1032H81132K0644q65545p25425L79161L31268p5339L6652L92084j1327l62317
1022I88R48061Q79042j481574l67944k45916R0400K50886N38501q12310p50736
1012i50602j38212j31989R37242n70404Q62928l53805k92442P0793l76168Q50409
1002i2250k0423M12202O61738p417r8839l3994L63230j464150r38522k01525J41133
991a278817N73872m49892j52118R05940J01042J381138o17169j134627j053642
982a724273R95583K8146L3201N40229m78257r90495M05133J314203q21694n34450
$$ plain form
972 -1232674 -898845 -434821 -159542 -482259 -1303114 -850920 -566980 -115649 1553888 819638
962 819638 1107547 2185281 2353132 1119332 57084 -1403007 -1167174 -1191146 -1665387
953 -1665387 -1433945 -574188 151883 29942 -29976 688744 1654419 1148475 -1359 -823798
943 -823798 326550 1069349 345959 536950 1459040 -526009 -1079821 -584004 -896030 -357425
933 -357425 23852 -444568 1672255 2450012 32969 -1797907 -1767307 -21226 383129
924 383129 -173015 -93304 -395544 309776 99734 85956 308914 -507525 -9708 682040
914 682040 1133919 1239367 -842045 -2448052 -753106 -302124 -996662 -874631 -416824
905 -416824 -416672 -722496 -70176 -1212044 -1464195 -1347794 -1948576 -419645 1752700 654827
$$ packed form
972a232674L33829M64024K75279l22717q20855M52194K83940M51331J669537p34250
962H19638K87909J077734J67851j233800j062248j460091K35833k3972m74241
953a665387K31442Q59757P26071j21941n9918P18720R65675n05944j149834q22439
943h23798J150348P42799p23390J90991R22090j985049n53812M95817l12026N38605
933c57425L81277m68420K116823P77757k417043j830876L0600J746081M04355
924C83129n56144P9711l02240P05320k10042j3778K22958q16439M97817O91748
914F82040M51879J05448k081412j606007J694946M50982o94538J22031M57807
905d16824J52l05824O52320j141868k52151J16401o00782J528931K172345j097873
$$ plain form
895 654827 483296 103467 -1027585 -464162 -27437 3621 -1034964 -1057240 -118156 525159
885 525159 94280 -656438 557386 -22661 377747 877112 886743 521244 1146649 596373
875 596373 -181618 -509940 -1032048 -89228 374259 497920 -45407 -1052800 -1039621 -1369374
865 -1369374 -511410 598862 1194886 1703470 1053249 406887 -1263005 -477082 448003
856 448003 1105572 1300729 627945 1465970 1064789 915855 604656 -1042398 -602497 648855
846 648855 1219223 -855642 -909945 -291550 -384881 -175850 160186 -442476 -783840 -753459
836 -753459 -471067 -427765 77007 474353 26237 -1271801 -1073242 -34935 684857 761221
826 761221 397553 517862 969749 1785292 1085853 1477995 751463 -169323 -1085233 -477316
$$ packed form
895F54827j71531l79829j131052N63423M36725L1058j038585k2276R39084O43315
885E25159m30879p50718J213824n80047M00408M99365R631l65499O25405n50276
875E96373p77991l28322n22108R42820M63487J23661n43327j007393J3179l29753
865a369374Q57964J110272N96024N08584o50221o46362j669892P85923R25085
856D48003O57569J95157o72784Q38025m01181j48934l11199j647054M39901J251352
846F48855N70368k074865n4303O18395r3331K09031L36036o02662l41364L0381
836g53459K82392M3302N04772L97346m48116j298038J98559J038307P19792P6364
826G61221l63668J20309M51887Q15543o99439L92142p26532r20786r15910O07917
$$ plain form
816 -477316 234400 -391577 -1095052 463653 -7789 -982267 -1187210 206139 1178708 47506
806 47506 486893 522478 232679 -193073 -56848 251618 911889 1569354 129555 -268145
796 -268145 390551 33979 371998 790717 157657 -125244 597849 649604 303679 1343790
786 1343790 1174395 964138 1052274 -109009 184381 -177165 254385 165205 -1165170 -1409645
776 -1409645 -531900 -458819 -424556 26271 708256 610075 1214254 519815 -20091 1021226
766 1021226 275900 -824426 22908 93016 1035001 1423188 709379 662580 695981 315791
756 315791 -338262 454566 441751 42036 140469 706547 952269 89043 -173270 257257
746 257257 778873 180635 607797 152081 254619 1493950 1930321 1877349 1094398 173658
$$ packed form
816d77316P11716o25977p03475J558705m71442r74478k04943J393349R72569j131202
806D7506M39387L5585k89799m25752J36225L08466O60271O57465j439799l97700
796b68145O58696l56572L38019M18719o33060k82901P23093N1755l45925J040111
786A343790j69395k10257Q8136j161283K93390l61546M31550q9180j330375k44475
776a409645Q77745P3081L4263M50827O81985r8181O04179o94439n39906J041317
766A021226p45326j100326Q47334P0108R41985L88187p13809m6799L3401l80190
756C15791o54053P92828j2815l99715R8433N66078K45722q63226k62313M30527
746B57257N21616n98238M27162m55716J02538J239331M36371n2972p82951r20740
$$ plain form
736 173658 190825 752002 -18802 239281 1364798 1351505 1241 -435011 513440 -118122
726 -118122 -1092333 -1124097 -613233 -464378 -527367 195465 -837522 185653 72165 -696977
716 -696977 -290491 -183856 -652703 -1182769 -232630 -480534 -640407 -458759 188766 1121486
706 1121486 1392447 621719 -410744 -114633 555759 114899 299021 -163273 -324404 708199
696 708199 531904 1343326 1493157 361722 -120978 -1422034 -1421493 -1260286 -1456474 200447
686 200447 -6647 -1170802 319004 1142425 311245 417216 170952 72612 -32418 -111372
676 -111372 193109 -92072 155382 -33307 796287 620216 -805298 352303 1304044 1300626
666 1300626 -80949 -19995 381677 570360 794749 72244 -484545 400417 -353052 -753249
$$ packed form
736A73658J7167N61177p70804K58083J125517j3293j350264m36252R48451o31562
726a18122r74211l1764N10864J48855o2989P22832j032987J023175j13488p69142
716f96977M06486J06635m68847n30066R50139k47904j59873J81648O47525R32720
706A121486K70961p70728j032463K96111O70392m40860J84122m62294j61131J032603
696G08199j76295Q11422J49831j131435m82700j301056N41J61207j96188J656921
686B00447k07094j164155J489806Q23421q31180J05971k46264r8340j05030p8954
676a11372L04481k85181K47454j88689Q29594j76071j425514J157601R51741l418
666A300626j381575O0954M01672J88683K24389p22505n56789Q84962p53469m00197
$$ plain form
656 -753249 162707 563903 762513 -1356367 -1696893 -396096 -133495 542727 639000 58402
646 58402 103230 294125 -466576 417665 1249492 -345847 -572254 152717 -78008 -21947
636 -21947 -154018 -1277772 -2255477 -1738779 -984195 -826415 -512922 176735 23451 712799
626 712799 1047340 1272236 917929 -436860 -146955 834370 -73379 -430485 6514 1019180
616 1019180 2199823 2598462 1103211 550032 425534 134825 25556 98558 -192523 -266211
606 -266211 -819343 -1322853 -1075229 -833005 1069419 1134082 -75186 488369 1196430 1815740
596 1815740 1437329 744852 1563242 346828 -1025458 -615977 428554 354473 1359953
587 1359953 1363506 50187 -103633 237937 -1090433 693960 341602 369080 244229 -1068933
$$ packed form
656g53249R15956M01196J98610k118880l40526J300797K62601O76222R6273n80598
646E8402M4828J90895p60701Q84241Q31827j595339k26407P24971k30725N6061
636b1947j32071j123754r77705N16698P54584J57780L13493O89657j53284O89348
626G12799L34541K24896l54307j354789K89905R81325r07749l57106M36999J012666
616A019180J180643L98639j495251n53179j24498k90709j09269P3002k91081p3688
606b66211n53132n03510K47624K42224J902424O4663j209268N63555P08061O19310
596A815740l78411o92477Q18390j216414j372286M09481J044531p4081J005480
587A359953L553j313319j53820L41570j328370J784393l52358K7478j24851j313162
$$ plain form
577 -1068933 -1034600 577167 1499597 2061640 1374948 1670622 692795 -863570 -229050 -648152
567 -648152 303629 730264 535115 518330 1447274 793750 -567532 -351520 -299924 542867
557 542867 1181647 680 102434 701037 468297 543794 -46179 -101597 68008 -138025
547 -138025 22870 1078654 541969 479569 1013333 1002275 1774017 1284901 630675 -142588
537 -142588 998244 1794297 1923886 1968473 676970 499492 1438680 729120 399440 -394480
527 -394480 125187 1410205 969813 713400 881597 1271774 330761 816542 1464388 104702
517 104702 552131 1280932 2602656 1682230 321636 392620 302381 118827 373554 489337
507 489337 702275 -760600 -223158 391759 -226308 -206975 151163 432585 262519 -10774
$$ packed form
577a068933L4333J611767R22430N62043o86692K95674r77827j556365O34520m19102
567f48152R51781M26635j95149j6785R28944o53524j361282K16012N1596Q42791
557E42867O38780j180967J01754N98603k32740P5497n89973n5418J69605k06033
547a38025J60895J055784n36685o2400N33764j1058P71742m89116o54226p73263
537a42588J140832P96053J29589M4587j291503j77478R39188p09560l29680p93920
527c94480N19667J285018m40392k56413J68197L90177r41013M85781O47846j359686
517A04702M47429P28801J321724r20426j360594P0984r0239j83554K54727J15783
507D89337K12938j462875N37442O14917o18067J9333L58138K81422j70066k73293
$$ plain form
497 -10774 -683254 921673 910809 119630 -62034 -530504 726725 762674 -252323 -746994
487 -746994 503090 757876 -1020706 -959684 -687254 170860 -478338 592580 768676 -591177
477 -591177 -650793 6546 -108337 -574250 -461215 -890422 -1004552 281964 -486263 -249261
467 -249261 711262 -450405 915958 908147 649552 637422 862342 391516 183862 589983
457 589983 850551 104029 -152346 -97091 -140436 412588 618244 1170046 695517 298881
447 298881 1183214 1135706 1572481 819319 -37696 1397040 762747 -363202 265401 304142
437 304142 73399 196766 -300225 -440384 208077 122437 -385539 -218472 -300060 1140432
427 1140432 996726 -43619 10000 474886 482973 458473 476468 133873 -18364 656050
$$ packed form
497a0774o72480J604927j0864p91179j81664m68470J257229L5949j014997m94671
487g46994J250084K54786j778582O1022K72430Q58114o49198J070918J76096j359853
477e91177n9616O57339j14883m65913J13035m29207j14130J286516p68227K37002
467b49261R60523j161667J366363p811k58595j2130K24920m70826k07654M06121
457E89983K60568p46522k56375N5255m3345N53024K05656N51802m74529l96636
447B98881Q84333m7508M36775p53162q57015J434736o34293j125949O28603L8741
437C04142k30743J23367m96991j40159O48461q5640n07976J67067q1588J440492
427A140432j43706j040345N3619M64886Q087k4500J7995l42595j52237O74414
$$ plain form
417 656050 268953 611026 543296 688846 448100 461503 295411 -623397 313851 32435
407 32435 -647180 -1081001 -1240788 -878060 257980 42446 340273 -885821 165074 729815
397 729815 -904387 -402401 -213809 500002 10681 -119565 -169382 315864 1167666 507705
387 507705 97846 -392701 -1322643 -589332 67973 -109795 -650964 -930734 -599643 -257095
377 -257095 -101896 435647 580864 776240 1730618 868164 503988 1475048 264278 -11574
367 -11574 -183582 -91473 1311081 1276278 551272 588415 477109 874292 1262908 178282
357 178282 165846 1379207 524701 -440658 -890280 408260 1856921 1713784 -70501
348 -70501 -1178008 -128384 19807 220932 -278242 -33168 467583 -123230 -561826 -711652
$$ packed form
417F56050l87097L42073o7730J45550k40746J3403j66092r18808R37248k81416
407C2435o79615m33821j59787L62728J136040k15534K97827j226094J050895N64741
397G29815j634202N01986J88592P13811m89321j30246m9817M85246Q51802o59961
387E07705m09859m90547r29942P33311O57305j77768n41169k79770L31091L42548
377b57095J55199N37543J45217J95376R54378q62454l64176R71060j210770k75852
367a1574j72008R2109J402554l4803p25006L7143j11306L97183L88616j084626
357A78282j2436J213361q54506r65359m49622J298540J448661j43137j784285
348g0501j107507J049624J48191K01125m99174K45074N00751n90813m38596j49826
$$ plain form
338 -711652 1173341 2448877 -330392 -1301808 -1737233 -662357 -616578 -547691 -634874 -674677
328 -674677 -105153 82689 -119122 502511 368422 -1417834 -1301721 -1448193 -424541 356896
318 356896 -503637 -149498 892073 1042598 597622 645122 -478476 -478896 5815 -1292238
308 -1292238 39208 438521 120843 135161 -761823 -1200995 -340580 -848048 -1202862 -76056
298 -76056 382085 -109745 -635104 -636104 -575450 -887209 -702188 621388 443559 896600
288 896600 1055351 675058 230334 -609885 -474907 -555547 484790 919333 1506453 1183392
278 1183392 -177276 -378047 -1733429 -548330 -1170262 272180 1456523 358948 -887400
269 -887400 -1519162 -1503233 -1120663 210952 1233756 748455 191224 -286006 807633 921751
$$ packed form
338g11652J884993J275536k779269r71416m35425J074876M5779O8887q7183l9803
328f74677N69524J87842k01811O21633j34089j786256J16113j46472J023652P81437
318C56896q60533L54139J041571J50525m44976M7500j123598m20M84711j298053
308a292238J331446L99313l17678J4318q96984m39172Q60415n07468l54814J126806
298g6056M58141m91830n25359j000O0654l11759J85021J323576j77829M53041
288H96600J58751l80293m44724q40219J34978q0640J040337M34543N87120l23061
278A183392j360668k00771j355382J185099o21932J442442J184343j097575j246348
269h87400o31762J5929L82570J331615J022804m85301n57231m77230J093639J14118
$$ plain form
259 921751 -985169 -758160 -542746 612121 1358790 878824 479129 1865729 115742
250 115742 -384533 378142 16774 113061 528559 1436842 1445622 370983 -535893 -587052
240 -587052 -539382 -1170753 108195 363464 500576 679719 566064 436294 42438 180488
230 180488 1220409 410063 1133635 -73163 68620 676319 700457 -17961 -508291 -140880
220 -140880 141012 -71863 1054967 1826515 268186 533310 950637 676401 321366 -189305
210 -189305 -425917 -145067 637978 744274 -758670 -445032 -395391 888867 784413 376636
200 376636 -432152 -491882 -812345 288482 -9551 144013 1418870 1111010 -278968 -918745
190 -918745 73126 6066 -111906 -114652 -597542 -1605233 -1975610 -2167164 -723338 -653411
$$ packed form
259I21751j906920K27009K15414J154867P46669m79966l99695J386600j749987
250A15742n00275P62675l61368R6287M15498R08283Q780j074639r06876n1159
240e87052M7670o31371J278948K55269J37112J79143j13655j29770l93856J38050
230A80488J039921q10346P23572j206798J41783O07699K4138p18418m90330L67411
220a40880K81892k12875J126830P71548j558329K65124M17327k74236l55035n10671
210a89305k36612K80850P83045J06296j502944L13638M9641J284258j04454m07777
200C76636q08788n9730l20463J100827k98033J53564J274857l07860j389978o39777
190i18745R91871o7060j17972k746m82890j007691l70377j91554J443826O9927
$$ plain form
180 -653411 190856 -46470 -1351003 -1481653 -2014266 -1016178 -588512 -956056 92964 1043727
170 1043727 1259681 1063494 682716 755768 -342014 -539916 -362801 405242 -718089 228625
160 228625 4438 175081 820488 338409 154127 390749 763841 1094261 1260331 1015037
150 1015037 759218 -1079997 -307119 607986 601769 682450 -395618 177186 139886 377001
140 377001 920869 756979 200359 445909 1195763 960247 -402613 -854940 110427 285277
130 285277 267953 1304677 767536 -328280 -204297 -325564 316007 391716 362691 -153977
120 -153977 -686982 -373499 597342 319179 -242940 524560 468594 1160237 791540 68354
110 68354 73169 -680534 -572441 -327024 470865 701738 975053 -334883 -482927 1493373
$$ packed form
180f53411Q44267k37326j304533j30650n32613R98088M27666l67544J049020R50763
170A043727K15954j96187l80778P3052j097782j97902J77115P68043j123331R46714
160B28625k24187J70643O45407m82079j84282K36622L73092L30420J66070k45294
150A015037k55819j839215P72878R15105o217Q0681j078068N72804l7300K37115
140C77001N43868j63890n56620K45550P49854k35516j362860m52327R65367J74850
130B85277j7324J036724n37141j095816J23983j21267O41571P5709k9025n16668
120a53977n33005L13483R70841k78163n62119P67500n5966O91643l68697p23186
110F8354M815p53703J08093K45417P97889K30873K73315j309936j48044J976300
$$ plain form
100 1493373 1157525 461694 4694 -1007236 -651461 -385715 214896 311135 504116 652442
90 652442 -292281 -511608 277666 -11653 -102275 640870 515464 -146420 -249852 134180
80 134180 509265 -192623 -491932 -156668 -400674 -911061 255460 605767 309989 509101
70 509101 555767 695223 -17523 152248 1188534 994831 965999 840166 -142009 91753
60 91753 602152 -404278 -141396 32784 -90199 -174895 475035 378238 -111000 176551
50 176551 670786 247243 -555859 -321085 132884 -497637 -996726 -939764 -623318 107083
40 107083 -397788 -433432 -720023 112768 1036511 -224742 76974 567836 988053 771975
30 771975 38977 460133 357633 -137894 626087 619024 945320 1195499 221692 351457
$$ packed form
100A493373l35848o95831m57000j011930L55775K65746O00611R6239J92981J48326
90F52442r44723k19327P89274k89319r0622P43145j25406o61884j03432L84032
80A34180L75085p01888k99309L35264k44006n10387J166521L50307k95778J99112
70E09101M6666J39456p12746J69771J036286j93703k8832j25833r82175K33762
60I1753N10399j006430K62882J74180j22983q4696O49930r6797m89238K87551
50A76551M94235m23543q03102K34774M53969o30521m99089N6962L16446P30401
40A07083n04871l5644k86591Q32791R23743j261253L01716M90862M20217k16078
30G71975p32998M21156j02500m95527P63981p063L26296K50179r73807J29765
$$ plain form
20 351457 535852 -382268 212054 132737 -23959 74627 -350395 1328305 1245834 239915
10 239915 161139 449073 721217 159022 -712420 -887023 -488362 320300 807202 683795
0 683795
$$ packed form
20C51457J84395r18120N94322p9317j56696R8586m25022J678700q2471j005919
10B39915p8776K87934K72144n62195q71442j74603L98661Q08662M86902j23407
0F83795
$$ Imaginary data points
##PAGE= N=2
##DATA TABLE= (X++(I..I)), XYDATA
$$ plain form
16383 -2548001 -3095519 -2945233 -2380149 -2730136 -3422786 -2537995 -2188325 -2689338 -2351173
16374 -2351173 -2913439 -2373854 -1925622 -2567683 -2413094 -2012991 -1424248 -834411 -1783509
16365 -1783509 -1492288 -2216037 -1120965 -1465715 -1796893 -1792636 -1991538 -1965069 -887518 -1255373
16355 -1255373 -2550839 -2468373 -2389593 -2587251 -2149355 -1789023 -1513035 -1482106 -1074486 -1253611
16345 -1253611 -1568834 -965809 -370569 -492938 -1364815 -816081 -947621 -1610276 -1480768
16336 -1480768 -1723129 -1272285 -1471428 -1986380 -1623313 -448097 210930 -218718 -388835
16327 -388835 -356627 206623 70421 -433270 -717977 -1502341 -822500 -866329 -392871 -528305
16317 -528305 -1216321 -689893 -358060 -279069 -374942 126292 236927 327761 -177262 12043
$$ packed form
16383b548001n47518J50286N65084l49987o92650Q84791L49670n01013L38165
16374b351173n62266N39585M48232o42061J54589M00103N88743N89837r49098
16365a783509K91221p23749J095072l44750l31178M257j98902K6469J077551l67855
16355a255373j295466Q2466P8780j97658M37896L60332K75988L0929M07620j79125
16345a253611l15223O03025N95240j22369q71877N48734j31540o62655J29508
16336a480768k42361M50844j99143n14952L63067J175216O59027m29648j70117
16327c88835L2208N63250j36202n03691k84707p84364O79841m3829M73458j35434
16317e28305o88016N26428L31833P8991r5873N01234J10635R0834n05023J89305
$$ plain form
16307 12043 487950 137701 -593357 -1301808 -1729642 -876443 -133284 -220699 -365944 -57782
16297 -57782 -117047 562509 854976 311277 110311 -271845 22865 -102662 95977 674284
16287 674284 1258069 1254872 1583302 2527218 2900910 2159518 1054645 -67454 786685 -101211
16277 -101211 -285180 805667 632188 1338623 2139416 2428862 1862715 1193054 499663
16268 499663 -345775 -249555 1309269 2670025 2021864 2482955 2132443 1618811 662363
16259 662363 1371740 2682434 1572718 1388319 789064 1872022 2393425 1586380 1976902
16250 1976902 1526281 859344 1822945 1949350 861285 678840 1880323 1806221 1728126
16241 1728126 1459644 1865313 2185616 1452858 2631603 1906890 1036387 1592017 1523242
$$ packed form
16307A2043M75907l50249p31058p08451m27834Q53199P43159q7415j45245L08162
16297e7782n9265O79556K92467n43699k00966l82156K94710j25527J98639N78307
16287F74284N83785l197L28430R43916L73692p41392j104873j122099Q54139q87896
16277a01211j83969J090847j73479P06435Q00793K89446n66147o69661o93391
16268D99663q45438R6220J558824J360756o48161M61091l50512n13632r56448
16259F62363P09377J310694j109716j84399n99255J082958N21403q07045L90522
16250A976902m50621o66937R63601J26405j088065j82445J201483p4102p8095
16241A728126k68482M05669L20303p32758J178745p24713q70503N55630o8775
$$ plain form
16232 1523242 1604299 1587695 2325317 1890394 2675929 2458608 2220129 1197224 1020069 1984088
16222 1984088 2278441 1740612 3029224 3327489 2707884 2460351 2067749 2295937 2176836
16213 2176836 2246569 2716427 2740378 2182008 1768133 1468786 1631504 2514059 2855872 2661605
16203 2661605 2183219 1851409 2448244 2573034 2430873 2916114 2773092 2052385 3359488
16194 3359488 2779855 1672190 2131611 2823061 1389766 2272630 1923508 1938615 2828248
16185 2828248 2726372 1622154 1267814 1784511 2150783 3461611 3085474 2750090 2443783
16176 2443783 2705223 3268813 2860809 1417498 1096278 1693439 2875542 2975845 3200334
16167 3200334 4021369 2873745 2840001 3401306 4027811 2840574 1843548 3044754 2710529
$$ packed form
16232A523242Q1057j6604P37622m34923P85535k17321k38479j022905j77155R64019
16222A984088K94353n37829J288612K98265o19605k47533l92602K28188j19101
16213B176836O9733M69858K3951n58370m13875k99347J62718Q82555L41813j94267
16203B661605m78386l31810N96835J24790j42161M85241j43022p20707J307103
16194C359488n79633j107665M59421O91450j433295Q82864l49122J5107Q89633
16185B828248j01876j104218l54340N16697L66272J310828l76137l35384l06307
16176B443783K61440N63590m08004j443311l21220N97161J182103J00303K24489
16167C200334Q21035j147624l3744N61305O26505j187237r97026J201206l34225
$$ plain form
16158 2710529 2196187 857654 1313130 2521768 3410529 3985602 3890909 2762981 2848692
16149 2848692 4162588 2863140 2486368 3156497 2821604 3412141 3000441 3267350 3556191
16140 3556191 3423116 4164741 4461610 3977155 3707379 2345447 3485382 3282055 2864134
16131 2864134 2624158 2455741 3630350 3069634 3097076 2683394 3203612 3703570 3251064
16122 3251064 4220661 4139430 3466601 2611301 3286762 4298475 3398323 2977530 3004484 3455263
16112 3455263 3087151 3606406 2544473 2410913 3719864 4072407 2363218 1610219 2385204
16103 2385204 3078476 3141827 2554007 2421259 2587583 3691535 3468400 2093225 3737004
16094 3737004 3716753 3526140 2951403 3894390 3977472 3600026 3203119 3220958 2787170 3043910
$$ packed form
16158B710529n14342j338533M55476J208638Q88761N75073r4693j127928Q5711
16149B848692J313896j299448l76772O70129l34893N90537m11700K66909K88841
16140C556191j33075P41625K96869m84455k69776j361932J139935k03327m17921
16131B864134k39976j68417J174609n60716K7442m13682N20218M99958m52506
16122C251064R69597q1231o72829q55300O75461J011713r00152m20793K6954M50779
16112C455263l68112N19255j061933j33560J308951L52543j709189p52999P74985
16103B385204O93272O3351n87820j32748J66324J103952k23135j375175J643779
16094C737004k0251j90613n74737R42987Q3082l77446l96907J7839m33788K56740
$$ plain form
16084 3043910 3231351 3294672 1720841 1994437 2980345 2708390 3692989 3482564 2202774
16075 2202774 604796 806376 1665107 2305846 2629054 2601781 3987729 4530800 2838894
16066 2838894 2243590 1291204 1960698 2853779 2942247 4208626 3572031 3311259 3533080
16057 3533080 2416768 4004388 4051903 3110307 3722497 3614521 2835649 3771934 3507926
16048 3507926 3236645 3150483 2525830 3054919 3713589 2242537 2786114 4340414 3666075
16039 3666075 2970634 3063668 3597622 3276057 3892111 4257818 3190154 2863062 2952501 3406587
16029 3406587 3603790 3249566 3102869 3536389 3345799 2669962 2117268 3460959 3530485
16020 3530485 3468930 3210197 3741215 3558497 2458954 2528300 3021929 4165568 4269716
$$ packed form
16084C043910J87441O3321j573831K73596R85908k71955R84599k10425j279790
16075B202774j597978K01580Q58731O40739L23208k7273J385948N43071j691906
16066B838894n95304r52386O69494Q93081Q8468J266379o36595k60772K21821
16057C533080j116312J587620M7515r41596O12190j07976p78872R36285k64008
16048C507926k71281q6162o24653N29089O58670j471052N43577J554300o74339
16039C666075o95441R3034N33954l21565O16054L65707j067664l27092Q9439M54086
16029C406587J97203l54224j46697M33520j90590o75837n52694J343691O9526
16020C530485o1555k58733N31018j82718j099543O9346M93629J143639J04148
$$ plain form
16011 4269716 4000513 3071556 2701315 2742817 3346790 4738446 4960669 3267725 2445588
16002 2445588 2803826 3467711 3028843 1922211 1576995 1145009 3171515 3498515 3777445
15993 3777445 3452214 3065748 2768765 3115471 3212293 3748305 3219120 2845832 3547605 3081720
15983 3081720 3196919 3916597 4388361 4116294 4089755 4499488 3855723 4184516 3886101 3339309
15973 3339309 2151302 2120103 3245503 3691183 3875404 3434081 2695036 3241278 3379993
15964 3379993 3090421 2260040 2657283 4818235 4076912 3867594 3625651 3693149 2833295
15955 2833295 3395971 3860194 3499729 1901709 2634991 2173667 1126886 1386473 3612568
15946 3612568 3783480 4308717 4725171 4352534 4420048 3417338 3131404 3491021 3102828
$$ packed form
16011D269716k69203r28957l70241M1502O03973J391656K22223j692944q22137
16002B445588L58238O63885m38868j106632l45216m31986K026506L27000K78930
15993C777445l25231l86466k96983L46706R6822N36012n29185l73288P01773m65885
15983C081720J15199P19678M71764k72067k6539M09733o43765L28793k98415n46792
15973C339309j188007l1199J125400M45680J84221m41323p39045N46242J38715
15964C379993k89572q30381L97243K160952p41323k09318k41943O7498q59854
15955B833295N62676M64223l60465j598020P33282m61324j046781K59587K226095
15946C612568J70912N25237M16454l72637O7514j002710k85934L59617l88193
$$ plain form
15937 3102828 2019406 3387873 3910019 3265239 4615991 3297295 3096560 2681264 3033003
15928 3033003 3327389 3326060 3791686 3506895 3102971 2461118 2709389 3002618 2501435 3243943
15918 3243943 3685684 2508650 3274196 3030075 1642477 2228106 2366407 2195496 4079054
15909 4079054 3444143 3852491 3149586 2478778 2834918 2969902 2456625 3034044 3728240
15900 3728240 3169385 2787280 1829471 2410347 1668912 3343391 4082771 2902725 2224117
15891 2224117 2345219 2544098 2544236 2859716 4021526 3331292 3627333 3485675 3752181 4135135
15881 4135135 3327496 2891671 2364143 3293075 3665575 2703423 2829981 3182252 1151345
15872 1151345 1643894 2684370 4066289 4190602 4283058 2857858 2908772 4013686 2881791
$$ packed form
15937C102828j083422J368467N22146o44780J350752j318696k00735m15296L51739
15928C033003K94386j329M65626k84791m03924o41853K48271K93229n01183P42508
15918C243943M41741j177034P65546k44121j387598N85629J38301j70911J883558
15909D079054o34911M08348p02905o70808L56140J34984n13277N77419O94196
15900C728240n58855l82105r57809N80876p41435J674479P39380j180046o78608
15891B224117J21102J98879J38L15480J161810o90234K96041j41658K66506L82954
15881D135135q07639m35825n27528R28932L72500r62152J26558L52271k030907
15872A151345M92549J040476J381919J24313R2456j425200N0914J104914j131895
$$ plain form
15863 2881791 2997694 3171740 5131181 3736686 1917203 2015791 2491651 4082529 4030403
15854 4030403 4408688 3477510 3658316 3438759 4878237 4375603 3622861 3295647 4071240
15845 4071240 3418018 4345143 3853297 3068933 3406031 3608113 2980131 3055252 3751569 3668342
15835 3668342 3331266 4434016 3590085 2556432 2188639 2957559 3436218 3890604 4469458
15826 4469458 2193516 3037620 2886760 2706225 2331194 2035550 1559345 1343486 2450677
15817 2450677 2366613 2097853 894553 1691692 3311088 2378027 3693955 3370993 3959396
15808 3959396 4180342 2998747 3345777 4021123 3709839 4015281 4013312 4431890 5595232
15799 5595232 4564740 4371910 3924589 3127120 4396851 3251812 3649430 3427318 3815218
$$ packed form
15863B881791J15903J74046J959441j394495j819483R8588M75860J590878n2126
15854D030403L78285r31178J80806k19557J439478n02634p52742l27214P75593
15845D071240o53222R27125m91846p84364L37098K02082o27982P5121O96317q3227
15835C668342l37076J102750q43931j033653l67793P68920M78659M54386N78854
15826D469458k275942Q44104j50860j80535l75031k95644m76205k15859J107191
15817B450677q4064k68760j203300P97139J619396r33061J315928l22962N88403
15808C959396K20946j181595L47030O75346l11284L05442j969M18578J163342
15799E595232j030492j92830m47321p97469J269731j145039L97618k22112L87900
$$ plain form
15790 3815218 3506996 3124871 3392024 3455940 4314261 4010490 3655224 4410585 3796930 3558792
15780 3558792 3841775 3551603 3404922 3142038 2313545 2510133 3153566 4389247 3046273
15771 3046273 2703893 2980797 3330549 4560431 3481002 3274172 3142912 3605064 3734105
15762 3734105 2687227 1470111 3183358 3752132 3034502 2674061 2237383 1926034 2296097
15753 2296097 2743731 3320103 4016029 4192044 2349664 2201321 3127413 2394057 2938258
15744 2938258 3322677 3231150 3815331 4663086 2675712 2855281 2953127 2646047 2934801 2438075
15734 2438075 3121848 3447720 3633917 3553575 4201630 2803838 2675799 3512919 3251964
15725 3251964 2986269 3874829 4409341 4184330 3435617 3317475 4469722 4669100 4431038
$$ packed form
15790C815218l08222l82125K67153O3916Q58321l03771l55266P55361o13655k38138
15780C558792K82983k90172j46681k62884q28493J96588O43433J235681j342974
15771C046273l42380K76904L49752J229882j079429k06830j31260M62152J29041
15762C734105j046878j217116J713247N68774p17630l60441m36678l11349L70063
15753B296097M47634N76372O95926J76015j842380j48343R26092p33356N44201
15744B938258L84419r1527N84181Q47755j987374J79569R7846l07080K88754m96726
15734B438075O83773L25872J86197q0342O48055j397792j28039Q37120k60955
15725C251964k65695Q88560N34512k25011p48713j18142J152247J99378k38062
$$ plain form
15716 4431038 3361649 2831268 3395466 3487752 3076961 3030798 3640330 4486786 4380931 3308547
15706 3308547 2605977 2182661 2863058 2558854 2100757 3410654 3155126 3535624 2473290
15697 2473290 4152847 4325959 2010233 3128707 3537392 3969122 2220584 2310062 3613613
15688 3613613 3479039 2975063 4422593 3648422 2369429 3039752 4247885 4419940 3484165
15679 3484165 3785327 2971093 2374726 2885029 2961137 3771661 3348903 3164585 2634285 2570096
15669 2570096 1909032 2166642 2132262 2415182 2612502 1928535 2580001 2923880 4311089
$$ packed form
15716D431038j069389n30381N64198R2286m10791m6163O09532Q46456j05855j072384
15706C308547p02570m23316O80397l04204m58097J309897k55528L80498j062334
15697B473290J679557J73112k315726J118474M08685M31730j748538Q9478J303551
15688C613613j34574n03976J447530p74171j278993O70323J208133J72055r35775
15679C484165L01162q14234n96367N10303P6108Q10524m22758j84318n30300o4189
15669B570096o61064K57610l4380K82920J97320o83967O51466L43879J387209
$$ [...]
##END NTUPLES=NMR SPECTRUM
##END=
