##TITLE=1H_EC-3293(II-32)
 CDCl3
 8 sc, 
 14.4.2023
##JCAMPDX= 6.0         $$ Bruker NMR JCAMP-DX V2.0
##DATA TYPE= NMR SPECTRUM
##DATA CLASS= NTUPLES
##ORIGIN= UXNMR, Bruker Analytische Messtechnik GmbH
##OWNER= root
$$ XWIN-NMR		Version 3.5
$$ Fri Apr 14 14:36:16 2023 Russian Standard Time (UT+4h)  she@DPX200
##.OBSERVE FREQUENCY= 200.13135
##.OBSERVE NUCLEUS= ^1H
##.ACQUISITION MODE= SIMULTANEOUS
##.ACQUISITION SCHEME= undefined
##.AVERAGES= 8
##.DIGITISER RES= 18
##SPECTROMETER/DATA SYSTEM= spect
##.PULSE SEQUENCE= zg30
##.SOLVENT NAME= CDCl3
##.SHIFT REFERENCE= (INTERNAL, CDCl3, 0, 15.7403)
##AUDIT TRAIL= $$ (NUMBER, WHEN, WHO, WHERE, WHAT)
$$ ##TITLE= Audit trail, XWIN-NMR		Version 3.5
$$ ##JCAMPDX= 5.01
$$ ##ORIGIN= Bruker BioSpin GmbH
$$ ##OWNER= she
$$ F:/spectra/data/she/nmr/H-F/1/pdata/1/auditp.txt
$$ ##AUDIT TRAIL=  $$ (NUMBER, WHEN, WHO, WHERE, WHAT)
(   1,<2023-04-14 14:34:56.76 +0400>,<she>,<DPX200>,
      <created by zg, POWCHK disabled, PULCHK disabled
       configuration hash MD5:
       00 E9 B6 7A A2 85 ED C7 34 08 36 98 17 FE 4E 26
       data hash MD5: 16K
       D8 6B A1 DF D0 FE 59 F3 DA 3A 06 96 A4 7A 35 BB>)
(   2,<2023-04-14 14:34:59.46 +0400>,<she>,<DPX200>,
      <Start of raw data processing
       efp BC_mod = 2 LB = 0.24 FT_mod = 6 PKNL = 1 PHC0 = -19832.06 PHC1 = 12.20081 SI = 16K 
       data hash MD5: 16K
       FD 86 CB 66 DD 1C 52 A0 69 D5 DC E5 20 56 D1 7A>)
(   3,<2023-04-14 14:35:25.54 +0400>,<she>,<DPX200>,
      <pk PHC0 = 0.5725887 PHC1 = 0.2 
       data hash MD5: 16K
       6A 1F 45 99 F7 9C 64 90 5D 67 61 4F 9D DC F3 D3>)
(   4,<2023-04-14 14:35:28.57 +0400>,<she>,<DPX200>,
      <abs ABSG = 5 
       data hash MD5: 16K
       5F D1 DD 10 6E 69 73 20 FC EC 7D 6F 46 C5 D8 72>)
$$ ##END=
$$ 
$$ hash MD5
$$ BE 29 B9 31 A9 B6 D9 37 C0 C6 E3 F7 6B 16 B1 1C
##$RELAX= 
##$RELAX= 
##$RELAX= 
##$RELAX= 
##$RELAX= 
##$RELAX= 
$$ Bruker specific parameters
$$ --------------------------
##$DU= <F:/spectra>
##$EXPNO= 1
##$NAME= <H-F>
##$PROCNO= 1
##$TYPE= <nmr>
##$USER= <she>
##$AMP= (0..31)
100 100 100 100 100 100 100 100 100 100 100 100 100 100 100 100 100 100 
100 100 100 100 100 100 100 100 100 100 100 100 100 100 
##$AQSEQ= 0
##$AQ_mod= 1
##$AUNM= <au_zg>
##$AUTOPOS= <>
##$BF1= 200.13
##$BF2= 200.13
##$BF3= 200.13
##$BF4= 200.13
##$BF5= 200.13
##$BF6= 200.13
##$BF7= 200.13
##$BF8= 200.13
##$BYTORDA= 1
##$CFDGTYP= 0
##$CFRGTYP= 5
##$CHEMSTR= <none>
##$CNST= (0..31)
1 1 145 1 1 1 1 1 1 1 1 1 1 1 1 1 1 1 1 1 1 1 1 1 1 1 1 1 1 1 1 1 
##$CPDPRG= <>
##$CPDPRG1= <>
##$CPDPRG2= <>
##$CPDPRG3= <>
##$CPDPRG4= <mlev>
##$CPDPRG5= <mlev>
##$CPDPRG6= <mlev>
##$CPDPRG7= <mlev>
##$CPDPRG8= <mlev>
##$CPDPRGB= <>
##$CPDPRGT= <>
##$D= (0..31)
0 1.2 0 0 0 0 0 0 0 0.06 0 0.03 0 0 0 0 0.0002 0 0 0 0 0 0 0 0 0 0 0 0 
0 0 0 
##$DATE= 1681468496
##$DBL= (0..7)
120 120 120 120 120 120 120 120 
##$DBP= (0..7)
150 150 150 150 150 150 150 150 
##$DBP07= 0
##$DBPNAM0= <>
##$DBPNAM1= <>
##$DBPNAM2= <>
##$DBPNAM3= <>
##$DBPNAM4= <>
$$ [...]
##$SUBNAM3= <"">
##$SUBNAM4= <"">
##$SUBNAM5= <"">
##$SUBNAM6= <"">
##$SUBNAM7= <"">
##$SUBNAM8= <"">
##$SUBNAM9= <"">
##$SW= 18.05172834244
##$SWIBOX= (0..15)
0 0 2 0 0 0 0 0 0 0 0 0 0 0 0 0 
##$SW_h= 3612.71676300578
##$TD= 16384
##$TD0= 1
##$TE= 0
##$TE2= 300
##$TE3= 300
##$TEG= 300
##$TL= (0..7)
0 120 120 120 120 120 120 120 
##$TP= (0..7)
150 150 150 150 150 150 150 150 
##$TP07= 0
##$TPNAME0= <>
##$TPNAME1= <>
##$TPNAME2= <>
##$TPNAME3= <>
##$TPNAME4= <>
##$TPNAME5= <>
##$TPNAME6= <>
##$TPNAME7= <>
##$TPOAL= (0..7)
0.5 0.5 0.5 0.5 0.5 0.5 0.5 0.5 
##$TPOFFS= (0..7)
0 0 0 0 0 0 0 0 
##$TUNHIN= 0
##$TUNHOUT= 0
##$TUNXOUT= 0
##$USERA1= <user>
##$USERA2= <user>
##$USERA3= <user>
##$USERA4= <user>
##$USERA5= <user>
##$V9= 5
##$VALIST= <valist>
##$VCLIST= <CCCCCCCCCCCCCCC>
##$VD= 0
##$VDLIST= <DDDDDDDDDDDDDDD>
##$VPLIST= <PPPPPPPPPPPPPPP>
##$VTLIST= <TTTTTTTTTTTTTTT>
##$WBST= 1024
##$WBSW= 4
##$XGAIN= (0..3)
0 0 0 0 
##$XL= 0
##$YL= 0
##$YMAX_a= 522805
##$YMIN_a= -636799
##$ZGOPTNS= <>
##$ZL1= 120
##$ZL2= 120
##$ZL3= 120
##$ZL4= 120
##$ABSF1= 15.73147
##$ABSF2= -2.320379
##$ABSG= 5
##$ABSL= 3
##$ALPHA= 0
##$AQORDER= 0
##$ASSFAC= 0
##$ASSFACI= 0
##$ASSFACX= 0
##$ASSWID= 0
##$AUNMP= <proc_1d>
##$AZFE= 0.1
##$AZFW= 0.1
##$BCFW= 0
##$BC_mod= 2
##$BYTORDP= 0
##$COROFFS= 0
##$CY= -3
##$DATMOD= 1
##$DC= 0
##$DFILT= <>
##$DTYPP= 0
##$F1P= 0
##$F2P= 0
##$FCOR= 1
##$FTSIZE= 16384
##$FT_mod= 6
##$GAMMA= 0
##$GB= 0
##$INTBC= 1
##$INTSCL= 3.70164e-10
##$ISEN= 128
##$LB= 0.24
##$LEV0= 0
##$LPBIN= 0
##$MAXI= 10000
##$MC2= 0
##$MEAN= 0
##$ME_mod= 0
##$MI= 1.114404
##$NCOEF= 0
##$NC_proc= -6
##$NLEV= 6
##$NOISF1= 3.799351
##$NOISF2= 2.8
##$NSP= 0
##$NTH_PI= 0
##$NZP= 0
##$OFFSET= 15.74028
##$PC= 1
##$PHC0= -19831.49
##$PHC1= 12.40081
##$PH_mod= 1
##$PKNL= yes
##$PPARMOD= 0
##$PSCAL= 0
##$PSIGN= 0
##$REVERSE= no
##$SF= 200.130006257331
##$SI= 16384
##$SIGF1= 3
##$SIGF2= 2
##$SINO= 5.538805
##$SIOLD= 16384
##$SREGLST= <1H.CDCl3>
##$SSB= 0
##$STSI= 16384
##$STSR= 0
##$SW_p= 3612.71676300578
##$SYMM= 0
##$S_DEV= 0
##$TDeff= 16384
##$TDoff= 0
##$TI= <>
##$TILT= no
##$TM1= 0
##$TM2= 0
##$TOPLEV= 0
##$USERP1= <user>
##$USERP2= <user>
##$USERP3= <user>
##$USERP4= <user>
##$USERP5= <user>
##$WDW= 1
##$XDIM= 16384
##$YMAX_p= 370185714
##$YMIN_p= -1336467
$$ End of Bruker specific parameters
$$ ---------------------------------
##NTUPLES= NMR SPECTRUM
##VAR_NAME=  FREQUENCY,     SPECTRUM/REAL,   SPECTRUM/IMAG
##SYMBOL=    X,             R,               I
##VAR_TYPE=  INDEPENDENT,   DEPENDENT,       DEPENDENT
##VAR_FORM=  AFFN,          ASDF,            ASDF
##VAR_DIM=   16384,         16384,           16384
##UNITS=     HZ,            ARBITRARY UNITS, ARBITRARY UNITS
##FACTOR=    0.220516191357247, 1,           1
##FIRST=     3150.10236518526, 0,            0
##LAST=      -462.614397820522, 0,           0
##MIN=       -462.614397820522, -1336467,    0
##MAX=       3150.10236518526, 370185714,    0
$$ Real data points
##PAGE= N=1
##DATA TABLE= (X++(R..R)), XYDATA
$$ [...]
6549A21289M1374j8765j22386K8899n4244j85535J13946J46928p2807K8527m0497
$$ 121289 162663 143898 21512 50411 -3833 -189368 -75422 71506 -1301 27226 -13271
6538a3271k0212L6102M9885j06706K8994J80892Q4084k03630j40787j43273M3918
$$ -13271 -33483 2619 52504 -54202 -25208 155684 239768 36138 -104649 -247922 -204004
6527b04004K3460P4455Q3170k2351J213k6594J31183l7081q8890O2372l9940M727
$$ -204004 -180544 -106089 -22919 -45270 -44057 -70651 60532 23451 -65439 -3067 -43007 -38280
6515c8280J7914L068R1120j37174k38910O4409J98639q966P0362K44683j38281
$$ -38280 -20366 -17298 73822 -63352 -302262 -237853 -39214 -48180 22182 266865 128584
6504A28584m4390o3720k57327L02K829J24656J26954J08039N1175j14820j71565
$$ 128584 84194 20474 -236853 -236551 -233722 -109066 17888 125927 177102 62282 -109283
6493a09283q8587N3183P5985J43558M9501Q9542j84224k45090p0288J46K3646
$$ -109283 -197870 -144687 -68702 74856 124357 213899 29675 -215415 -285703 -285557 -261911
6482b61911o1955P4878P9004J47551L2015o7001J4853j283m2605K11690o6982
$$ -261911 -323866 -248988 -169984 -22433 9582 -57419 -42566 -43849 -86454 125236 58254
6471E8254j49227J04631n3054N5282M7445j40674m7376j16881J84597J87780o8600
$$ 58254 -90973 13658 -39396 15886 63331 -77343 -124719 -241600 -57003 130777 62177
6460F2177l109k53171r8325J35115J05763N8274P9111o4684l0936K04346j95122
$$ 62177 59068 -194103 -292428 -157313 -51550 6724 85835 21151 -9785 194561 -561
6449e61j68616K7020J8687J35283N8964j4092j74419k5984J76609J35167R9443
$$ -561 -169177 -142157 -123470 11813 70777 56685 -117734 -143718 32891 168058 267501
6438B67501k54842j68285R4524J71404k0118p1102j6637j1522l1615p0277j26585
$$ 267501 12659 -155626 -61102 110302 90184 19082 2445 -9077 -40692 -110969 -237554
6427b37554k2040J18575Q772j9354J41770L0626J01430K1397j82931r5811P9965
$$ -237554 -259594 -141019 -132247 -151601 -9831 20795 122225 143622 -39309 -135120 -55155
6416e5155M0241P9831p8337k81155j30652J41897K35204j20934j6219O414R4712
$$ -55155 -14914 64917 -13420 -294575 -425227 -283330 -48126 -169060 -185279 -178865 -84153
6405h4153M3183j38830k1434P9950q3233L9782J51046o179j86156P5776M0380
$$ -84153 -40970 -179800 -201234 -121284 -204517 -164735 -13689 -19868 -206024 -130248 -89868
6394h9868J3422M4285p8392j14901P3633n4002j21893k0641J13426J42799m8357
$$ -89868 -76446 -32161 -110553 -225454 -151821 -205823 -327716 -348357 -234931 -92132 -140489
6383a40489j8470J29317J0989j91151J20620J3361O8783J17277J4140j16762j47194
$$ -140489 -158959 -29642 -18653 -209804 -89184 -75823 -7040 110237 124377 7615 -139579
6372a39579J10456Q6694j29798k5583R9130L9013J17193o973j78225p2248r0560
$$ -139579 -29123 57571 -72227 -97810 1320 40333 157526 150553 -27672 -99920 -190480
6361a90480J30804j9285j27257m3064J22290K48689j17077j3493p977m8843J42339
$$ -190480 -59676 -78961 -206218 -249282 -126992 121697 4620 -8873 -16850 -65693 76646
6350G6646R764j30495n6849J12227J10535j39061j29986M1493J67825J32101m284
$$ 76646 86410 -44085 -100934 11293 121828 -17233 -147219 -105726 62099 194200 189916
6339A89916k04182j71960N1877J38901J50835j83864j21400O3760j116M3578j09442
$$ 189916 -14266 -186226 -134349 4552 155387 -28477 -149877 -86117 -87233 -43655 -153097
6328a53097n6043l0301K3686J35159r3348O729m5859N8882J45714L9899j13566
$$ -153097 -209140 -239441 -215755 -80596 -173944 -167215 -213074 -154192 -8478 31421 -82145
6317h2145q2039j52022K7078J77641J74420J6304k16359j31209J29253L5182O9185
$$ -82145 -164184 -316206 -289128 -111487 62933 79237 -137122 -268331 -139078 -103896 -34711
6306c4711l5531R2235O7980m0520J16950j84660K5263J2901K431n9828L1116j7414
$$ -34711 -70242 21993 89973 49453 166403 -18257 7006 19907 22338 -37490 -6374 -23788
6294b3788P2165j13025j40163j34876k6035J23135K9780k0841J31004J41073j3327
$$ -23788 48377 -64648 -204811 -339687 -365722 -242587 -212807 -233648 -102644 38429 25102
6283B5102m5993j80235q5860N8861M6779J54858m0185n4621M83o3153j03914M9743
$$ 25102 -20891 -201126 -286986 -228125 -181346 -26488 -66673 -121294 -120811 -183964 -287878 -238135
6271b38135P6270J49803m2522j7096J40208k06683J7040J09056j18365j27582
$$ -238135 -161865 -12062 -54584 -71680 68528 -138155 -121115 -12059 -130424 -258006
6261b58006J38838J27171n5877p8722o9149M2927L3909m4920j13874P9096R8493
$$ -258006 -119168 8003 -47874 -126596 -195745 -152818 -118909 -163829 -277703 -198607 -100114
6250a00114N1182l2395j3491j17545L4243J00445q4081j11077O5712K23923r8417
$$ -100114 -48932 -81327 -94818 -212363 -178120 -77675 -161756 -272833 -207121 16802 -81615
6239h1615j21625M7073j03465L3072r962Q9984O4126O8270K67653j09434q5008
$$ -81615 -203240 -156167 -259632 -226560 -236522 -146538 -82412 -14142 253511 144077 59069
6228E9069k06049L9678J05651K1295M096J0194o9483j2591J13506j32730j38747
$$ 59069 -146980 -107302 -1651 19644 23740 33934 -35549 -48140 65366 -67364 -206111
6217b06111j09954m3064K29242K20397J20151j03524m3597n9081k28757q9500
$$ -206111 -316065 -359129 -129887 90510 210661 107137 63540 4459 -224298 -313798
6207c13798L41593J43181r2821j01214q2789m8904k3670m6358R5960K42791P2842
$$ -313798 27795 170976 78155 -23059 -105848 -154752 -178422 -224780 -128820 113971 186813
6196A86813P7385l700j57265r2334k6239j13636j29450J52018P0258j52128K48852
$$ 186813 264198 260498 103233 10899 -15340 -128976 -258426 -106408 -36150 -188278 60574
6185F0574R3287j21648K3258j06299p2924O1407K06352m3613m7432q0736j04473
$$ 60574 153861 32213 55471 -50828 -123752 -62345 144007 100394 52962 -27774 -132247
6174a32247q9965j00610m4485K01900P3764P2353m4745k8440r8888N0422m1907
$$ -132247 -222212 -322822 -367307 -165407 -91643 -19290 -64035 -92475 -191363 -140941 -182848
6163a82848K9586K47187k75844r1930J39417l7909L832O2780r6847J30342J2212
$$ -182848 -153262 93925 -181919 -273849 -134432 -172341 -168509 -105729 -202576 -72234 -60022
6152f0022J63051r7166m238o1561q3153m6355R3487J85263j1015J47013j71853
$$ -60022 103029 5863 1625 -59936 -143089 -189444 -95957 89306 78291 225304 53451
6141E3451k2216j4814j09565n2635m5508Q2969l6282J62411l6976k12253R2417
$$ 53451 31235 16421 -93144 -145779 -191287 -108318 -144600 17811 -19165 -231418 -139001
6130a39001K2023m8925N8254J44759M6639j2496o5751l3922K2047k6079q2469
$$ -139001 -116978 -165903 -107649 37110 83749 71253 5502 -28420 -6373 -32452 -114921
6119a14921j3422J78385J3158N6648k01859O4013N471q1200r3577Q8575j43500
$$ -114921 -128343 50042 63200 119848 -82011 -17998 -12527 -93727 -187304 -98729 -242229
6108b42229j25408L34706K07914J0757k01713j79667n4529R1396J6363J70668
$$ -242229 -367637 -32931 174983 185740 -15973 -195640 -250169 -158773 -142410 28258
6098B8258J8470L781m7346n1419O543J66885K3545j40382j9383N3229N778j04190
$$ 28258 46728 50509 3163 -48256 -41713 125172 148717 8335 -11048 42181 47959 -56231
6086e6231K6020j59032l1771P2768R907o786k0810K85590J30355J20301j59144
$$ -56231 -30211 -189243 -221014 -148246 -138339 -145125 -165935 119655 250010 370311 211167
6075B11167k91208n3678J23425J07375O0641J69686j18898j52074M7357k01733
$$ 211167 -80041 -133719 -10294 97081 157722 327408 208510 56436 103793 -97940
6065i7940k3672k7572m3133J16931K28936K34266k21206j2354n1109j46565L0187
$$ -97940 -121612 -149184 -192317 -75386 153550 387816 166610 154256 103147 -43418 -13231
6054a3231J21710j776l318n0279j66840l8865n5162j1365K84286J7333J1992J525
$$ -13231 108479 106703 103385 53106 -113734 -152599 -207761 -219126 65160 82493 94485 96010
6042I6010Q125q0800Q6073n8888k6854m3296m8970p672K07595K3634n3458R291
$$ 96010 104135 23335 109408 50520 23666 -19630 -68600 -76272 131323 154957 101499 110790
6030A10790n7028j1259j01897M3154O0542O4879k81052J92747Q7191r6981Q1147
$$ 110790 53762 42503 -59394 -16240 44302 109181 -171871 20876 108067 11086 92233
6019I2233j1368J11763n3536j86602J72279R8268M178m0183n852j82656N495Q7246
$$ 92233 80865 192628 139092 -47510 124769 223037 227215 187032 181180 -1476 4019 91265
6007I1265n7651j04546M6689r4508Q4126M3553j0147j05620j3526M9481L43082
$$ 91265 33614 -70932 -24243 -118751 -34625 8928 -1219 -106839 -120365 -70884 272198
5996B72198O2246k97056j09690o0661J34767R3419j9504l290L6889J87491n2777
$$ 272198 334444 37388 -72302 -132963 1804 95223 75719 72429 109318 296809 244032
5985B44032j01737N4214k0490K54427o8287k34362j13301R085J90034o0639m6222
$$ 244032 142295 196509 176019 430446 362159 127797 14496 23581 213615 152976 106754
5974A06754n2949M8212O3834o7195J21161N99o595P7214L9871j99460j65546N2286
$$ 106754 53805 102017 165851 98656 219817 220416 213821 291035 330906 131446 -34100 18186
5962A8186j2423J33227N1318j00974J5758n7236K28631K78889o2217j89890j71841
$$ 18186 5763 138990 190308 89334 105092 47856 276487 555376 493159 303269 131428
5951A31428k1201M1966J44823J03917k70854o1031j44258J34076J55329J33460
$$ 131428 110227 152193 297016 400933 130079 69048 -75210 58866 214195 347655
5941C47655p2106r5609M4678J05360j19671j4876J4337K5529J86808K5010j41643
$$ 347655 275549 179940 224618 329978 210307 195431 209768 235297 422105 447115 305472
5930C05472j65106M9413J91643o7523r0860m8039l3657Q1226J2355r038q6320
$$ 305472 140366 189779 381422 313899 223039 175000 141343 222569 234924 225886 139566
5919A39566j7794R5011K18876j27668M9951M593P2931J34213m9905j27158j65396
$$ 139566 121772 216783 435659 307991 357942 362535 435466 569679 519774 392616 227220
5908B27220p5181j1974K5473K2573J51176J18189q2786j04900j01647Q2772L4774
$$ 227220 152039 140065 165538 188111 339287 457476 374690 269790 168143 250915 285689
5897B85689M9885R4551J16231q2539k4559p7112k22170j78585J82346Q1575J92619
$$ 285689 335574 430125 546356 463817 439258 362146 139976 -38609 143737 225312 417931
5886D17931O9497p7707K57099L3412K3933k29662j2803J6612J66411Q7219l5251
$$ 417931 487428 409721 666820 700232 724165 494503 481700 498312 664723 751942 716691
5875G16691j56032n7908q570q7291L2293J58134p389J30483j71860k35395o0061
$$ 716691 560659 502751 494181 406890 439183 597317 589928 720411 548551 313156 253095
5864B53095m7242Q2649O8725R0508N1310n5909k2110J24782j20039j11235L1545
$$ 253095 205853 288502 357227 447735 499045 443136 421026 545808 425769 314534 346079
5853C46079J79093J4533J4415j47900j865K6723R6148r4579k9940O9311j47914
$$ 346079 525172 539705 554120 406220 404355 431078 527226 432647 402707 472018 324104
5842C24104J34375L6837M4045j3152j46114k508L5186k2311j03786J31174M4655
$$ 324104 458479 495316 539361 526209 380095 377587 412773 390462 286676 417850 462505
5831D62505k6721q244J55486k177n1972n1503j28253j27625r018J78364m2906
$$ 462505 435784 427540 583026 580849 528877 477374 349121 221496 212478 390842 347936
5820C47936m0699j04143N1812J19075L2109j27473j58810J6992K08570J92338
$$ 347936 307237 203094 254906 373981 406090 278617 119807 136799 345369 537707
5810E37707n9696j87447J25438q4462m7510j0797o8860J85840J44265j3686j25051
$$ 537707 478011 290564 416002 331540 284030 273233 204373 390213 534478 520792 395741
5799C95741j57025J53152K34434o1708j65744j55058J06999M8854J4845j80789
$$ 395741 238716 391868 626302 564594 398850 243792 350791 399645 414490 233701
5789B33701r0399J78722J19484J11900q7264q7391R3228M5930k92519l9236p8844
$$ 233701 143302 322024 441508 553408 466144 378753 471981 517911 225392 186156 107312
5778A07312O1259K275O478R113q6203J32614J59782p2871L2205k6014p3945J25934
$$ 107312 168571 170846 177324 186437 100234 232848 392630 319759 351964 325950 252005 377939
5766C77939m9893R9641m3327j17418p6808J86074J63274m639j21306n6837m017
$$ 377939 328046 427687 384360 266942 190134 376208 539482 534843 413537 356700 352683
5755C52683K04855P6343L1477j50412p8981q5246M3944O8761n1831k03473m3380
$$ 352683 557538 633881 665358 514946 435965 350719 394663 463424 411593 208120 164740
5744A64740K04181R5205j06981j11879n4464J25959J74602K36051l2172m14979
$$ 164740 368921 464126 357145 245266 190802 316761 491363 727414 695242 280263
5734B80263j69894L48040J87513p6888n9904j13156j9195k8810P2875k4897r055
$$ 280263 110369 458409 645922 569034 509130 395974 376779 347969 420844 395947 386892
5723C86892j02688K8032J29455o971m3288P5765j54986J51107J35087j16506k7534
$$ 386892 284204 312236 441691 434720 391432 467197 312211 463318 598405 481899 454365
5712D54365J02704j40414O1540n6822j02486J57535J49564J44022J1345K7090
$$ 454365 557069 416655 478195 421373 318887 476422 625986 770008 781353 808443
5702H08443k19120j6953O3721r4275p7751M2591N3902n4777R2612j3911p49k6063
$$ 808443 589323 572370 636091 541816 464065 506656 560558 505781 598393 584482 583733 557670
5690E57670j0777j36067q8137N2958K92202J93206o6679j15412j4773J06970m3757
$$ 557670 546893 410826 322689 375647 667849 861055 794376 678964 664191 771161 727404
5679G27404k88250p6533J00301L9581K13416K352P2712j22459j5802J12731R02
$$ 727404 439154 362621 462922 502503 715919 718271 790983 668524 652722 765453 766355
5668G66355j62718L8938O3041j88769k6307p2665M9443L4317J30451n3681K6121
$$ 766355 603637 642575 705616 516847 490540 417875 467318 501635 632086 578405 604526
5657F04526m8638j123P904J31639J19095q4680q0091K1472J2879j5225k4394P3607
$$ 604526 555888 554765 562669 694308 813403 728723 648632 670104 682983 667758 643364 716971
5645G16971J96218l6946O8683P543k0988q6826R452n5556o7778R2359J30619p652
$$ 716971 913189 876243 944926 952469 931481 844655 854107 798551 730773 823132 953751 946099
5633I46099N5109m1992L2262O8502q2142J2725J17250k36125l7063J26151k8137
$$ 946099 1001208 959216 991478 1059980 977838 990563 1107813 871688 834625 960776 932639
5622I32639N0939J07480o9637m7801K0619O5729J51023M6772m8611n496N4571
$$ 932639 983578 1091058 1021421 973620 994239 1059968 1210991 1257763 1209152 1203656 1258227
5611A258227Q5000N8903r3749J26763R4848k5407L3624K700m0597j6525J13391
$$ 1258227 1343227 1402130 1308381 1435144 1529992 1504585 1538209 1540909 1500312 1483787 1597178
5600A597178N3685r7112M5205L88406J16250o4317j18229J3796N3183J36929J3765
$$ 1597178 1650863 1553751 1598956 1987362 2103612 2039295 1921066 1934862 1988045 2124974 2138739
5589B138739n0409J79456K8648J76212J96748j11980o1767k8618L10634K97794
$$ 2138739 2088330 2267786 2296434 2472646 2669394 2557414 2495647 2467029 2777663 3075457
5579C075457j32115K5835N8661J46127R246N987j05446J0261J08539L34700Q7437
$$ 3075457 2943342 2969177 3027838 3173965 3183211 3189198 3083752 3094013 3202552 3537252 3624689
5568C624689K094j01053o8513K69369J29770k7108r8204p8980K68135J56358N2522
$$ 3624689 3626783 3525730 3457217 3726586 3856356 3829248 3731044 3652064 3920199 4076557 4129079
5557D129079q0129j5765O4780k9945J07459k2098L7014k9814l6257K0627J05546
$$ 4129079 4048950 4033185 4097965 4068020 4175479 4153381 4190395 4160581 4124324 4144951 4250497
5546D250497K8072j3892o714j40588L7545J8698j08965k58145j29849J35593Q2053
$$ 4250497 4278569 4264677 4257963 4117375 4154920 4173618 4064653 3806508 3676659 3812252 3894305
5535C894305o584l17317O888M9338M8933J7231P094k81428r6002L5773l5669q0060
$$ 3894305 3887721 3570404 3577292 3626630 3675563 3692794 3699888 3418460 3322458 3358231 3322562 3242502
5523C242502j07220j14882L6884J16007j73001j79400J39r6579o8479J22413m9454
$$ 3242502 3135282 3020400 3057284 3173291 3000290 2820890 2821029 2724450 2655971 2778384 2728930
5512B728930k15647j10874K27025n6483Q6374l9475r3811m2117l7964J16410Q5427
$$ 2728930 2513283 2402409 2629434 2572951 2659325 2619850 2526039 2483922 2445958 2562368 2647795
5501B647795J48001J1057k4277m5281l2660O1525k25395k13251j15810J0299j50189
$$ 2647795 2795796 2806853 2782576 2737295 2704635 2766160 2540765 2327514 2211704 2222003 2071814
5490B071814j06068J54201L9183j7894Q7077J1312R1930p0159J4403J19018P5184
$$ 2071814 1965746 2119947 2159130 2141236 2228313 2239625 2331555 2261396 2275799 2394817 2470001
5479B470001J5115O3J01486N7495J00336J44421J71163K34892J06382K13480J59689
$$ 2470001 2485116 2485179 2586665 2644160 2744496 2888917 3060080 3294972 3401354 3614834 3774523
5468C774523K1722j14163j15885M2761j34886k66502j32259j53412j87342q3872
$$ 3774523 3796245 3682082 3566197 3608958 3474072 3207570 3075311 2921899 2734557 2650685
5458B650685M018k4672j13510O4914r0888R2531M6651J07974J58204J34044N1956
$$ 2650685 2654703 2630031 2516521 2581435 2490547 2583078 2629729 2737703 2895907 3029951 3081907
5447C081907j538J54802k0801l0795Q3977Q4495K42792Q4427K30576K65952J7343
$$ 3081907 3080369 3235171 3214370 3183575 3267552 3352047 3594839 3679266 3909842 4175794 4193137
5436D193137j76258N5740j00936j301j33753o3177p8407l0860j17813l54645q5633
$$ 4193137 4016879 4072619 3971683 3970382 3836629 3773452 3695045 3664185 3546372 3191727 3106094
5425C106094l7434k29861N9095J81484N5687J66108L3392r0351k7958P3533N1018
$$ 3106094 3068660 2838799 2897894 3079378 3135065 3301173 3334565 3244214 3216256 3289789 3340807
5414C340807J15929J02123Q5910J8007R9223l2053l7935q6331J16455J42210r2872
$$ 3340807 3456736 3558859 3644769 3662776 3761999 3729946 3692011 3605680 3722135 3864345 3771473
5403C771473j0955k9646r2156L6114n7372j79050M4330J9984j70426K674j00686
$$ 3771473 3760518 3730872 3638716 3674830 3617458 3438408 3482738 3502722 3332296 3334970 3234284
5392C234284r4154m3052p175J09006J3093l17834p0489J22286L191J74718L4256
$$ 3234284 3140130 3097078 3089903 3198909 3212002 2894168 2823679 2945965 2949156 3123874 3158130
5381C158130j01898J33307n7690j44737o2411k8021N4977J10029M854r5224j42766
$$ 3158130 3056232 3189539 3131849 2987112 2924701 2896680 2951657 3061686 3066540 2971316 2828550
5370B828550k1482J74712n5392j35901j30171j26978L11166J98662j88255j27841
$$ 2828550 2807068 2981780 2926388 2790487 2660316 2533338 2844504 3043166 2854911 2727070
5360B727070M4134j7142P9815J24569j19981o2105N646p8714J9764L3127j19150
$$ 2727070 2771204 2754062 2833877 2958446 2838465 2776360 2782006 2703292 2723056 2756183 2637033
5349B637033j028l631l1913k0258P4228n4909j41728N8500n9626O8075O9406j8304
$$ 2637033 2636005 2632374 2600461 2580203 2654431 2599522 2457794 2516294 2456668 2524743 2594149 2575845
5337B575845J57663J6534j05995K363J0969n9651k4519j48700j83168L3139J61684
$$ 2575845 2733508 2750042 2644047 2646410 2657379 2597728 2573209 2424509 2241341 2274480 2436164
5326B436164K03952r3731n1779n7969p4480O0327o9481k8680R741p8927q105m5587
$$ 2436164 2640116 2546385 2494606 2436637 2362157 2422484 2353003 2324323 2334064 2255137 2247032 2201445
5314B201445n4274M3232o3192p3661R4470j60104o28q0498j17900j2919J28737
$$ 2201445 2147171 2190403 2127211 2053550 2148020 1987916 1987288 1906790 1788890 1775971 1904708
5303A904708N874j53093J18764J55941J20924k1593Q0359j16921j0721J5566O2460
$$ 1904708 1910582 1757489 1876253 2032194 2153118 2131525 2211884 2094963 2084242 2099808 2162268
5292B162268j34082j95534M7422j711K4472l7412j51855L8167K9610o1277j31893
$$ 2162268 2028186 1832652 1880074 1878363 1902835 1865423 1713568 1751735 1781345 1720068 1588175
5281A588175j1658p3006K20018J595l185n5126j15143N7929l934O0029k0556o291
$$ 1588175 1576517 1503511 1723529 1725124 1721939 1666813 1551670 1609599 1605665 1665694 1645138 1638847
5269A638847k5586k3915L7867m0372K8838J26718p6036r8232O0719j5212k33181
$$ 1638847 1613261 1589346 1627213 1586841 1615679 1742397 1666361 1568129 1628848 1613636 1380455
5258A380455m814O5151K3617q058M1285L7644j90845L4907j27540k190J44552
$$ 1380455 1375641 1440792 1464409 1456351 1497636 1535280 1344435 1379342 1251802 1249612 1394164
5247A394164N3174Q7871j66656J39243m3701m3830l6428J32474J66233J34312
$$ 1394164 1447338 1535209 1368553 1507796 1464095 1420265 1383837 1516311 1682544 1816856
5237A816856K4987N6206J38660j54250L0623P0767K40082N5453p4286R9917K112
$$ 1816856 1841843 1898049 2036709 1882459 1913082 1983849 2223931 2279384 2205098 2305015 2307127
5226B307127k2421j39667j32082q1619j49128j17463K2645j43269m9891j202p8948
$$ 2307127 2284706 2145039 2012957 1931338 1782210 1664747 1687392 1544123 1494232 1493030 1414082
5215A414082l7471J38384N5824j89488k2131M5696j9740k11304o9358m9637J37477
$$ 1414082 1376611 1514995 1570819 1381331 1359200 1404896 1385156 1173852 1104494 1054857 1192334
5204A192334j7985O4378J1410N397R7568L4018j39041j29101o2873J23678J46225
$$ 1192334 1174349 1238727 1250137 1255534 1353102 1387120 1248079 1118978 1056105 1179783 1326008
5193A326008j37260j47809M748J31589K8152j00676j06148J20285r666J262k5438
$$ 1326008 1188748 1040939 1045687 1177276 1205428 1104752 998604 1118889 1109223 1110485 1085047
5182A085047j0797n5164n6026L0474l1131P9825K826j05975R2907N7617o4412
$$ 1085047 1074250 1019086 963060 993534 962403 1042228 1045054 939079 1031986 1089603 1025191
5171A025191j60928L8617M8215k3147J09798O9457L6852J09968n3920o8067r189
$$ 1025191 864263 902880 951095 927948 1037746 1107203 1144055 1254023 1200103 1132036 1122847
5160A122847j1092L3068K0859k9244J29590Q6408Q3922R7132j30792k05527k9933
$$ 1122847 1111755 1144823 1165682 1136438 1266028 1352436 1436358 1533490 1402698 1197171 1167238
5149A167238J18880J18107L6405j69688m6010L35320m2579J6814J60555j16671
$$ 1167238 1286118 1404225 1440630 1270942 1224932 1560252 1517673 1534487 1695042 1578371
5139A578371p6631R3896j1778j08862P9044J20105P3263J84726J14383J404O3759
$$ 1578371 1501740 1595636 1583858 1474996 1554040 1674145 1747408 1932134 2046517 2047921 2111680
5128B111680j2627n3885J33485K3794P4477J65010m076J41097J88764j21514j16602
$$ 2111680 2099053 2045168 2178653 2202447 2276924 2441934 2437858 2578955 2767719 2646205 2529603
5117B529603L2239Q8703J22919J00352r9847N6638n6608r025L7252p9428L2543
$$ 2529603 2561842 2650545 2773464 2873816 2773969 2830607 2773999 2764974 2802226 2722798 2755341
5106B755341J11509N5301j6197Q9015J205J50343N0873p1656j0203L3810q1547
$$ 2755341 2866850 2922151 2905954 2994969 2996174 3146517 3197390 3125734 3115531 3149341 3067794
5095C067794K43749r8799k30453j65322j29907K0977O5223R4036M6199N2700K26394
$$ 3067794 3311543 3212744 2982291 2816969 2687062 2708039 2773262 2867298 2913497 2966197 3192591
5084C192591n1102J9350Q4985l0231J15875K757J39437P1870Q5490J8775p7604
$$ 3192591 3141489 3160839 3245824 3215593 3331468 3334225 3473662 3545532 3631022 3649797 3572193
5073C572193r2500j54934l8458m8290l9714N9224R225Q6234M6551l27016n7747
$$ 3572193 3479693 3324759 3286301 3238011 3198297 3257521 3266746 3352980 3399531 3072515 3014768
5062C014768K9992P1610q8829J749L5008p4930m3799j58646j93440r8469j36576
$$ 3014768 3044760 3116370 3027541 3029290 3064298 2989368 2945569 2786923 2593483 2495014 2358438
5051B358438j43735k06819l59535J80622K72601n5881j36455j65239m127n517
$$ 2358438 2214703 2007884 1648349 1828971 2101572 2045691 1909236 1743997 1739870 1734353
5041A734353N9498K8349k38918n4554K31090l4144j13450k45587o2177Q2273N8436
$$ 1734353 1793851 1822200 1583282 1528728 1759818 1725674 1612224 1366637 1304460 1386733 1445169
5030A445169R8476Q888j12168j29260J37798J5861m0102N865J39651j07971m0178
$$ 1445169 1543645 1552533 1440365 1311105 1448903 1464764 1424662 1430527 1570178 1462207 1422029
5019A422029k7342O0340j18227n6395K0537L251P4863Q1977P3283L7435N6895
$$ 1422029 1394687 1455027 1336800 1280405 1300942 1304193 1379056 1461033 1534316 1571751 1628646
5008A628646j32463K26741j85400r9257J00221K54650k85p8675J1090o8539l5900
$$ 1628646 1496183 1722924 1537524 1438267 1538488 1793138 1792853 1714178 1725268 1656729 1620829
4997A620829O4891J2289p9154O0131M5353J46000j63664J73398J23562K160j25964
$$ 1620829 1685720 1698009 1618855 1678986 1724339 1870339 1706675 1880073 2003635 2005795 1879831
4986A879831K8775N4371p9814j04020O004K349K05909J44940M3222R9015K47735
$$ 1879831 1908606 1962977 1883163 1779143 1785147 1787496 1993405 2138345 2181567 2280582 2528317
4975B528317M0239J24842K21343N3025j83761O8114J60443J93495N5748j03936
$$ 2528317 2568556 2693398 2914741 2967766 2784005 2852119 3012562 3206057 3261805 3157869
4965C157869k11004J0605J21092K0734J30232L6675J39932J89381P450l2972j965
$$ 3157869 2946865 2957470 3078562 3099296 3229528 3266203 3406135 3595516 3602966 3569994 3568029
4954C568029k18849j4105K66667K08638l1669k3431j7902j6210n910R1723O336
$$ 3568029 3349180 3335075 3601742 3810380 3778711 3755280 3737378 3721168 3715258 3806981 3813317
4943C813317l6528R1485J16703L1877K14782N6874j87423r4459M5974P9022J29681
$$ 3813317 3776789 3868274 3984977 4016854 4231636 4288510 4101087 4006628 4052602 4131624 4261305
4932D261305J00066J33136J06847q279j06877L7946K0561J26039J06963J94602
$$ 4261305 4361371 4494507 4601354 4593075 4486198 4524144 4544705 4670744 4777707 4972309
4922D972309p5J475J87652L0425q1067J40425j08840J96284K81792J19698R3216
$$ 4972309 4972234 4973709 5161361 5191786 5110719 5251144 5142304 5338588 5620380 5740078 5833294
4911E833294l1769J00206p3866J25894K20262K52708K19674L08543K97722O9041
$$ 5833294 5801525 5901731 5827865 5953759 6174021 6426729 6646403 6954946 7252668 7321709
4901G321709J57156j92737J5000k51446j16667k03567j44857k8617k63476p9947
$$ 7321709 7478865 7286128 7301128 7049682 6933015 6729448 6584591 6555974 6292498 6212551
4891F212551k35651P1110l1318P1706R1395o9992J5701k2296j13842j25154j99998
$$ 6212551 5976900 6048010 6016692 6088398 6179793 6109801 6125502 6103206 5989364 5864210 5664212
4880E664212k6586J01799O6127J02177r2811n0624r8695o9403p0760j4994j25100
$$ 5664212 5637626 5739425 5805552 5907729 5814918 5764294 5665599 5596196 5525436 5510442 5385342
4869E385342j5492K69746j30709o343j12711j44835j05412J01499m2595L2867
$$ 5385342 5369850 5639596 5508887 5502544 5389833 5244998 5139586 5241085 5198490 5231357
4859E231357j21920r5118K06957J37143P492k5262Q8906M7430j3906J7931j30231
$$ 5231357 5109437 5014319 5221276 5358419 5365911 5340649 5429555 5476985 5463079 5481010 5350779
4848E350779L0310K4324K01262J35366q1396J9387P4022r5832m3080p3707R7618
$$ 5350779 5381089 5405413 5606675 5742041 5660645 5680032 5754054 5658222 5615142 5541435 5639053
4837E639053K32010M9780j19416r5188j41278K879J19996o8385l0688q3760q4328
$$ 5639053 5871063 5920843 5801427 5706239 5564961 5567840 5687836 5619451 5588763 5505003 5420675
4826E420675j10452j7324n2667l4354n0581N9606Q8018k13847K3616k07848j98581
$$ 5420675 5310223 5292899 5240232 5205878 5155297 5214903 5302921 5089074 5112690 4904842 4706261
4815D706261J15619k53853l0801o9748m6034M8234o9278o9111L7019j3198q6385
$$ 4706261 4821880 4568027 4537226 4467478 4421444 4469678 4400400 4331289 4368308 4355110 4268725
4804D268725k3577k9204R0036J68751q9645M3287r4788k9101o853J3096M2274
$$ 4268725 4245148 4215944 4305980 4474731 4385086 4428373 4333585 4304484 4297631 4310727 4353001
4793D353001J32067Q8643J12763J75465j38966Q3702Q0039O0945K07682K44772
$$ 4353001 4485068 4573711 4686474 4861939 4722973 4806675 4886714 4947659 5155341 5400113
4783E400113K73379M11059l9051j09K47774J86505L10616K63469M83407M04759
$$ 5400113 5673492 6084551 6045500 6045391 6293165 6479670 6790286 7053755 7537162 7941921
4773G941921M44406M26244N48464M87606O62799J026834J450815J604418J882650
$$ 7941921 8386327 8812571 9361035 9848641 10511440 11538274 12989089 14593507 16476157
4764A6476157J643300J097610K13837n80459j100650j754140j916540j642156
$$ 16476157 18119457 19217067 19430904 18850445 17749795 15995655 14079115 12436959
4756A2436959j441107j157692q40785p85388n97494n09798n20721l25863r5330
$$ 12436959 10995852 9838160 8997375 8211987 7614493 7104695 6583974 6258111 6162781
4747F162781o5091k3830j31230j14216k92007j87618J03646j43823j54785k1375
$$ 6162781 6097690 6073860 5942630 5828414 5536407 5348789 5452435 5308612 5153827 5132452
4737E132452K47346R2203L9507J31608k9782O3699J66323L66353K35672Q5357
$$ 5132452 5379798 5472001 5511508 5643116 5613334 5677033 5843356 6209709 6445381 6530738
4727F530738K0093j15172l13217l28925k84477j45085n6669o3205Q7975K8092
$$ 6530738 6550831 6435659 6122442 5793517 5509040 5363955 5307286 5244081 5332056 5360148
4717E360148J68278j22396k6746K09668K505J76526R2065J46393K35157N21832
$$ 5360148 5528426 5406030 5379284 5588952 5591457 5767983 5860048 6006441 6241598 6763430
4707F763430K49247L39368L20328N36312P69289Q87303P72058J013198J364304
$$ 6763430 7012677 7352045 7672373 8208685 8977974 9865277 10637335 11650533 13014837
4698A3014837J521270J562780J366738O21886Q011n47902j211815j292764j634991
$$ 13014837 14536107 16098887 17465625 18087511 18095522 17547620 16335805 15043041 13408050
4689A3408050j526586j279855j112083p15091p94876m18982m46530n22055m03452
$$ 13408050 11881464 10601609 9489526 8774435 7979559 7560577 7114047 6591992 6188540
4680F188540l83384j87185k16494o5427p5706k14488r1671k9853J56095j41173
$$ 6188540 5805156 5617971 5401477 5336050 5260344 5045856 4954185 4924332 5080427 4939254
4670D939254k0377L45697M9717j1825j62718m2664l48548l34963P323k95205l04819
$$ 4939254 4918877 5264574 5314291 5302466 5139748 5097084 4748536 4413573 4420896 4125691 3820872
4659C820872j46272j44212k2142j09816o5521j60381l4849j93509j59183J52649
$$ 3820872 3674600 3530388 3508246 3398430 3332909 3172528 3137679 2944170 2784987 2937636
4649B937636o4982m5177k2331J7566K2142m2947j92741j58061k2941J51168m5954
$$ 2937636 2872654 2827477 2805146 2822712 2844854 2801907 2609166 2451105 2428164 2579332 2533378
4638B533378o1548J10528O3267J2702R887j03366j8382n2633J6312J43120j38936
$$ 2533378 2471830 2582358 2645625 2658327 2668214 2564848 2546466 2493833 2510145 2653265 2514329
4627B514329k57303j81990K57198J84378m4122j02859m6253p2278M2621O1826
$$ 2514329 2257026 2075036 2332234 2516612 2472490 2369631 2323378 2251100 2293721 2355547
4617B355547j41065j9872P0657K22780K80177j12562k48673j33650J29019q5588
$$ 2355547 2214482 2194610 2265267 2488047 2768224 2655662 2406989 2273339 2402358 2316770
4607B316770J07704r4209j38012l5192Q4389p555j43611j82222J43817L00992
$$ 2316770 2424474 2330265 2192253 2157061 2241450 2233895 2090284 1908062 2051879 2352871
4597B352871J74978n8201k03039L1516j1059P0788N2964o6077M9355M1456K23366
$$ 2352871 2527849 2469648 2266609 2298125 2287066 2357854 2410818 2344741 2394096 2435552 2658918
4586B658918k2262n3891n4366k07580m5956P1271R2146L4172O6815J62813K805
$$ 2658918 2636656 2582765 2528399 2320819 2274863 2346134 2438280 2472452 2539267 2702080 2704885
4575B704885q6226n6805j49075K14669L753P1489n2892q3749q8115o3946J70321
$$ 2704885 2618659 2561854 2412779 2627448 2631201 2702690 2649798 2566049 2477934 2413988 2584309
4564B584309J12496l4685q1276j1878P1234K37295k1461P4830j60290K7866P56
$$ 2584309 2696805 2662120 2580844 2568966 2640200 2877495 2856034 2930864 2770574 2798440 2799196
4553B799196O8016M2459o3123k6334p4852J54376j00809j39306N5121J51740q0607
$$ 2799196 2867212 2909671 2846548 2820214 2745362 2899738 2798929 2659623 2714744 2866484 2785877
4542B785877K23841M5361L3105K9626j3609p4431o5759Q1480L3952J58804J05314
$$ 2785877 3009718 3055079 3088184 3117810 3104201 3029770 2964011 3045491 3079443 3238247 3343561
4531C343561l8700p9579J08845P0300j36451K4225J64267N1499J52765R3069k00198
$$ 3343561 3304861 3225282 3334127 3404427 3267976 3292201 3456468 3507967 3660732 3753801 3553603
4520C553603J59522R5916l5933K1445J24251K37796N0045J937j01867l4291O4424
$$ 3553603 3713125 3809041 3773108 3794553 3918804 4156600 4206645 4208582 4106715 4072424 4136848
4509D136848J03132L4852P6215L62021N7484J97632L7027o6599P5218K72189L27423
$$ 4136848 4239980 4274832 4351047 4713068 4770552 4968184 5005211 4938612 5013830 5286019 5613442
4498E613442L2148K4141J07112l5948J19672O8735J22882J36088O9778L34453
$$ 5613442 5645590 5669731 5776843 5740895 5860567 5929302 6052184 6188272 6258050 6592503
4488F592503K85543J46516K50333K87421K71519K40905L50413J92439L95372L56197
$$ 6592503 6878046 7024562 7274895 7562316 7833835 8074740 8425153 8617592 9012964 9369161
4478I369161L38366M46371N10467L13374K07826K37676K75772M05992L52430K07311
$$ 9369161 9707527 10153898 10664365 10977739 11185565 11423241 11699013 12105005 12457435 12664746
4468A2664746J77236J21038O863J50464p7541m0457N1740J78101J65675J035R2561
$$ 12664746 12841982 12963020 12969883 13120347 13042806 13002349 13054089 13232190 13397865 13398900 13491461
4457A3491461R9443J91178L07390J46292L86512L69936M74752M83980O12772M74398
$$ 13491461 13590904 13782082 14089472 14235764 14622276 14992212 15466964 15950944 16563716 17038114
4447A7038114M88660M47602N92141N70015N36751M09265M84252L46608M14531
$$ 17038114 17526774 17974376 18566517 19136532 19673283 20082548 20566800 20913408 21327939
4438B1327939L02415L00440L39973J97404M58066L39384K43862K00931M61951
$$ 21327939 21630354 21930794 22270767 22468171 22926237 23265621 23509483 23710414 24172365
4429B4172365M16605L26446O9869J78016L30155M51812K45529J1392k9699J02302
$$ 24172365 24588970 24915416 24985285 25163301 25493456 25945268 26190797 26202189 26172490 26274792
4419B6274792P1646o1040j22238m8915O3670J78482L14743O5313K3055J1972M2247
$$ 26274792 26346438 26285398 26163160 26114245 26177915 26356397 26671140 26736453 26759508 26771480 26813727
4408B6813727K43367L93483J51528K68324M20413N11084M86583K57159R4018K10118
$$ 26813727 27057094 27450577 27602105 27870429 28290842 28801926 29288509 29545668 29639686 29849804
4398B9849804Q6614J12207Q4623Q0575r4844j81824j53858r3205l26227n77655
$$ 29849804 29936418 30048625 30133248 30213823 30118979 29937155 29783297 29690092 29363865 28786210
4388B8786210n86394n53801m68062n10843q43815q38883p69800q40074p84967
$$ 28786210 28199816 27646015 27177953 26667110 25823295 24984412 24214612 23374538 22589571
4379B2589571q56202p39978p17723o02900n18498o27458n91279n50460o55305
$$ 22589571 21733369 20993391 20275668 19672768 19154270 18526812 17935533 17385073 16729768
4370A6729768l61245k04935l25198k04184k38675k16964j94446j96095l88082
$$ 16729768 16368523 16163588 15838390 15634206 15395531 15178567 14984121 14788026 14399944
4361A4399944r0943o0388j01834j51619j26865L7334L9350n2918q4767o2536N6336
$$ 14399944 14309001 14248613 14146779 13995160 13868295 13905629 13944979 13892061 13807294 13744758 13801094
4350A3801094k1693J5558K35912J61577O6712o1870K61399K38012J70952K8907
$$ 13801094 13779401 13794959 14030871 14192448 14259160 14197290 14458689 14696701 14867653 14896560
4340A4896560L01900K38886L07699J91424K29008J32794K02961M36126M14875
$$ 14896560 15198460 15437346 15745045 15936469 16165477 16298271 16501232 16937358 17352233
4331A7352233J78967K44636M06131N11753M56935O19120M55442L79985M96867
$$ 17352233 17531200 17775836 18181967 18693720 19150655 19769775 20225217 20605202 21102069
4322B1102069O80997P03552O05248O32171J003272J111111Q59244Q02474O48438
$$ 21102069 21783066 22486618 23091866 23724037 24727309 25838420 26697664 27500138 28148576
4313B8148576P68586Q16002O89004M94650K82324K81253L37195J2600K9907n9671
$$ 28148576 28917162 29733164 30422168 30916818 31199142 31480395 31817590 31830190 31860097 31800426
4303C1800426k06180j09716O1918j99164Q246p6937j95056o6556k34002j21738
$$ 31800426 31594246 31484530 31546448 31347284 31355530 31278593 31083537 31016981 30782979 30661241
4293C0661241j49568o8700n5252k9500K5656N858J44462j00631Q7211K7395J6133
$$ 30661241 30511673 30442973 30387721 30358221 30383877 30389735 30534197 30433566 30520777 30548172 30564305
4282C0564305J94346N267n8330j12128R1888j3341k09706k18972l35177j57488
$$ 30564305 30758651 30763918 30705588 30593460 30685348 30672007 30462301 30243329 29908152 29750664
4272B9750664j52942l00886k99905l57076k08016k36087m43967m82761m71174
$$ 29750664 29597722 29296836 28996931 28639855 28431839 28195752 27751785 27269024 26797850
4263B6797850k06907j38676k15682k31431l63176k32802j25896l44628l33618
$$ 26797850 26590943 26452267 26236585 26005154 25641978 25409176 25283280 24938652 24605034
4254B4605034j74327n21598n77843l83860m56586m26448m33988n64581k98561
$$ 24605034 24430707 23909109 23331266 22947406 22490820 22064372 21630384 21065803 20767242
4245B0767242l44313l28041k95633j13202k85898j39020o1468p2361n2218J54397
$$ 20767242 20422929 20094888 19799255 19686053 19400155 19261135 19199667 19127306 19075088 19229485
4235A9229485o1789L7586R3523o6110j54658l5071p985K6151m8j27569k4964r488
$$ 19229485 19167696 19205282 19298805 19232695 19078037 19042966 19034981 19061132 19061084 18933515 18908551 18899063
4223A8899063P4148n1379L7450M2431r248J45163J38293n3659M9087l2089M2917
$$ 18899063 18973211 18921832 18959282 19001713 18992465 19137628 19275921 19222262 19271349 19239260 19282177
4212A9282177K50373N0427L0802K3638O2965L81365J80221O0300K69322K14381
$$ 19282177 19532550 19582977 19613779 19637417 19700382 20081747 20261968 20322268 20591590 20805971
4202B0805971K002J77614R4739K16643J34198K31382J80405K40502k2797n306
$$ 20805971 20807973 20985587 21080326 21296969 21431167 21662549 21842954 22083456 22060659 22055353
4192B2055353j29794K20104J11891N6590k4929J32169L06089j870l86506J02124
$$ 22055353 21925559 22145663 22257554 22314144 22289215 22421384 22727473 22725603 22339097 22441221
4182B2441221J83278J65164j10157k32382j845Q8458J17405m719K56091k33782
$$ 22441221 22624499 22789663 22679506 22447124 22445279 22533737 22651142 22646423 22902514 22668732
4172B2668732k0342K90302K20846K47879Q1222K2978J74091J99360J26241J26840
$$ 22668732 22648390 22938692 23159538 23407417 23488639 23511617 23685708 23885068 24011309 24138149
4162B4138149R0792J82383L97117L06580K39978K26021K31185M76612N58159L92854
$$ 24138149 24228941 24411324 24808441 25115021 25354999 25581020 25812205 26288817 26846976 27239830
4152B7239830L09472L15612J94897K41049M12216R586o6929r0659J75717L50759
$$ 27239830 27549302 27864914 28059811 28300860 28713076 28722662 28655733 28565074 28740791 29091550
4142B9091550K14409K36548P4433J14343J73122K23578j64890j36056j31294K2311
$$ 29091550 29305959 29542507 29616940 29731283 29904405 30127983 29963093 29827037 29695743 29718054
4132B9718054K23485r2009l6747j46937r5196J03405K10378K1149j25442j43135
$$ 29718054 29941539 29849530 29812783 29665846 29570650 29674055 29884433 29905582 29780140 29637005
4122B9637005k6498Q7858K4774K2965Q4196J68847Q9173J016L7826J1112L13447
$$ 29637005 29610507 29698365 29723139 29746104 29830300 29999147 30088320 30089336 30127162 30138274 30451721
4111C0451721K68184K63225K19742M79698N22550N43181N42321O61972P43942
$$ 30451721 30719905 30983130 31202872 31682570 32205120 32748301 33290622 33952594 34696536
4102C4696536P80473O86722P69354P60520Q61765Q15997O46511N52852O77897
$$ 34696536 35477009 36163731 36933085 37693605 38555370 39371367 40017878 40570730 41248627
4093D1248627O63103Q91964O45518N99303O91514R25736P59560P94633R84500
$$ 41248627 41911730 42803694 43449212 44048515 44740029 45665765 46425325 47219958 48204458
4084D8204458J076881J361543J375601J400036J413316J424703J506372J522082
$$ 48204458 49281339 50642882 52018483 53418519 54831835 56256538 57762910 59284992
4076E9284992J494465J415128J422138J599631J897454J861155K178252K637366
$$ 59284992 60779457 62194585 63616723 65216354 67113808 68974963 71153215 73790581
4068G3790581L166034L564011M269602M866550N145601N524538N026090M643913
$$ 73790581 76956615 80520626 84790228 89656778 94802379 100326917 105353007 109996920
4060A09996920L772369L558862L644352M153031M800356N487367O050096O260206
$$ 109996920 113769289 117328151 120972503 125125534 129925890 135413257 141463353 147723559
4052A47723559N740502M920635L831803K644750J566922J373730J630966K016085
$$ 147723559 153464061 158384696 162216499 164861249 166428171 167801901 169432867 171448952
4044A71448952K160225J386671r44047l913715o379870q405205r952063j0347297
$$ 171448952 173609177 174995848 174051801 170138086 163758216 155353011 145400948 135053651
4036A35053651r989642q508115o619886n329896m285193l532698k787642k074608
$$ 135053651 125064009 116555894 109936008 104606112 100320919 96788221 94000579 91925971
4028I1925971j324298j095599o27054K02857P15903J106156J845573K410906K711905
$$ 91925971 90601673 89506074 88879020 89081877 89797780 90903936 92749509 95160415 97872320
4019I7872320K363212J126195m96443j854394k791934l271599l210190k808789
$$ 97872320 100235532 101361727 100865284 99010890 96218956 92947357 89737167 86928378
4011H6928378k375225j745036j021722p05595j53581l1296J24086N00583Q56639
$$ 86928378 84553153 82808117 81786395 81080800 80927219 80895923 81020009 81520592 82377231
4002H2377231R74881R68373R81909J345213J468724J525422J683875J764970J614220
$$ 82377231 83352112 84320485 85302394 86647607 88116331 89641753 91325628 93090598 94704818
3993I4704818J702070J922724J993828K028645K252356K305349K057393K141475
$$ 94704818 96406888 98329612 100323440 102352085 104604441 106909790 108967183 111108658
3985A11108658K357490K202217K129576K288691K454186K117610K166560J965180
$$ 111108658 113466148 115668365 117797941 120086632 122540818 124658428 126824988 128790168
3977A28790168K139374K112272J970774J930078J696017J875099K004383K238194
$$ 128790168 130929542 133041814 135012588 136942666 138638683 140513782 142518165 144756359
3969A44756359K036771J888557J807044K159524K036934J859905J802551J665619
$$ 144756359 146793130 148681687 150488731 152648255 154685189 156545094 158347645 160013264
3961A60013264J526391J457568J498765J210286R88825R07047Q85814J024271
$$ 160013264 161539655 162997223 164495988 165706274 166695099 167602146 168487960 169512231
3953A69512231O20551N65903L42321J388p4646J8037l36929k66776o32755o33111
$$ 169512231 170132782 170698685 171041006 171042394 170967748 170985785 170648856 170382080 169749325 169116214
3943A69116214o17704n57208n58662r21604j024854j160411j300242j702145j769042
$$ 169116214 168498510 167941302 167382640 166461036 165436182 164275771 162975529 161273384 159504342
3934A59504342j883764k077052j963478j829591j866433j852932j860248j629555
$$ 159504342 157620578 155543526 153580048 151750457 149884024 148031092 146170844 144541289
3926A44541289j426282j362120j112994j020033j145674p55239n18648l65728
$$ 144541289 143115007 141752887 140639893 139619860 138474186 137718947 137200299 136834571
3918A36834571j76310J05568N91211J301685J288414J881758K310661K696924
$$ 136834571 136658261 136763829 137355040 138656725 139945139 141826897 144137558 146834482
3910A46834482L477371L774992M314319N064593N270160N564251N695998N293578
$$ 146834482 150311853 154086845 158401164 163465757 168735917 174300168 179996166 185289744
3902A85289744M742619M102903L420694K476274J765689J335581J038624J010640
$$ 185289744 190032363 194135266 197555960 200032234 201797923 203133504 204172128 205182768
3894B05182768J103160O60010Q46926P67263O31366L50344p3532p52328j535075
$$ 205182768 206285928 206945938 207792864 208560127 209191493 209541837 209468305 208715977 207180902
3885B07180902k166535k617137l040954l345633l284807l138373k667701k315240
$$ 207180902 205014367 202397230 199356276 196010643 192725836 189587463 186919762 184604522
3877A84604522k170260j608505j018082p63317j56289K10340M92137Q99717J536207
$$ 184604522 182434262 180825757 179807675 179044358 178888069 179098409 179590546 180490263 182026470
3868A82026470K038991K415411K796457K974773L237427K991461K717899K226299
$$ 182026470 184065461 186480872 189277329 192252102 195489529 198480990 201198889 203425188
3860B03425188J373922K70832m87472r76466j616629j901500k032185k400677
$$ 203425188 204799110 205069942 204582470 203606004 201989375 200087875 198055690 195655013
3852A95655013k353098k603508k808929k843166l198971l485395m009383m414194
$$ 195655013 193301915 190698407 187889478 185046312 181847341 178361946 174352563 169938369
3844A69938369m708758m821469n213654n259751n057549m548902m166044l524624
$$ 169938369 165229611 160408142 155194488 149934737 144877188 140328286 136162242 132637618
3836A32637618k551826j995802j226351m94028K77617R39395J590964K166350
$$ 132637618 130085792 128089990 126863639 126369611 126647228 127586623 129177587 131343937
3828A31343937K706954K882074K842203K394075J716279M21740l58580j065500
$$ 131343937 134050891 136932965 139775168 142169243 143885522 144307262 143948682 142883182
3820A42883182j873822k044882k320663k325288k192419j893865j732426j891785
$$ 142883182 141009360 138964478 136643815 134318527 132126108 130232243 128499817 126608032
3812A26608032k063100k262029k647481l064822l677782m167207m636820m884807
$$ 126608032 124544932 122282903 119635422 116570600 112892818 108725611 104088791 99203984
3804I9203984n087126n120431m872635m588585m054892l436085k860323k656227
$$ 99203984 94116858 88996427 84123792 79535207 75480315 72044230 69183907 66527680
3796F6527680k438197k086489k077347j717485j439247j225842j047984r46287
$$ 66527680 64089483 62002994 59925647 58208162 56768915 55543073 54495089 53548802
3788E3548802j052014p25806q35262j023734j032942j015602j106300r88725r11685
$$ 53548802 52496788 51770982 50935720 49911986 48879044 47863442 46757142 45768417 44856732
3779D4856732q10020r63085j067136r14860q62299q66253p44503p08523o93689
$$ 44856732 44046712 43083627 42016491 41101631 40239332 39373079 38628576 37920053 37226364
3770C7226364m23320n03457m33800o02029k56775k76348m55506j53613o4290k01690
$$ 37226364 36803044 36299587 35865787 35263758 35006983 34730635 34275129 34121516 34057226 33855536
3760C3855536J02813o9280n2935q6025q3505j72524k5527l65k63003K2398j95103
$$ 33855536 33958349 33889069 33836134 33750109 33666604 33494080 33468553 33468188 33205185 33227583 33032480
3749C3032480m44355m39175l84425m97267m26087o26259k58207o54712n35177
$$ 33032480 32588125 32148950 31764525 31267258 30841171 30214912 29956705 29301993 28766816
3740B8766816j46694l11937l62007l36735m86978l50120j95715k68410o333k04674
$$ 28766816 28620122 28308185 27946178 27609443 27122465 26772345 26576630 26308220 26301887 26097213
3730B6097213k39134o1054r620j26852M6300N4766J50138K28206R9550O8655N1705
$$ 26097213 25858079 25797025 25787405 25660553 25706853 25761619 25911757 26139963 26239513 26308168 26359873
3719B6359873j25901l00396m1518Q7828p9265j26537m1533k22861L9230N2631
$$ 26359873 26233972 25933576 25892058 25979886 25900621 25774084 25732551 25509690 25548920 25601551
3709B5601551j48793j04393J7604K8429J18473M26287J20289K3505J6090j39250
$$ 25601551 25452758 25348365 25365969 25394398 25512871 25939158 26059447 26082952 26099042 25959792
3699B5959792K16553K47004O6778K7591J15321L21128J86714L09256J27690k3653
$$ 25959792 26176345 26423349 26490127 26517718 26633039 26954167 27140881 27450137 27577827 27554174
3689B7554174J12267K86453L68053J48070J0664K10656L07719L18703L88716K83044
$$ 27554174 27666441 27952894 28320947 28469017 28479681 28690337 28998056 29316759 29705475 29988519
3679B9988519M9103K98848M49380L61462M39482L16035K67470N67362N06246L72249
$$ 29988519 30037622 30336470 30785850 31147312 31586794 31902829 32170299 32737661 33243907 33616156
3669C3616156M22896O10277P09256P60805O09522O33914O12372N28449P33128
$$ 33616156 34039052 34649329 35358585 36119390 36728912 37362826 37975198 38503647 39236775
3660C9236775Q06462Q23575O97651Q25007R35843J027867J085384J008563J199861
$$ 39236775 40043237 40866812 41564463 42389470 43325313 44353180 45438564 46447127 47646988
3651D7646988J074083J268005J372161J446392J452217J675386J559494J839939
$$ 47646988 48721071 49989076 51361237 52807629 54259846 55935232 57494726 59334665
3643E9334665J807053J890588K143723K670052K942878K895449L028129L071999
$$ 59334665 61141718 63032306 65176029 67846081 70788959 73684408 76712537 79784536
3635G9784536L710139L949189M455190M800360N250337N411720O005256O287460
$$ 79784536 83494675 87443864 91899054 96699414 101949751 107361471 113366727 119654187
3627A19654187O498094O785347O774201O933648O734022O532744O485292O325674
$$ 119654187 126152281 132937628 139711829 146645477 153379499 159912243 166397535 172723209
3619A72723209O581220O781265P228426P405149P332545P643257P808595P323734
$$ 172723209 179304429 186085694 193314120 200719269 208051814 215695071 223503666 230827400
3611B30827400O719178O231424N654185N264099M900548M654018M567751M589393
$$ 230827400 237546578 243778002 249432187 254696286 259596834 264250852 268818603 273407996
3603B73407996M699017M523084L918012L579193L055492K399560J854412J553360
$$ 273407996 278107013 282630097 286548109 290127302 293182794 295582354 297436766 298990126
3595B98990126J336295Q38170L15978j78753k94319p12417j149216j642337k505686
$$ 298990126 300326421 301164591 301480569 301301816 301007497 300295080 299145864 297503527 294997841
3586B94997841k977753l628805m391864m887970n613209n641578o213247o731826
$$ 294997841 292020088 288391283 283999419 279111449 273498240 267856662 261643415 254911589
3578B54911589o853026p105059p286518q069346q255587q456632q559433q870149
$$ 254911589 248058563 240953504 233666986 225597640 217342053 208885421 200325988 191455839
3570A91455839q581685q412271q109982p829011p774666p544418p260349p198196
$$ 191455839 182874154 174461883 166351901 158522890 150748224 143203806 135943457 128745261
3562A28745261p263202o881511o332931o061106n729201n217401n217563m583840
$$ 128745261 121482059 114600548 108267617 102206511 96477310 91259909 86042346 81458506
3554H1458506l974762l821661l395653l120682k929941k439301k511023k180405
$$ 81458506 77483744 73662083 70266430 67145748 64215807 61776506 59265483 57085078
3546E7085078j949387k058165j792976j744565j683848j517588j360992j075690
$$ 57085078 55135691 53077526 51284550 49539985 47856137 46338549 44977557 43901867
3538D3901867j202427j442667j320107j134152j089617r52296r72123q45736q60199
$$ 43901867 42699440 41256773 39936666 38802514 37712897 36760601 35788478 34942742 34082543
3529C4082543q63424o91741r12685j094828p21121m89633p92594n59966m91338
$$ 34082543 33219119 32527378 31614693 30519865 29798744 29309111 28516517 27956551 27465213
3520B7465213q48824p43640o57373n10184n94729n01783n02205k98830m71039
$$ 27465213 26616389 25872749 25215376 24705192 24110463 23608680 23106475 22807645 22336606
3511B2336606o23043n13297n36920n30634n97407m60867m41598m42085m26086
$$ 22336606 21713563 21200266 20663346 20132712 19535305 19074438 18632840 18190755 17764669
3502A7764669l41550k67622l29803l98650l66808k13143m04573k46855k43074
$$ 17764669 17423119 17155497 16825694 16427044 16060236 15847093 15442520 15195665 14952591
3493A4952591k97828k67817l20036k83684j88419k05826k63663k30512k36512
$$ 14952591 14654763 14386946 14066910 13783226 13594807 13388981 13125318 12894806 12658294
3484A2658294k21202k99398m59695j77731P9993j07374j66107k50325j90801l57442
$$ 12658294 12437092 12137694 11677999 11500268 11580261 11472887 11306780 11056455 10865654 10508212
3474A0508212j57713O3980j68747k36938j40901k35247o8619q3050j46917j88165
$$ 10508212 10350499 10414479 10245732 10008794 9867893 9632646 9564027 9480977 9334060 9145895
3464I145895q7794q9177N7798k18378j12183k8010k66762j34808j43030j13925
$$ 9145895 9058101 8968924 9026722 8808344 8696161 8668151 8401389 8266581 8123551 8009626
3454H009626j47178j34547K03547q5796k81247q3339p6898k28172J5269Q4509
$$ 8009626 7862448 7727901 7931448 7845652 7564405 7481066 7404168 7175996 7191265 7275774
3444G275774J1627j74260n9251n6165j80070k45440k39231O6102l3188J032l7806
$$ 7275774 7287401 7113141 7053890 6997725 6817655 6572215 6332984 6399086 6365898 6366930 6329124
3433F329124Q8784q5595n6795N4212j04008Q7352j37110k36610j75256j25779
$$ 6329124 6417908 6332313 6275518 6329730 6225722 6313074 6175964 5939354 5764098 5638319
3423E638319o5129N1436m0314r1702q6905l0086P1846P988q5544j55891r283K19937
$$ 5638319 5573190 5624626 5584312 5492610 5405705 5375619 5447465 5455453 5369909 5214018 5204735 5424672
3411E424672n4333j12395L0435J8251J30537j89266j58609j41327j04663J04913
$$ 5424672 5370339 5257944 5288379 5306630 5437167 5247901 5089292 4947965 4843302 4948215
3401D948215N1432j4244q9635j10656l9592p923K4004j80100J63396R6620p7101
$$ 4948215 4999647 4985403 4895768 4785112 4745520 4737597 4761601 4581501 4744897 4841517 4764416
3390D764416k59001l0039K61998N2411o0325q2593N2108j35177n5011j51805J53369
$$ 4764416 4505415 4475376 4737374 4789785 4729460 4646867 4698975 4563798 4508787 4356982 4510351
3379D510351J8612k18971m4104J8506N0449J30690n1107K4078M3645j90641q1248
$$ 4510351 4528963 4309992 4265888 4284394 4334843 4465533 4414426 4438504 4482149 4291508 4210260
3368D210260j359O8162k4847J21067j04036J2079k151j02818P9880K51135k1139
$$ 4210260 4208901 4277063 4252216 4373283 4269247 4281326 4279175 4176357 4256237 4507372 4486233
3357D486233n0909j7683l0960Q8487L0471o821k0049N571N6819J28252l9572n5135
$$ 4486233 4435324 4417641 4386681 4475168 4505639 4498818 4478769 4484340 4541159 4669411 4629839 4574704
3345D574704p302L8687P9043J03221M8050o9386P1446K77883L7300R8944N1356
$$ 4574704 4567402 4606089 4685132 4788353 4836403 4767017 4838463 5116346 5153646 5252590 5303946
3334E303946M3314J02838K77422l1696k27010J14075Q1172M9099J32975j56577
$$ 5303946 5347260 5450098 5727520 5695824 5468814 5582889 5664061 5713160 5846135 5689558
3324E689558p2466K47759K53621J38696J07584l0973o1937J51761J12607R192
$$ 5689558 5617092 5864851 6118472 6257168 6364752 6333779 6271842 6423603 6536210 6545402
3314F545402m3644K28785R4887P3017M5426J2707J39527K55490K3067O1688n0930
$$ 6545402 6501758 6730543 6825430 6898447 6943873 6956580 7096107 7351597 7374664 7436352 7385422
3303G385422K08500J79416J81090P6904j16873q0218R1295j048K27836J48514
$$ 7385422 7593922 7773338 7954428 8031332 7914459 7834241 7925536 7924488 8152324 8300838
3293H300838Q2963Q2574K10506m1947j45758K07459K28107K59200J55641J01989
$$ 8300838 8383801 8466375 8676881 8634934 8489176 8696635 8924742 9183942 9339583 9441572
3283I441572O3257j0291J07789J67751j6363J47213K27091J77330L6068J47890
$$ 9441572 9504829 9494538 9602327 9770078 9753715 9900928 10128019 10305349 10341417 10489307
3273A0489307K02770L03119M16805R6073J01046K46034L98727K86583K99624L13988
$$ 10489307 10692077 10995196 11412001 11508074 11609120 11855154 12253881 12540464 12840088 13154076
3263A3154076K32329K66167J33893K17358M27621N76593N52204M47987L12954
$$ 13154076 13386405 13652572 13786465 14003823 14431444 15008037 15560241 16008228 16321182
3254A6321182N05356M53828N61575P05238P59316Q58537R86753J087118J074718
$$ 16321182 16826538 17280366 17841941 18547179 19306495 20165032 21151785 22238903 23313621
3245B3313621J233357J589970J764350J753845J541964J654925J559747J429553
$$ 23313621 24546978 26136948 27901298 29655143 31197107 32852032 34411779 35841332
3237C5841332J132905M58404k89345o83166j363199j739487k050368k352240k504258
$$ 35841332 36974237 37432641 37143296 36460130 35096931 33357444 31307076 28954836 26450578
3228B6450578k156340j810539j772687j608028j375653j256445q07904q98489
$$ 26450578 24294238 22483699 20711012 19102984 17727331 16470886 15662982 14764493
3220A4764493q39759q18196o35202k56827k48050j05080R124j99644j06495N6906
$$ 14764493 13924734 13106538 12471336 12214509 11966459 11861379 11870503 11670859 11564364 11621270
3210A1621270M59943K64658L880k07162m69718n62075n04715o66434p26683p35894
$$ 11621270 12081213 12345871 12349751 12142589 11672871 11110796 10606081 9939647 9212964 8477070
3200H477070m08402l38395j98492k14174l94271l55672N584k1592q5583r5845
$$ 8477070 8068668 7730273 7531781 7317607 6923336 6567664 6573248 6551656 6466073 6370228
3190F370228m35747k41786j47683R5308M8359j0976k26141o6383J72597N9588
$$ 6370228 5934481 5692695 5545012 5640320 5688679 5677703 5451562 5385179 5557776 5617364
3180E617364n0705J23275J13013J46585J31199l5717m77113o6071k63654l58892
$$ 5617364 5566659 5689934 5802947 5949532 6080731 6045014 5567901 5501830 5238176 4879284
3170D879284k58224l51051k66137q2884q8821j99961l9007r0926j37949J24895
$$ 4879284 4621060 4270009 4003872 3920988 3832167 3632206 3593199 3502273 3364324 3489219
3160C489219q0280j34129j24884J3267p4721k4864j97944l01600o7369K1773O4505
$$ 3489219 3408939 3274810 3149926 3163193 3088472 3063608 2865664 2564064 2496695 2518468 2582973
3149B582973L5323j4097j05652n8240K33459j05847j34192J62975N742q505j22948
$$ 2582973 2618296 2604199 2498547 2440307 2673766 2567919 2433727 2596702 2602444 2593939 2470991
3138B470991k56830J2085n2750j6709O8527K85168k60824l17874j11503M983J30649
$$ 2470991 2214161 2226246 2173496 2156787 2225314 2510482 2249658 1931784 1820281 1825264 1955913
3127A955913J45398m2491j90742P0766N3979r1088j22454j68612r054J51999L0584
$$ 1955913 2101311 2058820 1868078 1938844 1992823 1901735 1779281 1610669 1601615 1753614 1784198
3116A784198K796o0654k7729O009J29001j52158m2142k04380k5369L46287K27655
$$ 1784198 1786994 1726340 1698611 1704620 1833621 1681463 1639321 1434941 1409572 1755859 1983514
3105A983514j58410l11871j12392J1903M3186j3594k4048N0716O9259R0595q8840
$$ 1983514 1825104 1513233 1400841 1412744 1455930 1442336 1418288 1469004 1538263 1628858 1540018
3094A540018k2424j59002p4600L451J33984M3132K8269L5651M5794Q9783j70224
$$ 1540018 1517594 1358592 1283992 1287443 1421427 1464559 1492828 1528479 1574273 1664056 1493832
3083A493832m3729r9672J3702P2319L5061k0765o3048o1288L7326p0525L9184
$$ 1493832 1450103 1350431 1364133 1436452 1471513 1450748 1387700 1326412 1363738 1293213 1332397
3072A332397Q1474L4354J06821k1306q0917k47262m9347Q1468n8384j7996J30636
$$ 1332397 1413871 1448225 1555046 1533740 1452823 1205561 1156214 1237682 1179298 1161302 1291938
3061A291938m7471K0379r3701J20247J1900j36635L3910J16406j39227o3100N7723
$$ 1291938 1244467 1264846 1171145 1291392 1303292 1166657 1200567 1316973 1177746 1114646 1172369
3050A172369r0637r3198J03972J16685n8970q0360k7177O8394M3893M788l6595
$$ 1172369 1081732 988534 1092506 1209191 1150221 1069861 1042684 1111078 1154971 1159759 1123164
3039A123164o4975m8182O5712l1803O123M1184o9923p3948O7984n1196q0526J9022
$$ 1123164 1058189 1010007 1075719 1043916 1050039 1091223 1021300 947352 1015336 964140 883614 902636
3027I02636P0951M2407J07483M7405N471j79086Q3324m5860m4423j34430p764
$$ 902636 973587 1015994 1123477 1170882 1176353 997267 1080591 1034731 990308 855878 848114
3016H48114J17704n2627K6710J10064Q4739o462k69359k9923J01097K18361J02700
$$ 848114 965818 913191 939901 1049965 1134704 1128242 858883 828960 930057 1148418 1251118
3005A251118k04257k3716Q340J68454l7260l8184j27924J02621p6791N8742j83246
$$ 1251118 1046861 1023145 1031485 1199939 1162679 1124495 996571 1099192 1022401 1081143 897897
2994H97897J2201J28538J18591o0538o8322r4790j16301K05384O4074m0431J47910
$$ 897897 910098 1038636 1157227 1096689 1028367 933577 817276 1022660 1086734 1046303 1194213
2983A194213j18610q7908J01996q3601P495j1735l110j4085J5265j9163J25173
$$ 1194213 1075603 987695 1089691 1006090 1013585 1001850 998740 984655 999920 980757 1105930
2972A105930j7209K38123O1763k18929J67087J10514j31472k44354P6470p8894
$$ 1105930 1088721 1326844 1388607 1169678 1336765 1447279 1315807 1071453 1147923 1069029
2962A069029K06943r089m3079m5821q615J42244L0237k9561j16929J56429R3045
$$ 1069029 1275972 1266883 1223804 1177983 1169368 1311612 1341849 1312288 1195359 1351788 1444833
2951A444833j7958L698L7048N1745j16334j09665q032K66986J30388j34768L9111
$$ 1444833 1426875 1430573 1467621 1519366 1403032 1293367 1285335 1552321 1682709 1547941 1587052
2940A587052M9756N4020R6959K03385k1232L08998L8988J11969J4245L7750j41770
$$ 1587052 1636808 1690828 1787787 1991172 1969940 2278938 2317926 2429895 2444140 2481890 2340120
2929B340120q721J37981J98597O469p5624l8486J11053J26379l9155j53593K00145
$$ 2340120 2331399 2469380 2667977 2674446 2598822 2560336 2671389 2797768 2758613 2605020 2805165
2918B805165j1614J26459N958n4538K6855P0716K8877j20659K9883j23843J7119
$$ 2805165 2793551 2920010 2925968 2871430 2898285 2969001 2997878 2877219 2907102 2783259 2800378
2907B800378O9871L06746K13922J11057l2340J95414K06045n1505K12231J93033
$$ 2800378 2870249 3176995 3390917 3501974 3469634 3665048 3871093 3819588 4031819 4224852
2897D224852K4968O8710n4938p0951q5426k60507k41227k55249l28617l04192
$$ 4224852 4249820 4318530 4263592 4192641 4107215 3846708 3605481 3350232 3021615 2717423
2887B717423N4103J48057m2987k3960l2279j54861p2081j01914k0601o4720l5532
$$ 2717423 2771526 2919583 2876596 2852636 2820357 2665496 2593415 2491501 2470900 2406180 2370648
2876B370648J64470j25676n126K10691j6464o9682r4351j90547N3096J05717K03504
$$ 2370648 2535118 2409442 2404316 2615007 2598543 2528861 2434510 2243963 2297059 2402776 2606280
2865B606280J36083K3655o7356P1747k44016j62317p1168K3018o6953m2688o4471
$$ 2606280 2742363 2766018 2698662 2770409 2526393 2364076 2292908 2315926 2248973 2206285 2141814
2854B141814p5265q5656j26369j43823o9459l4046J12689l6154R7304m6765j96069
$$ 2141814 2066549 1980893 1854524 1710701 1641242 1607196 1719885 1683731 1781035 1734270 1538201
2843A538201k05808L1664J09629J5430j0688p0933j1872j33156j12860r8336M9260
$$ 1538201 1332393 1364057 1473686 1489116 1478428 1407495 1395623 1262467 1149607 1051271 1100531
2832A100531M3889J51980J147m0925N4844j12099j03353k34971j54681K05738
$$ 1100531 1144420 1296400 1297547 1256622 1311466 1199367 1096014 861043 706362 912100
2822I12100J26859o3850J641J35776j01454k1758J9155r1283o3506J19404J04017
$$ 912100 1038959 975109 976750 1112526 1011072 989314 1008469 917186 853680 973084 1077101
2811A077101J26238n015j67016j42415j81321r2346j27244Q9359J25560p3736
$$ 1077101 1203339 1198324 1031308 888893 707572 615226 487982 577341 702901 629165
2801F29165J03518J6038j46838J5027j09587L5996K47148r323O8066p4416J5792
$$ 629165 732683 748721 601883 616910 507323 543319 790467 781144 849210 774794 790586
2790G90586K7605k99673j11997k8052L5244L0276J40433J58299n9135j18901j31023
$$ 790586 818191 518518 406521 378469 413713 443989 584422 742721 683586 564685 433662
2779D33662Q4128j11706P1236L15994j85523o4733O8742j22464j16655l9671j5358
$$ 433662 517790 406084 477320 793314 607791 543058 611800 489336 372681 333010 317652
2768C17652L5302J84817K5380n2783M8920o5039j50015M6556J08359j28323l7058
$$ 317652 352954 537771 563151 510368 559288 494249 344234 390790 499149 370826 333768
2757C33768J58699j06698J5781j68855N9902J40763j91583o6963J78529N6571
$$ 333768 492467 385769 401550 232695 292597 433360 241777 174814 353343 409914
2747D09914p7702J16569j45124j0748J40368k1758j02517J4282n1519q4372J74410
$$ 409914 332212 448781 303657 292909 433277 411519 309002 323284 271765 187393 361803
2736C61803j24967j40427J45105J16801j6446N9291l2993o6381j70735n7656J19433
$$ 361803 236836 96409 241514 358315 341869 401160 368167 301786 131051 73395 192828
2725A92828P3086J6610n8418j51207J38533K1019q9529j7967m3079Q7762J17880
$$ 192828 265914 282524 224106 72899 211432 232451 142922 124955 81876 169638 287518
2714B87518L3826j90335J9389m9369J6380n0235J0709K9863n5398K6313N6062
$$ 287518 321344 131009 150398 101029 117409 67174 77883 107746 52348 78661 134723
2703A34723m8206L1277J8971J76523j2446k02399P8218N1056o3526J0819o1068
$$ 134723 86517 117794 136765 313288 300842 98443 176661 227717 164191 175010 113942
2692A13942l9050O5422J62945K4970r5628M3957J07357r3615k31985q509l295
$$ 113942 74892 140314 303259 328229 232601 276558 383915 290300 58315 49806 46511
2681D6511P090m8664K4507K31964j52150p3579j9348j262J14083O0153n063J87493
$$ 46511 53601 4937 29444 261408 109258 35679 16331 15069 129152 189305 184242 371735
2669C71735K0217j22826J6662j77608n5071R8954o3701m4980J11513j30569l1732
$$ 371735 391952 269126 285788 108180 53109 152063 88362 43382 154895 24326 -7406
2658g406m9093P9229R9658J27664K4309k9125k4352J2306p6969J0143r7611j15692
$$ -7406 -56499 22730 122388 250052 274361 245236 220884 233190 156221 166364 68753 -46939
2646d6939j3161L2749J84836j27942o1670P1478k0331N1504J60619o0005k5471
$$ -46939 -60100 -27351 157485 29543 -32127 39351 19020 70524 231143 171138 145667
2635A45667P4602J33972O9699j78139j62326j49592P5573J6380J42201m4162J09144
$$ 145667 220269 354241 423940 245801 83475 -66117 9456 25836 168037 123875 233019
2624B33019J09248l6598j7006M5384j44499k00751M5086J58489R018j27254J66001
$$ 233019 342267 305669 288663 334047 189548 -11203 33883 192372 201390 74136 240137
2613B40137K560j47929r5634j15116L230J74333J30428R4688K3390j06790k60747
$$ 240137 242697 94768 -866 -115982 -112752 61581 192009 286697 310087 203297 -57450
2602e7450q5612Q0836J1712K43472J30491o4512j15690j29578J9714k7746K569
$$ -57450 -143062 -62226 -50514 192958 323449 258937 143247 13669 33383 5637 8206
2591H206j74050J15119J22047J9162m3383L7732l7073j42599q2494J93167N4020
$$ 8206 -165844 -50725 71322 90484 47101 84833 47760 -94839 -177333 15834 69854
2580F9854j2864R2653L6609K9328k43005j74936O366P5518J52020m1099J69034
$$ 69854 56990 149643 186252 215580 -27425 -202361 -195995 -120477 31543 -9556 159478
2569A59478K9626l4703K8431R8932j90672j79101R9928K06534o233k19213o072
$$ 159478 189104 154401 182832 281764 91092 -88009 11919 218453 212220 -6993 -13065
2558a3065j06067J22507P567o0019P2389j00049R4826K54039j05384p5930j27938
$$ -13065 -119132 3375 10942 -49077 23312 -76737 18089 272128 166744 90814 -37124
2547c7124o5852J40861J36973O1690j13260L5050P2433N2529j37940k46469q0601
$$ -37124 -102976 37885 174858 236548 123288 158338 230771 283300 145360 -101109 -181710
2536a81710m2457J60982K00130K01901r5508j88099n3009l987J19984J10794j91560
$$ -181710 -224167 -63185 136945 338846 243338 55239 2230 -1757 118227 229021 37461
2525C7461Q453P1121j04040j11449k14214j40374R4833K86176J917R4214L6273
$$ 37461 45914 117035 12995 -98454 -312668 -453042 -358209 -72033 -70116 24098 60371
2514F0371r0250J15227n1988n5932k379l951O0580J22729Q2005K9962k03442j69305
$$ 60371 -29879 85348 33360 -22572 -24951 -28902 31678 154407 236412 266374 62932 -106373
2502a06373j27310N5915N1003J57734K22250J12492J38085k92302j25043K3413
$$ -106373 -233683 -177768 -126765 30969 253219 365711 503796 211494 86451 109864
2492A09864o1212j13117l4717J30727p5424L2210o5303p5591L1539K97779k9172
$$ 109864 48652 -64465 -99182 31545 -43879 -11669 -76972 -152563 -121024 176755 147583
2481A47583j06433j09331L7893K40251P8820m1775k77321k06518J0240K1124j00226
$$ 147583 41150 -68181 -30288 209963 288783 247008 -30313 -236831 -226591 -205467 -305693
2470c05693J62069L6170N0951O8254M6047j00054j98846P6331J74217Q8215r5877
$$ -305693 -143624 -107454 -56503 11751 57798 -42256 -241102 -164771 9446 97661 1784
2459A784l8022m7614j49391P8743K2390N0940J7910l5564M6626J60915L4171j20464
$$ 1784 -36238 -83852 -233243 -154500 -132110 -81170 -63260 -98824 -52198 108717 142888 22424
2447B2424l3549l9361k6115J3898N0279J56041L1467j20839q33q3701l0603n8756
$$ 22424 -11125 -50486 -76601 -62703 -12424 143617 175084 54245 53412 -30289 -60892 -119648
2435a19648N529K54264J45556J7775k86689n0433K760J1267n1028M0200K11179
$$ -119648 -114119 140145 285701 303476 16787 -33646 -30886 -19619 -70647 -30447 180732
2424A80732O1057l2907j57425k73594k4995K26994L1226q9064p4124N6243J71435
$$ 180732 241789 208882 51457 -222137 -247132 -20138 11088 -77976 -152100 -95857 75578
2413G5578L200k37929N6098R0425n7059n0238J93545j52434j06152J86076P5273
$$ 75578 78778 -159151 -103053 -12628 -69687 -119925 73620 -78814 -184966 1110 76383
2402G6383j34025o3396K33971P3340k1848K3008m726j59515n6273n2912K00489
$$ 76383 -57642 -121038 112933 186273 164425 187433 182707 23192 -33081 -85993 114496
2391A14496l3159j0270J32826k6379l3855p2901k38339l4423K69845O6307M4538
$$ 114496 81337 71067 203893 177514 143659 70758 -167581 -202004 67841 134148 178686
2380A78686k52301l7189J18594L0177N5530K816o0593k9161O5793L632J81410
$$ 178686 -73615 -110804 7790 37967 93497 96313 35720 6559 72352 75984 257394
2369B57394M8733m09217k7657K74520J80580k2028o0538p1644N8136J5118n4572
$$ 257394 306127 -103090 -130747 143773 324353 302325 241787 170143 228279 243397 188825
2358A88825j43665j29949J57492J32712n1281J4733j19281k2855J26040M0699
$$ 188825 45160 -84789 72703 205415 154134 168867 49586 26731 152771 193470
2348A93470j2753k20644J11710J45002K8772N3339j06517k37083O6447J64058
$$ 193470 180717 -39927 71783 216785 245557 298896 192379 -44704 21743 185801
2338A85801k0942o3192j53956j45376J4651J39875J94949j48124l6363J19630
$$ 185801 164859 101667 -52289 -197665 -183014 -43139 151810 3686 -32677 86953
2328H6953Q6963J05394L7183j77418k66306K7129K29190R9645L0726l2635j29036
$$ 86953 173916 279310 316493 139075 -127231 -100102 129088 228733 259459 226824 97788
2317I7788K6977J8234j06243l0057K3437J19692Q8952m4696L4653j44475k7520
$$ 97788 124765 142999 36756 6699 30136 149828 238780 194084 228737 84262 56742
2306E6742J85288q6922n2137N3363P9223k01195n5290Q7879j20017J8898K1091
$$ 56742 242030 155108 102971 156334 235557 34362 -20928 66951 -53066 -34168 -13077
2295a3077J5393P6113J49147J693n7405n317m3164l7582n4498j87588j28101K24787
$$ -13077 2316 78429 227576 229269 171864 166547 123383 85801 31303 -156285 -284386 -59599
2283e9599J27839J94563k3269k28010r7479j77956K0934L16437J68866r1864P6107
$$ -59599 68240 262803 239534 11524 -85955 -263911 -242977 73460 242326 150462 226569
2272B26569n2697N6387q2462N0057k3335p9205O0147j30081j63Q9862m2442p7885
$$ 226569 173872 230259 147797 197854 174519 95314 155461 25380 25217 115079 72637 -5248
2260e248J9314K41636J6213r3954m2096Q6555J43801L2905o8631l08560P1654
$$ -5248 14066 255702 271915 177961 135865 222420 366221 399126 330495 21935 93589
2249I3589J48583j08243j16575J16494J54176R3870j203k27519r0558j6221R9123
$$ 93589 242172 133929 17354 133848 288024 381894 380691 153172 62614 46393 145516
2238A45516J53423M0071q1550j74073J47321j40470o1852L6444N0567J49160J1491
$$ 145516 298939 339010 257460 83387 230708 90238 28386 64830 115397 264557 276048
2227B76048O0062q1139M609J87674K5839j69829j38136Q1667M8539O3740m2456
$$ 276048 336110 254971 259580 447254 473093 303264 165128 246795 295334 359074 316618
2216C16618j43436R6042q3664M7847j09170p0245J5770J73888R5189l7907k6442
$$ 316618 173182 269224 185560 233407 124237 53992 69762 243650 338839 300932 274490
2205B74490l9110J42809k7799o8226R4241N315r4184l1571m130P1035O1357n3822
$$ 274490 235380 378189 350390 282164 376405 381720 287536 255965 251835 322870 384227 330405
2193C30405k52630j5816L04134J11126o633j54917N6247L02736m1568m6916j76153
$$ 330405 77775 61959 366093 477219 470586 315669 371916 674652 633084 586168 410015
2182D10015J25143J07330J7930P8508j56404r0535P5458P9801n370K2750R7973
$$ 410015 535158 642488 660418 738926 582522 491987 567445 647246 641876 664626 762599
2171G62599P8970k3518p6077P9278n2887J27641K23416L5792o0306m8372n6603
$$ 762599 841569 818051 741974 821252 768365 896006 1119422 1155214 1094908 1046536 989933
2160I89933R6937J50510r0523M8859R1379Q9267K2929O1719J35868j96869K7297
$$ 989933 1086870 1237380 1146857 1195716 1287095 1376362 1399291 1461010 1596878 1400009 1427306
2149A427306J48846k9678p3567R265J84573J3711n9076J18206P4875j81008K2363
$$ 1427306 1576152 1546474 1472907 1482172 1666745 1680456 1621380 1739586 1814461 1633453 1655816
2138A655816R1402J53478J91156J84251J10545J0818K09000L81164n4891J83654
$$ 1655816 1747218 1900696 2091852 2276103 2386648 2397466 2606466 2987630 2932739 3116393
2128C116393j07444K38520L36273N5508J84736K41917J42356M11448L19648K62318
$$ 3116393 3008949 3247469 3583742 3639250 3823986 4065903 4208259 4619707 4939355 5201673
2118E201673K55075M23448M39494M61691M51826M31198P33617N02788O86093R78600
$$ 5201673 5456748 5880196 6319690 6781381 7233207 7664405 8398022 8900810 9586903 10565503
2108A0565503J266955J578929J665557J880620K242158L583805M888051O745160
$$ 10565503 11832458 13411387 15076944 16957564 19199722 22783527 27671578 34416738
2100C4416738Q246221P476820K657427m676858p128870p707221o543723n152700
$$ 34416738 42662959 50139779 52797206 48120348 40991478 33284257 26740534 21587834
2092B1587834l689063k794341k099778j439448j160837j025246n83128m64539
$$ 21587834 17898771 15104430 13004652 11565204 10404367 9379121 8795993 8331454
2084H331454l97851o15905o86240m43438n58518l34984m12749l31086l77808j66411
$$ 8331454 7933603 7317698 6631458 6188020 5629502 5294518 4881769 4550683 4172875 4006464
2074D006464j56887k47053j44377k12292j83725k773q7035k11694k02974j53606
$$ 4006464 3849577 3602524 3458147 3245855 3062130 3059357 2972322 2760628 2557654 2404048
2064B404048n1432k6204l12521R4564K1816o0051j67321j86690p8408J6676l7124
$$ 2404048 2352616 2326412 2013891 2108455 2130271 2070220 1902899 1716209 1637801 1654477 1617353
2053A617353L6758o6869j49244p8640R236q1352L7883l4994m5983O5170p3603
$$ 1617353 1654111 1587242 1437998 1359358 1368594 1287242 1325125 1290131 1244148 1309318 1235715
2042A235715P8779j24746M7009k23073j03891l097M4774n5939J24728p6060K9388
$$ 1235715 1314494 1189748 1236757 1013684 909793 906696 951470 895531 1020259 944199 973587
2031I73587k1289k9629O0278q3448J70056j95569m7303p7204j16205m328j59117
$$ 973587 952298 922669 982947 899499 1069555 873986 826683 749479 633274 628946 469829
2020D69829M9625l0861j33585J43802P9650R3846J7362l9887r7605J31005J5002
$$ 469829 519454 488593 355008 498810 578460 672306 689668 649781 552176 683181 698183
2009F98183j83202j78682R0444m1566j16197J33454p5428j53340j42777J19133
$$ 698183 514981 336299 426743 385177 268980 402434 327006 173666 30889 150022
1999A50022J78833j41498J29775J67551J6396k4429j73987j29534j31548R4282
$$ 150022 328855 187357 317132 484683 501079 476650 302663 173129 41581 135863
1989A35863R6682l7062J03276L7202o4865j79095j6951n3105P0346J94346J83844
$$ 135863 232545 195483 298759 335961 271096 92001 75050 21945 92291 286637 470481
1978D70481K1544j4090L320j41868k32309p5549k6556J72046O8815j295J15078
$$ 470481 492025 477935 481255 339387 107078 31529 4973 177019 245834 244539 359617
1967C59617k2546j40154j9442J5364l7418q2058N6823M9150R8263O741L7028l1530
$$ 359617 337071 196917 177475 192839 155421 73363 130186 179336 277599 284340 321368 289838
1955B89838k47830O7429r2819J48472J59331r0662m1181o1833j50204J53581j01083
$$ 289838 42008 109437 16618 165090 324421 233759 192578 130745 -19459 134122 33039
1944C3039l5828J25032J86229n6520n1899J18080j83332j58528p8134j47075K44182
$$ 33039 -2789 122243 308472 251952 200053 318133 134801 -23727 -101861 -248936 -4754
1933d754J78065n5422k9036P2027N7003j91338k20814K5886J21000Q0330J08841
$$ -4754 173311 117889 88853 160880 217883 26545 -194269 -168383 -47383 32947 141788
1922A41788O3215p6156j20146j32547R4743L5690j03377Q4884k4255J98864q3929
$$ 141788 205003 128847 8701 -123846 -29103 6587 -96790 -11906 -36161 162703 78774
1911G8774J1846l9145k2792l5463r119J0900J39083M6125p7996O7707r3959m4321
$$ 78774 90620 51475 28683 -6780 -15899 -4999 134084 180209 102213 169920 75961 31640
1899C1640j953o1148K8183N4543k3289n5116J07398r777j31290P5272M6692K8817
$$ 31640 29687 -31461 -3278 51265 27976 -27140 80258 70481 -60809 14463 61155 89972
1887H9972J4908K9385q6991j58993p3936N1983j77204L5006K17631Q2880j4718
$$ 89972 104880 134265 47274 -111719 -185655 -133672 -310876 -275870 -58239 24641 9923
1876I923M7601j71744N7685J89534o7431q5233m9692J62109J67529j09507j21360
$$ 9923 57524 -114220 -56535 132999 65568 -19665 -69357 92752 260281 150774 29414
1865B9414L7835o7151l5096r3957J3025J68118Q5666O6306P5772j30609j86453
$$ 29414 67249 98 -34998 -128955 -115930 52188 137854 204160 279932 149323 -37130
1854c7130p391j05698K2300K43390k7036n1733o3770o177j2004j0651K2861N0383
$$ -37130 -44521 -150219 -127919 115471 88435 36702 -27068 -33245 -45249 -55900 -33039 17344
1842A7344L5029n451J59988K4030L045k66758j8605p9144J99117J30429O7618
$$ 17344 52373 46922 206910 230940 233985 -32773 -51378 -130522 68595 199024 266642
1831B66642J24272l2347j01773o3128k969p4255q1486m0560O8640K46767L5744
$$ 266642 390914 358567 256794 193666 190697 116442 34956 -5604 63036 309803 345547
1820C45547j72711q8722p8397O4850p9564Q9869r8447o8309R8680R4983O0734
$$ 345547 172836 84114 5717 70567 -8997 80872 -17575 -85884 12796 107779 168513
1809A68513k42111j42354P2715P4472o2574K694j17592K06039J99955k227j65478
$$ 168513 -73598 -215952 -143237 -68765 -131339 -128645 -246237 -40198 159757 157530 -7948
1798g948R463J52388j37444R022Q6458j5411j86435j13531M6348J05957m4611
$$ -7948 1515 153903 16459 25481 111939 96528 -89907 -203438 -157090 -51133 -95744
1787i5744K00932O9353m2031l0872j1700j45980j09062J71471M6334q1482K36633
$$ -95744 105188 174541 132510 101638 89938 -56042 -165104 6367 52701 -28781 207852
1776B07852j86021k40356k2547M3279J29993J2766J6332J29241q2359J05576j11065
$$ 207852 21831 -218525 -241072 -197793 -67800 -55034 -38702 90539 8180 113756 2691
1765B691k13001l6113J00393N8549J47843j23446j22035r0653J67904Q6769j41607
$$ 2691 -210310 -246423 -146030 -87481 60362 -63084 -185119 -275772 -107868 -21099 -162706
1754a62706P6669J62522O7884j4427l7694j10953q1583O1958p690l4627N7819
$$ -162706 -86037 76485 144369 129942 92248 -18705 -100288 -38330 -46020 -80647 -22828
1743b2828J13321l3158k20792j00148M9065P5572K8297J57849k8387l9321K6724
$$ -22828 90493 57335 -163457 -263605 -214540 -138968 -110671 47178 18791 -20530 6194
1732F194p2883p4006M5895J03843K5865r2802n5892J28470l4769j56562p988J48991
$$ 6194 -66689 -140695 -94800 9043 34908 -57894 -113786 14684 -20085 -176647 -184635 -35644
1720c5644M4879J859K29365k01411n1015r9893j0991J40283j2083j03493m648
$$ -35644 9235 11094 240459 39048 -11967 -111860 -122851 17432 5349 -98144 -102792
1709a02792n0530K9209m0509j4761m8087J18888J3366L1144o1055J10376K7102
$$ -102792 -153322 -124113 -164622 -179383 -227470 -108582 -95216 -64072 -125127 -14751 12351
1698A2351M0458Q088k38382P912P5952L9333J12347o6780Q4668q9857K8528K1789
$$ 12351 52809 60897 -177485 -169573 -93621 -54288 58059 -8721 75947 -13910 14618 36407
1686C6407k5222p2931m9829O4187M826j1855J2279k8039p2880O0530n9182J59130
$$ 36407 11185 -61746 -111575 -47388 -42562 -54417 -42138 -70177 -143057 -82527 -141709 17421
1674A7421j01427j33188O1084K9541L4960O2196j58813k08255L63710L70260j37571
$$ 17421 -84006 -217194 -156110 -126569 -91609 -29413 -188226 -396481 -32771 337489 199918
1663A99918p1584k46517k22397J88075K03341o7854J40908j41474m6520j0804
$$ 199918 128334 -118183 -340580 -152505 50836 -17018 123890 -17584 -64104 -74908
1653g4908m7950j51515j07914L77215M0611J04606p4912m5062p8383k3007K7761
$$ -74908 -122858 -274373 -382287 -5072 35539 140145 65233 20171 -58212 -81219 -53458
1642e3458N1635R231M0580Q4897q0712p3681k19621j1709k5623O1095r0837J98330
$$ -53458 -1823 7408 47988 132885 52173 -21508 -241129 -252838 -278461 -217366 -308203 -109873
1630a09873K24029Q3051j1342M0777j51758j49796K2606q0222M689J66963n1737
$$ -109873 114156 197207 185865 226642 74884 -74912 -52306 -132528 -127839 39124 -12613
1619a2613J2446Q0061j55325P870n744p5317J37774Q389k7343J95246n8683N5166
$$ -12613 -167 79894 -75431 -67561 -73305 -148622 -10848 -2459 -29802 165444 106761 161927
1607A61927j42354j64204M3232K6332n2790K8515J12008n0222j34377r1780Q8550
$$ 161927 19573 -144631 -101399 -75067 -127857 -99342 12666 -37556 -171933 -263713 -175163
1596a75163q382P9174j09616J07807N7875k8954J84993j6384j49313m4731O5534
$$ -175163 -183545 -104371 -213987 -106180 -48305 -77259 107734 91350 -57963 -102694 -37160
1585c7160m3628O5288N5899j52767l8554j75344j42310L9666J09477J32638O0675
$$ -37160 -80788 -15500 40399 -112368 -150922 -326266 -468576 -428910 -319433 -186795 -126120
1574a26120J05520j0597J67848K5130j66480k371J04642n7278o8085j30133k3422
$$ -126120 -20600 -31197 136651 161781 -4699 -7070 97572 40294 -27791 -157924 -181346
1563a81346K6058J25238J76909J1298p5225r9853M9886R524J61384K11364k41871
$$ -181346 -155288 -30050 146859 158157 82932 -16921 32965 42489 203873 415237 173366
1552A73366l14996p925j31221n2320M9323O8891K06793n3251l5736J64020J4245
$$ 173366 -141630 -149555 -280776 -333096 -283773 -214882 -8089 -61340 -97076 66944 81189
1541H1189j58779O3620l7353R1042n0160o2022N1001k3820J16467l7395o109r1727
$$ 81189 -77590 -13970 -51323 39719 -10441 -72463 -21462 -45282 71185 33790 27681 -64046
1529f4046j9079J29044J9293M5213N850k0777J3858o4220j27893r6145m308L5386
$$ -64046 -83125 45919 65212 110425 116275 95498 109356 45136 -82757 -178902 -183210 -147824
1517a47824J17790m4944Q0342P4855M930j05826m2008O7117l2060l1397J18051
$$ -147824 -30034 -74978 5364 80219 85149 -20677 -62685 4432 -27628 -59025 59026
1506E9026L8855o9547K2941r573Q3160J12618j43552j68652j3160L0772j3481
$$ 59026 97881 28334 51275 41702 124862 237480 93928 -74724 -87884 -57112 -70593
1495g0593r2121R0144q633K05654j3461p7147J34989p8443Q669P1256m7271j57962
$$ -70593 -162714 -72570 -81203 124451 110990 33843 168832 90389 99058 170314 123043 -34919
1483c4919N9490p361m1865K5478O5898l3984k18523J6295J71023O6784k7451m8002
$$ -34919 24571 17210 -24655 823 66721 32737 -185786 -169491 1532 68316 40865 -7137
1471g137q6118J83963J35879l4372o5372j20895q5613o5359k0938n8572j05731
$$ -7137 -93255 90708 226587 192215 126843 5948 -79665 -145024 -165962 -224534 -330265
1460c30265K7452J30781r166L5540N1146J63670J3315k4996j50398j53599J03754
$$ -330265 -302813 -172032 -181198 -145658 -94512 69158 82473 57477 -92921 -246520 -142766
1449a42766l6485J83685M5046j61610J6638L217j27862M8793k12052J23879K47526
$$ -142766 -179251 4434 49480 -112130 -95492 -92275 -220137 -171344 -383396 -259517 -11991
1438a1991m7977l6375M0494l4566q026J54720j56417K2029P7727O8852N5210j31838
$$ -11991 -59968 -96343 -55849 -90415 -98441 56279 -100138 -78109 -382 68470 123680 -8158
1426h158p8372o7432o1382R5837Q4510j4440p7851q9595K22570J51006j63972
$$ -8158 -86530 -153962 -215344 -119507 -34997 -49437 -127288 -216883 5687 156693 -7279
1415g279j05619j6073m8203l5939J96077Q5228r8391o9503j4372j38293R6153
$$ -7279 -112898 -128971 -177174 -213113 -17036 68192 -30199 -99702 -114074 -252367 -156214
1404a56214j493K6500J63459m7736R3429J4411j93418J59994R9120n6906j87975
$$ -156214 -157707 -131207 32252 -15484 77945 92356 -101062 58932 158052 101146 -86829
1393h6829M70k0594j15096M8490l3304J97698q7753l4365j7233j9961k5242L3232
$$ -86829 -86359 -106953 -222049 -173559 -206863 -9165 -96918 -131283 -148516 -168477 -193719 -160487
1381a60487J36087k775j7676q6050j12395M3394K03807J28861j66072J254j50998
$$ -160487 -24400 -27175 -44851 -130901 -243296 -199902 3905 132766 -33306 -32052 -183050
1370a83050M508J18798J6794j0608r053J07653l5752L4102j95065n5788L9309
$$ -183050 -178542 -59744 -42950 -53558 -62611 45042 9290 43392 -151673 -207461 -168152
1359a68152N6252L2120M5702p8594j01760J55894J13754j76995m6326P6727J13723
$$ -168152 -111900 -79780 -34078 -112672 -214432 -58538 55216 -121779 -168105 -91378 22345
1348B2345J4435j20722K4536K3776N7698j4243j69410Q838j7616l8948J96772
$$ 22345 36780 -83942 -59406 -35630 22068 7825 -161585 -152747 -170363 -209311 -12539
1337a2539n2634m1017K4831J28615J89303K1735m9502m4423m5477j52509J3962
$$ -12539 -65173 -106190 -81359 47256 236559 258294 208792 164369 118892 -33617 -19655
1326a9655j17239o1439j17659J13046J56861j82119j0955O799K30435K7947m1413
$$ -19655 -136894 -198333 -315992 -202946 -46085 -228204 -239159 -232360 -1925 26022 -15391
1315a5391l0269J39856P3555K7974j92915Q996N7298q8834n7684j78986P5677
$$ -15391 -45660 94196 167751 195725 2810 11806 69104 -19730 -77414 -256400 -180723
1304a80723J9110m5886O3735N5045m4376p861N0554L8753J05198o9412l8401J10745
$$ -180723 -161613 -207499 -143764 -88719 -133095 -140956 -90402 -51649 53549 -15863 -54264 56481
1292E6481j19204L9053n4716L9566J08718o4363N2815n8691p4016n5746R8084
$$ 56481 -62723 -23670 -78386 -38820 69898 5535 58350 -341 -74357 -130103 -32019
1281c2019K11612o2553j50846o2799k2144k888J03754K9454K08735j20831k80844
$$ -32019 179593 117040 -33806 -96605 -118749 -121637 -17883 11571 220306 99475 -181369
1270a81369k1182P4435J03981p2796j25406N0440J37352O0160n9361l2962N1328
$$ -181369 -202551 -128116 -24135 -96931 -222337 -171897 -34545 25615 -33746 -66708 -15380
1259a5380N5136O013p4173r3553o5837J08881K08381j11109j12997k1463M3108
$$ -15380 39756 45769 -28404 -121957 -187794 -78913 129468 18359 -94638 -116101 -72993
1248g2993n2395l6218R8551j7537J33679O6895m7045M0238j17055p77K4895k6513
$$ -72993 -125388 -161606 -63055 -80592 53087 119982 72937 113175 -3880 -4657 20238 -6275
1236f275q5532Q1209R7594j84701M4877J18133n827n6758L7733o9679j48703J27949
$$ -6275 -91807 -10598 86996 -97705 -52828 65305 59478 2720 40453 -29226 -177929 -49980
1224d9980K95O0021j23226K2656J16064k6072r0695j5271J94575q8566J205L3084
$$ -49980 -49685 10336 -112890 -90234 25830 -242 -90937 -106208 88367 -199 1006 34090
1212C4090j10850l5800J01681P4404m996l2742N7067r199k23699R9187J04146
$$ 34090 -76760 -112560 -10879 63525 58529 25787 82854 73655 -150044 -50857 53289
1201E3289j85155k9882L5818J2474j60911P0680L3135J0077r6250J04559J75276
$$ 53289 -131866 -161748 -125930 -113456 -274367 -203687 -170552 -160475 -256725 -152166 23110
1190B3110K25948L8231p2552j7677j7220k04653j58387k09763l1457J42354K44434
$$ 23110 249058 287289 214737 197060 179840 -24813 -183200 -392963 -424420 -282066 -37632
1179c7632Q621j39083K0403q0579J24300K18098J48215O9013k7852j76369M1853
$$ -37632 -29011 -168094 -147691 -228270 -103970 114128 262343 331356 303504 127135 168988
1168A68988J710k80518q8410Q0093J41242q5422O2188J46617l4257p0910K7724
$$ 168988 170698 -109820 -198230 -118137 23105 -62317 -129 146488 112231 41321 69045
1157F9045j15309r3441J02338J57911N8480j72960q0506j62346q9035k6154P7867
$$ 69045 -46264 -139705 -37367 120544 179024 6064 -74442 -236788 -325823 -351977 -274110
1146b74110J07643K2149p66K73650J75136k22300j24545j51821J0700K30786J49758
$$ -274110 -166467 -144318 -145084 128566 303702 81402 -43143 -194964 -184264 46522 196280
1135A96280r7676j16120j45452j0228J23192q1833j40127M751K46288O8114q3477
$$ 196280 98604 -17516 -162968 -173196 -50004 -131837 -271964 -267213 -20925 47189 -36288
1124c6288J6016O0437o9297M005o9839K3237M2113n3878O8029K21700m6431o4934
$$ -36288 -20272 40165 -29132 -25127 -94966 -71729 -29616 -83494 -15465 206235 159804 94870
1112I4870r5612K6968n8021o7904P8228Q3285m5622J82838p3270k00540R7271
$$ 94870 -742 26226 -31795 -99699 -21471 61814 16192 199030 125760 -74780 22491
1101B2491L8810R4105J4744j13402k50553j72717K24870J5654K2104M681N0780
$$ 22491 61301 155406 170150 56748 -193805 -366522 -141652 -125998 -103894 -99213 -48433
1090d8433O1897L7215j3198N0821l0526n3981N5603O8747r2526o6061J5757R1894
$$ -48433 13464 50679 37481 88302 57776 3795 59398 128145 35619 -30442 -14685 77209
1078G7209p5375j42160J45770O745Q742J39489J371K547n9608k4119j49078r0108
$$ 77209 1834 -140326 5444 12189 20931 160420 161791 164338 104730 80611 -68467 -158575
1066a58575J20592P7583J13603k17404n1710J37447p5594l2048l3100l8606J86860
$$ -158575 -37983 39600 153203 -64201 -115911 21536 -54058 -86106 -119206 -157812 29048
1055B9048K6025J9014M9448m1722q9233O0102k03968O824N8433N7142M6683n7937
$$ 29048 55073 74087 123535 81813 -7420 52682 -151286 -144462 -86029 -28887 17796 -40141
1043d0141j3440k9283o5692J77652p6374n1561L9763J05695k371l518o1714j0863
$$ -40141 -53581 -82864 -148556 29096 -47278 -98839 -59076 46619 44248 40730 -20984 -31847
1031c1847J35999R3305m2130l26138j37139J78394J18757m6951J10245J32431
$$ -31847 104152 197457 155327 -170811 -307950 -129556 -10799 -57750 52495 184926
1021A84926p471M8844k26689l0237P6782r7959J26707O4478k4454n3984k05723
$$ 184926 177455 226299 -390 -30627 46155 -51804 74903 139381 114927 60943 -144780
1010a44780j25611L1800J24458J44135R7969r8499l0245J77225J2091k7813o2991
$$ -144780 -270391 -238591 -114133 30002 127971 29472 -773 176452 188543 160730 97739
999I7739l0169j03845j04618j651J15910M6281k5601M4762L0066j00427K3276
$$ 97739 67570 -36275 -140893 -142544 -26634 19647 -5954 38808 68874 -31553 -8277
988h277O5916K37729n4923M7914m0450j88143J39271k02720j848m5146j19451
$$ -8277 57639 295368 240445 288359 247909 59766 199037 -3683 -5531 -50677 -170128
977a70128J04681J73471k4171p2841K8623O7763k6934j27414K3996n9157J03471
$$ -170128 -65447 108024 83853 11012 39635 107398 80464 -46950 -22954 -82111 21360
966B1360o1154L0643j3041j5669k0103j36526J41736J29007j07461N5944p0669
$$ 21360 -39794 -9151 -22192 -37861 -57964 -194490 -52754 76253 -31208 24736 -45933
955d5933o9748M2893j3277l0050O5635J04632k7044j50876L4991m5471m6562Q2442
$$ -45933 -115681 -72788 -86065 -116115 -50480 54152 27108 -123768 -88777 -134248 -180810 -98368
943i8368j56212R6592j2326r2288L1983Q8083r4201J25301L1029O9295L1710k24881
$$ -98368 -254580 -157988 -170314 -262602 -230619 -142536 -236737 -111436 -80407 -11112 20598 -204283
931b04283J45208J48812k7384K6444q019J25165l0208j06720q0255P8767O6912
$$ -204283 -59075 89737 62353 88797 80778 205943 175735 69015 -11240 67527 134439
920A34439q126L1964K2536j52384K9451J12229O813q5199j77916J5421J2224N9703
$$ 134439 126313 158277 180813 28429 57880 170109 176922 91723 -86193 -70772 -58548 1155
908A155j54164Q4552j19711N1690M9674l0754j4569j75340J72703J58568N6852
$$ 1155 -153009 -68457 -188168 -136478 -86804 -117558 -132127 -307467 -134764 23804 80656
897H0656O821o2251M9472r0621n1007K6040L6170L4445N4398j3096m655j62944
$$ 80656 87477 25226 74698 -15923 -66930 -40890 -4720 29725 84123 71027 66372 -96572
885i6572k4474Q6874K4501j19632m5878J77129J03363n2157n7506M5920L5765
$$ -96572 -121046 -34172 -9671 -129303 -175181 1948 105311 53154 -4352 41568 77333
874G7333M1674j77760j196n2265J30474o7834p4268Q3619P8496p4998Q3821J39510
$$ 77333 119007 -58753 -59949 -112214 18260 -49574 -123842 -40223 38273 -36725 47096 186606
862A86606K8287j14677o8533P492J5279O6956O3075j67647j40224l6795O0901
$$ 186606 214893 100216 31683 39175 54454 121410 184485 16838 -123386 -160181 -99280
851i9280K22453l8471j35551m4989M9617J54988O3034k61999j34092n4747K33929
$$ -99280 123173 84702 -50849 -95838 -46221 108767 171801 -90198 -224290 -279037 -45108
840d5108l9314R7648r2903j33169Q7290K70161k0275k7134r1600m4332J37726
$$ -45108 -84422 13226 -79677 -212846 -125556 144605 124330 97196 5596 -38736 98990
829I8990J04229p5039j87936p1024p9375J16803N7364j93942J36836R0556O4J5984
$$ 98990 203219 128180 -59756 -130780 -210155 -93352 -35988 -229930 -93094 -2538 -2474 13510
817A3510J01330M8817o6579n730j87036l7743k21785J14911J79129J08147L9154
$$ 13510 114840 163657 97078 91348 -95688 -133431 -355216 -240305 -61176 46971 86125
806H6125j45152l3642K02773M1066j48758q1671K1312O4821O6474k44096j29257
$$ 86125 -59027 -92669 110104 151170 2412 -79259 -57947 6874 73348 -170748 -300005
795c00005P1743R0125M8431Q2133L8551j82311N348L1591N6074K5464j20923P3717
$$ -300005 -228262 -138137 -89706 -7573 30978 -151333 -145985 -114394 -58320 -32856 -153779 -80062
783h0062P9212R8280j30607r1189K6010J29513j53902L2547j0760o034N2145J2602
$$ -80062 -850 97430 -33177 -124366 -98356 31157 -122745 -90198 -100958 -106992 -54847 -42245
771d2245l8395L688L829m0193k8459p7885K49235K6129l6937L99j8727Q1808M8656
$$ -42245 -80640 -76952 -73123 -113316 -141775 -219660 29575 55704 18767 19166 439 82247 130903
758A30903p661j03917J07057R273k2480j28370j53037n2316J14035K54382m8510
$$ 130903 123242 19325 126382 135655 113175 -15195 -168232 -220548 -106513 147869 99359
747I9359r0462k4500J41579J43468m2486j33474r0183q2864J45075N3294j18763
$$ 99359 8897 -15603 125976 269444 226958 93484 3301 -79563 65512 118806 43
736D3q8263J06904J20448P4405j71801q8005J1449N1396k1550j34624l6785R2352
$$ 43 -88220 18684 139132 213537 41736 -46269 -34820 16576 -4974 -139598 -176383 -84031
724h4031J77577J2070j44640K3060q1720L3368J13688M2200m9146k07227r1644
$$ -84031 93546 105616 -39024 -15964 -97684 -64316 49372 91572 42426 -164801 -256445
713b56445K21779J32204M0850m4174q8812P7491N4050Q9009p8915p2930j0763
$$ -256445 -34666 97538 138388 94214 5402 82893 136943 225952 147037 74107 63344
702F3344l7165m5943m1726j67007m4813L7325j3554J77709J12478j51311N2642
$$ 63344 26179 -19764 -61490 -228497 -273310 -235985 -249539 -71830 40648 -110663 -58021
691e8021J59519j050Q6248o3611k04687L8524J15406n9678j23823j13734j37539
$$ -58021 101498 100448 186696 123085 -81602 -43078 72328 12650 -111173 -224907 -362446
680c62446P9835K30446O9928J29791p0233r6466K37154L10j91368j14960j12441
$$ -362446 -282611 -52165 17763 147554 77321 -19145 218009 218319 26951 -88009 -200450
669b00450p064J32806J60101O208k02083o6275J25589K81665k5120o7326j17703
$$ -200450 -207514 -74708 85393 91601 -110482 -176757 -51168 230497 205377 138051 20348
658B0348J29491n6060Q0928J27351j74300p1811m8082J01199k1061r4853r1445
$$ 20348 149839 93779 174707 302058 127758 55947 7865 109064 88003 -6850 -98295
647i8295j6847J26765J65763j17184O6000p8782j37540j9453J34746m6050P0991
$$ -98295 -115142 11623 177386 60202 126202 47420 -90120 -109573 25173 -20877 50114
636E0114L8525k26947J31344K35099j63084j99018M7113l5727l5904N8608o3481
$$ 50114 88639 -138308 -6964 228135 65051 -133967 -86854 -122581 -158485 -99877 -163358
625a63358L663K29605J06843r7398K5382j68052p9953K86257J53722j17725k10483
$$ -163358 -159695 69910 176753 79355 104737 -63315 -143268 142989 296711 178986 -31497
614c1497m0958K0953Q067l1477j11036P3925K15999J60296j03343j78339j31853
$$ -31497 -72455 -51502 -43435 -74912 -185948 -112023 103976 264272 160929 -17410 -149263
603a49263J54741K58841n6232j24231o8149k9797J01890P2575m4605q5819o770
$$ -149263 5478 264319 208087 83856 15707 -14090 87800 160375 115770 29951 23181
592B3181l7285j08216K0111m9689P8184Q5151j98920L4178K01383r9453O2420
$$ 23181 -14104 -122320 -102209 -151898 -73714 11437 -187483 -153305 48078 -51375 11045
581A1045j3406q7284N7179K8102K07426j59816k37114L2306J97820L2404q0269
$$ 11045 -2361 -89645 -32466 -4364 203062 43246 -193868 -161562 36258 68662 -11607
570a1607p3900R5200N7818m3966J12353r675j16676j619P5380L655j51299j52960
$$ -11607 -85507 9693 67511 23545 135898 126223 9547 7928 83308 86963 -64336 -217296
558b17296O9410J11102L6885p9084j05389j12231K48511J39352o6032J26827J63953
$$ -217296 -147886 -36784 101 -78983 -184372 -296603 -48092 91260 25228 152055 316008
547C16008k12456j8419k7023J8346j44660r950k78050n0145M29717J24284r4381
$$ 316008 103552 85133 58110 76456 -68204 -78154 -356204 -406349 23368 147652 53271
536E3271j00383j5438J19314J37416j42856r3176p9365M3709R8280K23280j76365
$$ 53271 -47112 -62550 56764 194180 51324 -41852 -121217 -77508 20772 244052 67687
525F7687n31082J80308K56933Q7732k28093q3873K00182K0178J78588R7091k08595
$$ 67687 -463395 -283087 -26154 61578 -166515 -250388 -50206 -30028 148560 245651 37056
514C7056j20426N7868J73297J06592j95766k08586N4551K6332K0820j36978j04995
$$ 37056 -83370 -25502 147795 254387 58621 -149965 -95414 -69082 -48262 -185240 -290235
503b90235J3488M5592K21212J88107r5486N4132p9277r426M0728l9992Q0271P1235
$$ -290235 -276747 -231155 -9943 178164 82678 136810 57533 48107 88835 48843 129114 200349
491B00349p3401j64657j9058M9810j33610j8915J97387j35763J44125O6724L7134
$$ 200349 126948 -37709 -56767 -6957 -140567 -159482 37905 -97858 46267 112991 150125
480A50125K1890r9343N6067K7130j41963L2673j62173j32277Q2756K09733q1813
$$ 150125 172015 72672 128739 155869 13906 46579 -115594 -247871 -165115 44618 -37195
469c7195K16807j22547j56292J12790J64651J27525o8529o8361r6755O850N4470
$$ -37195 179612 57065 -99227 13563 178214 305739 237210 168849 72094 78944 133414
$$ [...]
##END NTUPLES=NMR SPECTRUM
##END=
