##TITLE=1H_EC-3293(II-3)
 CDCl3
 8 sc, 
 11.4.2023
##JCAMPDX= 6.0         $$ Bruker NMR JCAMP-DX V2.0
##DATA TYPE= NMR SPECTRUM
##DATA CLASS= NTUPLES
##ORIGIN= UXNMR, Bruker Analytische Messtechnik GmbH
##OWNER= root
$$ XWIN-NMR		Version 3.5
$$ Tue Apr 11 14:00:21 2023 Russian Standard Time (UT+4h)  she@DPX200
##.OBSERVE FREQUENCY= 200.13135
##.OBSERVE NUCLEUS= ^1H
##.ACQUISITION MODE= SIMULTANEOUS
##.ACQUISITION SCHEME= undefined
##.AVERAGES= 8
##.DIGITISER RES= 18
##SPECTROMETER/DATA SYSTEM= spect
##.PULSE SEQUENCE= zg30
##.SOLVENT NAME= MeOD
##.SHIFT REFERENCE= (INTERNAL, MeOD, 0, 15.7359)
##AUDIT TRAIL= $$ (NUMBER, WHEN, WHO, WHERE, WHAT)
$$ ##TITLE= Audit trail, XWIN-NMR		Version 3.5
$$ ##JCAMPDX= 5.01
$$ ##ORIGIN= Bruker BioSpin GmbH
$$ ##OWNER= she
$$ F:/spectra/data/she/nmr/H-F/1/pdata/1/auditp.txt
$$ ##AUDIT TRAIL=  $$ (NUMBER, WHEN, WHO, WHERE, WHAT)
(   1,<2023-04-11 13:57:32.23 +0400>,<she>,<DPX200>,
      <created by zg, POWCHK disabled, PULCHK disabled
       configuration hash MD5:
       00 E9 B6 7A A2 85 ED C7 34 08 36 98 17 FE 4E 26
       data hash MD5: 16K
       8E F7 3F A7 90 30 72 A7 F3 27 77 88 0A 99 AA 21>)
(   2,<2023-04-11 13:57:34.34 +0400>,<she>,<DPX200>,
      <Start of raw data processing
       efp BC_mod = 2 LB = 0.24 FT_mod = 6 PKNL = 1 PHC0 = -19471.3 PHC1 = 9.600799 SI = 16K 
       data hash MD5: 16K
       E9 F7 E7 02 F8 0B 92 DA F8 61 46 37 50 75 1C 4C>)
(   3,<2023-04-11 13:57:51.53 +0400>,<she>,<DPX200>,
      <pk PHC0 = -5.798365 PHC1 = 8.400001 
       data hash MD5: 16K
       03 F3 15 A6 39 81 49 41 F7 AA 03 5C 00 73 D5 7D>)
(   4,<2023-04-11 13:57:55.65 +0400>,<she>,<DPX200>,
      <abs ABSG = 5 
       data hash MD5: 16K
       7C E3 99 E3 57 7B 06 41 23 ED 82 F8 B7 8B 9F 88>)
$$ ##END=
$$ 
$$ hash MD5
$$ 96 1F C2 B6 40 53 97 D6 53 BD D8 3B B8 75 99 E5
##$RELAX= 
##$RELAX= 
##$RELAX= 
##$RELAX= 
##$RELAX= 
##$RELAX= 
$$ Bruker specific parameters
$$ --------------------------
##$DU= <F:/spectra>
##$EXPNO= 1
##$NAME= <H-F>
##$PROCNO= 1
##$TYPE= <nmr>
##$USER= <she>
##$AMP= (0..31)
100 100 100 100 100 100 100 100 100 100 100 100 100 100 100 100 100 100 
100 100 100 100 100 100 100 100 100 100 100 100 100 100 
##$AQSEQ= 0
##$AQ_mod= 1
##$AUNM= <au_zg>
##$AUTOPOS= <>
##$BF1= 200.13
##$BF2= 200.13
##$BF3= 200.13
##$BF4= 200.13
##$BF5= 200.13
##$BF6= 200.13
##$BF7= 200.13
##$BF8= 200.13
##$BYTORDA= 1
##$CFDGTYP= 0
##$CFRGTYP= 5
##$CHEMSTR= <none>
##$CNST= (0..31)
1 1 145 1 1 1 1 1 1 1 1 1 1 1 1 1 1 1 1 1 1 1 1 1 1 1 1 1 1 1 1 1 
##$CPDPRG= <>
##$CPDPRG1= <>
##$CPDPRG2= <>
##$CPDPRG3= <>
##$CPDPRG4= <mlev>
##$CPDPRG5= <mlev>
##$CPDPRG6= <mlev>
##$CPDPRG7= <mlev>
##$CPDPRG8= <mlev>
##$CPDPRGB= <>
##$CPDPRGT= <>
##$D= (0..31)
0 1.2 0 0 0 0 0 0 0 0.06 0 0.03 0 0 0 0 0.0002 0 0 0 0 0 0 0 0 0 0 0 0 
0 0 0 
##$DATE= 1681207051
##$DBL= (0..7)
120 120 120 120 120 120 120 120 
##$DBP= (0..7)
150 150 150 150 150 150 150 150 
##$DBP07= 0
##$DBPNAM0= <>
##$DBPNAM1= <>
##$DBPNAM2= <>
##$DBPNAM3= <>
##$DBPNAM4= <>
$$ [...]
##$SUBNAM3= <"">
##$SUBNAM4= <"">
##$SUBNAM5= <"">
##$SUBNAM6= <"">
##$SUBNAM7= <"">
##$SUBNAM8= <"">
##$SUBNAM9= <"">
##$SW= 18.05172834244
##$SWIBOX= (0..15)
0 0 2 0 0 0 0 0 0 0 0 0 0 0 0 0 
##$SW_h= 3612.71676300578
##$TD= 16384
##$TD0= 1
##$TE= 0
##$TE2= 300
##$TE3= 300
##$TEG= 300
##$TL= (0..7)
0 120 120 120 120 120 120 120 
##$TP= (0..7)
150 150 150 150 150 150 150 150 
##$TP07= 0
##$TPNAME0= <>
##$TPNAME1= <>
##$TPNAME2= <>
##$TPNAME3= <>
##$TPNAME4= <>
##$TPNAME5= <>
##$TPNAME6= <>
##$TPNAME7= <>
##$TPOAL= (0..7)
0.5 0.5 0.5 0.5 0.5 0.5 0.5 0.5 
##$TPOFFS= (0..7)
0 0 0 0 0 0 0 0 
##$TUNHIN= 0
##$TUNHOUT= 0
##$TUNXOUT= 0
##$USERA1= <user>
##$USERA2= <user>
##$USERA3= <user>
##$USERA4= <user>
##$USERA5= <user>
##$V9= 5
##$VALIST= <valist>
##$VCLIST= <CCCCCCCCCCCCCCC>
##$VD= 0
##$VDLIST= <DDDDDDDDDDDDDDD>
##$VPLIST= <PPPPPPPPPPPPPPP>
##$VTLIST= <TTTTTTTTTTTTTTT>
##$WBST= 1024
##$WBSW= 4
##$XGAIN= (0..3)
0 0 0 0 
##$XL= 0
##$YL= 0
##$YMAX_a= 180833
##$YMIN_a= -234215
##$ZGOPTNS= <>
##$ZL1= 120
##$ZL2= 120
##$ZL3= 120
##$ZL4= 120
##$ABSF1= 15.77554
##$ABSF2= -2.276309
##$ABSG= 5
##$ABSL= 3
##$ALPHA= 0
##$AQORDER= 0
##$ASSFAC= 0
##$ASSFACI= 0
##$ASSFACX= 0
##$ASSWID= 0
##$AUNMP= <proc_1d>
##$AZFE= 0.1
##$AZFW= 0.1
##$BCFW= 0
##$BC_mod= 2
##$BYTORDP= 0
##$COROFFS= 0
##$CY= -3
##$DATMOD= 1
##$DC= 0
##$DFILT= <>
##$DTYPP= 0
##$F1P= 0
##$F2P= 0
##$FCOR= 1
##$FTSIZE= 16384
##$FT_mod= 6
##$GAMMA= 0
##$GB= 0
##$INTBC= 1
##$INTSCL= 3.70164e-10
##$ISEN= 128
##$LB= 0.24
##$LEV0= 0
##$LPBIN= 0
##$MAXI= 10000
##$MC2= 0
##$MEAN= 0
##$ME_mod= 0
##$MI= 1.114404
##$NCOEF= 0
##$NC_proc= -8
##$NLEV= 6
##$NOISF1= 3.799351
##$NOISF2= 2.8
##$NSP= 0
##$NTH_PI= 0
##$NZP= 0
##$OFFSET= 15.73587
##$PC= 1
##$PHC0= -19477.1
##$PHC1= 18.0008
##$PH_mod= 1
##$PKNL= yes
##$PPARMOD= 0
##$PSCAL= 0
##$PSIGN= 0
##$REVERSE= no
##$SF= 200.130007138511
##$SI= 16384
##$SIGF1= 3
##$SIGF2= 2
##$SINO= 5.538805
##$SIOLD= 16384
##$SREGLST= <1H.CDCl3>
##$SSB= 0
##$STSI= 16384
##$STSR= 0
##$SW_p= 3612.71676300578
##$SYMM= 0
##$S_DEV= 0
##$TDeff= 16384
##$TDoff= 0
##$TI= <>
##$TILT= no
##$TM1= 0
##$TM2= 0
##$TOPLEV= 0
##$USERP1= <user>
##$USERP2= <user>
##$USERP3= <user>
##$USERP4= <user>
##$USERP5= <user>
##$WDW= 1
##$XDIM= 16384
##$YMAX_p= 491759518
##$YMIN_p= -1660244
$$ End of Bruker specific parameters
$$ ---------------------------------
##NTUPLES= NMR SPECTRUM
##VAR_NAME=  FREQUENCY,     SPECTRUM/REAL,   SPECTRUM/IMAG
##SYMBOL=    X,             R,               I
##VAR_TYPE=  INDEPENDENT,   DEPENDENT,       DEPENDENT
##VAR_FORM=  AFFN,          ASDF,            ASDF
##VAR_DIM=   16384,         16384,           16384
##UNITS=     HZ,            ARBITRARY UNITS, ARBITRARY UNITS
##FACTOR=    0.220516191357247, 1,           1
##FIRST=     3149.21984774328, 0,            0
##LAST=      -463.496915262499, 0,           0
##MIN=       -463.496915262499, -1660244,    0
##MAX=       3149.21984774328, 491759518,    0
$$ Real data points
##PAGE= N=1
##DATA TABLE= (X++(R..R)), XYDATA
$$ [...]
8696 109146932 87364287 72973848 63661828 56823523 51437068 46977971 42854191 39137567
8688 39137567 36370413 33971589 31603814 29923976 28908843 27620289 26685208 25978248
8680 25978248 25779573 25533492 25437457 25135388 25392459 25685002 25683729 25686031 25720937 25960920
8670 25960920 26263020 26361465 26707297 27087803 27690183 28648579 29400728 29862758 30143778 31179268
8660 31179268 32305120 33837524 35644417 37405735 39513659 41545483 43450534 45029777
8652 45029777 46650763 48002143 48750011 49194840 48777491 47653953 46304365 44858748 43380033
8643 43380033 41382162 39553258 37972953 36382309 35434626 34747161 34374859 34525675 34926901
8634 34926901 35488102 36063606 36613593 36838556 37549086 38155913 38459025 39131888 40500911
8625 40500911 41770370 43743338 45771087 47555537 49431668 51856872 54272510 55990775
8617 55990775 57182251 57611202 56907720 54398842 51416542 47862857 44194416 40903192
8609 40903192 38456263 36386467 34471381 32997659 31268854 29631141 28477045 27929483
8601 27929483 27246654 26632204 26248957 25838893 25487713 24982613 24271196 24136227 23755277
8592 23755277 23889855 24108475 24106817 24135540 24877792 25563940 25630030 25444077 25248955 26448289
8582 26448289 25981264 24818345 23651141 22371328 20874458 19537797 18214677 16778062
8574 16778062 15504959 14206167 13472809 12520314 11750296 11224730 10669495 10450943 10374570
8565 10374570 10113212 9647851 9176933 8591126 8381872 7983470 7778973 7197636 7020877
8556 7020877 6859552 6404704 6332554 6070514 5885596 5769509 5471472 5114417 5010780 4716451
8546 4716451 4649872 4245990 4263551 4153818 4056125 4092160 3833245 3643580 3322304 3306811
8536 3306811 3223029 3385768 3393556 3126631 3087656 2806190 2836029 3075152 3094596 2787220 2664179
8525 2664179 2633837 2505159 2511280 2491406 2618442 2642486 2410156 2443061 2236516 2328763 2449472
8514 2449472 2437823 2135180 1983294 2124844 1992742 1679950 1842757 1940593 1805769 1463926
8504 1463926 1332662 1388707 1022031 1251980 1563300 1601536 1241898 978119 878764 1234208
8494 1234208 1221923 985041 1049980 995400 905893 1083832 1072912 799697 885385 984721 808068
8483 808068 794823 997754 1339467 1322542 1377688 1506708 1351888 1013687 766303 677456
8473 677456 647297 657842 712761 897514 1036461 1030719 977672 981149 1046506 893182 737159
8462 737159 885904 956281 791630 685018 342700 194721 231821 285070 307162 770199
8452 770199 305320 185135 1088254 747805 487298 535093 577890 402740 285264 334275
8442 334275 83567 143417 339476 411066 520912 496161 362944 531070 694519 690405 742427
8431 742427 517516 226400 265002 553993 604289 419882 504324 678692 593597 540839 394756
8420 394756 361868 191914 316946 -8629 -97871 78310 46039 -184929 -68700 -19295
8410 -19295 -37704 203952 75609 312756 171571 -99936 386928 532637 94071 -95262
8400 -95262 -270138 4550 -134608 -128234 7459 107155 49737 -15643 -3565 -97896 97074
8389 97074 -65436 -216670 -78726 -265053 -356944 34961 -16051 181222 96367 -166001
8379 -166001 -99172 -195119 -9960 136722 161460 16937 -105950 -112948 -129616 172689 177812
8368 177812 -17707 125918 -110266 -402604 -350347 -475307 -195055 53027 -272762 -268615
8358 -268615 -19857 -128206 55403 193520 213579 -101578 -274538 39069 15824 -325407
8348 -325407 -188133 93218 148502 110497 316613 60611 109578 266449 57743 -68773
8338 -68773 -176475 -106581 -396719 -670434 -619996 -397739 -450960 -527990 -466873 -297715 -450870
8327 -450870 -638562 -340950 -419982 -392041 -440913 -521597 -322561 -503524 -623109 -212364
8317 -212364 -241612 -439178 -324987 -375413 -445683 -411255 -101652 -419299 -536136 -408825
8307 -408825 -249411 -182483 -33803 -228246 -532660 -471328 -604873 -263996 -63252 -198057
8297 -198057 -179418 -299834 -153441 -284596 -115005 39984 -39358 -27558 -130683 -42338
8287 -42338 -117418 26789 24629 -50436 51754 63221 -191447 -257226 145160 -219070 -389128
8276 -389128 -212023 -6270 -172514 -4018 143491 -29159 31275 -230331 -360403 -51064
8266 -51064 -113690 -119510 288950 97959 6961 10932 4201 160847 45142 57969 126749 307245
8254 307245 265227 24306 290178 297463 69198 -40441 -73015 -18928 120420 68742 -44182
8243 -44182 -45273 -360166 -563196 -280505 -40891 -255224 -339373 102769 97259 98775 -50570
8232 -50570 -125409 -54090 178715 167912 162674 400721 427122 531459 655196 897910 739073
8221 739073 778668 291877 163513 220573 26918 72644 334598 136016 -464920 -498025
8211 -498025 -616269 -405537 -219315 -221078 -346313 -507547 -499697 -293220 -136205 -297893
8201 -297893 -600173 -550343 -257135 -355073 -494085 -733475 -1096874 -1051575 -1660244 758025
8191 758025 1775727 390629 156107 -108543 290677 102211 174974 15124 -314492 -349208
8181 -349208 -338564 -124522 378715 206591 -127293 80218 -207248 -358750 -335966 -344886
8171 -344886 -86223 -96494 -239270 -309325 18536 120134 -80624 -464775 -514643 -190911
8161 -190911 -216026 -450095 -755701 -634635 -385337 -183120 -150870 81452 408600 17067
8151 17067 -170102 -201757 -240249 -273118 -390536 -198198 -215573 -465701 -208282 -316015 -364474
8140 -364474 -581895 -832318 -159791 -183348 -437853 -309701 -350651 -506394 -338034 76586
8130 76586 -119594 -331687 -355221 -543335 -278503 -393075 -401023 -401064 -414343 -422584 -671288 -455353
8118 -455353 -454190 -531309 -470251 -618126 -677786 -370057 -390012 -651675 -521774 -347307 -140437
8107 -140437 -18428 235482 -130093 -397488 -470194 -328807 -437073 -496596 -249686 -242956
8097 -242956 -312689 -501200 -508103 -572316 -469441 -405905 -456528 -524520 -494771 -418842 -492945
8086 -492945 -285964 -192506 -502228 -575283 -379108 -339163 -713806 -484368 -364004 -492805
8076 -492805 -552556 -505734 -902485 -665423 -443669 -482277 -565367 -667228 -783527 -725995 -588833
8065 -588833 -784936 -631391 -822432 -784482 -620968 -739650 -775682 -677298 -749921 -757507 -606295
8054 -606295 -608509 -628159 -579026 -492310 -517492 -705846 -770962 -679967 -634058 -497809 -449383
8043 -449383 -470569 -871201 -802884 -394471 -602898 -1054777 -669799 -504772 -553023 -620170
8033 -620170 -747905 -503390 -359427 -518284 -480709 -87342 -492269 -425054 -444637 -378819
8023 -378819 -415430 -583119 -491416 -615680 -695698 -620669 -264182 -425299 -443529 -339079 -266902
8012 -266902 -11641 -196624 -517444 -515472 -554686 -258085 -464133 -867307 -864108 -734045 -513847
8001 -513847 -310286 -204082 -418734 -323755 -464579 -484901 -502318 -579843 -632122 -555198 -540670
7990 -540670 -328675 -528437 -677547 -872427 -920934 -857412 -521364 -726940 -660534 -401458
7980 -401458 -595223 -663783 -454308 -538359 -585623 -555433 -636684 -112490 20721 -554781 -498620
7969 -498620 -209281 -333761 -564152 -634471 -868303 -680748 -414321 -494432 -334454 -503774
7959 -503774 -447417 -777661 -539414 -474659 -424388 -227242 -138231 -264238 -327769 -755082 -712326
7948 -712326 -256596 -234664 -163131 -241080 -249696 -290365 -421044 -693450 -635191 -583011 -541539
7937 -541539 -284801 -545334 -413426 88598 79676 191571 167427 -44720 -9436 -108410 -43626
7926 -43626 -241012 -237524 -424023 -46988 17262 -157148 -311400 -238067 -290484 -509758 -370430
7915 -370430 -55468 -30708 -317656 -472090 -332447 -514813 -437533 -312721 -257967 -289331
7905 -289331 -389989 -304244 -331535 -211056 -238325 -271394 -643290 -459537 -239383 -304947 -494175
7894 -494175 -288834 -461946 -399014 -187378 -527137 -687615 -379857 -579576 -706196 -767139
7884 -767139 -727450 -608123 -593885 -466646 -262196 -268480 -304097 -150550 -156644 -428007 -679916
7873 -679916 -444977 -407221 -333162 -206038 -62372 56914 207419 -57082 -216272 -87704
7863 -87704 -285809 -610550 -703223 -249714 -376412 -362368 -303501 -612612 -685071 -302382 14093
7852 14093 39489 -130802 -22174 -229245 -244095 -465836 -406027 -275035 -444778 -490658 -219116
7841 -219116 -252181 -443464 -748750 -750943 -453092 -419162 -291986 -337020 -270295 -436271 -295531
7830 -295531 -526931 -818074 -427632 -360917 -190761 -83329 -303474 -252347 -169924 -229108
7820 -229108 -255392 -297263 -384145 -447438 -368462 -472587 -457393 -387298 -336549 -358813 -601442
7809 -601442 -493670 -202665 -209232 -122379 -36510 -36501 -346518 -130974 523952 -80966 -223290
7798 -223290 -428862 -202368 -57623 -31815 -169542 -205123 -83966 -274371 -67063 -70133
7788 -70133 -97390 -4468 -232543 10534 202784 -52566 -130812 64925 -122424 118085
7778 118085 6140 -70204 122254 74747 321786 276110 223407 553863 445587 170107
7768 170107 70894 200429 591683 179481 10420 31425 -133617 -51407 50410 103191
7758 103191 -38808 -29421 10387 -178586 -247857 -122205 -14486 144413 195428 -56948 -179710
7747 -179710 -110234 -188660 125986 -93622 36536 45652 162099 -138896 -76090 280477 -131909
7736 -131909 -253181 -265879 -357405 -394195 39988 -123620 35885 110547 -94086 169810
7726 169810 94160 -216385 18482 172901 -95496 -233009 -174331 -154247 -173164 -109773 -238316
7715 -238316 56467 393328 282138 564761 130871 43311 43389 209971 389182 119304 278064
7704 278064 553825 858221 1235693 814739 1013191 1195451 1078769 1240135 1113672 655797
7694 655797 402043 401385 693400 847325 995230 956089 538160 617789 607281 330781 168654
7683 168654 201545 336225 107794 103977 -206310 -29360 338123 303598 434254 -106348
7673 -106348 -146828 44214 88960 273897 119914 138522 10415 229690 120914 -49806
7663 -49806 160844 -203751 -476287 -423694 -211855 -258040 -209803 130430 297819 -89956
7653 -89956 -262628 -14765 -63796 -187921 -282990 -176000 -126254 -102904 273893 -29838 34678
7642 34678 7222 -108994 55216 -169589 -94000 -79084 48968 84675 -178753 -154777 -13856
7631 -13856 -12737 103567 -71818 -220126 -239385 163304 167213 -45549 64039 178584 166554
7620 166554 -169402 23407 -77801 160435 166820 444121 691936 345360 441210 699329
7610 699329 702562 673759 850849 770273 351117 427405 546804 452720 238128 326957 240703
7599 240703 91794 -105452 -89558 179313 152437 157714 247016 332620 157345 149112 -75894
7588 -75894 86434 54130 91499 306994 530957 294239 14076 -691 -102584 -164370 -70328
7577 -70328 239986 244036 285562 121211 381730 471639 527399 560591 281845 457078 1197317
7566 1197317 1087880 808294 691883 529315 580731 619702 394439 609823 559087 407585
7556 407585 171061 -85524 -143901 61719 114550 152277 -25489 226767 540550 194786
7546 194786 32264 77933 232264 -74763 -170458 29158 76373 -99274 161612 365428
7536 365428 134340 58685 194118 -143430 109870 65663 137541 321475 109923 204246
7526 204246 19066 -7107 1697 -125022 -219553 -435998 -258424 9278 -22532 -138739 -67906
7515 -67906 -551 -18349 -231813 -92227 -26624 -64657 -282312 -148426 104066 49469 79500
7504 79500 142886 -47602 -63874 -42263 -85016 -77952 99962 593517 406803 332489 392238
7493 392238 78861 253416 836655 884385 268734 134823 -3217 191306 350684 274411
7483 274411 349594 248895 412198 569060 542390 342801 283671 406677 222389 344449
7473 344449 447571 235532 60923 154302 255669 527991 303798 -83026 -21391 42653
7463 42653 124134 127505 394217 332903 154609 49810 241609 349271 370456 233572 112888
7452 112888 241976 487482 520349 348857 253765 506170 416816 570419 826100 530709
7442 530709 -11707 39729 149801 -34306 420763 329015 329072 382968 563006 375837 -137075
7431 -137075 186005 341834 419622 567268 486796 503711 252623 -49255 -76609 132534
7421 132534 273537 359727 556027 385272 314732 271631 -11420 140239 448724 585872
7411 585872 298332 34559 440751 326518 302415 678466 345599 392198 323535 159529
7401 159529 495933 214862 346619 287262 244278 546129 631008 779599 414515 317583
7391 317583 683777 570610 584391 579109 532318 526213 307933 348639 485774 719240 858249
7380 858249 548730 418284 579091 618606 678916 546682 702482 998185 901924 829034
7370 829034 974411 608019 255483 364947 589539 945571 693444 859372 1029370 955108
7360 955108 1189944 889799 847500 912160 1112127 972314 776548 782653 778384 1035177 830716
7349 830716 839307 1037343 1068899 1237150 1366272 970750 876649 857439 1207478 1047368 1306688
7338 1306688 1334370 1344196 1322547 1186220 1494381 1552833 1460208 1491755 1431390 1332121 1140825
7327 1140825 1294295 1691203 1686474 1608881 1688036 1572446 1962733 2032294 1726672 1929213
7317 1929213 1820973 1870164 2093222 1917008 1976891 2220586 1800984 2204570 2075625 2107103
7307 2107103 2521005 2792529 2631984 2581519 2516338 2281557 2361084 2509752 2453370 2455822 2452097
7296 2452097 2749879 2609226 2736868 2766696 2778054 3116033 3164294 3099812 3165240 3234029 3340835
7285 3340835 3266845 3466069 3880236 3834303 3514682 3602316 3802269 3589438 3536404 3825423
7275 3825423 3963758 4083315 3943390 3806835 4039742 4001871 3982492 4016253 4149051 4064523
7265 4064523 4205618 4169868 4638873 4881186 4936703 4675445 4498849 4742389 4711966 5106220
7255 5106220 5141682 5208877 5443692 5520238 5557890 6284064 6543790 6389237 6720491 6952120
7245 6952120 6985952 7273604 7327684 7514185 7839627 8359531 8789076 8746155 9005061 9030741
7235 9030741 9371159 9549454 9688474 9499069 9403526 9616902 9397593 9194944 9537539 9489519
7225 9489519 9462508 9483598 8898691 8723871 8642042 8660921 8461516 8375303 8356562 8236620 8117944
7214 8117944 7859577 7475736 7607966 7666520 7306254 7584073 7494020 7346258 6992877 6789599
7204 6789599 6701317 6942283 7161881 7327281 7491303 7296549 7246717 7387549 7224358 7114473
7194 7114473 7310857 7529993 7637845 8038499 8131438 8267062 8358962 7907065 8161508 8289829
7184 8289829 8169987 7993726 8242977 8811082 8821031 8977202 9327146 9810411 10070574 9956424
7174 9956424 10031713 10298152 10822114 10965557 10893522 11124304 11520735 12174401 12729381 13018974
7164 13018974 13293877 13580827 13716413 14099077 14306137 14959538 15091362 15351285 15872740
7155 15872740 15997704 16134891 16054762 16240433 16569607 16893179 17116721 17464038 17300746 17652283
7145 17652283 18000134 18164773 18517534 18974951 19470709 20129700 20235567 20669424 21232318
7136 21232318 21744026 22121208 22678337 23567786 24422668 25353058 26102253 26619890 27284372
7127 27284372 28244302 28829607 29692584 30493687 31249241 32059072 32880580 33595377 34122786
7118 34122786 34681886 35096213 35372433 35719262 35892457 35993609 35755024 35245336 35187048 34934083
7108 34934083 34159900 33811255 33172637 32666069 32033747 31141152 30504419 29377036 28515137
7099 28515137 28025652 26908169 25436061 24680365 23878597 22993736 22335095 21489545 20805444
7090 20805444 20001114 19197103 18479252 17513270 17074860 16567181 16026420 15359333 14805788
7081 14805788 14467775 13912291 13487226 12706602 12334902 11990705 11308498 11071790 10746352
7072 10746352 10392229 10181318 9832381 9378263 9216374 9108856 8754723 8634942 8278435
7063 8278435 7973846 7918373 7535317 7420605 7449912 6936448 6490219 6225453 6265071 6128469
7053 6128469 6147456 5995866 5596873 5389554 5396873 5099138 4873010 5223146 5273316 5026709
7043 5026709 4852253 4540801 4475610 4118562 3847519 3902834 3930658 4086014 3938328 3855273
7033 3855273 3683724 3776390 3789075 3681442 3654285 3313293 2930896 2940440 3025017 3362479 3356272
7022 3356272 3311205 3183913 3252092 3088148 2684810 2823887 3262422 3025849 2781098 2768424
7012 2768424 2616662 2563936 2761470 2994346 2943524 2715505 2373909 2404682 2297186 2396436
7002 2396436 2554919 2497317 2371800 2440003 2462288 2335582 2220591 2519365 2412685 2346178
6992 2346178 2370169 2495545 2601420 2454600 2433570 2237666 2299937 2457168 2661034 2153073
6982 2153073 1898125 2169674 2100351 2015155 2030183 1914288 1919592 1739795 1851365 1908494 2306936
6971 2306936 2529371 2543939 2175185 1987390 2178537 2081759 2077156 1905750 1980120 1982659 2126842
6960 2126842 1645531 1690342 1782451 1847820 2118117 2022538 1997457 2172189 1929796 1851793 2117001
6949 2117001 1831486 1862669 2012696 2139731 2003359 1769539 1686313 1955540 2016864 1868988
6939 1868988 2263455 2074639 1874229 1617678 1441663 1745755 1547718 1589194 1671943 1907230
6929 1907230 2030488 1642031 1791017 1810694 1794291 2001650 1751197 1725779 1761688 1431919
6919 1431919 1618336 1807384 1575070 1721932 1973786 1997304 1852639 1574817 1491753 1413403
6909 1413403 1388183 1569542 1495462 1440550 1413445 1733335 1870042 1682438 1405292 1378796
6899 1378796 1544274 1507880 1252577 1365817 1482204 1454660 1392364 1120128 980970 921910
6889 921910 777925 739978 808901 716937 1115771 1288838 1237150 764990 804269 953873 1099162
6878 1099162 1298708 1253831 804333 1069177 972374 667520 721558 959622 728576 654987
6868 654987 748470 794241 738071 634849 381250 283090 561487 856754 884917 737943 712545
6857 712545 706417 848622 1010873 919688 869394 913432 768487 492108 319923 702869 733098
6846 733098 496671 545796 816019 961939 862508 794898 821765 766252 741530 502691 568675
6835 568675 486413 715801 625640 404750 495132 621029 631755 680728 678751 911685 970730
6824 970730 1198378 1085284 929268 586744 629311 736862 812970 1109909 1125460 1108219
6814 1108219 1012306 894309 884974 617709 855695 825480 847505 739011 750150 1025691 915947
6803 915947 761812 1039653 1002813 1188709 1427251 1526971 1161174 1263971 1682550 1770422
6793 1770422 1420456 1217860 1358971 1385887 1783125 1745788 2033279 2134773 1917712 1794617
6783 1794617 1749850 1635358 1757344 1835338 1870582 1513312 1806003 1706595 1775582 1903686
6773 1903686 2011097 2100629 1970967 1794284 1902719 2031001 2360304 2446980 2075530 2045938
6763 2045938 2031968 2432350 2313763 2288741 2338618 2553036 2599092 2554665 2837030 2839110 3011265
6752 3011265 3087215 3252656 3357970 3497753 3422061 3577227 3939352 3855578 3912943 4393598
6742 4393598 4642502 4934466 5452808 5673967 5690697 6181828 6483560 6618201 6967318 7755511
6732 7755511 8082178 8567503 9180534 9937853 10385436 10767895 11482953 11884725 12296965 12910316
6722 12910316 13192971 13690467 14307247 14901175 14952350 14916575 14985662 14393480 14021634 13347744
6712 13347744 12722184 12408926 11865429 10890413 10095620 9510025 9380974 8593828 8163942
6703 8163942 7464060 6678270 6458452 6150954 5811350 5373152 5156739 4740186 4519201 4325969
6693 4325969 4033971 3917020 3801168 3656577 3350890 3209636 3118220 2835918 2832188 2938690
6683 2938690 2864954 2622766 2385488 1602075 1812727 1984221 1871592 2101349 1847489 1591114
6673 1591114 1477619 1637544 1890746 1675744 1591363 1776269 1760355 1575634 1394423 1355112
6663 1355112 1213209 955053 1060021 1297731 1388449 1138468 1019444 1372586 1391222 1245134
6653 1245134 1166955 1007717 964703 855575 907666 865194 790574 812259 652483 614122 326059
6642 326059 55185 139825 433168 428291 599062 615061 527533 492627 575205 398330 515872
6631 515872 607161 778497 760880 600764 300121 120948 182019 208514 186455 701447 748941
6620 748941 517267 96062 10877 356027 287463 154104 232048 63327 180098 270468
6610 270468 273428 156572 -143987 147659 383202 306665 437119 226750 216426 303709 60650
6599 60650 340880 199384 6445 232807 -22105 93913 339698 -84574 -12083 372774
6589 372774 323977 138024 250243 -28140 163759 192628 209357 360527 165795 -139126
6579 -139126 -17716 409707 237264 -58707 108700 -52033 -112330 -223655 19254 -27469
6569 -27469 -243066 -456596 -391669 -102883 66950 116858 -125930 237662 207156 316758
6559 316758 211517 3578 9931 246609 281810 84175 473725 243253 -89266 -102649
6549 -102649 -170096 -145309 28612 -39241 81151 -64686 -219607 125489 -229483 -271156
6539 -271156 46136 -217349 -122946 -212986 -138922 -94862 -7336 -91377 -113963 -97697 99234
6528 99234 169867 -67654 -282183 -247006 -384852 -301157 -134496 -173202 -85972 -136989 -195361
6517 -195361 -539444 -131320 -218587 -264064 39103 -176572 49727 -274656 -497348 -228658
6507 -228658 8253 140258 146817 321730 271628 117703 -191074 -107979 -143541 -212638 -423906
6496 -423906 -394344 -345207 -268576 -552858 -622922 -230193 -185361 -185452 -196194 -236365 -105599 -4841
6484 -4841 -22007 -125013 -264609 65014 110460 31972 59672 -129969 -73652 -74496 -222391
6473 -222391 53636 -255513 -247907 93344 227880 5971 -256849 -245566 -30864 36551
6463 36551 -15693 -80159 -226079 -405292 -241367 16662 -26880 269530 181755 125384 6596
6452 6596 55486 175336 312612 81656 240677 76678 -29952 -31817 111225 17912 -24031
6441 -24031 -166084 -38079 -12862 67042 189301 149968 60545 -244803 -186842 -265388 -250339
6430 -250339 -425951 120020 153247 -230422 -306523 -227177 27340 -83751 -444324 -464280
6420 -464280 -366046 -122396 -54016 -49804 -29486 276466 405663 279226 268314 206988 -74767
6409 -74767 -127800 -245924 77960 32110 99425 31303 -371911 -155775 -184682 -264302 -30955
6398 -30955 12152 105177 -47622 -50252 -68090 -193782 -517170 -576252 -415315 -352110 32864
6387 32864 -126561 -166746 -51667 27996 142050 10025 -440594 -410661 -343791 -133182 -120458
6376 -120458 -41220 69495 190499 246607 58411 57468 -91487 -43615 -280683 -271409 163243
6365 163243 58632 -53419 -161756 -236769 -505465 -503022 -149043 -54462 -25369 254743 343953
6354 343953 179633 9802 -116126 -99494 18260 36729 324035 102583 -98689 -69774
6344 -69774 -164006 -293961 -87563 71461 -326098 -258798 -236269 -316530 -131813 20902 28619
6333 28619 34211 52269 -236472 5629 215838 144341 -33439 -103430 -115770 -26120 -83653
6322 -83653 -39407 424007 456062 147767 -29546 44778 40613 4079 -11890 -50429 213813
6311 213813 218212 -107987 -34293 -16928 -130910 -103562 -16997 -104747 -356975 -302265 -67770
6300 -67770 -132460 -62 77409 49422 49761 -54051 -445607 -376373 -319995 -263705 -340394 -349671
6288 -349671 -453744 -274234 -228256 -303137 -246779 -266743 -304484 -271081 -279686 -61364 20293
6277 20293 99097 38958 54616 -98378 -49273 20918 -74317 138959 -29685 -366756 -96138
6266 -96138 293626 140685 19494 69758 243186 140755 -116182 -267680 -166675 -40625
6256 -40625 -36926 177468 133636 -69853 -50026 154820 132835 -36389 -67901 221771 291982
6245 291982 -7113 382543 278633 -189192 -329352 -209661 -18811 -4910 -91923 -39405
6235 -39405 -83803 64792 22667 -139971 37019 198189 115175 349088 469916 319674
6225 319674 172203 118575 240491 -95153 -2932 224736 -95218 -290868 -118890 98068
6215 98068 -169853 -175195 102258 11490 -304265 -172634 -308654 -120932 -136943 134224 106860
6204 106860 -116187 429112 609967 228113 26802 -10099 312271 277037 -22732 -137303
6194 -137303 132717 207525 -194565 -135904 -68209 -1250 21757 24768 -110164 259527 430827
6183 430827 21179 92051 405895 247832 146687 146762 172451 78629 -17050 -145328 -223620
6172 -223620 71358 119261 -131074 289767 51187 -103027 -111291 -94941 -53027 -193488 -273699
6161 -273699 -121891 -242277 104805 124399 -225352 -185465 -285531 -14929 36417 -117561
6151 -117561 -447387 -431010 -45880 157287 -140309 -310462 -77626 -113813 72473 62555
6141 62555 27486 267726 158400 104142 -23857 70758 141284 241868 214151 127568 160754
6130 160754 384992 199047 185782 -126236 -366701 -21208 27079 -112409 -62416 -168979
6120 -168979 -71247 105405 -31860 -176825 -226768 -349299 -207782 -136480 95457 6049
6110 6049 -221309 -408103 -455863 -147701 47549 -273219 -308411 129398 231984 140133 81309
6099 81309 -46580 -429028 -414988 -356655 -49888 81949 -14970 -130163 -166630 -222605 -71775
6088 -71775 -19204 64666 221905 118895 -79570 184233 289789 -128913 -185078 -199869 -42058
6077 -42058 13676 3588 316081 88302 -61997 -250310 -132408 -216924 -112879 124521
6067 124521 308036 -1832 -189388 20096 -21323 267267 -29846 -147831 280081 449081
6057 449081 292174 411698 234104 -65980 74886 207926 130118 168267 395341 57366
6047 57366 -75035 -70065 278055 381577 27834 -319874 -283171 -365426 -225127 264189 114773
6036 114773 220379 294867 -24671 90775 -32481 -6251 224554 192535 -18968 29870
6026 29870 -61083 75986 67210 -97745 67469 254531 203954 -154544 301597 398923 137426
6015 137426 -170473 -53612 144528 310070 434930 66491 -81865 67314 29771 187238
6005 187238 225136 -29530 24518 299253 324082 222715 6563 36724 317046 314720 519784
5994 519784 622556 450751 420418 384288 530672 357963 40467 103766 160583 210232 151974
5983 151974 93858 380759 260430 62369 -25318 48364 84723 276335 329975 -114200 -9821
5972 -9821 92461 24758 58187 208889 505985 313070 270124 319071 263631 300617 94992
5961 94992 124045 239445 9730 92433 401073 265644 146479 380935 103016 54753
5951 54753 164607 392873 206152 306871 297560 162143 8635 33340 213995 168329 133733
5940 133733 433574 189538 288269 353795 398384 438147 -187532 14269 207444 533255
5930 533255 672992 496571 575894 589901 579711 683662 549206 335038 445203 678082
5920 678082 559131 566533 404202 350090 412450 116523 174071 397242 285862 200737 199668
5909 199668 459317 235890 402442 332901 318596 -134605 -50418 79731 113855 388787
5899 388787 367916 406032 574259 748004 573189 252621 177434 120487 175780 410566 566567
5888 566567 672893 495941 773145 690253 727344 517380 355988 353215 471714 486661 423105
5877 423105 464308 526228 454563 431126 403742 290690 358355 391654 504658 295511 565844
5866 565844 787317 708383 521904 485287 404869 131455 502541 745014 436772 389892
5856 389892 532178 440655 221699 376103 213890 142888 147418 379850 122577 173032 113973
5845 113973 204439 618693 458726 466181 545766 502936 447780 285246 130562 401939 493663
5834 493663 716644 426048 370498 729931 576598 263962 327724 477615 738321 570657
5824 570657 727835 827489 852953 694527 565973 588433 561556 607166 420228 783703 576907
5813 576907 747097 765661 809569 689664 510986 556713 594303 532271 642236 240850 359684
5802 359684 619180 371642 458056 570819 708184 657496 736341 732857 470060 187203 451619
5791 451619 429608 356445 269762 164039 310692 572983 338464 199939 290294 729862
5781 729862 803145 734501 692738 425674 286815 650041 801035 1060804 1026674 768691
5771 768691 792000 796048 884424 582695 345006 730045 854262 899481 923559 627496 373445
5760 373445 527409 696918 697399 699948 771410 446662 445782 715558 883723 739337 651904
5749 651904 628073 560159 700252 874654 973989 843127 870087 720684 610843 255862
5739 255862 -23884 231669 305977 546419 751447 973062 866957 749704 820969 736450
5729 736450 723863 577717 688286 640050 658104 590935 834317 1138786 1158896 1051965 880309
5718 880309 1145442 1164461 999397 876041 851722 1001763 1117731 895348 787947 767852
5708 767852 817810 827902 938167 1106595 975427 654547 695117 411226 589292 436923
5698 436923 558009 647954 423095 725536 575588 439200 742949 1118756 834379 926163
5688 926163 692670 843230 1004326 1128597 827890 806725 566046 653801 908223 974344
5678 974344 780426 1046768 1007744 930030 1101675 1329292 1400871 1079862 833776 1233411
5668 1233411 1400345 1245693 1062516 955150 822410 679729 1108387 1038720 1089872 1112928
5658 1112928 1169802 1060737 1037265 1081661 1026492 1063387 910593 1413531 1392695 1157921 1136621
5647 1136621 1159492 1163175 1122854 1142834 1395471 1573504 1730664 1749185 1607472 1685264 1598507
5636 1598507 1704696 1251797 1427758 1844907 1708315 1549169 1638859 1985319 2141371 2157879
5626 2157879 1993442 2039686 2174899 2031548 1915510 2192095 2282924 2201513 2533769 2364709
5616 2364709 2276020 2384740 2715554 2871088 2914801 2862467 2991448 2937684 3109526 3206802
5606 3206802 3205909 3476203 3524359 3649907 4064250 4468766 4454123 4374376 4603460 4669227 5059863
5595 5059863 5014224 5500925 5895596 6077908 6410975 6719454 6984449 7360227 7820899 7863386
5585 7863386 8099993 8519538 8611135 8666988 9088649 8929869 8907848 8796788 8433712 8275512
5575 8275512 8790187 8694851 8542509 8631008 8951712 9248332 9499599 9823608 10364091 10514927
5565 10514927 10714191 11425083 11645857 11630547 11923608 12125947 11894031 11666677 11597897 11524956
5555 11524956 11039979 10878265 10815352 10471281 9771585 9456594 9083467 8977683 8974022 9083562
5545 9083562 9024755 9233737 9413386 9220353 9082458 8903614 9040758 9286289 9307872 9093854
5535 9093854 8801594 8958758 8699575 8211653 7788052 7311445 7126633 6771033 6415232 5908235
5525 5908235 5853507 5849993 5699271 5745182 5437163 4943453 4827848 4656981 4442045 4512799
5515 4512799 4722301 4867116 5043952 5272839 5254316 5236199 5262245 5211388 5213659 4956232 4491432
5504 4491432 4192860 4348695 4235219 4232311 4019795 3850677 3780139 3676656 3468084 3608557
5494 3608557 3768781 3995878 3967039 3848146 4136197 4254605 4377274 4399743 4566668 4605150
5484 4605150 4820993 5454668 6010119 6052032 6812234 7603862 8206278 8242081 7719918 7901338
5474 7901338 7403817 6677431 6226850 6136429 5760349 5242373 5077680 4896602 4559927 4193285
5464 4193285 4476746 4673800 4750397 4827229 4890930 5115842 5252275 5142102 5339063 5623425
5454 5623425 5699645 5907450 6131565 6565483 7198047 7559804 7937702 8492663 9099212 9396645
5444 9396645 9419540 9145546 8605154 7930893 6953404 6498164 6143886 5875749 6093398 6013244
5434 6013244 5934228 5803407 5850994 6191156 6197180 6355964 6526650 6573220 6681313 6607132 6431277
5423 6431277 6683091 6715249 6439357 6392883 6197343 5833069 5920095 6004527 6467469 6499174
5413 6499174 6299501 6346122 6392322 6375664 5859394 5380123 5416620 5463024 5573225 5577139 5287626
5402 5287626 5327087 5179009 5050351 5317581 4980590 4828031 4804517 4766686 4693474 4698562 4467079
5391 4467079 4075746 4145406 4158359 4166218 4338036 4449577 4273966 4014466 4040854 3911803
5381 3911803 4015597 4090152 4141846 4201226 3989012 3564874 3512529 3799896 3868004 4046523
5371 4046523 4027060 3696383 3469230 3882046 3679490 3401879 3551595 3805880 3660144 3810602
5361 3810602 3694258 3660634 3427776 3463399 3748141 3736070 3486170 3481050 3473220 3426172 3373550
5350 3373550 3177189 3083749 3444823 3650689 3403912 3341153 3633373 3513813 3636871 3562373
5340 3562373 3322410 3641083 3869084 3979857 3566975 3451678 3580592 3653853 4025295 3601809
5330 3601809 3419973 3613694 3796169 3362090 3167711 3056363 2942974 2822616 2817470 2737511
5320 2737511 3034639 2943606 3124246 2979470 2811746 3196035 2885297 3132155 3123683 2900422
5310 2900422 2762241 2932333 2801789 3092252 3093084 2983534 3032441 2628941 2386706 3021016
5300 3021016 2809451 2782988 2692007 2442667 2265115 2502381 2661815 2660336 2696436 2911540
5290 2911540 2640951 2583610 2446720 2532214 2427080 2325989 2327030 2254058 2665340 2662525 2541590
5279 2541590 2516347 2632110 2382419 2106474 2068970 2199861 2268401 2511209 2405542 2220538
5269 2220538 2477355 2484285 2388998 2288229 2388982 2259393 2117947 2290621 2002136 2016426
5259 2016426 1989648 1911062 2269821 2147751 2221061 2401551 2285101 2200681 2369561 2506222
5249 2506222 2449604 2584201 2750807 2800544 2961000 3025900 3207300 3608361 3844203 3700411
5239 3700411 3836808 4237153 4220258 3971818 3565030 3279268 3160834 2957840 2779204 2460327
5229 2460327 2229882 2198626 2329275 2479432 2019382 1767786 1714682 1418518 1502132 1719067
5219 1719067 1782567 1685943 1445470 1825183 1926591 1816884 1571461 1525914 1608498 1787305
5209 1787305 2055956 2006741 1630216 1547438 1890700 1681696 1492112 1593835 1572136 1547063
5199 1547063 1370013 1429801 1487529 1383690 1447592 1493152 1619141 1681955 1808949 2028595
5189 2028595 1591578 1686517 1394629 1541988 1874132 1742681 1644769 1613418 1741540 1894516
5179 1894516 1802907 1702715 1747856 1496921 1571787 1830065 1907771 1817562 1850013 1528451 1575047
5168 1575047 1658900 1477710 1621825 1908751 2009734 1974567 1778884 1679605 1844559 2120181
5158 2120181 2021420 2096053 2197208 1861661 2137554 2273102 2419761 2284163 2531824 2524754
5148 2524754 2242957 2555920 2539085 2585415 2347100 2381517 2675174 2715131 2919280 2969962
5138 2969962 3466929 3810082 4071624 4529716 4521641 4590553 4723033 4883600 4915321 5095554
5128 5095554 5248654 5370883 5337094 5204648 5153880 4872034 4500484 4746391 4881731 5119202
5118 5119202 4752499 4847090 5087914 5323429 5393464 5540753 5819671 6086063 6093010 6226360
5108 6226360 6275332 6457387 6428222 6181731 6284917 6118657 5865748 5652031 5752539 5683571
5098 5683571 5773196 5793576 5705067 5611307 6042009 6393288 6135009 6081656 6342938 6513025
5088 6513025 6690772 6544962 6337453 6310838 6223315 6128819 6327357 5994730 5838172 5678574
5078 5678574 5931636 5946063 5853148 5633224 5677496 5867026 5451371 5494234 5675442 5862823
5068 5862823 5761656 5808802 5694343 5145107 5022983 4787803 4357959 4058984 3907154 3515226
5058 3515226 3512859 3294756 3188721 3122006 2929430 2948684 2794230 2675870 2734029 2532082
5048 2532082 2271413 2644566 2870019 2585644 2371432 2378085 2109742 2265433 2372524 2081304
5038 2081304 1747569 2351801 2477020 2035328 1729442 1869887 1962165 1842834 2274871 2133237
5028 2133237 2193524 2044553 1853985 1615819 1886792 2215831 1939248 1684096 1961391 2283742
5018 2283742 2433297 2627675 2118101 2172797 2531927 2266694 2307104 2582578 2666719 2794981
5008 2794981 2491833 2499490 2281742 2395696 2354092 2308392 2619476 2665986 2671058 2868395 3045495
4997 3045495 2756994 2524770 2703177 2737786 2859522 3026637 2766277 2426039 2657682 2680519
4987 2680519 2432749 2294410 2517640 2933830 2846207 2613401 2701900 2631184 2710990 2566322
4977 2566322 2705458 2882875 2793248 2786841 2766479 2838080 2757804 2784504 2924897 2724753 2655198
4966 2655198 2738226 2977528 3056166 2893577 3000366 2861737 2748759 2820651 3100292 2865040
4956 2865040 2699743 2763246 3061025 2765286 2829621 3177054 3186088 3068524 3079863 3250494
4946 3250494 3550227 3722217 3392879 3114178 3466225 3210425 3231583 3163364 2870486 3095652
4936 3095652 3232482 3442382 3650073 3648073 3742250 3638575 4049329 3978051 3506382 3806892
4926 3806892 3717892 3634870 3648394 3491620 3553832 3542128 3493874 3689309 3611489 3845790 3865994
4915 3865994 3740153 3511616 3818044 3975554 4166867 4371728 4375911 4536404 4341079 3923634
4905 3923634 3698435 3898765 3952351 3534547 3641795 3743834 3523812 3540026 3747404 3852896
4895 3852896 3567563 3523125 3513922 3373882 3474769 3812008 3697616 3460086 3435085 3422085
4885 3422085 3570224 3688738 3668358 4028799 4174321 4140900 3982425 4148812 4191081 3996417
4875 3996417 4037833 3970764 3855855 3818581 4069466 4238604 4396911 4121822 4484263 4396295
4865 4396295 4113748 4104772 3983219 3886942 3824043 3999785 4052248 4163827 3871996 3809086 3866152
4854 3866152 3692869 3939096 4344461 3996443 3941676 3878358 3896892 3787028 3988165 4150864
4844 4150864 4224361 4178494 4208410 4155954 4129716 4288999 4244877 4450036 4334219 4776079 4648428
4833 4648428 4593293 4334680 4234836 4291963 4417182 4515195 4410408 4888740 4938417 4854190 5341743
4822 5341743 5603014 5423222 5299735 5415098 5485411 5531669 5535537 5610174 5818603 5945337
4812 5945337 5799249 5836634 6317141 6616110 6603555 6537048 6810827 7093613 7426679 7436366
4802 7436366 7685107 8219638 8898702 8873060 8876790 9480930 10036870 10537386 11397942 12335594
4792 12335594 13198669 13942809 14424488 14860272 14869969 15587402 16330697 17138147 18249338 19878440
4782 19878440 22068298 24531062 28043599 32751490 38851129 46428575 54386105 61491246
4774 61491246 65465800 64413162 59221258 51975032 43889521 36814058 31330517 27204910
4766 27204910 24215082 22130603 20083733 17999928 16911941 15823110 14747207 13785285
4758 13785285 13215039 12837739 12455824 12100325 11436921 11005337 10839594 10650555 10322793
4749 10322793 10160388 9795536 9443237 9630462 9502959 9292829 9444641 9370428 9526598 9722378
4739 9722378 9652110 10132519 10114913 10018439 10095228 10442755 10654840 10558596 10221092 10273802 10836394
4728 10836394 10981937 11202410 11181412 11742951 12292143 12850734 13930098 14476575 14876307
4719 14876307 15635178 16480167 17467409 18964503 20771355 23060925 25990359 29742275 34563362
4710 34563362 40728371 48106606 54865684 60494954 63166780 61874176 57655978 50934971
4702 50934971 43758118 37227484 31581067 27353829 24557315 22165546 19982392 18557454
4694 18557454 17162440 15488026 14120349 13460343 12843756 12018640 11860414 11652038 11144128
4685 11144128 11172046 11046361 11103182 11191623 11105476 10680257 10190023 9923574 9336524 8894329
4675 8894329 8659858 8095365 8162380 7900995 7461296 6975053 6652445 6649451 6071259 6297602
4665 6297602 6239552 6115011 5972286 5857146 5752920 5646371 5563739 5320258 5230020 5241940
4655 5241940 5222917 5259638 5399574 5552380 5325893 5304612 5220803 5075310 5109254 5213625
4645 5213625 5164264 5166073 5253991 5079023 5393450 5182754 4826310 4694223 4308377 4614256
4635 4614256 4513323 4336963 4427906 4466833 4327874 4190437 4437990 4375340 4211488 4174224
4625 4174224 3933856 4055452 4058936 4092771 4259582 4377397 4581326 4561196 4625370 4800409
4615 4800409 4510193 4157117 4081114 4165799 4153416 4161731 4321359 3985028 3808420 3827831 4006789
4604 4006789 3981357 3903765 3847903 3591949 3732797 3851218 3773866 3752163 3929587 3936037 4034195
4593 4034195 3887248 3686163 3960863 4028887 4067286 3862980 4133354 3951176 4176149 4154350
4583 4154350 3914775 4013974 4007093 4167050 3922028 3622235 3966021 3710769 3585647 3666060
4573 3666060 3775168 4039682 4268165 4584855 4130372 4147905 4348544 4276312 4145675 4049460
4563 4049460 4101209 4175195 4220849 4333220 4715392 4547965 4276467 4430821 4349605 4309777
4553 4309777 4568576 4698819 4796771 4820360 4513265 4079805 4532709 4725349 4602952 4611601
4543 4611601 4772602 4802703 5094405 5120294 5217974 5200894 5157464 5079287 4950899 5204028 5461204
4532 5461204 5467467 5705527 5712651 5637678 5862271 5579224 5800937 5996661 6051112 6156274 6600820
4521 6600820 6585235 6792092 6967418 6950575 7115639 7506009 7216713 7331851 7890315 7676588
4511 7676588 7506412 7759766 7524871 7894381 8169787 8473456 8935733 8810828 8908530 9293007
4501 9293007 9472730 9887612 10067807 10207315 10410873 10530171 11075708 11529879 11825995 12172007
4491 12172007 12459324 12798829 13658281 13958217 13979603 14898918 15518094 16624937 17483103
4482 17483103 18159593 18755360 19414773 19792137 20359744 21009177 21212426 21830430 22301652
4473 22301652 22561549 23315995 23764270 23963969 24904798 25639978 26449153 27827531 29353069
4464 29353069 30930617 32943443 34708430 36882436 38669391 40946731 43115046 44983175
4456 44983175 46202676 46771600 46931956 47156117 47152510 47083023 46850905 47114269 47736209 48285591
4446 48285591 49218675 50236918 51304669 52534718 53507208 54494761 55295214 55710499 56223304
4437 56223304 56635284 56739857 56617833 56856397 56783520 56990134 56939159 56259124 55908310 55709085
4427 55709085 55374017 54824891 54275149 54210983 54147915 54299194 55085460 56166578 57476217
4418 57476217 58714937 59835580 60894911 61925433 63020731 63820583 64412863 65115079 65635715
4409 65635715 66281238 66843542 66991830 67474259 67228958 66846381 66223624 65430503 64336822
4400 64336822 62315381 60172511 57859232 55362121 52475921 49306280 46779347 44187886
4392 44187886 41709191 39599183 37409529 35945065 34367277 32876513 31484674 30379501
4384 30379501 29586368 29015021 28674587 27757881 27024887 27043210 26615808 25933508 25641824 25211181
4374 25211181 24737459 24417233 24540728 24121285 23697317 23493487 23394367 22897340 22845777 22867600
4364 22867600 22854368 22495612 22667535 22718588 22683602 23078428 23138927 23394544 23529570 24269605
4354 24269605 24484067 24704060 25123156 25811294 26175549 26521728 26963017 27538857 28180777
4345 28180777 28596008 29061517 29785238 30619858 31292919 31788828 32763720 33347449 34451261
4336 34451261 35451768 36484412 38336490 39947613 41776095 43600135 45980738 48720710
4328 48720710 51398230 54141849 57159316 60115895 62893975 65771044 67705726 69525684
4320 69525684 71043726 72111806 72855207 73172823 73518404 73080963 72361812 71659164 71076527
4311 71076527 70488326 69890461 69147475 68702610 67950856 67061249 66195948 64976097 64145209
4302 64145209 63605965 63102287 62895027 63288922 63468454 63918146 64554946 65002172 65798927
4293 65798927 66476915 67003069 67039718 67113945 67178775 66656164 66231902 65905510 65460799 64723001
4283 64723001 63914427 63038936 62169354 60837474 59532648 58321029 57071096 56123391 55019240
4274 55019240 54451219 53812565 53245898 52991074 52481080 52438207 51782281 51315164 50376799 49267515
4264 49267515 48078174 46650627 45017557 43299005 42033546 40273522 38909320 37841434
4256 37841434 36933120 35909408 34967974 34083693 33119837 31937960 31517192 31100311 30566352
4247 30566352 30044439 29645072 29479825 29600502 29242515 29591339 29702998 29818290 30167760
4238 30167760 30249591 30536528 30974560 31344225 31806951 32321211 32929315 33222814 32909956 32845031
4228 32845031 32514473 32281434 32152657 31673567 31213497 30780886 30733993 30515898 30400618 30522858
4218 30522858 30495292 30640797 31046444 31863994 32556303 32952356 33247473 34051247 34436343 34459657
4208 34459657 34802465 35111841 34659142 34549379 34305690 33980487 33824397 33399905 32711002
4199 32711002 32387583 31993256 31494673 31020112 30468852 30312632 30033620 30066715 29693199 29420666
4189 29420666 29542969 29795553 29944304 29986486 30576707 30565361 30516865 30387602 30250733 30385067
4179 30385067 30252125 29968657 29988500 29903428 29746101 29757170 29735264 29504036 29304725 29052412
4169 29052412 28710562 28528211 28247215 28372067 28443791 28569872 28595142 28864421 29239254 29406569
4159 29406569 29797303 29855856 30269746 30283897 30532509 30601167 30507549 30674184 30611068 30235630
4149 30235630 31002395 31455595 31595142 31686324 32071178 32551835 32771773 33384413 33602115 34002465
4139 34002465 34135557 34385599 34592873 34537448 34042127 33876734 34068298 33986895 34052595 34082904
4129 34082904 33649387 33508861 33693142 34237144 34553772 34804730 35280744 36015355 36388219
4120 36388219 36436159 36856046 37713151 38231620 38464102 39034500 39808260 40656655 41594556 42387137
4110 42387137 43312369 44088662 44778745 45773135 46529310 47407564 48409946 49236920 50203346
4101 50203346 51973373 53187464 54131584 55764421 56835963 58208337 59944219 61352591
4093 61352591 63006250 64976487 66767589 68683641 70935522 73353919 75914987 78520920
4085 78520920 81368455 84500537 87489435 90407090 93373529 97249380 101336953 105791666
4077 105791666 111239719 117712390 125599281 134664332 145819008 158741101 173151108 188907992
4069 188907992 204989996 221359841 237930194 255287224 273913217 293345179 312124403
4062 312124403 326760394 334292464 332259707 321049735 302327210 279121956 254503434
4055 254503434 231166904 211556161 195670307 182935760 173322835 166573862 161892754
4048 161892754 158487017 155838317 152798775 148470727 143126241 136658688 129921857 123639759
4040 123639759 118249817 113904669 110211881 107261023 105311041 103590185 102338121 101950107
4032 101950107 102380637 103286909 105168943 108266497 112424648 117185469 121764995 124713856
4024 124713856 124616255 121995686 117189627 111655358 107168200 103436053 100768478 98241946
4016 98241946 96876483 96201603 95761922 95799731 95830473 96190041 96871156 98190944 99180044
4007 99180044 100569450 102092864 103620027 105675906 107824347 109669607 111804436 113975964
3999 113975964 116306541 118975222 121451562 124421169 127663509 130684801 133728257 136852715
3991 136852715 140136203 143433933 146999841 150568204 153689642 157121181 160848215 164456826
3983 164456826 168036789 171701495 175523337 179666690 183564855 187696947 192068338 196238455
3975 196238455 200523117 204868350 209039252 213191633 216937957 220634396 224079666 227203898
3967 227203898 230202769 233008613 235631948 238195047 240822838 242568993 244587967 245917165
3959 245917165 247418347 247975703 248176690 248220720 247945139 247648192 247229986 246492416 245856194
3950 245856194 245140989 244368290 242990997 241492988 239873428 237065008 233926211 230527302
3942 230527302 226936726 223124561 218960778 214838074 211238657 207956031 204379468 201004718
3934 201004718 197581301 194486528 191448389 188566896 186047168 183279483 180973115 178779819
3926 178779819 176899860 175319076 174197312 173665711 173330612 173644957 174232074 175234793 177363460
3917 177363460 180020444 183387139 187298336 192181762 197653507 203102129 208168338 213440878
3909 213440878 217967221 222294872 226027220 229109390 231377985 233827920 235870000 238293481
3901 238293481 240681236 243346131 246813767 250212089 253534563 256659749 259403160 261041949
3893 261041949 261736419 261748190 260438018 258785391 257225217 255558436 254202132 253489970 253325547
3884 253325547 253714520 254774913 256553783 259276955 262726779 267168481 272539802 279285573
3876 279285573 287490074 297579215 309283361 322596801 337069462 351760603 365979656
3869 365979656 378652928 388663982 395339317 398634546 399084823 396781638 392335540 387398237
3861 387398237 382505967 377630815 373219142 369258486 365258489 360780887 355493349 348792839
3853 348792839 340643159 330466089 317893785 303756454 288567460 273025358 257933531
3846 257933531 243739858 230812989 218956864 209286186 201417978 195314636 190182057 186543487
3838 186543487 184822057 184053657 184796782 186527642 189001841 191944537 194126730 195835268
3830 195835268 196050121 195090792 192453090 189300392 185733229 181834232 178213533 174908554
3822 174908554 171947085 169181091 166691237 164054666 161730680 158440610 154645571 150085118
3814 150085118 144629379 138154379 131563914 124982194 118136988 111490114 105213398 100005177
3806 100005177 95372090 90778483 87054129 83539571 80138370 77766349 75218720 73045149
3798 73045149 71222630 69749578 68528847 67015844 65842277 64595104 63750446 62447781
3790 62447781 61091689 59702713 58251267 56817723 55457941 53845929 52795039 51711791
3782 51711791 50250105 48959434 48154654 47341314 46278610 45368774 44896303 44148338 43441957
3773 43441957 42822449 42219596 41911307 41166968 40898524 40477589 40222834 39864345 39489566
3764 39489566 39238767 39384302 39448466 39332221 39084632 39087942 39194425 39120834 38623843 38238337
3754 38238337 38040446 37948027 37333281 36533491 35551838 34933487 33932319 32986478 32683080
3745 32683080 32167320 31774778 31277504 31063157 30930884 30746636 30599245 30278206 30184130 29839034
3735 29839034 29584579 29609747 29663758 30122292 30315755 30120885 29740018 30123257 30104799 29995521
3725 29995521 29716513 29524654 29670881 29613875 29727535 29907723 29620848 29395801 29436644 28941420
3715 28941420 28928870 28859964 28584524 28330430 28388946 28723143 28523758 28648890 28957701 28775647
3705 28775647 28782176 29212107 29185597 29399516 29698450 29721193 30170465 30481502 30979662 31383024
3695 31383024 31657391 31902219 32150820 32358978 32647568 33001385 33561133 34344309 34576118
3686 34576118 35215977 35520615 35925730 36557575 37105740 37410068 38099798 38626657 39071138
3677 39071138 39836946 40210689 40909308 41688014 42431066 43451373 44510323 45367772 46207232
3668 46207232 47325121 48313815 49204521 50312942 51412376 52501878 53500877 54780683 56010789
3659 56010789 57235792 58532591 59867669 61732021 63394564 64745307 66352325 68373493
3651 68373493 70312030 72519843 74548036 76787937 79398656 82576435 85297885 88353559
3643 88353559 91719612 95496056 99577132 103686468 108148382 113513935 119292907 125244473
3635 125244473 131939257 139229306 146977504 154787039 162904587 170954419 178903788 186798580
3627 186798580 194866324 203058068 211705471 220632660 230402203 240895811 251953790 263093200
3619 263093200 274805267 286659447 298962639 310659523 322756880 335244077 347904576
3612 347904576 361078634 374266711 387206968 400082202 411583333 421184308 429629453
3605 429629453 436435716 442618513 448464068 454186589 460313801 466551683 473321089 479767974
3597 479767974 485429362 489544221 491759518 491286792 488344678 482812239 474964697 465047656
3589 465047656 453872707 442245946 430474880 419432668 408324020 397216659 385879549
3582 385879549 374061329 361966376 348969362 334958843 320122311 304667743 288396332
3575 288396332 272380688 257294598 242841255 229517316 217098844 205270090 193657329
3568 193657329 182608383 172195269 162393481 152909240 144512314 136492709 129549861 122958993
3560 122958993 117309973 112275601 107237166 102688987 98498492 94857307 91408283 88152504
3552 88152504 84940656 82124276 79251507 76952943 74635651 72366653 70406854 68446068
3544 68446068 66611688 65007942 63538251 62019236 60374569 58587222 57227657 55739152
3536 55739152 54341590 53381865 52316099 50972798 49869693 48709731 47365227 46123166
3528 46123166 45293789 44140469 43122731 42328229 41917293 41154207 40118321 39156995 38321285
3519 38321285 37427396 36416031 35503272 34511123 33852046 33065861 32374748 31990297 31703439
3510 31703439 30712010 30143506 29397158 29031249 28619858 27940195 27659030 26874918 26455377
3501 26455377 25770187 25181011 24811269 24394336 23907169 23454038 23085352 22541364 22239153
3492 22239153 21951589 21537661 20875367 20484769 20188318 19830868 19462404 19080421 18972474
3483 18972474 18692502 18286849 17769934 17338283 17019492 16757370 16597217 16105784 16034243 15872958
3473 15872958 15307357 15260254 15341551 15144682 14946815 15081265 14519446 14405179 14320821 13912109
3463 13912109 13250515 13102021 13053491 12984309 12809866 12539344 12582251 12430485 11890626 11668243
3453 11668243 11768520 11909282 11574331 11359703 11382818 11070994 10984625 10886210 10787343 10514977
3443 10514977 10192794 10184343 10417074 10057600 10075316 10092443 9859231 9892246 10039378 9924549
3433 9924549 9656028 9656584 9794345 9347130 9223409 9131501 9271790 9331512 9016576 9243299
3423 9243299 9371899 8735673 8365399 8366467 8504616 8499311 8466666 8299269 7973518 8109326
3413 8109326 8134762 8053270 8205383 8194463 7811714 7824438 7593853 7657711 7759097 7538530
3403 7538530 7236339 6952998 7259418 7282925 7206958 7018786 6891597 6784094 7039413 6981470
3393 6981470 7085684 7091966 7186342 7044774 6873031 6829294 7107726 7187418 6779918 6739909 6491163
3382 6491163 6185846 6473649 6495539 6364523 6138200 6350039 6332169 6240715 6374558 6366180
3372 6366180 6712108 6478626 6758124 6730504 6605951 7023364 6920821 6881869 6319281 6144080
3362 6144080 6308987 6306870 6601748 6529742 6539695 7023520 7061235 6914249 6918803 6753409 7075857
3351 7075857 6789350 6696890 7072412 7386883 7347456 7406373 7323652 7150290 7557800 7596090
3341 7596090 7498982 7496652 7447232 7820353 7723085 7842393 8175998 8512183 8229588 8113847
3331 8113847 8290943 8597063 9043635 9165341 9362870 9323648 9342574 9316052 9901917 10269794
3321 10269794 10116932 10450166 10492874 10602703 10469859 10778686 11039662 11121969 11055803 11305052
3311 11305052 11382224 11742477 12060070 12089855 12152803 12615631 12952491 13336511 13277831 13263268
3301 13263268 13162815 12782837 13179961 13525970 13485562 13544056 14038484 14520579 14805617 14843268
3291 14843268 15001141 15112292 15427861 15463864 15871035 16088683 16147531 16369801 16696301 17037967
3281 17037967 17326333 17636911 17615657 18058871 18858827 18948004 19505083 19926871 20171714 20900520
3271 20900520 21375011 22134003 23006247 23530998 24118101 24896244 25585992 26318701 27176020
3262 27176020 27476952 28462201 29548359 30727551 31606106 32586198 34220822 35862032 37415189
3253 37415189 39292238 41622256 44118405 46843651 50018453 53520524 56558989 59987139
3245 59987139 63671281 66923358 69810496 73343912 77170384 80270501 82422967 83291727
3237 83291727 82540871 80519071 77115495 72334997 67144147 61568932 56517322 51692826
3229 51692826 47403744 43469494 40090263 37182404 35022633 33206923 31428902 30149383
3221 30149383 28993995 28450208 28502897 28706603 29143963 29832580 29785477 28703092 27072609
3212 27072609 25120132 23089243 21091007 19726327 18575108 17780334 17112171 16559032 15760924
3203 15760924 15086510 14578903 13768417 13521146 12930121 12565485 12089341 11634397 11418669
3194 11418669 11212636 11086502 11007688 11230237 11182383 11079557 11449873 11454738 11924358 12874924
3184 12874924 13288159 13093068 12824168 12385447 11373491 10241343 9431310 9218471 8904881
3175 8904881 8254106 7618104 7569425 7381589 7075389 6878047 6434638 6313529 6251591 6091330
3165 6091330 5846652 5368701 5299163 5673130 5288052 4945042 5176311 5137727 4793611 4855712
3155 4855712 4465967 4690506 4942679 4901889 4819343 4300545 4066527 4093938 4021435 3714580
3145 3714580 4069392 4030325 3774629 3455611 3491457 3501064 3371041 3041442 3287736 3393144
3135 3393144 3306195 3358230 3339159 3495805 3466227 3417217 3013714 2763495 2699640 2922742 2834765
3124 2834765 2708894 2644927 2874023 2995589 3084819 3038373 2821418 2474401 2475414 2399083 2441521
3113 2441521 2286868 2309102 2462142 2386661 2390697 2528142 2281879 1872262 1950501 2065067
3103 2065067 1852168 1931133 2240381 2191728 2154582 1998112 1935522 1972869 2009701 1700377 1572616
3092 1572616 1833025 1929023 1621149 1765677 1963258 1633442 1339510 1364815 1746845 2064402
3082 2064402 2086352 2061152 1899793 1608400 1696006 1455638 1634424 1781130 1612177 1917930
3072 1917930 1811170 1674851 1934455 1944597 1739642 1709265 1250193 1475353 1681146 1826941
3062 1826941 1662089 1494793 1370440 1382738 1336822 1241177 1567313 1550388 1596500 1521463 1284391
3051 1284391 1479384 1414032 1327779 1430618 1214082 1257426 1398478 1331046 1224766 1353730
3041 1353730 1209853 1413517 1421711 1076630 1242059 1294960 966376 1389644 1320879 1216040
3031 1216040 1341723 1159740 1350443 1386743 1397259 1341425 1044079 1430959 1669384 1405245
3021 1405245 1427952 1275607 1297081 857321 1289330 1434145 1486553 1589249 1324302 1207796
3011 1207796 1301398 1400968 1423504 1281690 1404479 1321982 1215538 1378104 991105 1013624
3001 1013624 1015896 1212996 1347189 1092744 1106651 1169865 1331014 1373072 1131330 1647971
2991 1647971 1532646 1184566 1207284 1065175 1016082 1121732 1067075 879158 1344731 1271254
2981 1271254 1308548 1548509 1379160 1419557 1561691 1503380 1417403 1234558 1420311 1548842
2971 1548842 1166441 1472084 1934388 1784696 1495233 1704755 1780913 1852780 1585097 1488048
2961 1488048 1506495 1746230 2122356 2213692 1967262 2040444 1967802 1678998 1910068 1952604
2951 1952604 1792213 2174018 2360610 2600225 2593819 2411498 2479725 2271907 2773744 2703819
2941 2703819 3039432 3282492 2920606 3053860 3317992 3463078 3405645 3417007 3805786 4029523
2931 4029523 3935889 4098797 4190907 4377326 4242517 4802520 5011894 4569026 4783396 4735292
2921 4735292 4687794 4750349 4945569 4420834 4663032 5021453 4884100 4927699 4969813 4864326
2911 4864326 4871168 5187228 5449924 5961733 5983966 5823617 6153004 6348990 6507323 7153349
2901 7153349 7703821 7857381 8610012 8955980 8398298 7900514 7134416 6606899 6263901 5841114
2891 5841114 5340109 4789301 5154031 4922307 4739143 4823553 4299159 4403826 4324717 4354210
2881 4354210 4303341 4287750 4252838 4296320 4317419 3977661 3870649 4189790 4343532 4394498 4503318
2870 4503318 4476555 4410711 4620371 4559385 4268010 3722698 3413727 3455498 2991522 3365661
2860 3365661 3317378 2797061 2891381 2923715 2695316 2464856 2427074 2309738 2304549 2257030 2681121
2849 2681121 2593340 2303108 2350234 2170673 2094260 2011095 1617972 1595642 1471497 1463146 1763554
2838 1763554 1768711 1339237 1257494 1432744 1436139 1425272 1281332 1333755 1197092 1076451 963458
2827 963458 997450 1064719 702764 794564 1138060 1237268 923579 785794 894099 1088809
2817 1088809 1100593 1179910 1192126 1042339 857330 719058 944931 890175 908655 833137 633815
2806 633815 957427 561988 289639 472880 584220 589234 634097 444780 370748 657401
2796 657401 485244 261931 476197 862827 482793 503239 709095 667163 392285 471369
2786 471369 722286 529952 603288 658817 486093 567172 525957 685245 535600 385019
2776 385019 246566 498004 738249 666759 393263 653335 598691 219390 389189 498488
2766 498488 549545 496282 426940 467806 465242 619368 416467 506083 409960 693200 846722
2755 846722 580395 243085 554417 666426 588103 731461 794075 685595 442198 279412
2745 279412 263970 244572 358012 383097 330340 606927 379901 -13770 189455 417189
2735 417189 111721 144485 166112 109137 -11562 131769 35030 -115649 -65819 -329550 24746
2724 24746 85989 215193 417629 299075 258808 199272 172933 -55693 577269 794578 650239
2713 650239 235091 223484 51661 -213379 -51440 158060 315616 176573 100720 43122
2703 43122 -178160 -92835 44125 18360 -120792 23780 -57269 242817 260818 284039 244074
2692 244074 266793 249400 147150 -7784 213802 399560 530298 226529 -97609 156825
2682 156825 162900 215432 243294 457749 649928 247409 -234222 -202574 45223 262550 354182
2671 354182 260818 -1223 -68563 160634 117471 79812 72762 142878 178267 320274 482656
2660 482656 305992 65122 244687 320895 325063 256463 367934 537474 238616 -89000
2650 -89000 36867 8769 184647 298449 262026 191942 75478 -199606 -104266 271825 361660
2639 361660 523236 242536 -324394 -454970 73959 192571 -60916 -214273 145792 238430
2629 238430 280752 130255 -147712 -56974 101978 202791 249010 122077 317115 291151
2619 291151 263384 102792 54453 225022 381594 -70368 86913 53709 373719 213409
2609 213409 166664 404908 331655 277300 -77483 -270741 -201184 -226983 -186029 -79009 188246
2598 188246 -53165 -73327 5883 -111053 299933 7803 -71410 -172456 -198306 18375
2588 18375 137902 -92509 -161974 -74796 32631 151367 421979 309147 35186 82958
2578 82958 91129 163448 119249 75344 61165 161083 250543 122253 146615 101855 -69721 261654
2566 261654 98635 42588 -99950 120381 129205 189349 73178 120706 21757 -15018 -77469
2555 -77469 170710 396008 162968 -199744 -291391 23755 -59674 -44224 111960 296833
2545 296833 318447 171300 274240 387353 -94923 -206817 -16181 68540 126660 179193
2535 179193 -90193 298415 -76116 -23587 -85484 176299 411667 421575 219792 199192 411685
2524 411685 108677 -128338 35662 265183 86923 -121447 -292732 -147203 249889 253121
2514 253121 462334 574571 317150 306828 513672 226181 -209977 -356694 -199050 -39807
2504 -39807 131285 -167785 -263036 -76473 211522 167786 11835 42573 -22413 -170715 -349939
2493 -349939 -381184 -364565 -96881 141413 163654 425514 350063 58534 127333 3194 -34507
2482 -34507 -70473 -339069 -194224 -200490 -346585 -415969 -194849 235659 147075 -191087 11570
2471 11570 -105359 -61949 -38945 47909 378381 19937 86081 -229397 -247169 -437900 -196074
2460 -196074 -94714 -40515 -69017 -42333 -103365 -27974 -331896 -275599 84659 -189816 72745
2449 72745 91469 101023 -40810 -173438 -254738 -13969 117784 127819 428279 110646 -113449
2438 -113449 -198531 -252600 -186253 -16880 -334037 -341166 -286058 -120129 127113 -92290 278359
2427 278359 406846 393413 390175 137224 93430 108645 -172367 -263703 -104209 -21632 80003
2416 80003 -148539 -178075 -138971 -63345 -36528 -354102 -196170 -45260 73128 146006 205360
2405 205360 81807 -51374 -303786 -288487 -297818 181730 659498 293426 32386 153459
2395 153459 -20254 -105614 191526 455417 318098 -67085 9303 -1912 85280 167308 377536
2384 377536 62013 -179336 307700 226279 276388 362281 -8019 -60766 120109 -43528
2374 -43528 62027 237983 121883 411815 237937 369260 578428 655089 697017 690957 598985
2363 598985 711148 307250 19804 241182 139918 -91379 113009 252126 354373 232097
2353 232097 193920 -60024 286682 371116 942839 538236 15447 353974 387483 638850
2343 638850 293024 431077 308492 148645 182864 192854 364862 449387 208759 -122008
2333 -122008 -35419 -14545 -134638 -137444 -12327 44879 -19062 149893 218706 116861 65756
2322 65756 227124 184672 448444 419333 144451 -110072 177541 -37229 43181 -131428
2312 -131428 -95632 82766 -316161 -345436 -121991 -133172 -23915 242135 257021 -50938
2302 -50938 100822 70562 -47113 -305767 -346688 -245308 -452730 -62651 -188225 -181275 102454
2291 102454 282956 133982 -24262 63785 61432 27329 5875 384672 296607 193261 85938
2280 85938 103923 39034 145495 61788 239951 40387 68664 228536 360294 271879 266003
2269 266003 411087 -21268 -52911 335890 436625 440914 378032 294911 365435 380656 353560
2258 353560 361871 357702 73087 62040 120028 35335 185458 419348 311262 221643 63362
2247 63362 142672 379583 389163 313170 175502 212849 428813 349483 145550 22415 47472
2236 47472 17212 447253 665072 341709 348178 294689 188707 475784 424308 150276 202596
2225 202596 314042 -50425 203260 144078 552932 581072 263341 314157 553301 609561
2215 609561 604082 343018 304619 522855 522565 329805 603136 930497 707112 526371 717765
2204 717765 805257 593822 425897 449385 451225 590262 791891 541024 553197 823083 944654
2193 944654 1035623 1104131 762504 456956 771311 953525 683852 853816 1207936 1365112
2183 1365112 1307875 1261537 1378895 1322470 1033975 1241287 1226706 1410902 1623549 1759565
2173 1759565 1911981 1831845 1809318 1861266 1666055 1953821 2190854 1760937 1578750 1734977
2163 1734977 1847477 2037926 2429222 2342816 2016116 1874332 2367702 2385067 2700497 2715102
2153 2715102 2624329 2722920 3091914 3220391 3058837 3141089 3146527 3210311 3407385 3323096 3480928
2142 3480928 3457162 3481615 3890357 4204715 4180299 4350519 4470986 4874611 4897553 5189978
2132 5189978 5926620 6333728 6599035 6527519 6848197 7342307 7729615 8213762 8691136 9274734
2122 9274734 9950318 10836812 11754124 12721460 14197597 14829610 15502327 16293874 17178209
2113 17178209 17853036 19548707 21772290 24565577 27887263 32842957 38939140 47595611
2105 47595611 58427815 72670154 92256191 113406527 117633346 104856832 86190004
2098 86190004 67438819 53439857 44019667 37663810 32662165 28833476 25800177 23714136
2090 23714136 21525061 19984102 18521636 17683595 16729343 15244309 13979478 12590836
2082 12590836 11600574 10906062 10245327 9803280 9419387 9339404 9051465 8526585 7874882 7589204
2072 7589204 7489465 7172713 6496525 6227179 5770758 5845307 5591423 5536822 5381918 5049372
2062 5049372 4954067 4773903 4523772 4208243 3983254 4009844 3578260 3253631 3556951 3693900
2052 3693900 3407665 3323038 3206542 2994625 2722299 2656694 3052662 2840905 2745777 2796399
2042 2796399 2716303 2649083 2648242 2479334 2144530 2363172 2538542 2062265 2096121 2303149 2150060
2031 2150060 2102691 2070725 1975463 1687537 1773876 1904563 2088253 1835639 1696405 1718507
2021 1718507 1755688 1569830 1451239 1285907 1159079 1132847 1145755 929620 882179 979054
2011 979054 1000324 823210 1041486 1020222 930002 1017728 920292 1165806 1109081 872966 749209
2000 749209 791346 939271 1108764 1129915 1256660 1130819 1142049 1090839 1120887 1096997 936918
1989 936918 722784 896591 1221632 1148593 878757 651528 433816 426391 554394 424862
1979 424862 301598 447625 369658 467777 497395 504783 357557 723500 822258 530543 452579
1968 452579 313408 322641 357160 290181 379564 477581 537024 664599 371167 553686 561728
1957 561728 273453 484935 552897 440447 475592 251722 175496 -120541 -118540 279982 303080
1946 303080 170569 459978 530340 219663 137247 345256 387168 271260 254084 177176 123438
1935 123438 519521 569854 391356 254424 344378 -60124 -65366 246403 210560 -59965 46989
1924 46989 46829 -15564 329352 346038 558164 598132 677714 271798 96869 210728 250254
1913 250254 88053 178150 9059 177073 302589 185185 245435 65768 4457 137376
1903 137376 337054 387616 241814 391024 207217 316053 31293 85498 257003 -129543
1893 -129543 264347 328177 -22558 -3738 -152266 -263020 137111 253164 249567 -59947
1883 -59947 -101034 -10768 29323 158298 167049 255099 483389 590506 334820 25458 137379
1872 137379 76314 142155 176346 -76832 -8821 156344 -8117 126808 179824 -69932 15198
1861 15198 214202 299986 39759 99272 210276 269704 126640 264652 291215 310329 -48726
1850 -48726 186353 49709 -38616 -160367 -51638 131196 316029 316280 182422 239438 551195
1839 551195 730097 680113 278694 224598 483779 563181 302244 310915 483499 546261 520953
1828 520953 214830 326397 249898 367674 153412 -26364 -71765 216119 -3409 -360989
1818 -360989 -292453 44566 -88907 2676 -19532 280828 92740 -233527 -173899 149941
1808 149941 54086 -15408 28798 80751 222949 305443 69718 18083 83688 431361 486596
1797 486596 190438 87999 -93943 -158067 -153273 -277957 -297541 -159669 89438 221866
1787 221866 403796 140171 96798 54849 -163328 -112983 205848 171937 178237 -110738 -235311
1776 -235311 -138716 106190 184213 349968 149146 -140450 -69496 -218190 -173278 31370
1766 31370 91140 204739 197032 -57448 80398 144530 14120 79265 74023 -404373 -161630
1755 -161630 92328 -224505 -369295 -359665 -285337 59073 353417 164724 4417 -82291
1745 -82291 -125724 209756 -135222 -112407 -308418 66460 58062 -364758 -177964 -27510 -67907
1734 -67907 -308711 -166255 117816 230767 215475 55225 336290 272762 -58293 -92189
1724 -92189 175616 222040 496096 103786 169056 81065 -164758 -51226 -336148 -273242 5255
1713 5255 -252868 -334816 -613668 -96391 184174 153151 -52221 -482447 -186140 103558
1703 103558 -75014 -346709 -103805 -109706 -138479 -109480 -58597 75790 716 146293 357822
1692 357822 64152 -174321 -398620 -11309 53180 -93336 -29472 -7690 270301 78258
1682 78258 -363501 -419798 -57341 -12282 -182725 -30976 -57340 -43937 -1284 225655 176160
1671 176160 -185149 -134107 -16561 -26283 149607 262266 240971 224730 91602 150920 -48389
1660 -48389 -88638 247039 399059 338261 -176129 -300312 -52856 102075 249332 41124
1650 41124 230757 -22106 -184052 -26276 -302440 -494250 -297967 -150800 -381105 -247432
1640 -247432 6990 111080 143916 -62292 -424859 -253153 -437573 -290954 -317436 -32272
1630 -32272 15873 13572 138282 84522 -194195 -34714 -173613 -124070 -39284 -194900 -107454
1619 -107454 183791 -204696 -22449 -160125 -180481 -85518 -294315 14393 291295 -36493
1609 -36493 -199704 -240283 -224204 -138969 -477034 -269790 -438568 -132196 18010 96322 -29733
1598 -29733 -63189 -101889 -364299 -246451 -104518 19440 223406 136666 -48803 -47304 -142105
1587 -142105 -54983 -137027 -103842 -136653 -125465 41068 -191377 -205025 -187812 46054 213362
1576 213362 -107455 -125393 243133 131934 139091 -96167 -50499 -82056 -264204 -50928 -2081
1565 -2081 152751 413012 350732 -37500 69471 324023 285991 320250 185356 -23469 -97413
1554 -97413 -288637 -515697 -564523 -551400 -427888 -187530 93654 -262891 -143724 -141812 -108627
1543 -108627 16994 -32465 152115 281244 4410 11939 49462 86563 -136426 -141091 -526153
1532 -526153 -420107 -179604 -159283 -285145 -268365 -138826 -323802 -273892 -49545 -328469
1522 -328469 -99072 -68327 -437220 -388117 -261547 88157 -224595 -212051 -503304 -730953
1512 -730953 -452517 -144067 -128548 137492 -63614 -5677 -175713 -169161 233444 141712 -168905
1501 -168905 -387698 -374564 -238988 -209863 -375383 -31518 -187422 -449526 -206978 -111000
1491 -111000 -265122 -307691 21392 -84189 -119790 -11084 50959 -208344 -32871 159180
1481 159180 123708 -72065 -60065 7805 -100172 72729 332050 17058 43492 222473
1471 222473 386875 265375 -74106 -151468 -203667 -110583 33384 -34523 -119912 145395 123153
1460 123153 59971 -202462 -389592 -257795 -99246 -86859 -5288 -77221 29409 -59714 -86942
1449 -86942 112251 264456 317255 242154 263400 78799 57668 8584 72988 -76651 -568793
1438 -568793 -454614 -68301 -61088 -24895 106940 319049 242238 -108250 17618 -44510 247198
1427 247198 373372 347486 -292247 -3755 183439 -40619 -25434 -269487 39131 -170106
1417 -170106 -114768 -213048 170044 -65489 -94386 112162 -104242 -256362 110034 285571
1407 285571 161476 234994 8293 -148481 8400 -185075 -153342 -106768 -14934 281697
1397 281697 73575 15125 52605 -74276 -110368 -294075 -759939 -645168 -315771 -367540
1387 -367540 -350321 73517 68144 -63862 -332042 18115 37772 -112220 -98220 -132250 -21899
1376 -21899 -338659 -524534 -391597 -368260 21982 223553 53800 -89404 20690 -1438
1366 -1438 -345068 -336047 -78278 -123232 -82215 -21580 -180683 -89344 -60164 -78299 -334834
1355 -334834 -272268 -4896 -201450 -11144 8153 -134725 -140153 -26755 -241885 -115136
1345 -115136 43970 156078 254425 294303 410960 37026 152318 142735 68317 14671 -190838
1334 -190838 52206 -1285 -293242 -83294 -98186 87943 152481 94428 -434086 -291749
1324 -291749 -83392 -293177 -220013 -88963 -75554 -235337 -275761 -328011 -180042 -88568 -118721
1313 -118721 -206217 -227101 -315324 -525360 -476511 24605 65475 -112281 -71177 -103521 -111948
1302 -111948 -88128 -36886 -6366 -187538 -253490 -118754 8122 -254575 -316722 -232270 37051
1291 37051 59387 -180520 -174043 -265745 -542366 -509183 -168366 -71144 -3194 118649 116837
1280 116837 -271258 -1305 -223711 -91828 160891 204983 12663 -108808 315155 101801
1270 101801 90068 243942 178293 -151578 169844 -149088 -244624 -245437 -178741 136070 140484
1259 140484 340538 213786 -132212 -485122 -83985 101577 -372878 -123188 -199557 -191217
1249 -191217 -333229 -450376 -400559 -365096 -434795 -479740 -228448 -217477 -83529 -73369 -101972
1238 -101972 -95404 153219 48042 -145897 147693 356555 110442 28494 59817 205583
1228 205583 118578 148973 29793 -75652 -128746 -614 81809 148258 50053 -110612 -297917
1217 -297917 -669579 -481730 -91236 -228249 -512941 -436299 -273201 -155973 -224768 -530405
1207 -530405 -113942 -33492 -18774 -197056 -146414 -43389 -91023 103829 -117992 -283360
1197 -283360 -180894 -46900 -164614 -529987 -428726 -211389 141004 207635 34215 -74654
1187 -74654 -56222 135784 116954 42655 124690 233633 1309 167665 78241 84290 -25511
1176 -25511 31517 124865 306880 668445 265914 21975 -148272 -25592 143040 -80263
1166 -80263 -59547 -2342 -120047 -5315 -6366 -161298 -94595 -293754 -407422 -120487 140530
1155 140530 -304124 -177606 -25188 45440 -28277 94237 -107126 58520 11201 -126508
1145 -126508 -179058 181328 -70731 -20153 56856 32941 266893 393034 128130 -209210
1135 -209210 -39447 -321245 -152311 238914 240228 -25734 -155571 -152849 -194183 -294299 -6499
1124 -6499 25410 -115414 -9035 29192 -85429 72974 113930 10987 7882 172824 149628
1113 149628 646471 555357 263964 197042 -30807 -177039 -102361 -202260 73791 94382 -270096
1102 -270096 -298017 -271745 -351978 -304700 -31258 -3301 145282 196302 266796 -125760 -151617
1091 -151617 -330150 -302878 156636 246879 -73348 -396774 -108181 -271270 -282570 -63801
1081 -63801 -273658 -338430 -169859 20844 121638 -203250 -13874 -105521 -184341 -166457 -257504
1070 -257504 -297519 -559967 -357061 -176434 -217034 -294521 -20015 -241148 -261104 378560
1060 378560 412574 59987 -129591 40163 142406 456299 354257 240480 -146618 -327910
1050 -327910 -280276 57642 69328 -155731 -199667 -113706 -116708 -116191 -175263 -348032 -202105
1039 -202105 -271178 -159301 238721 251215 -11410 146451 112852 -29208 -74019 -45865 -235495
1028 -235495 -358194 -318593 -106918 -40839 -41137 -50351 -108549 -66883 -1521 251443 226803 126599
1016 126599 119101 95021 -25817 -244888 236366 431186 183899 -8021 148991 65290
1006 65290 16723 93166 -35111 63220 89605 -115244 -360502 -200354 -244168 52954 333200
995 333200 -140711 -200184 -309517 -369837 -158628 -190025 -39359 246849 -185134 -384967
985 -384967 -383859 -438040 265781 217362 109372 -204704 -355971 -410314 -566208 -451774 -130173
974 -130173 -47985 1549 60662 79219 -433777 -617593 -458571 -500377 -454608 -222781 -8866
963 -8866 -200982 -201215 -245961 -220459 -127031 9803 32474 -68486 -1536 -313023 -348315 -298373
951 -298373 -314905 86603 59939 23384 -337930 -349422 -156960 192917 13878 132521 -69219
940 -69219 93893 -92127 -24599 -88618 -75424 -216462 -497353 -200998 -100037 -270920 -58575
929 -58575 152691 172690 57587 -125951 -64940 116738 71568 -129220 29346 102613 267272
918 267272 207149 59473 91306 2295 -371546 -154626 29593 86430 51291 -61379 72985
907 72985 28747 -131248 185346 361106 424290 319043 267437 169796 219931 227008 65686
896 65686 -58673 -1649 20890 86877 413174 65112 -137185 -62421 -14354 222433 210385
885 210385 417346 383695 517061 418071 275143 570861 455362 254111 214439 32642
875 32642 135654 281220 613641 207316 207622 399729 545688 403189 194100 359258 -64988
864 -64988 -242259 44335 -106465 -97785 235064 299040 204948 216180 478852 253111 93002
853 93002 -52466 251133 75446 -92349 -212066 -391585 -251338 172313 83892 -79420
843 -79420 206326 190793 164490 261376 136860 -127012 49815 30189 -135593 -489182 -532959
832 -532959 -277652 143650 124963 -80406 -398603 127743 426349 152638 88818 85818 -41393
821 -41393 -314586 -279138 -270344 171494 367679 171746 119273 221835 65365 167254 -80983
810 -80983 -165361 -202724 -325222 -17076 -151293 -347909 -63261 -121249 -14379 163632 -227127
799 -227127 219755 52896 -102249 -225815 -269494 -444609 -339303 -30387 42313 108866
789 108866 7361 98750 125547 -9795 -172074 -34488 -17017 -11021 -36399 -2711 99715
778 99715 -2131 9755 91230 45093 -215032 -92976 136574 -221708 -342646 -312212 -263754
767 -263754 -100653 -71167 -22201 164812 -8009 3335 -13072 104110 161761 150211 81874
756 81874 -129786 -34206 -183374 -181915 188993 393294 228769 17647 -337530 -266712 40089
745 40089 -150291 -65194 -200623 -373853 -242472 -53137 -113281 -136860 -244193 -274146 -152171
734 -152171 68002 -118926 -334402 -494669 -163053 -105213 165261 -86560 63293 -33202
724 -33202 -216337 -256263 -281247 -142825 -184786 -39703 139937 23348 98079 193807 141416
713 141416 32978 -107 -192485 -141160 119092 -54446 -9334 -371096 -206132 185033
703 185033 133887 215966 316946 317806 246439 15229 36558 26037 107384 242192 44943
692 44943 -72115 -179120 -27929 -117143 -252594 142811 161656 166798 117494 65773 -80436
681 -80436 -252250 -345974 -19211 329585 206057 -110540 -154992 -231497 37080 229352 233272
670 233272 70893 166709 -172859 -235227 -64051 -153120 -161565 236189 -141327 -293701 -373230
659 -373230 -372514 -445215 -344463 -69104 60555 120586 66576 -55910 -248710 -38108 292076
648 292076 132080 -201902 -189542 24223 260533 243006 203384 287130 188129 -39693 -87625
637 -87625 9284 -159686 -225175 -481932 -265749 -106630 -541822 -289107 -43419 -11812 -115323
626 -115323 -170387 -286130 -374915 -212354 -192823 -93575 228869 -38829 -428258 -139739 -14565
615 -14565 160683 233959 210396 -54648 -370116 -87271 -9140 -29075 -77807 -37698 184475
604 184475 23264 -24425 -135700 -264925 -216604 4648 332392 167216 309247 52640
594 52640 -61793 -126686 -164134 -83485 -31605 -175860 -64910 -120120 -199295 -311721 80869
583 80869 227397 326728 338803 176781 118017 80552 15741 27832 -142720 -105983 -53005
572 -53005 284845 144216 -25039 238447 343717 112121 -30108 374626 209477 -74313
562 -74313 -199855 98046 159606 -14154 -165925 29202 285793 553434 478286 296528
552 296528 17930 208404 67666 -11507 336584 -82880 62111 189405 104543 -109694
542 -109694 -62738 -140344 -178347 -238911 -157210 55405 -47690 -135165 -89433 202651 204479
531 204479 52510 403834 571880 230736 211265 269887 74420 -104771 -23370 -131039
521 -131039 -172793 -86939 -156027 -107895 -36875 33246 252260 407450 65895 -83119 210405
510 210405 68842 -115279 147558 361902 278437 139602 25129 152400 -12089 -201787
500 -201787 -153066 26460 -4416 -50934 -247956 -258245 -359340 -392745 -341230 -129216 -165068
489 -165068 -315320 -191722 -88719 -115785 -96517 -337746 -280845 67382 -10106 -15441 -32463
478 -32463 -70097 -341385 -132819 118165 34233 99789 177171 99958 -117334 -13181 -86862
467 -86862 -7189 92300 -124231 -18471 106644 -57396 -47427 265971 78711 -63200 83808
456 83808 510101 227635 41482 -124555 -240002 -2439 -120917 -74684 -11152 -82522 78426
445 78426 193117 222129 221458 -60109 103587 -15098 -15493 -147678 -8800 332153 287601
434 287601 14437 150367 142128 134244 143337 385951 -47597 -229504 -150140 -405184 -140662
423 -140662 -257629 -125393 97034 244344 148613 46472 87078 59422 -112966 89774
413 89774 194890 92870 154508 7724 51418 212430 42246 299212 258576 -1040 -23234
402 -23234 -50251 -78662 10044 144470 358875 248583 272237 355566 164308 -66397 -194579
391 -194579 -172662 -96291 -379304 -72872 134912 482830 379683 211507 312670 254097
381 254097 568005 646724 394678 238759 158987 -5139 -125772 -76775 12440 -309133 -248556
370 -248556 -294586 -6181 325492 399679 361293 340495 -149763 24869 137403 -37336 91957
359 91957 -11942 65391 65470 -42120 113782 115621 301468 394298 100719 83374 10695 80622
347 80622 30490 57068 -31880 -76131 -223153 -94365 205497 37536 91370 194442 390175
336 390175 244994 226984 266120 194022 -49217 368650 91545 6550 -14848 -228639 51466
325 51466 122262 268925 9272 73267 8259 138128 61265 -14653 29767 314430 335840
314 335840 146454 206989 164662 439295 263485 78600 121365 21059 199002 268706 559472
303 559472 407159 215749 109608 139873 295495 231101 -110159 -3248 -84198 210553
293 210553 -80837 -89994 -196320 -73335 167785 -195088 220594 364474 214317 48880
283 48880 50433 252732 247513 280667 367659 165979 282807 228725 312496 -8394 168626
272 168626 342803 352980 305271 184147 -17717 54394 159189 602046 321989 -44596
262 -44596 235658 322856 249827 32350 -223054 -92505 219182 246034 107063 263170 124413
251 124413 -20690 87573 49551 230059 71558 21798 -26501 211705 185134 24694 82256
240 82256 201925 333937 368789 88294 -5232 154413 192697 133988 82602 93719 -7917
229 -7917 -65757 -220583 -274337 85359 105451 -100829 -256555 -99421 89413 -20713 -182159
218 -182159 136501 444679 380601 261539 203567 152480 87642 79576 149906 151405 174662 61426
206 61426 104667 22428 -2931 52003 181116 307892 273709 111615 227569 149048 142510
195 142510 288801 213359 257378 181100 216809 176643 205713 175883 234846 292283 -1004
184 -1004 122261 120201 -15630 331443 189900 53249 83553 57552 -19852 127540 155301
173 155301 -14638 15706 33495 69880 347524 335784 120713 29260 2912 -220203 -96550
162 -96550 26123 91105 85846 240417 100462 406827 511283 269857 172306 326815 378870
151 378870 158241 145846 239933 149320 407617 416911 612467 421181 485670 554125 721901
140 721901 508184 369960 370344 84007 278671 407438 210890 -82388 -79245 -159055 108122
129 108122 44151 169647 3243 -38137 -157548 -363612 -227311 82871 68201 63773 23795
118 23795 -4739 23001 94781 244898 213487 163729 317857 204530 207819 -112184 152747
107 152747 402268 327561 177467 177508 181347 172971 240927 333328 157112 78117 2882 -131749
95 -131749 -114226 256723 281315 209195 349896 434330 339851 173014 240346 70972 137224
84 137224 158102 112263 265857 125133 168413 165992 152379 -147821 -195014 -22320 39899
73 39899 194464 180632 312439 205986 20523 112199 146287 75968 210699 244001 399759
62 399759 380283 230985 172989 -123089 -5949 61397 139500 19732 -123840 42633 8533
51 8533 69390 -24924 282777 329644 206628 249665 74782 -6993 65317 114198 420773 408835
39 408835 457613 312122 393162 403076 306569 227645 336622 400665 405796 515149 473183 187171
27 187171 134906 177546 70823 22928 -2154 65939 126973 109632 46319 177147 143447 -17737
15 -17737 -70578 -70611 143470 415326 435901 253957 150589 274585 124695 221717 268048 64248
3 64248 54621 90923 173409
0 173409
$$ Imaginary data points
##PAGE= N=2
##DATA TABLE= (X++(I..I)), XYDATA
16383 -2974850 -3041986 -2941917 -3009673 -2761558 -2631766 -2591103 -2495539 -2632209 -2490594 -2557568
16373 -2557568 -2830691 -2746186 -2521564 -2389613 -2220522 -2337989 -2198159 -2108067 -2180055 -2212811
16363 -2212811 -2171655 -2316459 -2290577 -2191181 -1962448 -2043360 -1926686 -1808672 -1844030 -1954622
16353 -1954622 -1806738 -1698003 -1553961 -1402202 -1357870 -1356464 -1429172 -1302474 -1414459 -1074211
16343 -1074211 -1024304 -1100538 -1017122 -772145 -905506 -1071198 -964938 -1034707 -960727 -910003
16333 -910003 -687995 -495388 -469593 -422704 -507840 -528961 -471695 -433556 -464765 -505086 -342729
16322 -342729 -54637 93470 357312 240826 112143 169626 311119 89275 -37888 104798
16312 104798 353290 488429 360447 400775 526503 767978 724719 579425 692975 813315
16302 813315 940442 950035 897457 833650 944268 967621 965344 1238783 1279391 1088878 1112849
16291 1112849 1082173 1003011 1226860 1259790 1450661 1323999 1596570 1530446 1463052 1352221
16281 1352221 1577229 1734562 1750858 1799988 1915526 2026717 1874006 1907919 2036438 1994011
16271 1994011 2158933 1992501 1725281 1739733 1582411 2075234 2160559 1917258 2083627 2199404
16261 2199404 2359359 2441895 2242310 2115818 2278185 2569355 2578118 2771711 2699711 2673568
16251 2673568 2646022 2640226 2822093 2768378 2774182 2745707 2667004 2698604 2812451 2918886 2727810
16240 2727810 2757172 2968910 2943799 2982682 3012577 3133034 3135276 3217351 3182066 3248222 3271507
16229 3271507 3172054 3394228 3079667 3037558 3129686 3369511 3367700 3268957 3017569 3052908 3184685
16218 3184685 3259584 3208336 3400904 3565305 3501746 3725071 3762520 3644260 3451777 3730996
16208 3730996 3850010 3938209 3713422 3529719 3653775 3826954 3961326 3497065 3654449 3471692
16198 3471692 3729080 3909928 3802538 3563796 3818536 4299267 4251577 4203509 4185440 3997087
16188 3997087 3800385 3833128 3949588 4518264 4417837 4489073 4303453 4096591 3974756 4021738
16178 4021738 4312983 4052149 4358068 4532157 4117121 4183111 4453727 4299903 4115444 4127902
16168 4127902 4114854 4104208 4061558 4029167 4102399 4571916 4328013 4509293 4384334 3910355
16158 3910355 3878582 4189951 4340565 4591889 4442400 4158003 3841386 4118723 4262137 4561598
16148 4561598 4744719 4572739 4622169 4683847 4832675 4579915 4478472 4390721 4457684 4703222
16138 4703222 4345620 4114022 4704805 4452517 4388127 4542172 4512826 4705236 4693913 4606187
16128 4606187 4914052 5050713 5015068 4743082 4642247 4794276 4372334 4507819 4611485 4628239
16118 4628239 4427452 4679688 4864660 4684983 5063763 4953450 4932934 4962002 4907095 4989429
16108 4989429 5038925 4934583 4687337 4866114 4866916 4782342 4875370 4746314 4886652 4687785
16098 4687785 4621189 4699448 4566979 4579960 4904136 4609481 4496444 4541690 4794492 4804829
16088 4804829 5018440 4881456 4897589 4922738 4769610 4683146 4475840 4540519 4879664 4909773
16078 4909773 5297636 5150541 5080556 4762489 4743552 4767204 4695507 4794728 4708033 4851537
16068 4851537 4581621 4479331 4382425 4279057 4538884 4837245 4727907 4845135 4843152 5057918
16058 5057918 5247334 4709977 4609672 4746263 4874855 5132172 5080473 5348863 5201514 4939336
16048 4939336 4795969 5010291 4894027 4986361 5075742 5179692 5224821 4930636 5027292 4995225
16038 4995225 4746018 4947236 5116493 5268088 5071620 5546946 5583814 5264337 5075535 4792017
16028 4792017 4574204 4753221 4633956 4537907 4629180 4770394 4819189 4928956 4864186 4995150
16018 4995150 5239372 5069312 5043912 4787600 4917784 5024737 5018967 4805087 4807586 5043086
16008 5043086 4878228 4977588 5030563 5182381 4927140 4957606 5077047 5069728 5101958 4985040
15998 4985040 4856459 5262948 5208444 5073424 5210949 4954739 5032892 5021282 5099560 5178762
15988 5178762 5013586 4965858 5118433 5180432 5570512 5380920 5058992 4725387 4896585 5041027
15978 5041027 5109834 4941438 5063885 5076418 5115716 5140146 5170941 5338175 5242406 5118959
15968 5118959 5017813 5189243 4939548 4918246 5099972 5015596 4963777 5106523 5032002 4717293
15958 4717293 4648802 4653744 4757312 4723402 4749839 4841208 4976025 5052266 5184746 5162024 5401481
15947 5401481 5253728 4958557 4914198 4840186 4978378 4982788 4946537 4682818 4579008 4705382
15937 4705382 4734921 4798436 4869439 5050051 5123540 4734837 4717508 4748930 4708145 4731545 4947101
15926 4947101 5063824 5474424 5416025 5164126 5091478 5172375 5098739 5085710 5050784 5125181 5173271
15915 5173271 5107643 5420186 5389598 5028606 4773081 4936839 4997202 5117612 5265442 5401661
15905 5401661 5079152 4870900 5036260 4932672 4921448 5261429 5070817 5069883 4843389 4794451
15895 4794451 5020286 5173939 5088679 4969235 4929845 5200628 5243555 5077717 5089285 4937039
15885 4937039 5000406 4897518 4915000 5098318 5131899 5127686 4935177 4974630 4879504 4896682 4938479
15874 4938479 4935700 4760322 4867344 4767043 5113733 5355338 5196624 4875665 5068633 5265362
15864 5265362 5009898 4861612 4696022 4919912 5045803 5184001 5173135 4682590 4493837 4988434
15854 4988434 4705202 4591005 5084132 5044772 5203757 5169839 4929077 5007182 5064606 5133721
15844 5133721 5220392 5255010 5305862 5383787 5177256 4876249 4738155 4852597 5022795 4972982
15834 4972982 5103550 5395407 4991129 5190061 5139101 5275457 5029337 5232737 5002546 5055235
15824 5055235 5030105 5033677 5019364 5257327 5121062 5082300 5186050 5260556 5051290 4690685
15814 4690685 4750194 4876793 4944164 4921323 5011899 5052896 5146003 4931504 4923760 4985714 5106185
15803 5106185 4964333 4858952 5018822 5199672 4954038 5148126 5142905 5025376 4896651 5003721
15793 5003721 4794718 4805866 4742519 4446712 4720930 4878689 5115811 5472648 5633671 5600561
15783 5600561 5248148 4994641 5088767 5188986 5279803 5129285 5388697 5020139 4754091 5072204
15773 5072204 5228124 4983224 5044673 5218159 5162431 4958180 5048438 4948790 5057245 5154570
15763 5154570 5110496 5214135 5184987 5363596 5209362 5178968 4945490 5083776 5064651 4960232
15753 4960232 5037131 4953761 4822890 4935687 4965351 5243608 5287141 5174496 4970746 4935886
15743 4935886 5157689 5176242 4786736 5230757 5560636 5504191 5558632 4957153 4804060 4830779
15733 4830779 4805938 4922079 5130270 5208408 4929536 5075029 5014941 4868761 4757000 5046142
15723 5046142 5179327 5117801 5417986 5424004 5179592 4918239 4948552 5280382 5411162 5343125
15713 5343125 5063527 5293679 5364536 5154941 4774992 4631439 4826607 5019517 5180869 5153858
15703 5153858 5073512 4959239 4889765 4824510 4971443 5091764 5095680 4869220 5123112 5192223
15693 5192223 4878791 4953777 5119626 5055932 5117929 5331198 5308758 5339224 5215896 5337814
15683 5337814 5247240 5232241 5199290 5094421 5119520 5319567 5193846 5045553 4857421 5111976
15673 5111976 5101416 4841202 5118518 5167587 5391130 5380328 5231749 5287414 5406446 5041348
15663 5041348 4774485 4891250 5032066 5254000 5271208 5109247 4779268 4777700 5076402 5056306
15653 5056306 5086548 5354037 5177938 5011482 5053993 5084378 5233453 4844207 4988114 4828934
15643 4828934 5142405 5224907 4833619 5077030 5164620 4937090 4930088 4959647 5067201 5195289
15633 5195289 4967364 5032980 5156541 5159269 5237016 5147127 5237555 5301883 5702798 5347291 5117692
15622 5117692 5187200 5072807 5041534 5023619 4704873 4815598 5074782 5513282 5319777 5091169
15612 5091169 5333141 5753375 5603002 5349878 5256478 5070494 5066862 5148158 5091467 4996530
15602 4996530 5216798 5268432 5267639 5436519 5442937 5402468 5158026 4980737 5231643 4851493 5050292
15591 5050292 4678875 4906785 5193109 5225065 5365685 5359917 5051800 5167603 5248554 5014715
15581 5014715 5198431 5271503 5193050 5292951 5183663 5005769 4909048 5232460 5360255 5194658
15571 5194658 4963415 4422393 4786630 5003732 4942896 4999809 4882131 4864980 4947956 4872963
15561 4872963 5097215 5309577 5237412 5286620 5090521 5078050 5002503 5024828 5301500 4884541
15551 4884541 4779078 4815109 4874622 4924660 4844622 4649814 4618484 4899487 5078557 4953322
15541 4953322 4933737 4873775 4876825 5112302 5012258 4844739 5110580 5035085 4957084 5175275
15531 5175275 5157399 4760495 4789236 5116213 5159061 5327895 5333220 5162053 5114853 5306748
15521 5306748 4993568 5208741 5132699 4989465 5363938 5068700 5296616 5285202 5348805 5424354
15511 5424354 5149684 5181850 5235369 5356368 5360470 5384304 5062699 4874093 4817265 5150614
15501 5150614 5422536 5151177 4707426 5139537 5202578 5137932 5292719 5421976 5296705 5155803
15491 5155803 4798871 5107998 5340155 5251516 5106266 4819104 4988741 5414871 5683387 5540670
15481 5540670 5250843 5242819 5322939 5390643 5066039 4972728 5062096 5197574 5442192 5154718
15471 5154718 5329258 5280596 5192920 5046486 5025252 4928642 5203898 5088122 5182248 5182844 5238209
15460 5238209 5489179 5250652 5255935 5284552 5265495 5486296 5365934 5168443 5128742 5164356
15450 5164356 5206250 5238600 5392815 5277862 5677193 5553559 5251057 5160244 5340464 5601728
15440 5601728 5463990 5429808 5383085 5400382 5194937 5348866 5272290 5168764 5021452 4754061
15430 4754061 5219022 5494491 5428416 5393419 5162153 5248354 5120757 5213504 5428219 5090576
15420 5090576 5208651 5473066 5369749 5175068 5350848 5358425 5340927 5395112 5382859 5349539
15410 5349539 5321598 5160874 5168760 5400950 5613711 5514204 5362824 5397168 5410076 5345448 5366501
15399 5366501 5314689 5306462 5256836 5338709 5407128 5120399 5214850 5036985 5122246 5343211 5182845
15388 5182845 5436658 5457324 5316791 5400455 5408397 5466046 5527998 5089127 5145436 5361517 5288093
15377 5288093 5245212 5193244 5418446 5323871 5324404 5233205 5302377 5371634 5339223 5377979 5204152
15366 5204152 4996590 5309130 5665677 5956838 5547065 5213642 5252680 5332954 5007477 4943988
15356 4943988 5001445 4841755 5009465 5261343 5183592 5246134 5122275 5074070 5326310 5263272
15346 5263272 5500343 5740375 5443754 5098871 5163474 5196192 5278154 5436423 5166170 5221462
15336 5221462 5456514 5387826 5382431 5290331 5593014 5636724 5401308 5656682 5535439 5575363
15326 5575363 5555703 5373468 5577803 5619916 5296250 5562162 5659740 5623880 5690204 5545382
15316 5545382 5540259 5795774 5417728 5064255 5274538 5320376 5199404 5381225 5425160 5500686
15306 5500686 5531931 5533218 5390545 5205656 5353282 5306143 5583627 5441539 5148908 5020227
15296 5020227 4921551 4797860 5140633 4944007 4885093 5219125 5334606 5387778 5165341 5061113
15286 5061113 5173976 4988862 5068799 5312892 5352138 5100873 5220156 5480340 5273045 5248632
15276 5248632 5501093 5565981 5385891 5382463 5758315 5573301 5763395 5512608 5474803 5725212
15266 5725212 5756245 5442659 5400684 5210916 5215326 4964310 5250590 5248820 5155989 5162451 5182380
15255 5182380 5196972 5328185 5383893 5443331 5363904 5750277 5728956 5565718 5500975 5423805 5539109
15244 5539109 5154224 5049715 5193819 5281625 5356874 5117091 4916372 5033765 5074607 5542121
15234 5542121 5428202 5236231 5176490 5312476 5311406 5536258 5170557 5224902 5122630 5268050
15224 5268050 5599630 5808095 5460651 5393273 5346080 5303602 5293087 5267107 5488243 5634530
15214 5634530 5490399 5512793 5359323 5455121 5780367 5670851 5666660 5344755 5222458 5363666
15204 5363666 5299686 5473009 5449608 5465392 5580212 5570522 5484971 5440786 5498173 5233033 5467823
15193 5467823 5464823 5747092 5870441 5765638 5745795 5546035 5835441 5435266 5249804 5161387
15183 5161387 5237386 5274048 5279794 5272501 5408096 5237480 5097022 5071357 5396839 5847403 5824116
15172 5824116 5366232 5268886 5378584 5328352 5264516 5271160 5516731 5607763 5498626 5475710 5622897
15161 5622897 5584839 5389350 5263266 5562057 5500790 5612444 5871082 5615260 5526079 5628181
15151 5628181 5460440 5282289 5323166 5588676 5424068 5526171 5183076 5393237 5410413 5404290
15141 5404290 5590253 5412873 5721461 5618962 5295115 5345274 5488815 5621135 5655368 5494139
15131 5494139 5345123 5125524 5331192 5094746 5175247 5492227 5582898 5530569 5508682 5483290
15121 5483290 5759439 5422452 5452478 5539388 5578958 5187076 5144954 5139403 5124632 5383786 5575694
15110 5575694 5619621 5242314 5116056 5195485 5546475 5680382 5447760 5436046 5635523 5346339
15100 5346339 5389578 5253980 5249032 5523702 5759038 5441934 5465776 5467235 5247834 5168838 5550654
15089 5550654 5485093 5285626 5468019 5360650 5001749 5307687 5258264 5317446 5367734 5515625
15079 5515625 5371424 5406067 5358793 5553142 5609370 5249611 5575400 5454861 5296012 5651743
15069 5651743 5789349 5727997 5467838 5092017 5366133 5359196 5395457 5595052 5772270 5605031
15059 5605031 5603411 5509496 5349645 5306718 5564445 5817414 5768709 5861433 5418024 5364372 5534799
15048 5534799 5735706 5539410 5596025 5615271 5436169 5265048 5278833 5254046 5493477 5808899
15038 5808899 5760820 5862778 5672358 5712032 5639357 5401318 5419080 5535197 5380545 5493742
15028 5493742 5885917 5712693 5570089 5472136 5356233 5574456 5934868 5992842 5752430 5691431
15018 5691431 5807266 5599036 5616248 5549021 5433038 5517713 5249604 5395026 5610939 5386609
15008 5386609 5670883 5517557 5649801 5702043 5627939 5471233 5631708 5764864 5545153 5449298
14998 5449298 5309725 5293515 4937246 5115664 5159246 5245241 5595518 5511200 5360575 5426363
14988 5426363 5435790 5557475 5375334 5538519 5276135 5500821 5347255 5502319 5283084 5234786
14978 5234786 5354848 5395124 5379784 5310641 5432359 5269305 5147909 5018147 5401917 5707595
14968 5707595 5878559 6036604 5843403 5820387 5693275 5568896 5452980 5367192 5230210 5366801
14958 5366801 5642597 5904426 5808303 5578987 5650598 5504522 5563912 5503302 5580127 5791037
14948 5791037 5668736 5531625 5658620 5624235 5647312 5698300 5659829 5648901 5432552 5427212 5446358
14937 5446358 5584581 5514176 5540615 5564792 5698606 5820713 5675490 5570820 5789079 5450382
14927 5450382 5319745 5505307 5626225 5743572 5870730 5680094 5468664 5704336 5736032 5899591
14917 5899591 5735591 5575852 5399676 5565267 5553826 5677612 5395984 5638213 5531820 5315723
14907 5315723 5371140 5300098 5564751 5813903 5754583 5617235 5939159 6051249 5626446 5729823
14897 5729823 5539782 5633976 5874191 5811447 5899896 5940822 5965397 5799327 5805912 5760891 5767722
14886 5767722 5761396 5675987 5362576 5582511 5558837 5402785 5652588 5638985 5415418 5496481
14876 5496481 5360318 5300202 5150301 5255767 5449938 5698548 5814261 5724105 5765697 5822046
14866 5822046 5968524 5437898 5166807 5726103 5877096 5812957 5836102 5381248 5483205 5514391
14856 5514391 5653003 5667788 5403259 5299269 5428501 5351774 5721638 5626757 5504214 5558439
14846 5558439 5382606 5558568 5440609 5786200 5751897 5438558 5431513 5524287 5740636 5633505
14836 5633505 5503781 5430189 5893016 5717599 5831252 5484595 5364601 5769409 5773258 5910631
14826 5910631 5892385 5647717 5570605 5607167 5638286 5782221 5599321 5694199 5842648 5662601
14816 5662601 5478688 5429900 5469970 5826446 5737386 5529993 5731015 5505647 5621253 5863902
14806 5863902 5800082 5648542 5436010 5514718 5702207 5630427 5527946 5745147 5759495 5469139
14796 5469139 5705756 5800832 5599781 5635706 5529374 5540799 5718344 6036777 5736875 5617280
14786 5617280 5781914 5682805 5687863 5730247 5872631 5584538 5517771 5715572 5638628 5528405
14776 5528405 5558840 5763418 5473992 5530181 5387082 5556477 5578868 5699969 5742120 5611590
14766 5611590 6096049 6065793 5894669 5936931 5582384 5757988 5646748 5588545 5741299 5651971
14756 5651971 5415202 5590183 5557979 5830334 5853661 5556734 5573161 5556189 5789601 5900862
14746 5900862 5769806 5632491 5410108 5422234 5411343 5889806 6026346 6246263 5995744 5665853
14736 5665853 5647042 5288433 5506974 5741323 5605372 5133205 5184381 5391343 5708233 5718735
14726 5718735 5864061 5750415 5763589 5742409 5627956 5891279 5871604 5802329 5601193 5316059
$$ [...]
##END NTUPLES=NMR SPECTRUM
##END=
