##TITLE=1H_EC-3293(II-3)
 CDCl3
 8 sc, 
 11.4.2023
##JCAMPDX= 6.0         $$ Bruker NMR JCAMP-DX V2.0
##DATA TYPE= NMR SPECTRUM
##DATA CLASS= NTUPLES
##ORIGIN= UXNMR, Bruker Analytische Messtechnik GmbH
##OWNER= root
$$ XWIN-NMR		Version 3.5
$$ Tue Apr 11 14:04:57 2023 Russian Standard Time (UT+4h)  she@DPX200
##.OBSERVE FREQUENCY= 200.13135
##.OBSERVE NUCLEUS= ^1H
##.ACQUISITION MODE= SIMULTANEOUS
##.ACQUISITION SCHEME= undefined
##.AVERAGES= 8
##.DIGITISER RES= 18
##SPECTROMETER/DATA SYSTEM= spect
##.PULSE SEQUENCE= zg30
##.SOLVENT NAME= MeOD
##.SHIFT REFERENCE= (INTERNAL, MeOD, 0, 15.7436)
##AUDIT TRAIL= $$ (NUMBER, WHEN, WHO, WHERE, WHAT)
$$ ##TITLE= Audit trail, XWIN-NMR		Version 3.5
$$ ##JCAMPDX= 5.01
$$ ##ORIGIN= Bruker BioSpin GmbH
$$ ##OWNER= she
$$ F:/spectra/data/she/nmr/H-F/1/pdata/1/auditp.txt
$$ ##AUDIT TRAIL=  $$ (NUMBER, WHEN, WHO, WHERE, WHAT)
(   1,<2023-04-11 14:03:45.70 +0400>,<she>,<DPX200>,
      <created by zg, POWCHK disabled, PULCHK disabled
       configuration hash MD5:
       00 E9 B6 7A A2 85 ED C7 34 08 36 98 17 FE 4E 26
       data hash MD5: 16K
       ED 0C 82 84 CA 42 D6 F9 08 5E F2 89 2E D6 6C 3C>)
(   2,<2023-04-11 14:03:48.15 +0400>,<she>,<DPX200>,
      <Start of raw data processing
       efp BC_mod = 2 LB = 0.24 FT_mod = 6 PKNL = 1 PHC0 = -19477.1 PHC1 = 18.0008 SI = 16K 
       data hash MD5: 16K
       25 12 AE A2 97 7F D9 D3 91 BC 80 49 1E 3D A8 59>)
(   3,<2023-04-11 14:04:06.76 +0400>,<she>,<DPX200>,
      <pk PHC0 = 2.347724 PHC1 = -3 
       data hash MD5: 16K
       05 BA 3A 17 CF 2C 90 75 10 D8 59 68 15 2C BD AB>)
(   4,<2023-04-11 14:04:10.04 +0400>,<she>,<DPX200>,
      <abs ABSG = 5 
       data hash MD5: 16K
       98 49 4D B4 1B 53 AB 48 F4 ED 8A B4 69 3B 04 88>)
$$ ##END=
$$ 
$$ hash MD5
$$ 73 79 B2 7C 1A 97 A7 A6 3E AC CC 43 CE EA 15 43
##$RELAX= 
##$RELAX= 
##$RELAX= 
##$RELAX= 
##$RELAX= 
##$RELAX= 
$$ Bruker specific parameters
$$ --------------------------
##$DU= <F:/spectra>
##$EXPNO= 1
##$NAME= <H-F>
##$PROCNO= 1
##$TYPE= <nmr>
##$USER= <she>
##$AMP= (0..31)
100 100 100 100 100 100 100 100 100 100 100 100 100 100 100 100 100 100 
100 100 100 100 100 100 100 100 100 100 100 100 100 100 
##$AQSEQ= 0
##$AQ_mod= 1
##$AUNM= <au_zg>
##$AUTOPOS= <>
##$BF1= 200.13
##$BF2= 200.13
##$BF3= 200.13
##$BF4= 200.13
##$BF5= 200.13
##$BF6= 200.13
##$BF7= 200.13
##$BF8= 200.13
##$BYTORDA= 1
##$CFDGTYP= 0
##$CFRGTYP= 5
##$CHEMSTR= <none>
##$CNST= (0..31)
1 1 145 1 1 1 1 1 1 1 1 1 1 1 1 1 1 1 1 1 1 1 1 1 1 1 1 1 1 1 1 1 
##$CPDPRG= <>
##$CPDPRG1= <>
##$CPDPRG2= <>
##$CPDPRG3= <>
##$CPDPRG4= <mlev>
##$CPDPRG5= <mlev>
##$CPDPRG6= <mlev>
##$CPDPRG7= <mlev>
##$CPDPRG8= <mlev>
##$CPDPRGB= <>
##$CPDPRGT= <>
##$D= (0..31)
0 1.2 0 0 0 0 0 0 0 0.06 0 0.03 0 0 0 0 0.0002 0 0 0 0 0 0 0 0 0 0 0 0 
0 0 0 
##$DATE= 1681207425
##$DBL= (0..7)
120 120 120 120 120 120 120 120 
##$DBP= (0..7)
150 150 150 150 150 150 150 150 
##$DBP07= 0
##$DBPNAM0= <>
##$DBPNAM1= <>
##$DBPNAM2= <>
##$DBPNAM3= <>
##$DBPNAM4= <>
$$ [...]
##$SUBNAM3= <"">
##$SUBNAM4= <"">
##$SUBNAM5= <"">
##$SUBNAM6= <"">
##$SUBNAM7= <"">
##$SUBNAM8= <"">
##$SUBNAM9= <"">
##$SW= 18.05172834244
##$SWIBOX= (0..15)
0 0 2 0 0 0 0 0 0 0 0 0 0 0 0 0 
##$SW_h= 3612.71676300578
##$TD= 16384
##$TD0= 1
##$TE= 0
##$TE2= 300
##$TE3= 300
##$TEG= 300
##$TL= (0..7)
0 120 120 120 120 120 120 120 
##$TP= (0..7)
150 150 150 150 150 150 150 150 
##$TP07= 0
##$TPNAME0= <>
##$TPNAME1= <>
##$TPNAME2= <>
##$TPNAME3= <>
##$TPNAME4= <>
##$TPNAME5= <>
##$TPNAME6= <>
##$TPNAME7= <>
##$TPOAL= (0..7)
0.5 0.5 0.5 0.5 0.5 0.5 0.5 0.5 
##$TPOFFS= (0..7)
0 0 0 0 0 0 0 0 
##$TUNHIN= 0
##$TUNHOUT= 0
##$TUNXOUT= 0
##$USERA1= <user>
##$USERA2= <user>
##$USERA3= <user>
##$USERA4= <user>
##$USERA5= <user>
##$V9= 5
##$VALIST= <valist>
##$VCLIST= <CCCCCCCCCCCCCCC>
##$VD= 0
##$VDLIST= <DDDDDDDDDDDDDDD>
##$VPLIST= <PPPPPPPPPPPPPPP>
##$VTLIST= <TTTTTTTTTTTTTTT>
##$WBST= 1024
##$WBSW= 4
##$XGAIN= (0..3)
0 0 0 0 
##$XL= 0
##$YL= 0
##$YMAX_a= 264156
##$YMIN_a= -342460
##$ZGOPTNS= <>
##$ZL1= 120
##$ZL2= 120
##$ZL3= 120
##$ZL4= 120
##$ABSF1= 15.73587
##$ABSF2= -2.315979
##$ABSG= 5
##$ABSL= 3
##$ALPHA= 0
##$AQORDER= 0
##$ASSFAC= 0
##$ASSFACI= 0
##$ASSFACX= 0
##$ASSWID= 0
##$AUNMP= <proc_1d>
##$AZFE= 0.1
##$AZFW= 0.1
##$BCFW= 0
##$BC_mod= 2
##$BYTORDP= 0
##$COROFFS= 0
##$CY= -3
##$DATMOD= 1
##$DC= 0
##$DFILT= <>
##$DTYPP= 0
##$F1P= 0
##$F2P= 0
##$FCOR= 1
##$FTSIZE= 16384
##$FT_mod= 6
##$GAMMA= 0
##$GB= 0
##$INTBC= 1
##$INTSCL= 3.70164e-10
##$ISEN= 128
##$LB= 0.24
##$LEV0= 0
##$LPBIN= 0
##$MAXI= 10000
##$MC2= 0
##$MEAN= 0
##$ME_mod= 0
##$MI= 1.114404
##$NCOEF= 0
##$NC_proc= -7
##$NLEV= 6
##$NOISF1= 3.799351
##$NOISF2= 2.8
##$NSP= 0
##$NTH_PI= 0
##$NZP= 0
##$OFFSET= 15.74358
##$PC= 1
##$PHC0= -19474.75
##$PHC1= 15.0008
##$PH_mod= 1
##$PKNL= yes
##$PPARMOD= 0
##$PSCAL= 0
##$PSIGN= 0
##$REVERSE= no
##$SF= 200.13000559482
##$SI= 16384
##$SIGF1= 3
##$SIGF2= 2
##$SINO= 5.538805
##$SIOLD= 16384
##$SREGLST= <1H.CDCl3>
##$SSB= 0
##$STSI= 16384
##$STSR= 0
##$SW_p= 3612.71676300578
##$SYMM= 0
##$S_DEV= 0
##$TDeff= 16384
##$TDoff= 0
##$TI= <>
##$TILT= no
##$TM1= 0
##$TM2= 0
##$TOPLEV= 0
##$USERP1= <user>
##$USERP2= <user>
##$USERP3= <user>
##$USERP4= <user>
##$USERP5= <user>
##$WDW= 1
##$XDIM= 16384
##$YMAX_p= 322150199
##$YMIN_p= -956485
$$ End of Bruker specific parameters
$$ ---------------------------------
##NTUPLES= NMR SPECTRUM
##VAR_NAME=  FREQUENCY,     SPECTRUM/REAL,   SPECTRUM/IMAG
##SYMBOL=    X,             R,               I
##VAR_TYPE=  INDEPENDENT,   DEPENDENT,       DEPENDENT
##VAR_FORM=  AFFN,          ASDF,            ASDF
##VAR_DIM=   16384,         16384,           16384
##UNITS=     HZ,            ARBITRARY UNITS, ARBITRARY UNITS
##FACTOR=    0.220516191357247, 1,           1
##FIRST=     3150.76272636527, 0,            0
##LAST=      -461.954036640509, 0,           0
##MIN=       -461.954036640509, -956485,     0
##MAX=       3150.76272636527, 322150199,    0
$$ Real data points
##PAGE= N=1
##DATA TABLE= (X++(R..R)), XYDATA
$$ [...]
8760 33455345 34248248 35158130 36039524 36883552 37712017 38307717 38796885 38918011 38549605
8751 38549605 37840816 36752632 35376573 33634748 31737699 29794710 28101793 27056254
8743 27056254 25930699 24918012 24208124 23706273 23180802 22584184 22091081 21559447 21217495
8734 21217495 21100788 20915838 20604669 20476587 20388908 20476943 20769056 20761689 20929575 21169310
8724 21169310 21539771 21919722 22689572 23292725 24051608 24999057 26074920 26775705 27977784
8715 27977784 29004612 30230385 31863367 34258310 36991582 40518662 44386378 49398578
8707 49398578 55908977 64728340 76033975 91365942 111690436 137072524 149384867
8700 149384867 139099643 120974138 98513312 78867723 63789663 53708067 46573254
8693 46573254 41010991 36536163 33272369 30313882 27888169 25633950 23741263 22367271
8685 22367271 21325722 20462988 20106802 19611853 19123036 18876260 18618070 18371539 18272504
8676 18272504 18013422 17798585 17533426 17451109 17394580 17154217 17001128 17010514 17016488 16904445
8666 16904445 16986660 17224607 17661865 18280397 18984206 19350446 19934870 20373285 21033763 21830310
8656 21830310 22471083 22760084 22806107 22834211 22758345 22701009 22735608 22574439 22460774 22424723
8646 22424723 22500838 22440143 22445565 22341919 22587094 22641285 22593878 22677388 22770335 22543135 22302813
8635 22302813 22224440 22276537 22609807 23145231 23734127 24175181 24785967 25613842 26284312 27320666
8625 27320666 28688156 30149652 31305473 31884469 31671954 31128291 30164664 28894279 27955011
8616 27955011 27320760 26948114 26750572 26471088 26157123 25765842 25236372 24764732 24426655
8607 24426655 24228731 23877441 23315550 22716344 22127143 21395284 20666088 20327545 20078674
8598 20078674 19787465 19618440 19733493 19857910 20128726 20542330 20877732 21385620 22032429
8589 22032429 22276520 22091516 21189375 20204765 18987368 17968920 16978967 16134258 15666759
8580 15666759 15041278 14620214 14114576 13528048 12924022 12539207 12146071 11835158 11550938
8571 11550938 11000047 10517590 10044350 9695548 9274277 9046813 8820819 8470953 8291873
8562 8291873 8135956 7993683 7910031 7705149 7641669 7577970 7403955 7008259 6851566 6688695
8552 6688695 6196279 5887295 5708228 5336602 4944257 4640123 4353505 4148625 4082665 3736756
8542 3736756 3346510 3292682 3181378 3071011 2899719 2984837 3060256 2824054 2709583 2754480
8532 2754480 2613864 2675431 2389740 2315014 2288126 2091438 2039274 2105153 2054623 1810942 1784998
8521 1784998 1849530 1643513 1720194 1734726 1872584 1692782 1510001 1567538 1727049 1736010 1610971
8510 1610971 1534042 1579604 1524845 1529371 1674604 1730875 1409427 1171417 1291185 1187067 1049188
8499 1049188 1255797 1304013 1399691 1338244 1115265 1121902 1223148 1224098 1116499 1125282 1151327
8488 1151327 1077083 1089647 1033212 908101 1026965 964867 980566 943415 971635 933924 1090141
8477 1090141 1065020 1168205 1237728 1187997 1040867 981562 1126008 1114752 1125988 1008375 991241
8466 991241 915761 1071286 1050521 1093603 1111958 1022193 1034435 1036756 1195077 1064942 933584
8455 933584 1012134 926772 1066314 1073357 806309 813223 842893 899292 936033 899869 844021 831429
8443 831429 1039355 1161944 968874 967735 966524 968159 933937 860201 795126 910106 865792
8432 865792 713439 839161 815001 719991 700342 683566 653097 610658 712080 666212 644785
8421 644785 801323 968456 1056641 1088957 862389 764776 648919 723499 725243 660599 618233
8410 618233 677220 844820 739445 737837 811256 784318 565288 473372 580937 644972 694709
8399 694709 602299 453981 400194 365808 492973 455839 365229 346572 391097 453974 432849
8388 432849 358557 309809 335789 337648 373545 408165 375724 340696 236635 168219 330957
8377 330957 331728 334685 375049 216967 121861 196205 262819 361066 183940 129193 203638 229341
8365 229341 308147 291712 293426 258605 193229 117813 171039 144890 157885 127669 390336 486366
8353 486366 239188 244751 272344 167966 205260 81657 78186 216080 167646 219522 268460
8342 268460 230100 171684 140913 228498 244723 250580 263179 184268 203667 173824 191983 299982
8330 299982 334999 274228 240938 342195 367406 219322 117731 153637 90050 192249 151434
8319 151434 99159 100376 174085 152092 66870 -2821 -179025 -50244 117706 108920 -50301
8308 -50301 57615 38894 -3422 170912 215710 216572 199775 88587 -29360 -33098 57814 241330
8296 241330 344202 51540 75920 149635 53657 3392 -40719 27489 45897 61686 133255
8285 133255 209773 166469 264620 219049 240584 150466 116144 189741 38914 -25563 103923
8274 103923 -42311 -62219 -33011 41098 30978 -101747 10526 78060 215564 218734 173046
8263 173046 161274 249730 80343 113621 210011 250113 175579 214081 257904 341172 367752
8252 367752 379945 258915 247774 254804 357581 394784 247202 307044 274013 238336 81164
8241 81164 178876 306396 352886 276635 306737 251981 164632 226532 240080 155833 278872
8230 278872 421831 461986 480133 538470 541586 703356 911510 844675 621768 677399 753302
8219 753302 576610 387946 299931 440041 346079 278460 181453 75184 146216 226496 133372
8208 133372 164292 210967 112393 62134 66908 101057 118670 -9992 21034 221098 167870
8197 167870 152495 169563 375843 278049 604940 -792009 -956485 -310767 -423339 -178581
8187 -178581 -61886 -8347 -282504 -106836 -190425 83365 36112 -19871 -213443 -26651
8177 -26651 -125930 -29473 22369 37064 130481 193095 249117 72896 -175386 -140086 -12672
8166 -12672 -113719 -124632 -199489 -164392 6388 -54095 -928 -88128 -115124 -3430 9409
8155 9409 -108698 -199491 -261698 -258211 -198712 -183455 -7015 -93414 -240750 -110258 -139564
8144 -139564 -234600 -81128 -149971 53559 -38851 -9090 -72179 -107674 -19371 -35440 -172862
8133 -172862 -135671 -133776 -143666 -93602 -102718 -118628 -115998 -67938 -27783 44529 -2219 -74935
8121 -74935 -158198 -56922 51670 -2640 -64164 61076 108006 45142 -87751 76527 78149
8110 78149 -39442 -25469 -106571 -50214 20487 -29556 -101939 -146329 57664 109819 -21655
8099 -21655 124199 270621 218094 165257 91612 34505 -67981 -112538 -150190 -189708 -115349
8088 -115349 21438 48235 -78955 18904 -67005 -109431 -57153 -216828 -134585 59497 -61323
8077 -61323 -174061 -186032 -22775 -22857 -125377 -203500 -100858 -161569 -219475 -155205 -156119 -79507
8065 -79507 -91487 -68205 -47373 53574 -40972 76007 157616 -7363 85482 17549 39346
8054 39346 137038 257523 144834 195965 267527 242826 107176 -54692 -6830 3296 -6575
8043 -6575 6877 9012 24568 -8155 -40323 40521 3584 49708 -6795 101487 160504 20373
8031 20373 76482 181832 9555 -53108 -8121 187483 -13273 -52289 97563 -3814 -203192
8020 -203192 -210369 -80365 -37146 -21203 22512 -172294 -187791 -152707 -183160 -141886 -30998
8009 -30998 29443 -199014 -222979 -316346 -128039 -17282 4595 -61276 -62220 -113588 101879
7998 101879 109720 50020 73402 36879 138732 -21418 -74821 -85009 -75295 -129775 -127762 -135843
7986 -135843 27057 -215287 -125158 -146370 -165908 -25430 -96068 3206 24533 29662 45154
7975 45154 -100452 -112042 8491 51861 -125630 -116601 91956 35719 -113633 -45986 -38359
7964 -38359 -114919 -40376 -36115 -106588 -134751 -13336 -67428 -217868 -280924 -161764 -95795
7953 -95795 9063 5866 69514 -27151 -48616 -19091 4582 48295 76118 -45629 -56012 43980
7941 43980 -86168 -32083 54809 -85927 -86180 -42181 -132243 -95694 -99626 -68393 -89008 -47382
7929 -47382 23217 -116231 -211594 -71819 -32632 -13149 -6300 81118 -835 -224591 -118572
7918 -118572 -95434 -29989 -81928 -87053 -126937 -196159 -162463 -85366 -185096 -76075 -12626 -28971
7906 -28971 -194931 -176077 -174594 -112689 -65690 -42250 3733 31470 41524 198563 202749 126014
7894 126014 38969 -108964 -37688 6001 49067 100483 37861 -103905 29555 76473 -47255
7883 -47255 -26501 309 -35469 -38042 -100182 -93838 -124216 -156815 -198452 -166992 19591 17736
7871 17736 71241 239232 74774 -32755 -12931 14724 -60519 -100344 -48674 16095 50242
7860 50242 20729 162214 49785 47157 230859 175722 55704 17048 -37691 -56644 89303
7849 89303 -1514 -27068 -126727 -58131 49091 64630 1006 70524 80467 177090 255622 151327
7837 151327 -22202 178925 192107 165921 168239 99197 110864 158762 61447 144203 223355
7826 223355 256106 301089 213317 260485 406168 419605 319242 322069 507425 416356 307953
7815 307953 289758 310319 280865 352135 366459 421607 503368 504829 476374 481817 332276 526649
7803 526649 503019 622572 671813 512503 630517 439201 534116 548768 547189 568481 579368
7792 579368 603555 702405 726735 822154 813278 787120 878871 1045667 1095653 1183605 1318483
7781 1318483 1363069 1513403 1679102 1797903 2008209 1965645 2351106 2608475 3050840 3739699
7771 3739699 4326823 4798105 4913558 4956615 4940645 4773370 4810907 4682382 4939069 5247154
7761 5247154 5308458 5180704 4845119 4459550 3883172 3388208 2854992 2695192 2500482 2262724
7751 2262724 2251610 1829142 1722942 1732963 1692427 1636047 1544037 1620867 1682589 1484735 1542477
7740 1542477 1377188 1312992 1465635 1358671 1430511 1371693 1335460 1432597 1325732 1168796
7730 1168796 1299492 1327193 1272714 1335915 1216905 1160492 1329175 1444948 1394327 1475757 1518895
7719 1518895 1502819 1600685 1620689 1698339 1852168 1978683 2068580 2215121 2310317 2373178 2589932
7708 2589932 2688101 2791125 3043270 3293269 3399437 3625384 3925470 4462847 4887318 5480885
7698 5480885 6493350 7456657 8529064 9930484 11301101 11895070 11977701 11619330 11318476
7689 11318476 11062297 10809012 10858932 11522819 11968656 11711428 10920794 10057996 8910262
7680 8910262 7393414 6197003 5517406 4701904 4266072 3911745 3509796 3237107 3033111
7671 3033111 2792420 2625485 2595989 2417377 2321419 2180401 2092486 2068761 2081459 2018116 1858766
7660 1858766 1836353 1773685 1893904 1907404 1898573 1839794 1810118 1751131 1676724 1735428 1640384
7649 1640384 1753009 1690632 1628382 1645820 1647876 1686697 1575110 1457238 1379167 1398166 1506510
7638 1506510 1645610 1794774 1749051 1667151 1610367 1671577 1648664 1622323 1744134 1742556 1807199
7627 1807199 1793061 1949147 2112802 2160675 2112808 2065545 2004276 2199578 2469825 2703525
7617 2703525 2792187 2999231 3314707 3648433 4171303 4633591 5392895 6060302 6815331 8063154
7607 8063154 8890018 9000594 8657203 7786815 6806347 5785519 5091775 4368809 3795650
7598 3795650 3473328 3144176 2890060 2685455 2618268 2405355 2344941 2189967 2269064 2299777
7588 2299777 2172622 2103992 2119179 2198609 2152218 2072265 2227601 2408756 2279234 2221283 2368762
7577 2368762 2595292 2707587 2810835 2786132 3075030 3378454 3497483 3831097 4232538 4662342
7567 4662342 5344788 6107318 7065082 8136276 9177427 9996685 10046031 9335097 8328888
7558 8328888 7207778 6008938 5105179 4357541 3822317 3598101 3348156 3002264 2768575
7549 2768575 2611725 2337281 2211958 2189720 2080084 2146238 2133897 1952678 2178541 2162841
7539 2162841 2265859 2352408 2296404 2446970 2618859 2769603 2966630 3211097 3575232 3699646
7529 3699646 3813750 3522626 3134003 2731669 2336607 2066100 1890331 1841121 1600401 1400928
7519 1400928 1319539 1352394 1283171 1412961 1272935 1231684 1027867 1094034 1218062 1249911 1384293
7508 1384293 1373480 1349356 1397724 1330230 1445585 1300197 1282593 1584602 1508070 1586105 1618105
7497 1618105 1675978 1702998 1820897 1942707 2086974 2170591 2452133 2760287 3142042 3655933
7487 3655933 4172288 4549086 4725809 4533375 4142694 3630167 3138601 2594954 2251684 1884422
7477 1884422 1894120 1683614 1638188 1530850 1458649 1224146 1131124 1183022 1159980 994209 787788
7466 787788 834384 690125 947985 835359 960381 998988 850239 902346 910273 1036698 1016350
7455 1016350 775199 989521 1097659 972259 895214 1103594 1046057 906099 856000 1059290
7445 1059290 1154630 1004039 973498 932898 688090 673151 693990 730281 658640 726250 794365
7434 794365 787688 642004 698455 682008 594522 562835 462399 486122 560084 571331 653670
7423 653670 653652 666053 674131 574811 609636 668884 604923 579765 581890 547016 485805 414369 585084
7410 585084 583467 528245 625427 622976 474545 452432 534074 475849 489314 571013 541468 575118
7398 575118 550449 527918 528000 490254 592331 666028 508389 578927 761561 702680 627708 674249
7386 674249 674251 714833 637070 545321 535572 568241 676011 648481 542422 678147 780347 712694
7374 712694 735742 698446 591037 613481 631902 710764 736237 760293 628402 587192 755909
7363 755909 609259 703048 687199 638993 682588 690934 707874 688081 804894 736001 816675
7352 816675 809006 623353 743273 954909 1000053 1066392 1100181 918052 856532 821565 777350
7341 777350 788570 866665 1023618 908794 922943 913538 978801 1030003 1073290 1193283 1019460
7330 1019460 928391 1076979 1190444 1299261 1174950 1131889 1290806 1329389 1272892 1244829
7320 1244829 1246145 1184861 1372253 1434255 1411989 1591997 1651485 1477148 1407182 1596764 1641291
7309 1641291 1646703 1569073 1700939 1885478 1876561 1953757 1906332 1820567 1938261 2012133 2021557
7298 2021557 2094777 2155930 2207028 2223698 2265000 2303119 2335671 2378114 2387055 2536756 2619322
7287 2619322 2733193 2824236 2751121 2568596 2675374 2666711 2793076 2840889 2672515 2673926 2751723
7276 2751723 2709591 2754040 2810487 2932553 2893072 2983012 2885179 2957332 2981594 3033877 3131929
7265 3131929 3210524 3360919 3338045 3456508 3422337 3546236 3707029 3733676 3709692 3746241 3848915
7254 3848915 4038058 4345072 4458637 4580436 4771005 4941111 5064830 5163078 5332859 5473434
7244 5473434 5687996 5670896 5834487 5882771 6003534 5876220 6010181 6137696 6204837 6186157
7234 6186157 6114723 6289586 6458619 6532144 6707837 6700434 6804421 7206712 7490158 7823523
7224 7823523 7975122 8121578 8495208 8665176 9131460 9377905 9905889 10428162 10709849 11080529
7214 11080529 11312585 11433412 11975243 12256746 12579983 12624612 12523815 12410755 12289719 12180420
7204 12180420 12009532 11818818 11529077 11131221 10807289 10515183 10291405 10021682 9907001
7195 9907001 9803603 9662547 9488368 9221101 9184093 8849504 8869125 8782060 8754045 8830295
7185 8830295 8879778 8958182 9031429 8964499 9096351 9170310 9478433 9557327 9581317 9674118 9995486
7174 9995486 10103088 10355764 10704986 10822832 11071985 11175169 11329565 11534947 11714568 12064910
7164 12064910 12426031 12839444 13170062 13565856 14058967 14585503 15054839 15980097 16934619
7155 16934619 17759234 18697790 18898186 18669075 18400387 17893738 17442015 17383835 17525735 17783913
7145 17783913 17630331 17094569 16308403 15302161 14206365 13006597 11927997 11228164 10558343
7136 10558343 9956228 9570578 9243530 8929421 8397159 8115980 7967863 7769230 7476159
7127 7476159 7461307 7295730 7116672 7017646 6926301 6917445 7002504 7021877 6906686 7085445 7130619
7116 7130619 7441488 7626462 7761136 8293883 8899372 9647321 10490976 10897671 11086466 10991246
7106 10991246 10688635 10290481 10068384 10043047 10232903 10610075 10642663 9960558 9221486 8433977
7096 8433977 7609813 6834299 6006049 5511169 4955200 4550365 4413175 4392738 4063377 3912536
7086 3912536 3890066 3532976 3342623 3310630 3284462 3268455 3228309 3127447 3058072 3021932 2894278
7075 2894278 2812887 2607762 2819561 2898612 2798065 2643579 2875997 2690507 2503744 2653828
7065 2653828 2478791 2356615 2426354 2574673 2320555 2332333 2429076 2399234 2292719 2218645
7055 2218645 2156313 2130654 2264371 2363201 2298490 2269384 2100626 1969927 1937350 1956734 2076934
7044 2076934 2174349 2060598 2049987 1922550 1934354 2179317 2277391 2204095 2207941 2112909 2185211
7033 2185211 2222999 2147669 2122379 2112874 2134373 2115691 2018855 2078468 2105835 2144749 2227135 2262741
7021 2262741 2340260 2392714 2277945 2216565 2409790 2356073 2426802 2423494 2439650 2518980 2635746
7010 2635746 2662189 2648595 2557501 2586403 2620677 2578635 2742975 2846058 2976131 3054539 3051489
6999 3051489 3007657 3189958 3130109 3157910 3258879 3435892 3581319 3627483 3687572 3668498 3800477
6988 3800477 3891458 3956328 4167372 4319225 4270989 4352143 4543683 4714986 4952088 5146672
6978 5146672 5273164 5372516 5551222 5615772 5672157 5764518 5922065 6010802 6153166 6128011 6218209
6967 6218209 6351420 6606082 6843230 6915923 6994251 6781450 6975799 7045016 7007089 6962077
6957 6962077 7241815 7289023 7178807 7136742 7057475 6957841 7124761 7088847 6957374 6735748
6947 6735748 6694981 6622646 6535979 6557680 6427854 6319730 6122134 6147426 5985086 5724190
6937 5724190 5606567 5214930 5254068 5203198 5085221 4903724 4594077 4426896 4378871 4315311
6927 4315311 4251117 4162383 4026362 3860717 3761940 3744080 3541572 3549183 3350640 3358714 3212114
6916 3212114 3228374 3012415 3004450 2932042 2879945 2772849 2672053 2693435 2564048 2650139 2572642
6905 2572642 2471810 2357499 2256004 2282723 2426426 2401780 2368189 2446729 2284009 2121696
6895 2121696 2231215 2310717 2084184 2023166 2111552 2000897 2075319 2019672 1892119 1930040 1969346
6884 1969346 2002616 1908133 1796868 1736416 1750107 1903503 1908112 1845764 1838407 1759430 1716456
6873 1716456 1634957 1527157 1596109 1644979 1631648 1677007 1632914 1712448 1561385 1485506 1475945
6862 1475945 1470687 1466737 1554023 1596557 1559684 1634237 1652535 1651279 1627562 1659281 1610142 1610241 1709002
6849 1709002 1666312 1713961 1727375 1701340 1681590 1735415 1792960 1597769 1591267 1662428 1894355
6838 1894355 1884024 1836707 1675158 1741718 1826444 1791482 1815391 1929325 1978980 1928237 2096213
6827 2096213 2191491 2210935 2216345 2353107 2412781 2286921 2163800 2128054 2281962 2278418 2343285
6816 2343285 2414273 2572616 2655932 2817290 2851242 2795396 2793570 2777036 2879418 2891791 3066892
6805 3066892 3196774 3201766 3275058 3382763 3435992 3422240 3451096 3541055 3555968 3681174 3875103
6794 3875103 3788668 3932095 4053508 4037344 4307094 4632099 4716403 4743792 4863940 5044049
6784 5044049 5145975 5217819 5451091 5673867 6005623 6147964 6461362 6658150 6849915 7121240
6774 7121240 7248288 7889317 8047978 8342238 8899663 9415277 10005216 10460638 11013247 11768304
6764 11768304 12377264 13043881 14002626 14864787 15867094 17013785 18243596 19380648 20820525
6755 20820525 22022965 23486655 25019323 26628465 28010887 29382884 30632848 31759313
6747 31759313 32733120 33469573 33455774 33174628 32620361 31672846 30453823 29115299 27557041
6738 27557041 25948050 24306566 22669051 21441895 19974271 18738806 17536549 16424348
6730 16424348 15344704 14380873 13558199 12559097 11907892 11463903 10762213 10167268 9660579
6721 9660579 9276052 8809812 8491060 8186438 7708350 7198806 6900490 6574602 6394744 6271114
6711 6271114 6204744 5901821 5518440 5291032 5017490 4798565 4718605 4572012 4325572 4297929
6701 4297929 4189758 4002595 3873890 3730539 3576727 3252263 3021355 3138693 3083828 2964962
6691 2964962 2907547 2925094 2790719 2622184 2649233 2528256 2383527 2266602 2196776 2302352
6681 2302352 2091138 1887393 1935861 1798721 1775009 1813298 1821028 1941126 1873963 1668638 1495653
6670 1495653 1372149 1384829 1514380 1548588 1477558 1429128 1309520 1355821 1440477 1320208 1214874
6659 1214874 1349100 1144324 1035695 1054147 1098510 1117681 1092994 1031136 1076071 1056401 980896
6648 980896 980022 852650 690120 528992 594067 560851 529820 550819 574935 687264 741458
6637 741458 503628 569338 635517 678199 638291 548895 479842 441199 576423 599114 698859
6626 698859 563019 472654 489044 462794 562533 451711 420802 424195 324095 295673 279434
6615 279434 324548 332888 348949 299285 381003 278802 240759 207482 220242 225039 210783 390398
6603 390398 423572 319253 220568 353842 248938 263795 240679 133416 148423 243921 396402
6592 396402 385604 282477 340886 356997 340198 328073 221338 169109 99432 208093 169479
6581 169479 208398 118706 57271 35856 116934 242463 244203 260547 157051 222210 173493
6570 173493 194369 114896 -89588 -36073 160950 227353 97751 95228 204895 163232 99531
6559 99531 111920 233959 174634 135890 182316 119199 166693 250458 183998 142861 247820
6548 247820 164795 258016 123252 62361 87344 41328 -23012 141485 231123 107291 4974
6537 4974 141270 295816 94000 -172210 -205132 -98379 -131061 66018 78819 191488 151369
6526 151369 20803 -92772 -42934 -42058 76459 304279 257824 164452 194887 131551 164990
6515 164990 198451 72941 -15860 47019 94220 31256 -71884 180661 175619 72221 104230
6504 104230 57008 -15072 22241 -3532 -56019 -12246 -79110 -32103 29635 27049 -1455 20326
6492 20326 81766 77263 42675 -139536 -154591 81374 129478 159804 31663 163108 305627
6481 305627 326551 224087 92285 -53346 -134169 -17929 -74371 -199032 -44997 -76186
6471 -76186 -169207 -187788 -177570 -118964 -165686 -142167 31225 45280 -28885 -90996 10442
6460 10442 39513 -72534 -99970 -48068 -203161 -215467 -225698 -181022 -37734 -15217 101058
6449 101058 81644 75910 62112 48131 -167009 -257038 -166864 -274085 -228723 -116794 -79869
6438 -79869 -33225 -108698 -189855 -109312 -36191 57873 115517 -38981 -91301 15285 -17193
6427 -17193 -41177 -94042 -5360 101670 189374 92042 -18107 -44684 -64070 -176811 -57907
6416 -57907 -46208 -123648 -89152 -54409 -5071 -38465 -2431 -14134 21590 -44779 -95896 -143236
6404 -143236 -59168 -204631 -164444 -39024 -78337 -42198 12344 -72628 -20641 -81513 -151831
6393 -151831 -146979 -78143 -55638 -96047 -19953 -58949 -100725 -153791 -244418 -72597 -106032 -101794
6381 -101794 -156744 -221443 -95069 -150825 -100276 -157938 -282332 -195941 -232171 -49467 -63754
6370 -63754 -114064 -163167 -186480 -79013 -2517 -120896 -66811 -46821 -25353 -73294 -34527
6359 -34527 95559 -24014 -56139 -82056 -97770 -140712 -144827 -325946 -39845 1243 -40657
6348 -40657 -127094 -70949 -171085 69946 81733 -21326 -25409 134783 255426 70059 98431
6337 98431 45311 83628 -702 -31740 -44964 17679 -34840 -136970 -97359 -105156 51956 -1267
6325 -1267 -51222 38885 -46472 -222077 -205085 -96621 -158750 -43108 -740 97087 70215
6314 70215 -47876 -101862 -101358 -97821 -95014 -58910 -259091 -162211 -114571 -138276 -143781 -149705 -195016
6301 -195016 -283440 -245034 -255290 -136996 -121759 -227889 -218247 -183697 -61398 -3775 -45095
6290 -45095 1711 -155211 -117667 -176714 -214502 -128150 -77060 -26110 -106091 -44249 4069 19574
6278 19574 -73569 -152801 -322653 -262961 -91337 -58788 -113035 -102584 -56577 -13432 4778
6267 4778 -29508 -143849 -137276 -220977 -246338 -200684 -148608 -3180 -154803 -114907 -148222 -114723
6255 -114723 -57153 -62411 -157218 -167879 -136372 -225222 -220870 -240655 -367216 -247332 -292213 -195169
6243 -195169 -134425 -154912 -143390 -211810 -426453 -257837 -179587 -268901 -226234 -51278 139873
6232 139873 118670 56478 145674 -2031 -143296 29126 1941 -146446 -37708 71187
6222 71187 -45775 -131170 -194881 -130055 -137801 -127503 -172853 -23099 -158755 -126788 55300
6211 55300 -43157 -84063 -83770 -177196 -159285 -164116 40664 130864 63393 -52515 -238656 -158474
6199 -158474 -243541 -180753 -116792 87076 72216 3388 8797 -15656 32969 -42758 176929
6188 176929 53904 -52894 -98571 -62561 -18663 -29300 -144846 -111688 -133263 -77363 -56402
6177 -56402 64146 32025 2136 30137 -48176 -52401 -103375 -98978 -131022 50104 85073 -97846
6165 -97846 -75910 51064 -103009 -83678 -246344 -36201 237735 49393 -237242 -226948
6155 -226948 -258245 -197949 -278305 -362064 -265920 -203412 -241585 -277442 -231149 -281845 -98989
6144 -98989 -102115 -172628 -268982 -42114 -141626 -270857 -167554 -243144 -265584 -233204 -28592
6133 -28592 -188730 -236721 -176135 -90112 -123426 -180054 -101009 -132695 -38316 -53390 -146132 -19057
6121 -19057 63694 106719 -120007 -56055 -36567 -169734 -67779 -83470 -44753 -155071 -219637
6110 -219637 -306424 -85902 -118200 -251520 -52129 -162439 -290130 -255776 -243355 -123140
6100 -123140 -129461 -60082 -95779 -174929 -83943 111486 -25156 -83989 -65001 -269080 -219844
6089 -219844 48384 24058 -187501 -101012 -95527 -163192 11195 -149881 -176508 -126946 -192776
6078 -192776 -129797 -129766 -19185 -79108 13561 -142935 -235863 -170548 -139988 -151477 -96344 -169359
6066 -169359 -282243 -19409 -126144 -101666 13447 24415 -47513 -85950 -168183 -141535 -131614
6055 -131614 -106336 -26287 -226360 -201244 -187286 62097 42294 -109272 -119526 5170 -8367
6044 -8367 -38452 1754 -170767 -152398 -175316 -236300 -238736 -64087 -16590 -6706 14303 -184001
6032 -184001 -155584 -142663 -131323 -63356 -147801 -150996 -157039 -91224 -15891 -214946 -192433 4042
6020 4042 -76792 -149513 -201119 -136961 -167221 -56879 100656 -8666 -186416 -159300 -32066
6009 -32066 -148138 -156013 -150533 -106199 -21665 44510 11098 -51820 -85643 -121175 -21505 -195750
5997 -195750 -256750 -190570 -22266 93335 58032 63414 24590 127860 -15455 -27992 -116218
5986 -116218 -62600 -20651 29419 17582 -52781 -93316 102081 73747 -34350 -140349 15833
5975 15833 32066 35263 106478 -54218 46313 28256 -51178 -165321 -79743 44017 -44150
5964 -44150 35735 -80762 -102907 -76764 -72390 18307 5839 114027 141279 231591 189579 168122
5952 168122 -5891 -131858 -66651 13020 31333 76731 151839 97164 -23212 43585 30375
5941 30375 50069 14924 57301 132628 65807 127606 64423 36904 75376 -32959 34000 79395
5929 79395 19361 -27452 77953 85568 -41409 51607 27801 -62406 -6397 90504 145117 141198
5917 141198 -49191 -210272 -95469 -150286 -199925 -213774 8334 -69261 -26409 -23561 33249
5906 33249 -29663 -89609 -3135 99273 148633 117908 118793 167948 124376 32133 -34783 -44402
5894 -44402 41908 -5243 -10873 -2025 129244 138429 160997 53257 7939 43075 -48383 -46494
5882 -46494 37997 105709 125057 1197 74744 111916 158187 209600 235566 230689 246940 145288
5870 145288 74118 157575 219310 188506 114198 73247 125802 215980 191041 139328 132378 175480
5858 175480 118321 158480 107653 135815 156628 171575 -44704 24420 4366 -21058 8832
5847 8832 -19117 33384 79656 25512 -124993 -70013 -41561 590 -121210 -76213 41469
5836 41469 71484 -927 91274 129538 147395 27889 -59559 44712 139509 159330 125903
5825 125903 30674 77704 63779 44471 -29062 61002 57748 10213 61756 44832 69101 194100
5813 194100 198618 83304 -41190 17903 59753 -36141 -58680 -116484 -284761 -28880 92815
5802 92815 141407 238803 60201 93694 130462 83793 79561 -27777 -154621 -23495 -19285
5791 -19285 18170 109767 92667 -68662 -101590 31952 28799 -20531 37752 4509 -54210 49437
5779 49437 127459 159800 146741 -1766 -78659 45545 -2948 -78408 60734 122042 104202
5768 104202 238970 295655 115954 92728 17107 -147427 -192825 -141722 -125196 -26853 103870
5757 103870 2272 189998 42066 23885 76736 178378 73968 44396 71479 93986 176815
5746 176815 68324 192470 175814 61557 -26162 -37778 81326 136534 223278 283739 260544
5735 260544 246028 168653 240330 175029 10086 56288 90989 -11865 121005 225394 280931
5724 280931 118763 36222 101900 36513 28499 341497 294783 109245 48706 179956 -53446
5713 -53446 -46388 8175 204620 91393 67885 61591 23882 70872 78099 48521 152116 336549
5701 336549 291799 156288 206903 144073 148807 169937 97838 82446 64499 223414 209730
5690 209730 172319 96078 146509 136667 520 -24827 13258 7525 83544 38862 -100526 -142748
5678 -142748 94498 62813 20312 58640 -46829 -105757 -74790 52700 196349 133254 253341
5667 253341 209379 20615 -55093 53935 156703 166233 54895 187227 136609 75565 223542
5656 223542 107230 156505 67817 190234 284328 235473 233063 301452 352857 178363 167917
5645 167917 104069 106005 66758 184090 88338 78703 39224 124083 91341 85180 83343 154640
5633 154640 286913 111853 193568 362821 243319 238543 214747 135522 182044 140647 258205
5622 258205 321253 190309 169740 334466 374059 235273 266715 357484 218365 218062 375502
5611 375502 448499 332828 190150 99514 77515 172467 240836 370625 453619 356019 367940
5600 367940 445190 473370 338554 382031 571699 581085 566122 531677 482204 634624 731968
5589 731968 868133 866525 650083 788550 809415 887661 990457 1166311 1081537 957270 1049722
5578 1049722 1185934 1198512 1080620 1186669 1114684 1177107 1183126 1217884 1349032 1285652 1250068
5567 1250068 1305418 1190208 1182651 1283927 1477249 1212808 1276333 1370424 1504303 1710339
5557 1710339 1802956 1822416 1679870 1636055 1820452 1888288 1777122 1770805 1708796 1578110 1537232
5546 1537232 1578635 1487733 1459612 1318972 1145318 1222711 1308856 1316352 1188004 1290204 1465573
5535 1465573 1439118 1413632 1513910 1462079 1442689 1518683 1581811 1584491 1409692 1433561 1249243
5524 1249243 1263122 1086739 1209139 1155831 1102499 1044770 1043768 1032735 1086018 1028803 882514
5513 882514 921947 1106385 1144144 1073151 1091812 999521 1016109 958302 1076895 930823 1116858
5502 1116858 1116640 1317737 1437293 1303535 1138716 1157007 1266909 1160097 1012733 952137
5492 952137 1065414 1089054 1138758 1033281 1014708 1034064 957699 925301 939592 1047946 1169340
5481 1169340 1234364 1227585 1215916 1289404 1464367 1530697 1668146 1762033 1757334 2048288 2183128
5470 2183128 2168871 2450242 2627613 2522136 2542439 2534854 2372452 2016410 2037302 2000242 1841751
5459 1841751 1923516 1787983 1792494 1991801 1940350 2104641 2035894 2011684 2302494 2339646 2447660
5448 2447660 2662550 2688084 2769487 3005739 3220007 3223843 3350986 3350927 3421080 3606539 3785355
5437 3785355 4033246 4020731 3914465 3746292 3773268 3625273 3267707 3255304 3279761 3436535
5427 3436535 3428527 3323996 3410655 3542594 3910653 4166716 4236088 4512699 4707134 4690872
5417 4690872 4835022 4821816 4871744 4635312 4592339 4395207 4327906 4378348 4273111 4160173
5407 4160173 4164100 4337591 4425262 4344763 4344681 4333208 4238728 4150084 4082453 4042160 4154939 4212004
5395 4212004 4325263 4283272 4304949 4600001 4627753 4556836 4483163 4412853 4270434 4166042 4299114
5384 4299114 4222043 4040587 4126304 4045755 4148149 3986643 4069924 3903350 3939963 3781392
5374 3781392 3698194 3634939 3512125 3629615 3633112 3591432 3584065 3507731 3339313 3317113 3201663
5363 3201663 3405759 3199475 3141756 3117048 3179569 3110544 3079677 3203238 3071704 3184378
5353 3184378 3121820 3081293 3074288 2988473 3039613 2989452 2962705 3064553 3183770 3063702 3029203
5342 3029203 2905838 2785092 2900660 2896564 2845391 2738983 2686825 2620818 2588992 2508980 2542996
5331 2542996 2615018 2502976 2508671 2320794 2338547 2265682 2311032 2372358 2462729 2338192 2104733
5320 2104733 2023712 2068241 2259245 1943130 1976259 2001839 1857242 1969054 1868415 1809713
5310 1809713 1763922 1691209 1631120 1760345 1667404 1526253 1706865 1756294 1792917 1665749 1614566
5299 1614566 1624175 1676955 1686072 1807642 1865809 1924774 1758685 1696132 1754510 1891391 1857167
5288 1857167 1807354 1707166 1557828 1483838 1440461 1385426 1412787 1414353 1305992 1280855 1214524
5277 1214524 1307885 1211074 1349570 1528673 1365174 1297579 1280702 1313020 1311496 1257978 1242885
5266 1242885 1424090 1373133 1448675 1327684 1459946 1489371 1430150 1581048 1469050 1279253
5256 1279253 1174701 1179216 1031658 907456 1054024 1132751 972890 1086567 1000670 854049
5246 854049 871606 822980 976175 949385 899141 845801 750912 826731 1031715 1100466 1059890
5235 1059890 1067361 1043256 940583 872488 985653 886145 1125660 1103172 1028582 1028693 914215
5224 914215 790735 780079 940622 852103 762178 849471 854502 825797 842101 947122 880748
5213 880748 850592 824131 702738 670598 864339 620910 646791 758235 888996 978084 916958
5202 916958 918980 788967 578926 705735 675669 674687 685850 705417 628479 567340 618728 697000
5190 697000 691704 584498 700457 569539 536668 567488 514000 610252 578611 540332 576207
5179 576207 565730 483007 441452 497397 454743 472024 595539 555621 529209 586361 479746
5168 479746 580900 609847 567519 551479 601169 601171 692053 738585 577618 682345 810281 932912
5156 932912 921287 696475 713915 667770 644168 699667 797209 828182 915131 831244 728894
5145 728894 720688 796000 795538 930944 886743 944168 826859 788630 966237 962526 1017318 1202678
5133 1202678 1274058 1247203 1186490 1191309 1384530 1436822 1569741 1634564 1531632 1577466 1556342
5122 1556342 1651350 1874332 2048027 2034753 1909791 2010064 1910163 1815692 1666088 1591158
5112 1591158 1634479 1686074 1799953 1819672 1927035 2032234 2117692 2095476 2241086 2203999 2180604
5101 2180604 2174524 2374226 2505177 2456475 2416070 2306576 2239521 2129505 2037723 2037736 2069536
5090 2069536 1973757 1940088 1918421 1964226 2031118 2111044 2227578 2239544 2331202 2307955 2377109
5079 2377109 2468100 2527229 2593346 2394477 2480752 2581400 2581146 2450271 2344418 2299562 2251759
5068 2251759 2398135 2356931 2296119 2161031 2179167 2278140 2289550 2498522 2230575 2242598 2262819
5057 2262819 2013136 1879189 1799779 1684622 1566665 1496491 1459934 1320296 1313842 1342059 1252125
5046 1252125 1227605 1130313 1017574 1078708 1190795 1278073 1292920 976804 918400 926238 962012
5035 962012 1039041 1075111 1093280 979395 928702 915733 948358 1042292 968933 808148 862053
5024 862053 769940 829342 749806 766194 657631 749623 768412 875700 925525 877199 846659
5013 846659 760670 720622 769370 912959 943574 854781 809134 906448 977708 995440 1009862
5002 1009862 1149531 912063 748435 819776 873661 908161 1009741 1020411 965744 980106 940078
4991 940078 954105 891624 864360 926585 1107942 1234633 1185270 1094570 1120536 1246753 1100556
4980 1100556 1270384 1463410 1495400 1484508 1657731 1514334 1554628 1836510 1967851 1965181
4970 1965181 1998243 2053192 2096271 2112529 2136006 2118072 2129577 2312172 2279142 2210043 2280720
4959 2280720 2338496 2262856 2166090 2120293 2079824 2041513 2068857 2218471 2461173 2567292 2596728
4948 2596728 2657502 2827322 2841179 2710599 2853744 2842699 2790360 2880724 2950350 2868858 2934177
4937 2934177 2843175 2749386 2803658 2820562 2748640 2704512 2796803 2828788 2949329 3054190 3112004
4926 3112004 3064287 3228531 3296568 3440399 3533795 3649463 3619477 3647296 3703206 3804751 3839887
4915 3839887 3657353 3663505 3634463 3674620 3821089 3944948 4053401 4097017 4338305 4503465
4905 4503465 4644868 5006369 5142878 5183242 5105278 5015015 5054642 4890612 4913483 4927752 4722389
4894 4722389 4601628 4588141 4599839 4641451 4389923 4263975 4203769 4240985 4297190 4206920 4263578
4883 4263578 4163113 4208605 4218385 4014261 4051399 4090450 4045126 4163922 4047664 4075613 4157799
4872 4157799 4151561 3936316 3932189 4027511 4034913 3970849 3762364 3646424 3750938 3595658 3418367
4861 3418367 3426325 3387115 3428117 3402273 3332216 3270246 3280855 3352450 3289352 3340448 3529087
4850 3529087 3705117 3884617 3899194 4033673 4219407 4132794 4132428 4368002 4243460 4395423
4840 4395423 4554701 4403299 4552186 4720753 4652467 4576819 4785199 4760815 4834838 4789113
4830 4789113 4915836 4823592 4693293 4635745 4463099 4362964 4176740 3996173 4045013 4087906
4820 4087906 3878742 3709148 3668801 3807240 3499531 3332404 3388198 3311114 3381105 3494186
4810 3494186 3389135 3543227 3694958 3754714 3730554 3692230 3672007 3737921 3725274 3761209 3962267
4799 3962267 3939567 3993283 3982753 3944331 4030738 4147208 4159463 4212370 4368520 4471902 4591930
4788 4591930 4939317 5114612 5280627 5556876 5832982 6110341 6412464 6759483 7025742 7398410
4778 7398410 8057941 8668761 9095247 9578463 10312541 11043300 11789789 13116336 14657476
4769 14657476 16536686 18771459 21542015 25309020 30266452 35903309 40837989 43645156
4761 43645156 43764221 40959383 36526049 31408121 26444371 22164027 18939228 16364826
4753 16364826 14466448 13106518 11913186 10781388 9805569 9105346 8447226 7941553 7519190
4744 7519190 7388407 7217814 6876010 6735115 6785005 6671937 6617432 6618390 6746997 6512822
4734 6512822 6672998 6818950 6865337 6777740 6703395 6694317 6612057 6486904 6163111 5921804 5750398
4723 5750398 5804921 5700751 5746053 5781280 6088055 6387364 6533324 6742434 7155405 7459555
4713 7459555 7825757 8252210 8499931 8887567 9295712 9670222 10136542 10737456 11522499 12309464
4703 12309464 13506841 15047009 16843550 18978780 21900257 25707085 30470285 35665674
4695 35665674 39409087 41666550 42263429 40241580 36247857 31699919 27203564 23221672
4687 23221672 19896797 17112462 15077471 13468057 12012703 10806538 9927482 9134967
4679 9134967 8438757 7939924 7561531 7290898 7165023 6979496 6930291 7245151 7087678 6870203
4669 6870203 6621804 6280869 5865066 5536448 5309374 4949947 4617240 4516893 4084245 3855558
4659 3855558 3756814 3556720 3493253 3558148 3410473 3145559 3104462 3103252 3003203 2804074 2714856
4648 2714856 2839507 2810788 2674882 2608282 2544624 2550936 2438629 2269618 2223089 2161915 2092300
4637 2092300 2207432 2347081 2126371 2132082 2185598 2058244 1895869 1855203 1840742 1856845 1784654
4626 1784654 1801030 1834871 1902475 2078126 2035930 1982546 1741188 1639611 1639874 1660134 1750200
4615 1750200 1621022 1699718 1791582 1623788 1621912 1706320 1659984 1636636 1736199 1592531 1448859
4604 1448859 1456927 1496348 1398273 1528792 1649023 1577204 1510793 1556197 1518530 1605018 1618691
4593 1618691 1549371 1617085 1587994 1526960 1439535 1452589 1520233 1630597 1699727 1599882 1625206
4582 1625206 1747142 1552964 1529761 1692071 1561892 1691357 1662208 1590366 1732285 1600708
4572 1600708 1516902 1664229 1717491 1706004 1735907 1732941 1750660 1795046 1705088 1791956 1823283
4561 1823283 1860153 1803400 1805639 1859958 1747928 1817496 1754736 1811632 1980282 1929402 1967053
4550 1967053 1853005 1661045 1792476 1955789 1902769 1961333 2033234 2033245 2066782 2088731 2136604
4539 2136604 2183345 2382772 2356629 2076700 2095458 2126819 2331986 2222848 2286245 2606304
4529 2606304 2669128 2625443 2734304 2603793 2513414 2549127 2671259 2764952 2816631 3084567 3040901
4518 3040901 3020354 3140366 3241818 3469565 3588639 3331447 3517678 3690015 3843710 4015740
4508 4015740 3987617 3994728 3999573 4016895 4176271 4223309 4373583 4510183 4621337 4634700 4838367
4497 4838367 5130330 5158070 5190537 5384167 5658744 5903302 6246930 6480025 6736057 7165781
4487 7165781 7443347 7828075 8332004 8832053 9269668 9932700 10480681 11026676 11597906 12064390
4477 12064390 12762842 13366300 13780230 13973046 14263403 14418742 14598196 14709468 14471528
4468 14471528 14265656 13982470 13648248 13363342 13202622 12938072 12596983 12484936 12327589
4459 12327589 12398346 12802803 12970178 13069081 13440699 13785670 14269139 14881490 15300879 15505518
4449 15505518 15768899 16065748 16112673 16123272 16107435 16207546 16256270 16227366 16199311 16295609 16306198
4438 16306198 16522632 16938478 17328621 17598484 17755198 17887868 17856581 18129196 18212682 18291352
4428 18291352 18210784 18153147 18221113 18093118 18202038 18289170 18153394 17870653 17639786 17528837
4418 17528837 17245340 17078474 17285584 17321331 17543039 17843510 18321071 18721037 19267675 19655017
4408 19655017 19987418 20434005 20673368 20800442 20782599 21106170 21373215 21760845 22040817 22287713
4398 22287713 22310986 22357058 22243660 21990613 21601420 20957298 20171604 19183718 18290671 17182009
4388 17182009 16013420 14943681 14076130 13244195 12512642 12039442 11651369 11211651 10718501
4379 10718501 10233280 9974328 9800188 9545629 9400505 9165965 9023990 8710597 8524353
4370 8524353 8488934 8415328 8409079 8301567 8397548 8191904 8189409 8326289 8357434 8247866 8294226
4359 8294226 8317510 8282805 8347068 8269298 8219941 8160776 8263950 8286560 8352411 8455744 8723590
4348 8723590 8988681 9235098 9410410 9561196 9921737 10167557 10347219 10758539 11119941 11288580
4338 11288580 11542234 11674972 12049106 12492904 12806835 13272516 13709138 14370033 15077666
4329 15077666 15935956 16742785 17314933 17995262 18895568 19607378 20074827 20662365 21486705
4320 21486705 21878624 22095867 22408441 22640010 22628882 22602698 22462492 22634616 22530975 22281714
4310 22281714 22142655 21846847 21672026 21455131 21042432 20728942 20441735 20065351 19893782
4301 19893782 19813296 19589379 19399672 19565634 19773682 19871407 19752769 19999591 20191730 20303616
4291 20303616 20401329 20622449 20673919 20822711 20911649 21026427 21127023 21443462 21454149 21341519
4281 21341519 21295252 21182198 21064831 20887038 20721962 20124242 19728992 19276897 18902206 18420332
4271 18420332 17999888 17540024 17254874 17143141 16745074 16497043 16220886 15797177 15590642
4262 15590642 15383636 15070094 14846565 14634935 14392145 13966921 13591182 13506996 13344056 13146252
4252 13146252 13094560 13124631 13133684 13045362 12953338 12745337 12627529 12577693 12392930 12160716 12076584
4241 12076584 11882731 11722108 11687426 11673271 11750167 11718352 11704883 11887851 12177335 12295258
4231 12295258 12390532 12517211 12716226 12917421 13194238 13234890 13433225 13848938 14097118 14428468
4221 14428468 14424125 14415565 14336931 14243753 14104106 14034776 13854759 13860417 13837930 13964124 14010359
4210 14010359 14136048 14516398 14769582 14897778 14913609 15126103 15276899 15369441 15481042 15615157
4200 15615157 15636081 15741849 15732273 15934579 16172210 16289635 16297613 16363010 16357214 16231087 16243131
4189 16243131 16012793 15878444 15917022 15789695 15660866 15761348 15875691 15896203 15961414 16163565
4179 16163565 16421098 16543173 16606897 16728631 16873027 16864560 17006320 17090915 17223795 17151462
4169 17151462 17031883 17268824 17380479 17418524 17543491 17866236 18085359 18210774 18470236 18838945
4159 18838945 19133741 19513884 19850512 19978213 20418650 20524633 20633314 20938106 21154777
4150 21154777 21225492 21365084 21517066 21650509 21755257 21996302 22255509 22481699 22677156 22866511
4140 22866511 23241899 23438890 23600636 23727044 23591493 23460078 23607288 23720021 23741681 23881175
4130 23881175 24103018 24380673 24606779 24727594 24924585 25067034 25084123 25102995 25198972 25201112
4120 25201112 25061286 25241516 25293580 25156572 25327072 25558748 25897792 26004212 26125034 26315089
4110 26315089 26769204 27365784 27832276 28448766 29265929 30188343 31292078 32367798 33623067
4101 33623067 34846136 36099456 37335045 38269743 39206596 40180130 40838616 41549280 42194401
4092 42194401 42936549 43787018 45062538 46380317 47851217 49744500 51905880 54136952
4084 54136952 56092653 57441689 57930284 58156190 58112627 58090096 58133664 58743149 59501098 60456739
4074 60456739 61848032 63455973 65548418 68248168 71501722 75419079 80313353 86194473
4066 86194473 93095296 100700158 109068145 118400537 128422214 138464903 147741523 153670592
4058 153670592 154477183 151619591 146677362 141123330 135980122 132516582 131641217 133881862
4050 133881862 138182767 141795074 141301415 136927083 130856112 123212154 114968021 107787081
4042 107787081 102082876 97890805 94704123 92478049 91174518 90229619 89827066 89804287 89986426
4033 89986426 90585320 91610992 92960392 94824229 97063734 99868078 103196310 107449958
4025 107449958 112969035 119810831 128387282 138813363 150392141 160833007 165420664 163332220
4017 163332220 157048296 147968644 138150202 128950838 121642646 116237948 112229222 109418908
4009 109418908 107505379 106155966 105662537 105366376 105513867 106126295 107033616 108193960 109581349
4000 109581349 111172601 112696034 114233119 115820849 117340488 119109570 121062563 123264952
3992 123264952 125618766 127949471 130312557 132731785 135215160 137667840 139994393 142194855
3984 142194855 144338019 146206357 148063171 150004537 151669119 153201200 154475511 155477140
3976 155477140 156491314 157624568 159005099 160486588 162161091 163836867 165721020 167954637
3968 167954637 170503577 173058458 175718072 178674502 181463609 184093553 186870392 189575000
3960 189575000 192163342 194676423 197172547 199705053 202601858 205355845 207990251 210790053
3952 210790053 213502919 216251629 219370376 222807754 226858320 231198147 236224753 241795252
3944 241795252 247431811 253148268 258226795 262254762 264734575 265493390 264474847 261969188
3936 261969188 258451782 254064604 249445279 244602560 239956894 235609482 231713788 227986491
3928 227986491 224190943 220208329 216146956 211835000 207153154 202255391 197311136 192551940
3920 192551940 188260551 184466615 181286560 178491344 176529911 175467768 174876158 174823601
3912 174823601 175151294 176090901 177694040 179714750 182004172 184705853 187407714 189261329
3904 189261329 190450191 190950713 190558798 189549219 187923104 186061290 184364814 182982123
3896 182982123 181889040 181116682 180670187 180620036 180467798 179938890 179182232 178311433 176673730
3887 176673730 174573501 172075560 169445153 166877542 164572758 162496800 160834209 159632517
3879 159632517 158765143 158429230 158294683 158591851 158963306 159617430 160641235 161889128 163457717
3870 163457717 164749329 165920980 167182702 168150811 168471161 168457471 168259422 167733794 166608617
3861 166608617 165375987 164142252 162650498 161229670 159999197 158632956 157509708 156433656
3853 156433656 155283762 154251292 152952918 151284408 149310260 147095531 144654859 142149856
3845 142149856 139724170 137249629 135359042 134217338 133425063 133359299 133937917 135160041 137379377
3836 137379377 140494600 144624181 149596075 155948586 163622660 172591765 182927139 194679608
3828 194679608 207481377 220773828 233680765 245158134 254423199 260496799 263373635
3821 263373635 263509895 261685299 258389382 254349843 250343651 246570959 243257962 240454124
3813 240454124 238022456 235532760 232443821 228647237 223304644 216487043 208054735 197788430
3805 197788430 186363620 174438121 162722384 151434455 140964579 131421673 122794237
3798 122794237 115374706 108939431 103444659 98760834 94497608 90864346 87932539 85510346
3790 85510346 83546770 81816485 80312729 79044032 77877777 76824010 75499668 74026034
3782 74026034 72337656 70490739 68598761 66695805 64566258 62263788 60236326 58106695
3774 58106695 56006685 54179580 52599088 51238447 50072680 48612944 47566831 46872949
3766 46872949 46137286 45362053 44767050 44568215 44246989 44150230 44145973 44171863 44241065 44462830
3756 44462830 44461415 44664245 44985867 45013676 45274083 45330186 45232049 44990977 44770770 44621019
3746 44621019 44485321 44142382 43511021 42546416 41524881 40173201 38804214 37478737 36242608
3737 36242608 35042271 34005130 33216559 32667621 32094547 31533179 31212412 30987008 30875241
3728 30875241 31065697 31303400 31477828 31717298 31926622 32207022 32345810 32275806 32273147 32313651
3718 32313651 32132846 31893068 31748374 32000009 32169437 32203837 32297354 32299781 32198680 32083339
3708 32083339 31826832 31419154 31086583 30596739 30250128 30007049 29564748 29185223 29030877
3699 29030877 29279027 29637580 29863149 30109919 30194507 30567680 30879540 31045685 31258416 31146274
3689 31146274 31061044 31216613 31312256 31280026 31300349 31635869 31765861 32136496 32591298 33217606
3679 33217606 33707572 34217221 34968999 35406714 35771313 35880339 35995765 36369317 36567621
3670 36567621 36790340 37362208 37570966 37896391 38397694 38967434 39453099 40073060 40625531
3661 40625531 41477175 42230803 43022833 44171667 45432399 46529187 47728936 49193211 50784929
3652 50784929 52456353 54210930 55902975 57982057 60198580 62593129 65117357 67749506
3644 67749506 70692695 73945451 77502313 81376814 85881186 90841636 96048590 101675041
3636 101675041 107561328 113188571 118536665 123878716 128874160 134186555 139962315 146292482
3628 146292482 152942063 160074028 167895119 175724874 183223622 190473938 197192903 203076204
3620 203076204 208444867 212862912 216708514 220528192 224454069 228523712 232986218 237235022
3612 237235022 241560952 245986312 250222742 254055839 257603348 260667650 263225322 265379323
3604 265379323 267536542 269808436 272320434 275287210 278668079 282216862 286394234 290857633
3596 290857633 295741930 300925341 306048536 311073369 315370551 318755583 320943465 321953261
3588 321953261 322150199 321647705 320896952 320223667 319607349 319377737 319523713 320132571 320161071
3579 320161071 319486109 317570102 313930348 308456089 301150142 292194281 281986639 271104540
3571 271104540 260073469 249110576 238445649 228619854 219606449 211276952 203273223 195252534
3563 195252534 187182022 178694339 169681421 160177061 150693531 141137270 132019272 123595691
3555 123595691 115817770 108851637 102324659 96497247 91243134 86678373 82487477 78592741
3547 78592741 75057930 71720668 68749286 66144934 63512987 61213420 58957086 56836299
3539 56836299 54868903 52985280 51380152 49726658 48236210 46892701 45427016 43948706
3531 43948706 42651673 41523786 40318479 39287001 38133385 36990612 35994553 35056641
3523 35056641 34204511 33358451 32382740 31526468 30749822 29990748 29163512 28270660 27500241
3514 27500241 26793522 25995460 25237395 24530952 23899382 23298896 22595502 22040987 21506916
3505 21506916 21041815 20560669 20005077 19475126 18942440 18398620 17958726 17696330 17256767
3496 17256767 16911952 16502468 16175351 15658614 15329242 15224125 14960131 14651055 14144877
3487 14144877 13763237 13457449 13168433 13059204 12945014 12441749 12294741 12138898 12072336 11833876
3477 11833876 11476443 11284815 11184179 10913361 10704304 10455942 10359447 10232322 10110823 10006160
3467 10006160 9797428 9690471 9490188 9340658 9214365 9083470 8997189 8820324 8667365 8436405
3457 8436405 8332175 8317347 8320449 8236706 8030557 7776477 7770329 7654585 7487221 7428859 7251229
3446 7251229 7124247 6944151 7030642 6996642 6908695 6795026 6854339 6680125 6632831 6594311 6482329
3435 6482329 6629601 6558362 6487052 6419515 6383468 6293953 6208578 6156382 6096906 5905854 5760774
3424 5760774 5887198 5969361 5861454 5617869 5494037 5524088 5504823 5386955 5297301 5351977
3414 5351977 5296083 5203702 5090895 5086084 5188694 5219891 5273674 5110757 5084770 5207382 5034442
3403 5034442 4910607 5011063 4783931 4723075 4638853 4713050 4524302 4615627 4681430 4673430 4595880
3392 4595880 4569105 4490882 4457932 4377888 4280660 4252922 4284410 4191772 4110046 4221602 4019486
3381 4019486 4131282 4121965 4041409 4018950 4186905 4027883 3981094 3970688 3943955 3955542 3975016
3370 3975016 3965602 3929892 3902984 3836708 3809166 3760459 3617674 3676598 3712101 3808873 3822106
3359 3822106 3778098 3594978 3529944 3768676 3789590 3665161 3687892 3600122 3689351 3868631 3731942
3348 3731942 3651146 3662236 3697214 3798102 3684821 3751619 3688247 3672540 3670587 3801240 3947399
3337 3947399 3995649 3987336 4088179 4158670 4235577 4483831 4411749 4225302 4181531 4375893 4342945
3326 4342945 4359985 4478374 4445828 4466344 4436256 4490415 4575014 4550501 4638084 4697635 4477420
3315 4477420 4574458 4719352 4677382 4895099 4785793 4690494 4805202 5032074 5092620 4994551
3305 4994551 4913227 5176606 5253396 5036611 5036644 5118948 5281717 5312358 5228956 5173272 5016186
3294 5016186 5067202 5129894 5211070 5359126 5357637 5439567 5491182 5417073 5497557 5481045 5432947
3283 5432947 5491516 5523118 5347629 5520686 5530059 5507949 5525200 5414301 5315676 5252948 5456721
3272 5456721 5576881 5563647 5553223 5579745 5649564 5637369 5591956 5646069 5818825 5853900 5760872
3261 5760872 5898708 6073470 5980448 6206638 6406237 6434545 6672339 6735804 6824127 6896821
3251 6896821 6987618 7281332 7563303 7860374 8088868 8445898 8732965 9275565 9935830 10447416
3241 10447416 10926764 11544738 12176775 12554371 13100575 13275133 13396987 13665946 13714273 13609106
3231 13609106 13243146 12845677 12225148 11477596 10764274 10049258 9314759 8652049 8036161
3222 8036161 7416535 7054664 6898097 6508927 6358625 6127569 5853171 5920077 5905513 6104755
3212 6104755 5957751 6093945 6589047 7098785 7334835 7278881 6851897 6399444 5974894 5526379
3202 5526379 5124859 4867688 4808967 4718535 4526281 4357011 4289091 4421956 4428173 4278223
3192 4278223 4221368 4180606 4037429 3799637 3466035 3415444 3471975 3487555 3355027 3257049 3327590
3181 3327590 3247171 3309445 3624913 3822385 4034660 4200679 4064330 3996097 3721960 3376103
3171 3376103 3220145 3031336 2955383 2739953 2796461 2758486 2468008 2492501 2492623 2402768 2462274
3160 2462274 2518123 2452463 2356072 2262864 2112121 2037902 1984387 1914389 1989677 1891156 1919248
3149 1919248 1838327 1777090 1730346 1660248 1742754 1624677 1760686 1709736 1489436 1416370 1558165
3138 1558165 1586197 1527315 1538646 1436578 1312227 1290005 1406636 1491054 1435593 1350995 1329658
3127 1329658 1437421 1536475 1462619 1340609 1141731 1260562 1247959 1255194 1169101 1207148 1273781
3116 1273781 1305997 1383550 1347284 1349065 1148131 1231154 1239485 1019993 1021612 1032304 1011425 887356
3104 887356 1016707 1059459 1060001 1046344 1158481 1127413 1132060 1117682 1176014 1139416 1239237 1163298
3092 1163298 1074092 1151363 1059800 946162 953950 1059590 1101485 1148318 908367 994098 1048535
3081 1048535 1023967 984043 983398 888479 955997 1068950 980898 1073869 941572 915001 967824
3070 967824 1012869 844162 801723 835039 824915 927174 877156 965301 1060460 1142577 1217605
3059 1217605 1191767 1046348 960713 916267 1012054 924459 967600 1025698 1042016 1033703 908806
3048 908806 883446 918268 934406 864299 953128 996501 956956 1075238 1099570 947652 861025
3037 861025 818224 941707 996397 881674 915866 835440 737249 592706 658073 1016051 844794
3026 844794 874657 1053996 818845 815642 889450 813122 603212 765439 854856 826927 904895
3015 904895 776295 772651 690742 735589 877351 758790 946623 891746 757889 609701 570649
3004 570649 700183 820593 717872 763905 836299 816459 674100 790748 771918 540214
2994 540214 502206 682130 656223 584156 678842 734075 910552 716931 584640 519639 768340
2983 768340 807056 912563 864601 670876 770811 849065 927909 961283 801251 705722 724182
2972 724182 793167 752459 869767 838175 750113 690378 869825 862165 820231 864372 1086397
2961 1086397 1000271 831249 829969 739881 860043 925214 983176 888866 810858 935395 1118875
2950 1118875 1093431 1138151 991477 852699 914341 1052882 1099986 1091504 1073771 1198407 1177639
2939 1177639 1078604 1255624 1340432 1361138 1583193 1882917 1732242 1634312 1690214 1541939
2929 1541939 1470954 1438355 1323816 1384529 1274411 1360834 1592003 1383805 1284787 1545701
2919 1545701 1419475 1353801 1465140 1442340 1550554 1425496 1467710 1502511 1511440 1457275 1409808
2908 1409808 1511973 1680466 1749575 1840808 1902159 2034672 2066196 2093714 2108478 1791544 1743298
2897 1743298 1817523 1702020 1585245 1671859 2043462 1974119 1958869 1890158 1792196 1739127 1573190
2886 1573190 1602808 1621808 1499877 1350824 1394656 1362379 1258100 1224370 1353586 1321639 1259301
2875 1259301 1348021 1467703 1297091 1319916 1532286 1440286 1240908 1253666 1192939 1162658 1315721
2864 1315721 1303978 1334343 1445422 1413596 1334806 1302456 1201934 1250867 1092940 1143544 1306364
2853 1306364 1269828 1306300 1261980 1069899 1012650 1049041 935263 869478 972309 954295 868749
2842 868749 855084 1015198 829515 757517 824709 656545 607641 690566 781223 677205 674696
2831 674696 666688 696229 681206 640247 649870 878911 817548 648259 508908 377541 389767
2820 389767 424516 435414 407050 405551 376800 397324 373518 244796 366410 482558 519939
2809 519939 615970 582621 545997 411464 418307 435215 539373 491404 426109 407400 300835
2798 300835 464414 463476 514587 518659 551073 464878 254179 324943 436481 504506 395821
2787 395821 341791 463631 469664 480692 443202 437798 512607 512609 371603 27259 8674 154748
2775 154748 230551 325290 175796 97731 197055 100114 192208 161044 222255 278203 343332
2764 343332 266351 207572 332887 225360 315334 286558 317049 386176 145517 200348 399285
2753 399285 393589 348538 323724 289748 180547 269235 298876 201051 90272 206993 271968
2742 271968 -8140 -27865 47684 144769 237286 125880 127832 156348 209485 263566 326601
2731 326601 228643 183857 116524 235661 174507 254613 249156 146461 150079 181648 315382
2720 315382 348036 296939 283052 174097 39308 52762 186321 222664 195075 308382 287924
2709 287924 174605 81243 196723 266914 202499 334325 296381 224614 295255 250930 212848
2698 212848 174156 166132 110649 83702 78035 87281 35048 67364 185289 79687 155336 105837
2686 105837 148361 240549 155742 143541 123199 165259 77933 41523 104519 123567 21873
2675 21873 188914 273814 181239 156761 173832 176731 108470 202306 126064 158349 281744 176133
2663 176133 78536 100828 202879 232610 280194 272032 308363 170397 111970 66806 152218
2652 152218 125518 81234 165059 243072 29426 47610 21518 -44861 75940 169706 202534
2641 202534 149784 893 11910 43959 139978 105467 58705 115836 220436 155655 -85749
2630 -85749 -26324 53016 19661 42576 -84895 -28226 46458 115270 31695 -36165 14544 52302
2618 52302 -102665 -12720 -30254 -115169 -18083 92883 122228 111520 213103 280092 141937
2607 141937 37924 154884 100856 49376 37370 53462 151550 118975 -14197 88866 176931
2596 176931 233863 308355 292502 205974 326237 238871 223004 156691 36548 -99328 34327
2585 34327 35998 -7346 100189 192117 141266 137268 109704 37600 -62071 96604 70970 158644
2573 158644 259497 112831 198034 256285 122002 177256 12018 134285 164317 87127 126508
2562 126508 44594 -29475 -35402 33527 121620 243831 226182 106826 222996 112126 127919
2551 127919 9831 -78366 104118 60872 142901 142358 59576 -40758 -74517 71762 36217
2540 36217 22314 74332 77891 78147 6267 -16621 15738 31044 104519 100798 7206 -3576 13125
2527 13125 175136 100305 28929 81001 109330 175351 126685 50247 77506 -59514 -128182
2516 -128182 16354 -8859 28896 -14152 61815 78775 31817 -6433 6096 -102041 -207346
2505 -207346 -24284 54327 141976 124931 44149 15983 169531 156352 155300 86458 108678
2494 108678 160801 238553 160738 34922 91288 97163 152334 131155 47748 187754 63584
2483 63584 56010 140921 81275 94311 11638 -100141 -40586 107690 -12435 -141582 -153290
2472 -153290 -26757 63302 29059 236370 212201 172090 41881 139681 102955 -33443 68695
2461 68695 254763 -7643 -71447 112737 221075 88258 7192 75970 110487 95898 -42907
2450 -42907 -8860 125332 110864 116552 30845 33417 79224 113824 17754 89580 24311 -43538
2438 -43538 57641 42440 151374 143422 41552 24060 -81431 30201 50801 -63098 40747
2427 40747 85868 99051 10712 74328 90174 40564 199719 178517 234700 260071 170864 273397
2415 273397 187643 269845 211093 153378 120413 125448 11721 36262 8610 30032 37954 16705
2403 16705 -87614 -73650 -94534 -38139 9655 25523 85429 123855 54613 33199 10766 -48632
2391 -48632 110808 128270 -22998 1005 -74112 -98794 97750 68623 39370 -39739 -62329
2380 -62329 -13361 -41239 -32461 87889 67477 -18852 106887 -19101 70779 144850 151960 105372
2368 105372 203447 343274 201465 124217 163916 231480 204439 217934 99948 134267 63420
2357 63420 45764 101286 57441 118269 97878 187499 49266 109087 148427 193300 206635 113101
2345 113101 144749 228576 159715 75494 64232 -70076 -114933 -103018 -57223 40449 163770
2334 163770 143343 60410 101658 49844 -123558 -68832 37095 118951 78928 121077 63348
2323 63348 3525 104876 127966 171245 90531 51897 82970 140427 58938 -69823 22053
2312 22053 88827 63369 -14160 23166 20006 70809 196245 131562 136725 36678 65953 155949
2300 155949 44177 41115 196104 301897 230106 89166 163084 120046 130277 93058 175453
2289 175453 14593 -90782 198484 191134 93734 28379 155348 250777 107863 99861 86405
2278 86405 -61032 115278 45462 54575 62468 -66237 -13501 83940 179293 195690 200313 272022
2266 272022 306392 296108 163426 128138 52413 95155 52902 49055 7511 112838 338253
2255 338253 371479 438213 315426 248361 230293 151798 194407 221885 184172 84330 126718
2244 126718 156970 119314 126937 142840 125986 129761 189259 276602 199271 267453 368624 230502
2232 230502 279169 305250 400563 258057 125364 164741 71452 219321 212159 403232 378584
2221 378584 388209 325218 248082 231453 314169 142586 245063 258524 226848 295639 426027
2210 426027 408283 259345 296719 387759 293049 171809 294735 295530 308269 351697 442912
2199 442912 377902 429339 319449 305557 444763 461865 416558 236717 426074 478572 224751
2188 224751 309871 232960 253006 252755 433171 407973 346353 372696 334798 300320 414561 520929
2176 520929 512948 391940 399112 451134 590143 612098 772881 774699 547776 737017 1089686
2165 1089686 1127948 989036 941229 964700 967631 971752 998382 930316 1004586 996937 1094137 1213280
2153 1213280 962547 1048105 1151084 1127475 1064375 1206841 1258486 1332523 1174070 1309408
2143 1309408 1261357 1433930 1616564 1382505 1516622 1598735 1835156 1907829 1909463 1918340 2005106
2132 2005106 2152039 2088717 2088192 2197604 2227149 2444278 2560911 2730840 2880929 2969569 3163747
2121 3163747 3310361 3465192 3708812 4149756 4458328 4822224 5192738 5585878 6260404 6939279
2111 6939279 7555205 7967907 8388741 8813504 9461212 10252104 11277772 12706253 14159669
2102 14159669 16109344 18727644 22277255 26747565 32577616 40740606 50810290 53654870
2094 53654870 49402108 43694115 36186862 29096524 23441107 19620311 16522046 14335799
2086 14335799 12726267 11566689 10365617 9536360 8745857 8303195 7762011 7194008 6723866
2077 6723866 6323008 5842719 5316302 5135005 5001772 4762080 4543322 4403997 4127811 3898276
2067 3898276 3877886 3711995 3623115 3517258 3239945 3056029 3012770 2874618 2670367 2535339
2057 2535339 2282357 2181125 1952399 1905572 2010428 2127334 2073587 1910509 1724300 1798229
2047 1798229 1705421 1656416 1684388 1623565 1663678 1589684 1391562 1142838 1193486 1278220 1240421
2036 1240421 1137249 1155701 1119769 902935 758027 807843 936718 877194 880517 870833 845903
2025 845903 869417 939995 865975 905846 857949 831575 846585 802844 758982 669943 575197 623541
2013 623541 578536 534561 682098 670299 586645 652835 631779 562868 694598 627934 564715
2002 564715 482506 437716 423869 382833 357794 320090 229380 244368 157459 328405 463971
1991 463971 453828 447092 398504 238112 249695 370608 329048 297617 401888 396980 379053
1980 379053 327404 319566 310002 330319 272981 223404 293215 361109 361319 218464 208441 250244
1968 250244 301887 540395 439562 300380 312407 245558 286184 150894 142255 213503 277494
1957 277494 246710 192443 179284 246147 108279 -9235 162598 202418 117930 142403 85500
1946 85500 129054 176762 96474 101864 90203 87204 176434 139967 249141 497579 329881 266180
1934 266180 272674 262693 288580 39053 74155 165130 101553 85086 162002 182655 194368 64765
1922 64765 29827 23774 129807 87345 23926 -20583 42722 128458 188408 155833 80026 118410
1910 118410 83939 100504 144779 272546 147844 39587 76770 62159 -38150 -114035 80727
1899 80727 194270 141543 16991 121601 188045 179121 300745 291440 162558 49391 -16562
1888 -16562 83720 160555 126100 107303 -44377 29810 76676 74232 -6363 2996 139698 83746
1876 83746 116919 143756 141097 211368 75369 -56561 -1824 -41599 -11038 102120 144261
1865 144261 6642 97423 216763 109582 110479 109526 -60492 -16549 49883 113203 -31155
1854 -31155 -61940 47077 84060 146318 110065 105954 -35415 20577 -80058 -66291 32954
1843 32954 87869 90647 83636 93354 -6565 191460 213149 123154 139040 159399 196240 222172
1831 222172 272410 342285 320068 390055 365543 365670 278413 274236 222816 54902 52600 212905
1819 212905 164255 -5919 126954 8841 -64548 47123 54301 157407 66052 52651 -42957
1808 -42957 48549 237205 180865 235130 43798 -48339 -122130 -1896 -140664 20694 46856
1797 46856 135078 108953 192621 23765 37438 223292 67819 -30456 44089 13551 108874
1786 108874 26107 -75899 -131755 -83581 54530 -122355 -209576 -160170 -50112 -131565 48158
1775 48158 231246 214916 19334 -34819 67319 99796 45086 -73988 41139 -1955 -23254
1764 -23254 67229 -54548 8777 29150 21313 73922 6895 49805 86219 21518 -17037 -2433
1752 -2433 9947 -74916 40396 168218 -17912 10385 108190 81761 -11796 -197650 -238657
1741 -238657 34517 106169 291737 237215 22862 -12242 -16503 9092 -10939 57612 5873
1730 5873 -80138 -8837 -48683 -63058 -36102 111163 81235 -109949 -38473 -2473 63736 221184
1718 221184 238972 -64975 -32750 56915 3375 -274155 -108 73895 -10491 -24230 -96
1707 -96 4297 67621 11230 -15214 -48231 100594 136641 71641 27085 -163657 -164359 6658
1695 6658 -112507 -19844 38459 28075 -44047 -79219 -35901 -44596 -158800 -27838 113055
1684 113055 184652 45075 124390 129328 7722 -76791 -19950 25898 -17094 -46713 23785
1673 23785 40061 -71676 3239 78727 106513 -4030 32689 101777 74945 -176299 -163946
1662 -163946 -42489 21057 105392 231491 231334 180751 217170 117811 40917 -170390 -303719
1651 -303719 -42174 -21950 -87433 -192096 -93162 -5021 12027 -4320 41008 -10251 45791
1640 45791 -40616 -165651 -113679 -94387 -143111 -63741 137256 188366 67763 88475 -19511
1629 -19511 8090 -83682 -44008 79525 177198 100261 800 -44331 -94416 -105647 -94382 -81330
1617 -81330 -63780 -121982 -191809 -107485 14972 -22007 -26471 -59603 38358 28098 14686 169805
1605 169805 175319 73535 27616 -122630 -194579 -129198 -101686 -242482 -139276 7659 59441
1594 59441 9087 -145229 192643 73800 -103082 -113517 -221367 -57446 -49881 -62705 -137597
1583 -137597 -98151 -225470 -136885 -73874 -85075 -22552 -10770 -169557 -166345 -97727 -70392
1572 -70392 -22722 -45468 96315 109096 213219 147241 6444 -14802 69306 7439 74573
1561 74573 46307 67093 -57711 -103023 -212819 -125245 50574 20438 -262196 -200874 -169167
1550 -169167 -142452 25785 185832 55541 39509 74602 -87253 -84761 -21658 -97669 -108628
1539 -108628 -188236 -161652 -90962 52688 48096 33682 159484 -17570 5254 -110254 -34624
1528 -34624 7153 45986 -40392 28502 -16053 -124621 -121977 -63619 -21097 -58474 17549 -162872
1516 -162872 -186778 -217551 -205684 -227501 4802 196468 36651 108910 73888 35999 131676
1505 131676 80466 79185 160108 125287 98095 -105802 -216838 -216314 -107224 -97502 -138216 36747
1493 36747 -60107 -144956 -95019 -143451 -68330 -122745 -7442 86179 50544 20180 32687 69450
1481 69450 -25542 104315 133594 76158 92891 168831 84744 136052 -36833 -27390 183193
1470 183193 58646 13139 93022 35534 -25018 -51390 99593 144835 -35766 -46162 -41036
1459 -41036 -85495 -151772 -244111 -88658 65197 53396 12238 -22864 29870 17362 -61007
1448 -61007 -121656 -166577 -217792 -169946 -115913 -13615 -69021 -103360 -211955 -126975 -172886
1437 -172886 -222829 -42027 35091 115534 122940 27264 65944 23496 -24864 -86556 -77054 -64796
1425 -64796 -97211 5198 59659 -17343 -264863 -83963 143460 90175 -36809 38077 57234
1414 57234 87508 89734 55811 57313 -25617 90048 91747 79064 60502 -107894 -65941 15358
1402 15358 -21486 -156569 -126308 -77787 -74724 36120 -26342 -37430 90810 76659 122929
1391 122929 25222 76255 66260 -54189 -71667 -106830 -56550 -85105 12275 -40204 -84078 -156060
1379 -156060 -84710 -68873 -38131 -20726 -98592 -125561 -61242 -58689 125032 42043 -20921 59223
1367 59223 -32917 -241435 -89940 -174913 -419019 -354261 -192667 -23930 -72308 -67687 -114339
1356 -114339 -61870 -47452 -122574 -157025 -39023 -105019 -124187 -70495 -42534 -67719 -162721
1345 -162721 -136481 -125118 -23077 4936 45222 64586 30155 207300 -24614 -162591 -158462
1334 -158462 -166368 -98860 -77192 24499 78557 84580 102650 80440 16243 -23306 -187058 -245160
1322 -245160 -223438 -210167 -139203 -112367 -128897 21051 175303 11164 -80579 -152126 -164152
1311 -164152 -71069 -55057 4701 77573 81095 45258 95506 69701 -11289 57023 112092 25219
1299 25219 -132200 -88882 -80916 -67149 -43540 -35696 -19699 86553 173887 15867 -19547 -93086
1287 -93086 -116330 -163623 -139818 53815 126297 72123 -76941 -100839 -33717 12020 82837
1276 82837 180617 42673 85157 -33307 -50808 -29755 -71703 -102118 -155189 17158 114640
1265 114640 -2532 -191743 -91699 103735 15970 -101188 -25527 74738 68720 79438 123493
1254 123493 134732 48556 -105407 -218566 -204384 -25247 27750 52900 -60088 -202356 -77724
1243 -77724 2177 -59601 -61936 -77633 -81113 -95320 -143033 -125016 3440 -14227 -98227 -115441
1231 -115441 -163489 -93951 -61407 -135230 163 -43653 29064 -145515 -44559 31570 -14836
1220 -14836 -3771 -135442 3789 -48130 4576 -62007 -129945 -139033 65450 113879 159589
1209 159589 82171 -49371 -138696 -187490 -34533 -67111 46438 147055 101437 -11404 -63711
1198 -63711 -15582 -25910 -29691 -69075 -116318 -42103 -104013 -72781 -51934 -106520 -107618 36311
1186 36311 42381 89393 -60845 -87154 -75595 46748 2711 -207398 -135618 -116737 -71635
1175 -71635 -153280 20883 -42049 -111035 -208177 -114108 -141061 -115210 -164694 -86276 -83967 -62097
1163 -62097 -14171 -138953 -92865 -58995 -19582 -36557 119710 119949 56559 -25816 12454 -17296
1151 -17296 -91783 -96616 -20607 -68422 -144005 -46594 -14875 44833 49651 32106 -19699 -15400
1139 -15400 -72600 -140797 15006 15801 -13732 -236711 -69751 35173 17534 -67201 -140701
1128 -140701 -92347 -186371 -75392 -76251 -34677 -17881 84493 266422 35615 -93554 23548
1117 23548 -66675 10832 148757 43093 186775 125314 18885 177440 34106 -164820
1107 -164820 -141037 -51440 2200 36097 52148 12229 -33773 -194919 -179803 -201461 -124725
1096 -124725 100139 99390 69759 -2806 107214 124078 -34286 -253395 -121925 1620 54038
1085 54038 -55950 -132535 -56679 3807 -67680 -126332 -29098 67477 88990 -161089 -131876
1074 -131876 -69272 -19367 103241 36096 -15818 -209909 -152591 -132390 -177515 -139629 -59580
1063 -59580 139826 89574 13257 53909 24512 -142649 -165396 -118437 -243152 -104462 -38727
1052 -38727 -110524 41154 -8533 -158164 -98932 19929 -123344 -47853 -38773 -65213 -117568
1041 -117568 -122199 117214 74045 28803 156770 -22238 -116372 -5122 6680 -70000 -37383
1030 -37383 -21631 -74140 68520 97116 131187 -126497 -182668 -84063 -144482 -130920 -5385
1019 -5385 -50341 -84222 -155445 -145465 49540 164360 200149 78771 145756 63197 33601 85676
1007 85676 39940 -36231 -39480 14170 58157 -38684 -68945 3086 -84143 -73448 -97977 -100402
995 -100402 -94337 5254 8043 65845 97253 13667 18018 -75526 -49078 -57939 -44185 -101705 -127994
982 -127994 -62175 57265 -36096 -21717 123884 1178 -52348 -70257 -80829 52754 17480
971 17480 -89033 -62000 -128661 -183534 -80185 -33819 74520 91023 -34840 -149420 -144168
960 -144168 -35488 -104812 -117880 -193467 -140707 -116124 -121502 -44482 92540 142259 57957 7425
948 7425 -178740 -153041 -108849 10507 33098 -77934 -87844 -79561 29416 -145565 -150306 51404
936 51404 -38933 -226024 -107344 -93563 -340869 -137532 -65665 -162381 -9808 -163299 -126858
925 -126858 -109782 -242645 -71671 35606 45067 32801 1065 -35085 -29904 -34371 26407 -53559
913 -53559 -58188 -33372 8967 -156887 -238296 -221598 -28728 -19864 20584 35710 -159038 -82210
901 -82210 -132139 -47350 -79993 -164172 -64378 61736 89186 -126846 -242868 -65446 -110950
890 -110950 45336 43693 37834 79780 -13848 7477 68542 3175 42824 50448 -17173 83098
878 83098 159159 126675 10522 -160621 -75273 -841 24087 83788 133782 162526 81643 73834
866 73834 131086 51289 148266 -6876 -172554 -106272 -119126 -140710 -77138 -98245 -111238 -119671
854 -119671 -142601 -127719 -49016 19806 116028 169394 18699 43225 -115998 -2305 2350
843 2350 72574 103787 87265 -47721 -20039 469 -134518 -43195 18174 -146911 -177002 3792
831 3792 -50335 -206260 -166633 -71795 -115082 -49478 -132729 -200869 -27105 113984 23522 -9190
819 -9190 58142 119880 19827 -130913 -132060 -130298 91440 98017 171335 122724 154861 210331
807 210331 138702 58127 89218 115747 -164895 -108362 14541 90685 99389 882 6552 -79642
795 -79642 29001 -81208 119197 247708 51582 -26635 -179244 -165164 -115149 -202472 -91506
784 -91506 -2458 -37384 85677 46144 -57213 -50750 46297 20614 24890 -17065 -50697 -71890
772 -71890 46765 49917 -2815 90618 86187 23992 -13618 -48868 -72691 -146828 61231 68591
760 68591 185185 114208 71570 117484 62231 -53440 -90719 -198247 -44585 254450 86906
749 86906 -29255 -131562 -140710 -235839 -355978 -248228 42430 107188 29249 -29852 -169870
738 -169870 -61597 74145 -22113 -68375 4124 -16130 -45401 -121246 -82273 44686 155440
727 155440 215900 190513 200824 17578 -86431 -131196 -97396 -36184 -54700 -4676 -10062 -5856
715 -5856 45752 83883 -21198 258617 268601 141216 89924 -43932 -48272 74863 80468 -88987
703 -88987 -9599 -35161 -15759 -107466 -85495 -71280 -16062 -79976 -63558 -83542 -46286 67697
691 67697 199351 105471 181514 149713 94471 102496 -54604 -26582 -618 -32540 -23875 35851
679 35851 43149 10986 156 27767 70658 119410 188197 92597 -1520 43491 -21804 6610
667 6610 -53389 -104296 -45978 92746 178067 -50503 -108894 -8161 89432 204892 175946
656 175946 96886 104384 191946 90534 115785 6844 11972 -147252 15317 -9979 3467
645 3467 -49944 -78682 -82036 -116506 -61063 -70667 -1962 -117414 -52181 -26654 -68160 61972
633 61972 -108284 -196694 -71593 -44227 14458 75012 95456 -33673 12942 -19039 -158258
622 -158258 -135652 27693 46123 86944 -21977 -32532 13938 -5365 21728 72930 -53032
611 -53032 -51856 -28658 56487 28688 -11485 69015 78657 89454 152814 249797 187618 22710
599 22710 -73827 22544 118312 -26644 -60041 -65515 -66598 45567 51546 -8347 -9943 -25979
587 -25979 -8849 -150284 -137223 -74376 -76053 -377 43887 -83751 -52431 -59266 -26278 -73604
575 -73604 -125877 -12872 69596 -64734 -128565 -78855 -135239 -166469 -71509 -79799 -66118 -130019
563 -130019 -119433 17262 -177030 -175129 -134232 -23629 11908 50072 -80484 -139961 -199491
552 -199491 -124703 -144240 -111676 -49862 -44836 59707 67797 51306 -144413 -96247 74985 -19325
540 -19325 -14473 180135 170876 -45739 -1357 156615 156932 -15715 72901 -16352 -137239 156964
528 156964 210916 -18805 -118743 -185699 -189799 -87744 -105255 -84525 24904 -24996 102523
517 102523 170620 49588 -11669 33303 94394 22314 -20375 -1244 -71275 -58068 -122962 26447
505 26447 30530 -145797 -90528 -150586 -224186 -90965 -18673 -4907 -71744 -70992 1792 -37621
493 -37621 146935 113411 63509 185697 91786 25378 153595 82153 66851 54663 -98800
482 -98800 -117681 -151206 15681 193553 181505 138050 37139 77476 44150 14254 -97139
471 -97139 -108855 78575 -31692 8245 -8299 -108063 -7178 48929 30968 -71955 -148714
460 -148714 7053 51746 -94790 49990 25504 -84241 -124302 24986 78261 22316 148427
449 148427 60601 161908 72627 -52552 44181 122309 82162 -11461 2930 79534 111054
438 111054 -40991 34182 161398 84403 141761 59410 8123 58612 85232 -90399 -116539
427 -116539 29588 -40832 -2914 -28155 143152 -27560 -77198 -69214 190353 107160 -15437
416 -15437 -97298 -166696 34591 5915 105609 -27677 -68614 -14186 22657 151816 238640
405 238640 219732 138851 -118816 -85512 -27598 -271789 -14495 -97207 -45804 -51162 -25095
394 -25095 -9755 53406 56642 -27773 208373 64367 34974 39801 -990 -16338 -60201 5596
382 5596 -51754 -142925 -157669 -219868 -42785 -19293 -100908 -103318 25681 -40348 -66952 -44744
370 -44744 -10405 111713 106265 66512 95458 47938 72896 120586 153148 126918 45363 20200
358 20200 -96429 -147456 12240 -34525 -199629 -190528 5120 76605 -67841 -59577 -115876
347 -115876 -178055 -245618 -147926 9461 -53671 -23579 -95945 -156891 -187364 -188811 -104687 -11166
335 -11166 -5354 5137 118976 157728 82479 14073 -108028 -107807 47514 141716 124371 48448
323 48448 30364 46105 41590 4594 83753 153835 87712 60866 28540 -73746 -114260 8256
311 8256 -1642 11796 134247 72691 27739 36062 4087 -64427 17735 124487 125353 33462 -19182
298 -19182 90847 14466 -2441 112087 142909 34947 4687 -53122 -153642 -194516 -72209
287 -72209 79617 101565 114278 128770 85187 -14903 -56055 -65392 -79200 18806 134687 40348
275 40348 39801 89987 27275 -21936 -39284 67254 101785 -30904 -1607 58735 92234 66846
263 66846 63626 35442 65287 31046 15476 -188549 -128760 54492 27302 -3125 -43722 70548
251 70548 136987 -29513 -82434 128627 82472 59206 69675 -149202 -122631 -92922 -238407
240 -238407 -212317 -224976 -38279 2770 -112977 14596 57004 104981 100330 -29113 -55201
229 -55201 -185702 -310275 -177446 -123463 -49844 -164133 -111543 -49666 -82984 32293 -23296
218 -23296 70706 -41156 -33147 57928 -6557 -51312 -39674 101103 151395 49789 134324 71796
206 71796 -81544 -68679 -107689 -87483 34626 32044 14146 98576 163981 226132 226364 33409
194 33409 -45175 -75008 6105 -26791 -87952 -19055 76534 191028 55041 -100104 -113387
183 -113387 -143352 -134308 -117908 -140763 -21260 15847 128108 -57564 -82003 -48428 -110279
172 -110279 -103334 -35103 -94011 -91682 -84325 -225875 -204615 -179886 55004 104282 40039 73311
160 73311 -92753 6646 72924 203748 207350 30786 68618 109560 162975 20411 752
149 752 -53240 -65316 16495 -63707 -28724 215404 211545 80441 115668 75567 83574 144208
137 144208 128397 73601 98796 -1606 18991 18514 -114310 -169907 -84561 -19684 6422 -19771
125 -19771 43654 94826 55320 85042 25223 -35392 9522 123410 86872 -42015 -11040 -30884
113 -30884 20917 27925 -2511 113873 -89574 -109012 -12966 -41454 -8849 -42278 -81570 -28836
101 -28836 -102346 -158691 -14751 -7567 -67113 -24923 -109609 -64818 -81107 -27536 22966 -49972
89 -49972 3255 18281 -37536 50559 97047 27619 -32497 -149435 -87657 -112624 -84611 -11573
77 -11573 -85376 -41488 52196 105802 192859 193030 133148 87529 -37684 122451 123757 119176 32269
64 32269 -40117 115896 111583 101617 51246 52267 54847 2155 9337 -10547 -3250 -94358 -141316
51 -141316 -44170 14580 -17835 2163 -8588 75477 13169 -45589 -49979 -155273 -70716 -45669
39 -45669 -100304 -16537 96871 78567 -19620 -110478 -121024 14005 -17896 -198674 -79262
28 -79262 1735 87655 101679 -6111 34861 -67310 -55500 48242 127864 87047 90235 98232
16 98232 13735 2178 -72101 -20718 -96831 -22768 36668 -59176 -35075 -7275 57966 120298
4 120298 -3812 -35665 -5214 56493
0 56493
$$ Imaginary data points
##PAGE= N=2
##DATA TABLE= (X++(I..I)), XYDATA
16383 -2321930 -2386883 -2416256 -2251636 -2142155 -2077865 -2050822 -2061250 -2017448 -2080356 -2009131 -1955602
16372 -1955602 -1845556 -1819960 -1754209 -1758259 -1752312 -1678564 -1710359 -1746756 -1764639 -1652407 -1672899
16361 -1672899 -1456074 -1372734 -1425570 -1334086 -1315279 -1379106 -1358125 -1218121 -1338583 -1161463
16351 -1161463 -1001858 -1062995 -995548 -1068892 -1026127 -940341 -949114 -842796 -768323 -792264 -702345
16340 -702345 -665516 -738466 -739269 -692698 -785885 -756264 -650805 -569300 -437172 -419499 -424968 -402773
16328 -402773 -364534 -460078 -437748 -327005 -334325 -386071 -355276 -211439 -208617 -231593 -191892
16317 -191892 -151235 -7024 63678 -3401 12419 -15397 120794 144362 114655 36644 189048
16306 189048 309748 419358 395892 509259 526929 447938 497094 464300 536820 492928 554668
16295 554668 489793 597143 784809 751436 657652 844431 915247 810382 720474 831179
16285 831179 901850 934431 1028192 959578 906479 947097 994884 1009798 972478 977144 965249 990623
16273 990623 1151236 1247593 1192622 1149385 1224116 1264362 1318432 1310056 1371496 1502901 1570239
16262 1570239 1584960 1657631 1644440 1675970 1707495 1739838 1659341 1677494 1612327 1668419 1668522 1711127
16250 1711127 1767651 1784361 1795719 1834284 1987741 1916914 1841410 1862999 1955483 1942839 1868248
16239 1868248 1887663 1894633 1880194 1939330 1968925 1918838 1829390 1884748 2042507 2263087 2296923
16228 2296923 2266186 2189545 2122653 2151860 2094458 2282697 2352639 2221832 2284122 2359975 2238635
16217 2238635 2273653 2345843 2233216 2516004 2448712 2464409 2544862 2457491 2434362 2546999 2682996
16206 2682996 2576791 2452735 2434866 2602430 2623628 2550863 2617684 2663548 2554597 2494468
16196 2494468 2504741 2426923 2407962 2565310 2536385 2722030 2794571 2732476 2750801 2695350 2592170
16185 2592170 2596539 2812087 2864736 2936194 2784780 2814546 2787914 2714960 2894735 3030501 2981012
16174 2981012 2990712 3045975 3100506 3013932 2950926 2814677 2768136 2962374 2919431 2863711 3003968
16163 3003968 2927793 3047497 3132971 3169352 3153997 3023516 3009601 2893259 2863866 2844105 2855551
16152 2855551 2869128 2965787 2924579 3074477 3071731 3177171 3113882 3014582 3091143 3028784 3126154
16141 3126154 3186361 3140876 3159208 3285595 3306675 3310183 3198339 3084162 3167548 3179991 3152499
16130 3152499 3085838 3109537 2907177 2837896 3069525 2981342 2992205 3191036 3274482 3198335 3104515
16119 3104515 3101554 3144983 3294376 3299260 3250042 3214778 3115462 3124904 3165203 3267751 3417265
16108 3417265 3412578 3253259 3299705 3288065 3337057 3230942 3398659 3366506 3257496 3176222 3099984
16097 3099984 3118077 3235078 3367426 3376654 3378805 3323328 3278729 3253338 3305481 3382197 3301906
16086 3301906 3291558 3237746 3308964 3323045 3238407 3309553 3308309 3205029 3169454 3226349 3268633
16075 3268633 3334776 3238723 3226766 3212493 3320799 3158867 3249602 3269432 3499516 3400236 3234540
16064 3234540 3291695 3281879 3248057 3304745 3145730 3308484 3303082 3244270 3359632 3402383 3471531
16053 3471531 3291722 3356507 3384856 3464535 3536736 3516895 3514308 3274908 3376201 3544943 3425349
16042 3425349 3394381 3233831 3160650 3386379 3389452 3272641 3178879 3402252 3539789 3414507
16032 3414507 3304583 3213311 3345395 3514025 3499115 3444536 3520929 3508179 3426828 3280321
16022 3280321 3425655 3474472 3422912 3451260 3441406 3373817 3316859 3264967 3341003 3468558 3433798
16011 3433798 3429399 3350245 3338945 3316763 3524333 3664185 3630444 3552734 3433125 3452281 3349110
16000 3349110 3280151 3261624 3405842 3336651 3284200 3118469 3141541 3030941 3227643 3426013
15990 3426013 3480430 3273499 3263250 3374987 3372654 3456995 3445396 3498572 3468229 3487886 3539210
15979 3539210 3540914 3552460 3556413 3473329 3397130 3367929 3271660 3358224 3429388 3367636 3216271
15968 3216271 3296315 3442333 3622362 3451188 3374929 3403878 3378183 3384527 3346986 3524743 3486657
15957 3486657 3476804 3376924 3406255 3431809 3494596 3446677 3479156 3456002 3466797 3516306 3455421
15946 3455421 3544733 3394656 3405310 3563216 3586548 3531354 3489214 3415459 3459556 3490170 3522960
15935 3522960 3515752 3497646 3555566 3468160 3541826 3329625 3400980 3608479 3404208 3405103 3268359
15924 3268359 3286003 3360059 3303777 3477083 3366414 3309279 3321210 3405530 3416370 3402331 3531508
15913 3531508 3586846 3501475 3515796 3360274 3391879 3353562 3391994 3372275 3303842 3499406 3435406
15902 3435406 3359793 3369779 3278172 3442432 3416183 3416878 3508465 3541492 3583239 3545068 3558673 3548938
15890 3548938 3508806 3476846 3366709 3286911 3443213 3431696 3430917 3561662 3551491 3561559 3548510
15879 3548510 3405651 3408269 3422178 3609441 3529297 3534563 3571000 3391068 3500841 3540250 3478111
15868 3478111 3451469 3441628 3501295 3474318 3355128 3416388 3403089 3468484 3583291 3547919 3573561
15857 3573561 3589118 3542246 3476877 3484106 3594801 3614575 3592336 3519609 3547121 3418856 3407757
15846 3407757 3410692 3454199 3413434 3268587 3261843 3342850 3468293 3396966 3436412 3377595 3316925
15835 3316925 3459190 3406970 3445683 3458377 3353945 3576304 3672130 3671090 3535645 3473113 3562205
15824 3562205 3598504 3521265 3459039 3366350 3412267 3494968 3496033 3528878 3600383 3639752 3512421
15813 3512421 3501789 3580674 3396230 3487274 3528104 3582640 3670040 3693219 3633955 3652500 3595648
15802 3595648 3372012 3364027 3487896 3446528 3368304 3412279 3409268 3581303 3664321 3476637 3350504
15791 3350504 3420524 3631102 3463940 3347133 3487200 3428637 3443580 3467654 3594840 3547702
15781 3547702 3563168 3482147 3451883 3453998 3546049 3579677 3528343 3540057 3397027 3475347 3443637
15770 3443637 3472667 3443360 3378887 3529275 3589209 3436100 3424149 3497371 3535546 3493745 3571040
15759 3571040 3456983 3501087 3574025 3389860 3520683 3658399 3459162 3405116 3529486 3435142
15749 3435142 3452930 3461031 3578764 3815975 3681875 3638989 3590756 3565670 3628706 3735826 3610807
15738 3610807 3598799 3489516 3373647 3565402 3428275 3462942 3373742 3512014 3673476 3603348
15728 3603348 3553583 3608236 3652492 3567542 3441155 3454251 3408143 3380705 3478514 3497470 3565628
15717 3565628 3595154 3567285 3625876 3699628 3667217 3633532 3559176 3407522 3646642 3648720 3581881
15706 3581881 3596235 3445457 3400327 3537600 3495591 3481495 3416610 3488884 3527579 3466866 3509202
15695 3509202 3528667 3500067 3472659 3603015 3565559 3609321 3545964 3638346 3675735 3559329 3549116
15684 3549116 3483763 3606393 3628689 3528289 3619769 3633149 3664471 3706073 3704211 3695617 3624132
15673 3624132 3603723 3508681 3394056 3534135 3581568 3433282 3623024 3676276 3620903 3766219
15663 3766219 3698479 3570459 3625955 3617134 3566777 3484399 3379716 3353583 3370991 3556473 3758862
15652 3758862 3792791 3689976 3560612 3642754 3761831 3684381 3484047 3489944 3610168 3628030
15642 3628030 3644422 3747486 3670346 3593556 3569958 3576763 3607049 3585214 3698552 3549294 3362389
15631 3362389 3453698 3553607 3625256 3651368 3678760 3621217 3620918 3801182 3661430 3599911 3550538
15620 3550538 3623807 3688908 3743690 3700595 3656584 3733342 3675395 3802864 3684117 3648337 3563192
15609 3563192 3487154 3541483 3606680 3668669 3694240 3689261 3584250 3788253 3724873 3744460 3689165
15598 3689165 3645490 3645423 3618140 3600305 3550872 3513757 3525935 3512040 3625059 3638223 3600928 3545893
15586 3545893 3411677 3461248 3401684 3427657 3463734 3509956 3625302 3735647 3744992 3665912 3595707
15575 3595707 3566505 3568757 3463175 3440404 3583417 3664490 3618573 3543193 3525431 3496207 3369504
15564 3369504 3404447 3494612 3573205 3508554 3459731 3505463 3578113 3551713 3540515 3622060 3535335
15553 3535335 3539483 3454644 3453925 3407632 3407931 3395797 3492934 3722487 3792254 3723728 3639342 3553089
15541 3553089 3529845 3567416 3651151 3518276 3416096 3555862 3579006 3370593 3344809 3469624
15531 3469624 3419877 3528146 3556252 3568171 3606426 3551853 3485522 3536182 3456016 3508630 3557393
15520 3557393 3624421 3827929 3891472 3824911 3644675 3571431 3727721 3635295 3566206 3580001 3533409
15509 3533409 3420820 3365962 3462617 3529577 3517615 3469397 3552870 3620525 3648794 3498226 3491312
15498 3491312 3551664 3624013 3525328 3592087 3455141 3518090 3651388 3723634 3671360 3784546 3688886
15487 3688886 3758238 3564756 3424948 3543516 3616952 3621991 3523372 3650921 3699189 3642465 3646376
15476 3646376 3830947 3773081 3638547 3448036 3491599 3637110 3634131 3498137 3600398 3493557
15466 3493557 3501965 3571025 3447226 3533203 3746033 3592779 3571511 3397499 3392526 3437834 3544305
15455 3544305 3584304 3535458 3513886 3606523 3575535 3476236 3499508 3482240 3575719 3618660 3649547
15444 3649547 3615098 3739485 3599386 3474373 3647954 3717898 3718004 3647661 3485684 3574569 3665155
15433 3665155 3590138 3774879 3710629 3730665 3855440 3749546 3709675 3395851 3519287 3596964
15423 3596964 3679517 3641395 3532782 3614831 3675150 3684901 3596995 3588139 3556058 3637263 3774461
15412 3774461 3752986 3757445 3652643 3665245 3657345 3583039 3581967 3646576 3671340 3635169 3583222 3493640
15400 3493640 3589416 3620747 3745579 3648738 3506493 3582844 3532947 3537167 3575396 3597188 3532501
15389 3532501 3447180 3455067 3580040 3741123 3713899 3624258 3569334 3455492 3440954 3513705 3574732
15378 3574732 3642538 3631108 3609632 3562321 3572612 3694313 3652795 3421181 3482416 3634666 3704149
15367 3704149 3606513 3688017 3711151 3613334 3628854 3664156 3609090 3695472 3602140 3500268 3532456
15356 3532456 3714125 3909389 3830555 3728439 3613363 3637379 3743706 3751401 3678891 3616479
15346 3616479 3544981 3588479 3619597 3679112 3654020 3755184 3881286 3821140 3852977 3725498 3792673
15335 3792673 3826260 3717841 3689840 3811964 3567541 3452060 3541375 3619639 3631700 3622002 3795841
15324 3795841 3653522 3515736 3588339 3719044 3685650 3691472 3724768 3565734 3448750 3511620
15314 3511620 3500070 3570540 3634990 3535094 3612638 3671883 3557464 3623614 3650955 3644481 3643261
15303 3643261 3619981 3646266 3644767 3767431 3851655 3898318 3878137 3733709 3708360 3561263 3663165
15292 3663165 3686675 3623481 3691342 3672826 3628714 3674439 3678050 3714680 3724443 3773969 3658591
15281 3658591 3629965 3732240 3689767 3656403 3573371 3463876 3557927 3657108 3809704 3779705 3628242
15270 3628242 3677157 3676747 3696144 3740161 3626743 3546232 3528972 3634076 3627891 3619176 3741848
15259 3741848 3594073 3631231 3657141 3592238 3691801 3857435 3755469 3751859 3680549 3548405 3695990
15248 3695990 3926064 3980394 3917134 3709828 3644479 3730737 3756615 3823090 3759796 3812351 3784734
15237 3784734 3696662 3736868 3842586 3727469 3680854 3841882 4025281 3800268 3683136 3728755
15227 3728755 3696831 3633352 3668903 3710893 3636078 3843733 3706551 3514769 3672544 3641159
15217 3641159 3519502 3638781 3713238 3633862 3521112 3516579 3462421 3521600 3601986 3682915 3714282
15206 3714282 3681698 3623457 3667813 3804331 3866114 3801843 3668685 3553548 3708608 3667506
15196 3667506 3620812 3686908 3771729 3780568 3627835 3798496 3788613 3836260 3707249 3773470 3849399
15185 3849399 3636673 3627774 3702058 3765699 3765718 3552541 3602867 3658288 3633251 3688555 3676409 3762274
15173 3762274 3819752 3673552 3647540 3725982 3697617 3720060 3787371 3809292 3749533 3737755 3818384
15162 3818384 3779004 3772562 3938131 3880550 3943080 3798196 3807972 3834883 3778455 3721522 3674143
15151 3674143 3630135 3722313 3889107 3876397 3884031 3950436 3996512 3713963 3515609 3576382 3731790
15140 3731790 3709031 3860856 3895966 3676494 3700687 3738949 3876334 3877354 3836050 3897234 3929243
15129 3929243 3898476 3748612 3745040 3761286 3795220 3913593 3869227 3812137 3693733 3858365 3896824
15118 3896824 3890079 3869323 3841709 3821073 3834946 3794312 3812022 3853946 4096455 4024292 3861488
15107 3861488 3863282 3958621 3882918 3910204 4027536 3918482 3960209 3913809 3775759 3636831 3608084
15096 3608084 3653769 3927790 3881896 3758415 3593187 3697138 3699326 3597026 3675096 3663919
15086 3663919 3637924 3742302 3755833 3833425 3916662 3961556 3840984 3810624 3866001 3783196 3762541
15075 3762541 3851813 3928777 3902836 3907524 3692120 3521767 3671794 3803975 3679147 3797737
15065 3797737 3763306 3705148 3662073 3701186 3751966 3775023 3840204 3934582 3854602 3623191 3731387
15054 3731387 3684714 3729731 3786566 3744221 3687664 3814663 3793652 3799767 3884821 3960113 3822767
15043 3822767 3640127 3697689 3577690 3508386 3809423 3750190 3696569 3794081 3679455 3624783
15033 3624783 3687553 3736919 3723141 3772700 3726677 3738985 3732179 3721930 3887900 3955577 3866965
15022 3866965 3946660 4025713 3901520 3899539 3773843 3722122 3872203 3883821 3660593 3802316
15012 3802316 3985567 3828028 3849264 3943329 3988186 3874469 3801677 3841699 3918962 3899733 3770211
15001 3770211 3778312 3752656 3735610 3766364 3820199 3858026 3994445 3916088 3902268 3892951 3751321
14990 3751321 3812191 3854090 3767825 3794154 3698327 3780418 3750176 3823921 3827514 3743021 3654314
14979 3654314 3695281 3746613 3782052 3855882 3685213 3696737 3890376 3914730 3731177 3768066 3606655
14968 3606655 3912370 3876595 3769298 3741664 3593521 3671849 3774181 3814642 3775990 3974274
14958 3974274 4014870 3892917 3955321 3897419 3865647 3743273 3777196 3846280 3719828 3721895 3964398
14947 3964398 3924589 3843302 3948053 3927497 3717610 3713975 3843444 3642557 3678392 3881426
14937 3881426 3686633 3736140 3844772 3817048 3750235 3873578 3865178 3745245 3864747 3877897
14927 3877897 3922724 3820769 3572401 3633330 3886187 3869344 3936698 3894774 3753951 3873814
14917 3873814 3833322 4025827 3980817 3817696 3835883 3875246 3874540 3975524 3936182 3865801 3802865
14906 3802865 3602501 3684598 3802448 3791435 3887688 3851992 3833790 3859957 3940146 4015285 3770237
14895 3770237 3830244 3918029 3785606 3821652 3927335 3888825 3864895 3763040 3633046 3758956
14885 3758956 3756440 3888539 3892450 3936399 3964043 3912344 3943795 3718332 3674019 3725238 3784245
14874 3784245 3873481 3875676 3896849 4023068 3865190 3747204 3858376 3878389 3913154 3851159 3863694
14863 3863694 3767548 3709971 3800997 3867323 3988944 3868165 3778364 3855489 4069558 3967370
14853 3967370 3878298 3761860 3868424 3935804 3830653 3785239 3819739 3698149 3630960 3738393
14843 3738393 3910626 3925690 3936226 3956169 4038172 3937140 3950020 3846699 3769048 3748259 3811028
14832 3811028 3991480 4074254 3935554 3823156 3984913 3942069 4161093 4068749 4083484 3953516
14822 3953516 3891180 3962607 3955815 4048139 3996101 3965065 4092253 4067672 3973431 4002204 3905464
14811 3905464 3896446 3956038 4010073 3915825 3931039 3848081 3846437 3857856 3795405 3773613 3882846
14800 3882846 3858026 3789005 3772024 3767131 3732534 3630864 3663730 3777714 3808021 3899600 3965103
14789 3965103 3905060 3921466 4029509 4039279 4032310 3981085 3986270 3938262 3991749 3999456 3966735 3958804
14777 3958804 3864056 3786057 3925106 3960985 3938078 3884719 4036797 4133667 4128898 3912622 3895133
14766 3895133 4074707 4017428 4106594 3960025 3878819 3842138 3876305 3867080 3942324 3987849 4057763
14755 4057763 3786790 3691027 3908031 3974577 3962805 3857165 3768236 3825703 3971980 3886175
14745 3886175 3712799 3783175 3785442 3891002 3815417 3992398 3953663 3766602 3719150 3833394
14735 3833394 3909144 3883160 3796453 3717906 3797941 3961858 3922317 3905631 3923623 3948860 3946772
14724 3946772 3919405 3985275 3976390 4131862 3957727 3930030 3921097 3871968 3989756 3907598 3946885
14713 3946885 3991760 3868232 3966392 4081334 4026723 3926926 3978055 3994006 4026640 4035684 4032548
14702 4032548 4137644 3910196 3740542 3812768 3965127 4079492 4041513 3980505 3993269 3930049
14692 3930049 3923810 3965450 4061170 4129531 4099816 3887310 3891816 3805129 3882195 3984110 3959021
14681 3959021 3856225 3937063 4135079 4120971 3948867 4045431 4097157 3996338 3948065 3964970
14671 3964970 4007718 4083913 4178932 4201399 4108573 4048286 3894170 3860054 3968939 4023783 4026362
14660 4026362 4046289 3930304 3899128 3858163 3824786 3921008 3973305 4072169 4098993 4063335 4045989
14649 4045989 4150232 4182178 4098948 3978535 4134884 4019209 4095943 3978738 3873829 4021543
14639 4021543 4085946 3956410 3908378 3947184 3895901 3952375 3826589 3833671 4025750 3984722 4024839
14628 4024839 3915447 3985276 4036732 4074841 4170286 4178203 3916309 3843243 3906944 3974486 4012963
14617 4012963 3965817 3958311 3951846 4051021 4218720 3969216 3887332 3826217 3793820 3723229 3985310
14606 3985310 3959235 3962442 4233027 4102569 4088394 4015422 3903905 4120326 4085305 4032682 4077657
14595 4077657 3966716 4058203 4074554 4092577 4021563 3945939 4055296 4103583 4022008 3979273 4016508
14584 4016508 3886228 3950450 4072968 4009413 4052668 4093717 4167728 4192675 4172691 4236612 4162002
14573 4162002 4072196 4002632 4063676 3947080 4010697 3958615 3821614 4021937 3953434 3964995 4050570
14562 4050570 3937770 4041838 4000449 3787218 3752741 3740672 3796174 3995585 4242008 4135029
14552 4135029 4031937 4010355 3920485 3948153 3992508 3991324 3946025 3953590 4038375 4075589 4072374 3943579
14540 3943579 4006752 4007732 4047040 3946702 4029610 3909910 3871600 3832027 3878969 3917861 4031154
14529 4031154 4110714 4148077 4174539 4076415 4054744 4051978 3984640 4077906 4188322 4144833 4158592
14518 4158592 4162374 4206149 4161202 4138951 4062537 4031724 4166272 4093304 4094167 3935668 4047896
$$ [...]
##END NTUPLES=NMR SPECTRUM
##END=
