##TITLE=1H_EC-3293(II-1)
 CDCl3
 8 sc, 
 11.4.2023
##JCAMPDX= 6.0         $$ Bruker NMR JCAMP-DX V2.0
##DATA TYPE= NMR SPECTRUM
##DATA CLASS= NTUPLES
##ORIGIN= UXNMR, Bruker Analytische Messtechnik GmbH
##OWNER= root
$$ XWIN-NMR		Version 3.5
$$ Tue Apr 11 13:52:07 2023 Russian Standard Time (UT+4h)  she@DPX200
##.OBSERVE FREQUENCY= 200.13135
##.OBSERVE NUCLEUS= ^1H
##.ACQUISITION MODE= SIMULTANEOUS
##.ACQUISITION SCHEME= undefined
##.AVERAGES= 8
##.DIGITISER RES= 18
##SPECTROMETER/DATA SYSTEM= spect
##.PULSE SEQUENCE= zg30
##.SOLVENT NAME= MeOD
##.SHIFT REFERENCE= (INTERNAL, MeOD, 0, 15.7755)
##AUDIT TRAIL= $$ (NUMBER, WHEN, WHO, WHERE, WHAT)
$$ ##TITLE= Audit trail, XWIN-NMR		Version 3.5
$$ ##JCAMPDX= 5.01
$$ ##ORIGIN= Bruker BioSpin GmbH
$$ ##OWNER= she
$$ F:/spectra/data/she/nmr/H-F/1/pdata/1/auditp.txt
$$ ##AUDIT TRAIL=  $$ (NUMBER, WHEN, WHO, WHERE, WHAT)
(   1,<2023-04-11 13:50:45.00 +0400>,<she>,<DPX200>,
      <created by zg, POWCHK disabled, PULCHK disabled
       configuration hash MD5:
       00 E9 B6 7A A2 85 ED C7 34 08 36 98 17 FE 4E 26
       data hash MD5: 16K
       88 B4 B4 E3 CE BD 72 27 13 6A 8A FB A6 10 16 7B>)
(   2,<2023-04-11 13:50:47.26 +0400>,<she>,<DPX200>,
      <Start of raw data processing
       efp BC_mod = 2 LB = 0.24 FT_mod = 6 PKNL = 1 PHC0 = -19383.12 PHC1 = 11.4008 SI = 16K 
       data hash MD5: 16K
       A2 D2 D4 94 C4 DA C9 1C C7 35 37 34 EB 1A C3 BC>)
(   3,<2023-04-11 13:50:50.35 +0400>,<she>,<DPX200>,
      <abs ABSG = 5 
       data hash MD5: 16K
       A4 9C D2 D7 B6 EE 5B 0F 6D B2 F2 99 F4 FC 75 A9>)
(   4,<2023-04-11 13:51:15.75 +0400>,<she>,<DPX200>,
      <pk PHC0 = -88.18258 PHC1 = -1.800002 
       data hash MD5: 16K
       76 B0 55 A4 4F 7B DF 6C CB 7F F9 C3 8B 81 AC E4>)
(   5,<2023-04-11 13:51:18.82 +0400>,<she>,<DPX200>,
      <abs ABSG = 5 
       data hash MD5: 16K
       40 0D D5 AB BD 09 35 B5 2E 5E B7 DF 82 50 BE A6>)
$$ ##END=
$$ 
$$ hash MD5
$$ 5B C3 79 28 47 9B 99 D2 92 CE A0 9D 45 03 23 BE
##$RELAX= 
##$RELAX= 
##$RELAX= 
##$RELAX= 
##$RELAX= 
##$RELAX= 
$$ Bruker specific parameters
$$ --------------------------
##$DU= <F:/spectra>
##$EXPNO= 1
##$NAME= <H-F>
##$PROCNO= 1
##$TYPE= <nmr>
##$USER= <she>
##$AMP= (0..31)
100 100 100 100 100 100 100 100 100 100 100 100 100 100 100 100 100 100 
100 100 100 100 100 100 100 100 100 100 100 100 100 100 
##$AQSEQ= 0
##$AQ_mod= 1
##$AUNM= <au_zg>
##$AUTOPOS= <>
##$BF1= 200.13
##$BF2= 200.13
##$BF3= 200.13
##$BF4= 200.13
##$BF5= 200.13
##$BF6= 200.13
##$BF7= 200.13
##$BF8= 200.13
##$BYTORDA= 1
##$CFDGTYP= 0
##$CFRGTYP= 5
##$CHEMSTR= <none>
##$CNST= (0..31)
1 1 145 1 1 1 1 1 1 1 1 1 1 1 1 1 1 1 1 1 1 1 1 1 1 1 1 1 1 1 1 1 
##$CPDPRG= <>
##$CPDPRG1= <>
##$CPDPRG2= <>
##$CPDPRG3= <>
##$CPDPRG4= <mlev>
##$CPDPRG5= <mlev>
##$CPDPRG6= <mlev>
##$CPDPRG7= <mlev>
##$CPDPRG8= <mlev>
##$CPDPRGB= <>
##$CPDPRGT= <>
##$D= (0..31)
0 1.2 0 0 0 0 0 0 0 0.06 0 0.03 0 0 0 0 0.0002 0 0 0 0 0 0 0 0 0 0 0 0 
0 0 0 
##$DATE= 1681206644
##$DBL= (0..7)
$$ [...]
##$SUBNAM3= <"">
##$SUBNAM4= <"">
##$SUBNAM5= <"">
##$SUBNAM6= <"">
##$SUBNAM7= <"">
##$SUBNAM8= <"">
##$SUBNAM9= <"">
##$SW= 18.05172834244
##$SWIBOX= (0..15)
0 0 2 0 0 0 0 0 0 0 0 0 0 0 0 0 
##$SW_h= 3612.71676300578
##$TD= 16384
##$TD0= 1
##$TE= 0
##$TE2= 300
##$TE3= 300
##$TEG= 300
##$TL= (0..7)
0 120 120 120 120 120 120 120 
##$TP= (0..7)
150 150 150 150 150 150 150 150 
##$TP07= 0
##$TPNAME0= <>
##$TPNAME1= <>
##$TPNAME2= <>
##$TPNAME3= <>
##$TPNAME4= <>
##$TPNAME5= <>
##$TPNAME6= <>
##$TPNAME7= <>
##$TPOAL= (0..7)
0.5 0.5 0.5 0.5 0.5 0.5 0.5 0.5 
##$TPOFFS= (0..7)
0 0 0 0 0 0 0 0 
##$TUNHIN= 0
##$TUNHOUT= 0
##$TUNXOUT= 0
##$USERA1= <user>
##$USERA2= <user>
##$USERA3= <user>
##$USERA4= <user>
##$USERA5= <user>
##$V9= 5
##$VALIST= <valist>
##$VCLIST= <CCCCCCCCCCCCCCC>
##$VD= 0
##$VDLIST= <DDDDDDDDDDDDDDD>
##$VPLIST= <PPPPPPPPPPPPPPP>
##$VTLIST= <TTTTTTTTTTTTTTT>
##$WBST= 1024
##$WBSW= 4
##$XGAIN= (0..3)
0 0 0 0 
##$XL= 0
##$YL= 0
##$YMAX_a= 889576
##$YMIN_a= -1058029
##$ZGOPTNS= <>
##$ZL1= 120
##$ZL2= 120
##$ZL3= 120
##$ZL4= 120
##$ABSF1= 15.74799
##$ABSF2= -2.30386
##$ABSG= 5
##$ABSL= 3
##$ALPHA= 0
##$AQORDER= 0
##$ASSFAC= 0
##$ASSFACI= 0
##$ASSFACX= 0
##$ASSWID= 0
##$AUNMP= <proc_1d>
##$AZFE= 0.1
##$AZFW= 0.1
##$BCFW= 0
##$BC_mod= 2
##$BYTORDP= 0
##$COROFFS= 0
##$CY= -3
##$DATMOD= 1
##$DC= 0
##$DFILT= <>
##$DTYPP= 0
##$F1P= 0
##$F2P= 0
##$FCOR= 1
##$FTSIZE= 16384
##$FT_mod= 6
##$GAMMA= 0
##$GB= 0
##$INTBC= 1
##$INTSCL= 3.70164e-10
##$ISEN= 128
##$LB= 0.24
##$LEV0= 0
##$LPBIN= 0
##$MAXI= 10000
##$MC2= 0
##$MEAN= 0
##$ME_mod= 0
##$MI= 1.114404
##$NCOEF= 0
##$NC_proc= -4
##$NLEV= 6
##$NOISF1= 3.799351
##$NOISF2= 2.8
##$NSP= 0
##$NTH_PI= 0
##$NZP= 0
##$OFFSET= 15.77554
##$PC= 1
##$PHC0= -19471.3
##$PHC1= 9.600798
##$PH_mod= 1
##$PKNL= yes
##$PPARMOD= 0
##$PSCAL= 0
##$PSIGN= 0
##$REVERSE= no
##$SF= 200.129999199653
##$SI= 16384
##$SIGF1= 3
##$SIGF2= 2
##$SINO= 5.538805
##$SIOLD= 16384
##$SREGLST= <1H.CDCl3>
##$SSB= 0
##$STSI= 16384
##$STSR= 0
##$SW_p= 3612.71676300578
##$SYMM= 0
##$S_DEV= 0
##$TDeff= 16384
##$TDoff= 0
##$TI= <>
##$TILT= no
##$TM1= 0
##$TM2= 0
##$TOPLEV= 0
##$USERP1= <user>
##$USERP2= <user>
##$USERP3= <user>
##$USERP4= <user>
##$USERP5= <user>
##$WDW= 1
##$XDIM= 16384
##$YMAX_p= 333687859
##$YMIN_p= -210505
$$ End of Bruker specific parameters
$$ ---------------------------------
##NTUPLES= NMR SPECTRUM
##VAR_NAME=  FREQUENCY,     SPECTRUM/REAL,   SPECTRUM/IMAG
##SYMBOL=    X,             R,               I
##VAR_TYPE=  INDEPENDENT,   DEPENDENT,       DEPENDENT
##VAR_FORM=  AFFN,          ASDF,            ASDF
##VAR_DIM=   16384,         16384,           16384
##UNITS=     HZ,            ARBITRARY UNITS, ARBITRARY UNITS
##FACTOR=    0.220516191357247, 1,           1
##FIRST=     3157.15887799337, 0,            0
##LAST=      -455.557885012408, 0,           0
##MIN=       -455.557885012408, -210505,     0
##MAX=       3157.15887799337, 333687859,    0
$$ Real data points
##PAGE= N=1
##DATA TABLE= (X++(R..R)), XYDATA
$$ [...]
7308C288149O7963Q5367P0776O5075Q3572P9537P7943Q4135J10785J02185J01457
$$ 3288149 3356112 3441479 3512255 3577330 3660902 3740439 3818382 3902517 4013302 4115487 4216944
7297D216944J08724J24831R5634J09111J22371J29080R6323J36616J40930J31233
$$ 4216944 4325668 4450499 4546133 4655244 4777615 4906695 5003018 5139634 5280564 5411797
7287E411797J11235J38616J16766J51262J43246J64962J80705J67524K07238J73971
$$ 5411797 5523032 5661648 5778414 5929676 6072922 6237884 6418589 6586113 6793351 6967322
7277F967322J81484K27322K36863K17044K43860K64220K64099K58844K72321L18370
$$ 6967322 7148806 7376128 7612991 7830035 8073895 8338115 8602214 8861058 9133379 9451749
7267I451749L20400L07972L28947L48214L40163L75682L90106L98919M17083M00852
$$ 9451749 9772149 10080121 10409068 10757282 11097445 11473127 11863233 12262152 12679235 13080087
7257A3080087M43205M29961M50937M62546M49609M68722M85207M77260M44420
$$ 13080087 13523292 13953253 14404190 14866736 15316345 15785067 16270274 16747534 17191954
7248A7191954M28619M12422M05460L51832L06505K84033K31047J23029J26567
$$ 17191954 17620573 18032995 18438455 18790287 19096792 19380825 19611872 19734901 19861468
7239A9861468P6796r765o5065j30382j73632k16717k42727l33378l58667l88351
$$ 19861468 19938264 19928499 19863434 19733052 19559420 19342703 19099976 18766598 18407931 18019580
7229A8019580l75829m45190m44262m38924m51868m35975m49287m14977m35779
$$ 18019580 17643751 17198561 16754299 16315375 15863507 15427532 14978245 14563268 14127489
7220A4127489m45708m55334m51924m35037m05453m09787l85460l67944l75120
$$ 14127489 13681781 13226447 12774523 12339486 11934033 11524246 11138786 10770842 10395722
7211A0395722l21086l31097k96033k94963k94023k33280k49212k28850k23971
$$ 10395722 10074636 9743539 9447506 9152543 8858520 8625240 8376028 8147178 7923207
7202G923207k30468k20821j86451j74242j57212j69710j66414j59296j63570j24396
$$ 7923207 7692739 7471918 7285467 7111225 6954013 6784303 6617889 6458593 6295023 6170627
7192F170627j03007j33668j23275q1397r4332q1992o3024q6461q1163j01659q1020
$$ 6170627 6067620 5933952 5810677 5729280 5634948 5552956 5489932 5403471 5322308 5220649 5139629
7181E139629p4736n9824o3059m2432j6350q5802l3793m0048m7608l5855K71n0624
$$ 5139629 5064893 5005069 4942010 4899578 4883228 4797426 4763633 4723585 4675977 4640122 4640393 4589769
7169D589769k2361j9601k9372m6327l9213j3629L806k3161k4397J8228j575J4061
$$ 4589769 4567408 4547807 4518435 4472108 4432895 4419266 4423072 4399911 4375514 4393742 4392167 4406228
7157D406228L2017P438M3588O7687M7482O2363N1510P0738P6757J06450R6356
$$ 4406228 4438245 4445683 4489271 4556958 4604440 4666803 4718313 4789051 4865808 4972258 5068614
7146E068614J23017R5210Q9974R7576R4661J09981J14249J34158J88427J78556
$$ 5068614 5191631 5286841 5376815 5474391 5569052 5679033 5793282 5927440 6115867 6294423
7136F294423K12334K24856K32886K50852K42983K76544L76551M77261N45722O56395
$$ 6294423 6506757 6731613 6964499 7215351 7458334 7734878 8111429 8588690 9134412 9790807
7126I790807P93747R38826J080143J302653J614632K018656K539575L252938L778003
$$ 9790807 10584554 11523380 12603523 13906176 15520808 17539464 20079039 23331977 27109980
7117B7109980K853015N02251j205647j852949k293492j929548r83243J04680J038214
$$ 27109980 29962995 30465246 29259599 27406650 25113158 23183610 22200367 22305047 23343261
7108B3343261J886203K400878J600454m25686j981300k721184l213711l015134
$$ 23343261 25229464 27630342 29230796 28805110 26823810 24102626 20888915 17873781
7100A7873781k419284j741329j238346r12386o76630m92972l21068k39102j93031
$$ 17873781 15454497 13713168 12474822 11562436 10885806 10392834 10071766 9832664 9639633
7091I639633j39667p6069o5448K009J05167K01320L05780L87431N08812O51015
$$ 9639633 9499966 9423897 9358449 9360458 9465625 9666945 9972725 10360156 10868968 11519983
7081A1519983P93995R48546J241159J591006J992575K565252K928295K043462
$$ 11519983 12313978 13262524 14503683 16094689 18087264 20652516 23580811 25624273
7073B5624273J27579j059773j597054j935636j590367p62926J10739Q77730J677731
$$ 25624273 25751852 24692079 23095025 21159389 19569022 18806096 18916835 19794565 21472296
7064B1472296K061003J098723q57584k057284k613218k980231k652944k046799
$$ 21472296 23533299 24632022 23774438 21717154 19103936 16123705 13470761 11423962
7056A1423962j499892j067229q31550o53020n45743m33293l59396l28199l19360
$$ 11423962 9924070 8856841 8025291 7372271 6826528 6393235 6033839 5705640 5386280
7047E386280k78599k41446k11595j83915j75768j70403j15753j23436j35677j26118
$$ 5386280 5107681 4866235 4654640 4470725 4294957 4124554 4008801 3885365 3749688 3623570
7037C623570j47805j04210j26936j13087j09803j22205j10840r5935j05248r5694
$$ 3623570 3475765 3371555 3244619 3131532 3021729 2899524 2788684 2692749 2587501 2491807
7027B491807p6366q5367o6606o3338l5321q8206n7769m4333m1685m8942n8961
$$ 2491807 2415441 2330074 2263468 2200130 2164809 2076603 2018834 1974501 1932816 1883874 1824913
7016A824913p1072n4604l0702k6373k9663l0188o162k0982p8400l7976q407l2694
$$ 1824913 1753841 1699237 1668535 1642162 1612499 1582311 1576149 1555167 1476767 1438791 1430384 1397690
7004A397690P249l5338l3131l8602k9300k8908j593l2076j3613r19j9555l391
$$ 1397690 1404939 1369601 1336470 1297868 1268568 1239660 1238067 1205991 1192378 1191459 1171904 1168513
6992A168513m1602p712N746j6537j4219k8232j8378j597j2876j8744j3608j0747
$$ 1168513 1126911 1119199 1124945 1108408 1094189 1065957 1047579 1045982 1033106 1014362 1000754 990007
6980I90007O372Q712j763j3162j9945o436J6013j7388k910j9333l635l370j1942
$$ 990007 996379 1005091 1003328 990166 970221 963785 979798 962410 959500 940167 936532 933162 921220
6967I21220r236L2704K0151P943L0408K6482K6433L6483M3273J9934M5612o990
$$ 921220 911984 944688 964839 972782 1003190 1029672 1056105 1092588 1135861 1155795 1201407 1194417
6955A194417K0513L2976K616N950M4868L7162N6203K0839L5578J00374Q4811Q3496
$$ 1194417 1214930 1247906 1250522 1256472 1301340 1338502 1394705 1415544 1451122 1551496 1636307 1719803
6943A719803P6519N4567N2591K5877J8778J8629m501l5475o2412p3203r3167p6640
$$ 1719803 1796322 1850889 1903480 1929357 1948135 1966764 1962263 1926788 1864376 1791173 1698006 1621366
6931A621366r0340r4121p3294o7492r2504p9737n2247n8852o0230o2313k7654
$$ 1621366 1531026 1436905 1363611 1296119 1203615 1123878 1071631 1012779 952549 890236 862582
6920H62582o0226n2586p735m7646k4899j2023k6355k8022m1139j1008j342m0114
$$ 862582 802356 749770 742035 694389 669490 657467 631112 603090 561951 550943 549601 509487
6908E09487n574j5657j2968k7126j4263j3765N721L381l1619j4668l361J99m8945
$$ 509487 503913 488256 475288 448162 433899 420134 425855 429236 397617 382949 379588 379787 330842
6895C30842r168J0924o199j956l2061k542j3679j7468R22L444j0877j4132J1551
$$ 330842 321674 332598 326399 324443 292382 289840 276161 258693 259615 263059 252182 238050 249601
6882B49601k3401j5124m965M382K8881l197n627j8703r004k2346O52j6280P33
$$ 249601 226200 211076 206111 210493 239374 236177 230550 211847 202843 180497 181149 164869 165602
6869A65602J4473j3160m5330J6998J2675J059j9576J3960L7067k5434j3797l1234
$$ 165602 180075 166915 121585 138583 151258 152317 132741 146701 183768 158334 144537 113303
6857A13303r263K9874k9386j3372L113J0558N71o686J2726P536M086m6848K3185
$$ 113303 104040 133914 104528 91156 94269 104827 105398 98712 111438 118974 123060 76212 99397
6844I9397L243M717l602k8851k3478j170j1873K0072J5253o271n240p935j5950
$$ 99397 102640 107357 103755 74904 51426 50256 38383 58455 73708 67437 62197 54262 38312
6831C8312J6120j8027Q58q34R850n926J5722m851k8308j8253j1766K0252J5128
$$ 38312 54432 36405 37263 36429 46279 40353 56075 51224 22916 4663 -7103 13149 28277
6818B8277r625K4746j7200k8753K6770O374J6544j3185k3272m258l001N532j539
$$ 28277 18652 43398 26198 -2555 24215 30589 47133 33948 10676 6418 3417 8949 7410
6805G410K5923k2730j7712J2670j3159j3810l010M262J3854j0736j7148J3001
$$ 7410 33333 10603 -7109 5561 -7598 -21408 -24418 -20156 -6302 -17038 -34186 -21185
6793b1185K0077K062j7053j3699j276N688O337L1750j9917j6136P736q32J7927
$$ -21185 -1108 954 -16099 -29798 -31074 -25386 -19049 12701 -7216 -23352 -15616 -16448 1479
6780A479k5j3451L6306o851J1361k2403k2024q250N653O956J3922J0443N610L175
$$ 1479 1454 -11997 24309 17458 28819 6416 -15608 -23858 -18205 -11249 2673 13116 18726 21901
6766B1901j6299l3504k042P417J5922K7286p4J2774J7363J5484L3483j9594K4837
$$ 21901 5602 -27902 -29944 -22527 -6605 20681 20607 33381 50744 66228 99711 80117 104954
6753A04954L5471M0769O769k2446j7783j6031K155j6573n698r426j4145j400J6804
$$ 104954 140425 181194 187963 165517 147734 131703 133858 117285 111587 102161 88016 86616 103420
6740A03420k7497k6382J4737R459q852N135j8959k4989o990N84k332l519J5686
$$ 103420 75923 49541 64278 73737 64885 70020 51061 26072 19082 19666 17334 13815 29501
6727B9501O448r992J5748r268j2388k623K016k9018P18k43L437J2243j379j657
$$ 29501 35949 25957 41705 32437 20049 17426 19442 -9576 -8858 -9101 -5664 6579 5200 3543
6713C543O804L4870l62j1621p129J1724J5618K1674K3623k4340o557J7264l5687
$$ 3543 10347 45217 44855 33234 26105 37829 53447 75121 98744 74404 67847 85111 49424
6700D9424J2448K5247o177n064k9744J888j1950j9369j9215k1424J4437L175l6045
$$ 49424 61872 87119 80942 75878 46134 48022 36072 16703 -2512 -23936 -9499 -6324 -42369
6687d2369r83J027j4896l857r620r490o499o392N526K8466L598k5405M767O527
$$ -42369 -43352 -42325 -57221 -61078 -70698 -80188 -86687 -93079 -87553 -59087 -55489 -80894 -76127 -69600
6673f9600P305j4827M960j3681J0218J7207j6947o332o305k964n730K3902K934
$$ -69600 -62295 -77122 -72162 -85843 -75625 -58418 -75365 -81697 -88002 -90966 -96696 -72794 -69860
6660f9860n967l0136J2696j4371J5705n836r306L1892J324o971o508O269n798
$$ -69860 -75827 -105963 -93267 -107638 -91933 -97769 -107075 -75183 -73859 -80830 -87338 -81069 -86867
6647h6867N636O345j5490M746j5449l0802M3246P103k893j1855Q552j006j4276
$$ -86867 -81231 -74886 -90376 -85630 -101079 -131881 -88635 -81532 -84425 -96280 -87728 -88734 -103010
6634a03010p059j3101J6967j5222J6688J5011K3422J3280m6414L89L1142l985
$$ -103010 -110069 -123170 -106203 -121425 -104737 -89726 -66304 -53024 -99438 -99049 -67907 -71892
6622g1892j3012j9221j5665J617j6806K7563K667k2044R188K856N623k834j122
$$ -71892 -84904 -104125 -119790 -118173 -134979 -107416 -104749 -126793 -117605 -114749 -109126 -111960 -113082
6609a13082M361Q05J6610j7969J804j4743l4385L5972p576j9958K0680P182k849
$$ -113082 -108721 -107916 -91306 -109275 -107471 -122214 -156599 -120627 -128203 -148161 -127481 -120299 -123148
6596a23148n655L179P325J2141j6103J6912M801j2680q063L619j044j1899J3557
$$ -123148 -128803 -125624 -118299 -106158 -122261 -105349 -100548 -113228 -121291 -117672 -118716 -130615 -117058
6583a17058J0772l660k0881O422j4564N073n338o063M429j359J5517j095k0432
$$ -117058 -106286 -109946 -130827 -124405 -138969 -133896 -139234 -145297 -140868 -142227 -126710 -127805 -148237
6570a48237R166q14n161j9250J707J3543L2128m508o506j1339R547J619J633K2417
$$ -148237 -139071 -139885 -145046 -164296 -162589 -149046 -116918 -121426 -127932 -139271 -129724 -128105 -126472 -104055
6556a04055j8027O652J2644o695j6708J7146L0678j0204j3295l7330K3693N375
$$ -104055 -122082 -115430 -102786 -109481 -126189 -109043 -78365 -88569 -101864 -139194 -115501 -110126
6544a10126o974j8940j5653K0906k7671M174J3391J3990q052m087K571J8562j7617
$$ -110126 -117100 -136040 -151693 -130787 -158458 -154284 -140893 -126903 -134955 -139042 -136471 -117909 -135526
6531a35526J2174P285o200o205M029P15j3477K390J836M937m756j8008r57J5860
$$ -135526 -123352 -116067 -122267 -128472 -124443 -123728 -137205 -134815 -132979 -128042 -132798 -150806 -151763 -135903
6517a35903J6833j2136p229j8649m1K1814l381P92j4877j2297R471J0204J4908
$$ -135903 -119070 -131206 -138435 -157084 -157125 -135311 -138692 -137900 -152777 -165074 -155603 -145399 -130491
6504a30491R612J0755J6203r575j4267l1561j2442L5391J80k6209k3671J5030
$$ -130491 -120879 -110124 -93921 -103496 -117763 -149324 -161766 -126375 -126195 -152404 -176075 -161045
6492a61045j7535K5910K991k627j228P597L615k4196j5841J365K9937j5274J8645
$$ -161045 -178580 -152670 -149679 -152306 -153534 -145937 -142322 -166518 -182359 -180994 -151057 -166331 -147686
6479a47686j294p112J9851j3805m327J1931q990p253l489l546K0468M902j2595
$$ -147686 -148980 -156092 -136241 -150046 -154373 -142442 -151432 -158685 -162174 -165720 -145252 -140350 -152945
6466a52945K2277K7892n951j5794O008k1415j9897J0710p181J3096J865l4734
$$ -152945 -130668 -102776 -108727 -124521 -118513 -139928 -159825 -149115 -156296 -143200 -141335 -176069
6454a76069l216K9896l914j9562J9852J0914j196l506k4772j8349Q305K593J0015
$$ -176069 -179285 -149389 -153303 -172865 -153013 -142099 -143295 -146801 -171573 -189922 -181617 -179024 -169009
6441a69009J258J2485J0179O324j1070j3400J3005J7570j9150k2597j7185R917
$$ -169009 -167751 -155266 -145087 -138763 -149833 -163233 -150228 -132658 -151808 -174405 -191590 -181673
6429a81673J9305J2263j0017j122J4753q742j3577L228j6171l720J1152q44m449
$$ -181673 -162368 -150105 -160122 -161244 -146491 -155233 -168810 -165582 -181753 -185473 -174321 -175165 -179614
6416a79614Q066n155J4591L1274R52m1886k1329k769K7683K991q529J2984o088
$$ -179614 -171548 -176703 -162112 -130838 -129886 -171772 -193101 -195870 -168187 -165196 -173725 -160741 -166829
6403a66829J5153j7188k7617J5046q811J368R560j4523J6082R360r271n471O61
$$ -166829 -151676 -168864 -196481 -181435 -190246 -188878 -179318 -193841 -177759 -168399 -177670 -183141 -182480
6390a82480J0119Q458j8151k077J706R632k653r130j0764K5938O327n186j9050
$$ -182480 -172361 -163903 -182054 -184131 -182425 -172793 -175446 -184576 -195340 -169402 -163075 -168261 -187311
6377a87311J3872K7779j8801K2017m56q195j1865L112j956l956P615q495m189
$$ -187311 -173439 -145660 -164461 -142444 -142900 -151095 -162960 -159848 -161804 -165760 -158145 -166640 -170829
6364a70829K4934O834l6963m803O059K1951o72L65R144M349k0122j0228J3334
$$ -170829 -145895 -139061 -176024 -180827 -174768 -152817 -153489 -153124 -143980 -139631 -159753 -169981 -156647
6351a56647P081R914J2593O04j5450J0632k453p728R536m620m103J4885p290J4045
$$ -156647 -149566 -139652 -127059 -126455 -141905 -131273 -133726 -141454 -131918 -136538 -140641 -125756 -133046 -119001
6337a19001q162j4717m133j1518K2127J4795j1902P367J1232j9144J7618R800
$$ -119001 -127163 -141880 -146013 -157531 -135404 -120609 -132511 -125144 -113912 -133056 -115438 -105638
6325a05638J7358N189k2250l731J4935L089p833n309n278n667K192p448J2576
$$ -105638 -88280 -83091 -105341 -109072 -94137 -91048 -98881 -104190 -109468 -115135 -112943 -120391 -107815
6312a07815j4716j0519J5974J172r013q846r881M675j9237l0621L7715J754j3449
$$ -107815 -122531 -133050 -117076 -115904 -124917 -133763 -143644 -138969 -158206 -188827 -151112 -149358 -162807
6299a62807M548j7013J9941N281O865J3998n500j7050M294k0798j7101L2502R926
$$ -162807 -158259 -175272 -155331 -150050 -143185 -129187 -134687 -151737 -147443 -168241 -185342 -152840 -142914
6286a42914l7039O151K5591j7694l812j2448k847K4640n108L059O594L800J7476
$$ -142914 -179953 -173802 -148211 -165905 -169717 -182165 -185012 -160372 -165480 -162421 -155827 -152027 -134551
6273a34551l617j7010l0249L2094m284j0926J2612K887k3652J236J1175J8909
$$ -134551 -138168 -155178 -185427 -153333 -157617 -168543 -155931 -153044 -176696 -175460 -164285 -145376
6261a45376l0554r103J8190l102O692j7829J9939Q880J3534j5082O44n579J2818
$$ -145376 -175930 -185033 -166843 -169945 -163253 -181082 -161143 -152263 -138729 -153811 -153167 -158746 -145928
6248a45928N624k0286q444o372M502r672J543Q631j6773L579J4547O236k687n143
$$ -145928 -140304 -160590 -169034 -175406 -170904 -180576 -179033 -170402 -187175 -183596 -169049 -162813 -165500 -170643
6234a70643J590l626K713k2501J7388K0509J5499j9190k0089J4441R462j8435
$$ -170643 -169053 -172679 -169966 -192467 -175079 -154570 -139071 -158261 -178350 -163909 -154447 -172882
6222a72882J5419q565K831K309j125N203m29Q935j0058j6766N882J7880j6897
$$ -172882 -157463 -166028 -163197 -160888 -162013 -156810 -157239 -148304 -158362 -175128 -169246 -151366 -168263
6209a68263L507k3910p12J4029l44j1484K487Q249L523K3129J8395q074j6910
$$ -168263 -164756 -188666 -189378 -175349 -175693 -187177 -184690 -176441 -172918 -149789 -131394 -139468 -156378
6196a56378k0050J3519N750j6363J38j0856J601J3304J6965m544q679j3897o986
$$ -156378 -176428 -162909 -157159 -173522 -173384 -184240 -182639 -169335 -152370 -156914 -165593 -179490 -186476
6183a86476r588M389K0766m03R850j3218K2042m07l5627L355J8329k0482J3500
$$ -186476 -196064 -191675 -170909 -171312 -161462 -174680 -152638 -153045 -188672 -185317 -166988 -187470 -173970
6170a73970J4862Q037o816k2760J6975n24J2565j6598Q843J2343m96j6688J9807
$$ -173970 -159108 -151071 -157887 -180647 -163672 -164196 -151631 -168229 -159386 -147043 -147539 -164227 -144420
6157a44420K3083k6126l2099J1180J817j6499o303k886j5427J3651L1469J7074
$$ -144420 -121337 -147463 -179562 -168382 -166565 -183064 -189367 -192253 -207680 -194029 -162560 -145486
6145a45486O413J57P611j4439k7261p915J9752K847k0949L0979n391p746r555
$$ -145486 -139073 -138916 -131305 -145744 -173005 -180920 -161168 -158321 -179270 -148291 -153682 -161428 -170983
6132a70983l477M2060k8073k9883N187k481J486K2580J1196l873J4471j4831l1357
$$ -170983 -174460 -132400 -160473 -190356 -185169 -187650 -186164 -163584 -152388 -156261 -141790 -156621 -187978
6119a87978k2527L5988J0181o660L002m165R427Q47M791R519p187n553Q939Q650
$$ -187978 -210505 -174517 -164336 -170996 -167994 -172159 -162732 -161885 -157094 -147575 -154762 -160315 -151376 -142726
6105a42726Q489k2719J4050j1998J2255k1618l871p836J545J983O322j2794k963
$$ -142726 -134237 -156956 -142906 -154904 -142649 -164267 -168138 -175974 -174429 -172446 -166124 -178918 -181881
6092a81881J5274K7327q794l26J7051j1053j1353k0270j6839J7226Q979o236R727
$$ -181881 -166607 -139280 -148074 -148400 -131349 -142402 -153755 -174025 -190864 -173638 -164659 -170895 -161168
6079a61168J1047J0460p831O298p348l3679Q982J3543K603q045K148O877P64K000
$$ -161168 -150121 -139661 -147492 -141194 -148542 -182221 -173239 -159696 -157093 -165138 -162990 -156113 -155349 -153349
6065a53349P041k2027O753J0335j7658R96Q318o571M651K7160o250o136O128k613
$$ -153349 -146308 -168335 -161582 -151247 -168905 -167909 -159591 -166162 -161511 -134351 -140601 -146737 -140609 -143222
6051a43222p056l3049N969Q640j6659N685K6186O025M43k8019k1113K6232k3835
$$ -143222 -150278 -183327 -177358 -168718 -185377 -179692 -153506 -147481 -147038 -175057 -196170 -169938 -193773
6038a93773K0705m44l640K2357J6635l7555j752J7216J515m531j1559r409O312
$$ -193773 -173068 -173512 -177152 -154795 -138160 -175715 -177467 -160251 -158736 -163267 -174826 -184235 -177923
6025a77923k953L1402K2290O693L070l1865j3531K759N745K3427K487J170L579
$$ -177923 -180876 -149474 -127184 -120491 -117421 -149286 -162817 -160058 -154313 -130886 -128399 -127229 -123650
6012a23650N172m155j0201p588K2514N360J0805N852k797K758J5049j9702r739
$$ -123650 -118478 -122633 -132834 -140422 -117908 -112548 -101743 -95891 -98688 -95930 -80881 -100583 -110322
5999a10322M048r074k000J5518L641r040n77j3158k1437J2504J3791j484J7385
$$ -110322 -106274 -115348 -117348 -101830 -98189 -107229 -107806 -120964 -142401 -129897 -116106 -117590 -100205
5986a00205J4556Q810m3406j2292J0843L754M896J0394N162J5199J3367J6584
$$ -100205 -85649 -76839 -120245 -132537 -121694 -117940 -113044 -102650 -97488 -82289 -68922 -52338
5974e2338K5876N883j2461r135n092O245l3l4223j6125J0702l72l3722J0599J039
$$ -52338 -26462 -20579 -33040 -42175 -47267 -41022 -41055 -75278 -91403 -80701 -81073 -114795 -104196 -103157
5960a03157Q427q319l6411Q50n574j849K1313K8514J3180m09q556k0437n969L0952
$$ -103157 -94730 -103049 -139460 -138610 -144184 -146033 -124720 -96206 -83026 -83435 -91991 -112428 -118397 -87445
5946h7445L97K0427j3237p418j431q886l15n829J949J6682k6286K1162k7599j8726
$$ -87445 -87048 -66621 -79858 -87276 -88707 -97593 -97908 -103737 -101788 -85106 -111392 -90230 -117829 -136555
5932a36555J8944p763k173j5668J9071K001q145n456J8383J5301p109m734k3311
$$ -136555 -117611 -125374 -127547 -143215 -124144 -122143 -130288 -135744 -117361 -102060 -109169 -113903 -137214
5919a37214j7593Q137L776L385J6979n334k602L9924j7302j338j9205k3446k837
$$ -137214 -154807 -146670 -142894 -139509 -122530 -127864 -130466 -90542 -107844 -109182 -128387 -151833 -154670
5906a54670K4446K1786o790J6166l097o320j4451N544j7764K635Q61J4852J9652
$$ -154670 -130224 -108438 -115228 -99062 -102159 -108479 -122930 -117386 -135150 -132515 -131654 -116802 -97150
5893i7150l214P837n659j2142m974k1808N783L762o771J5656J253K2714N14j1654
$$ -97150 -100364 -92527 -98186 -110328 -115302 -137110 -131327 -127565 -134336 -118680 -117427 -94713 -94199 -105853
5879a05853q17k847p691K1844l923o238J1377k48o529M615j405j1851J7846L8244
$$ -105853 -106670 -109517 -117208 -95364 -99287 -105525 -94148 -94396 -100925 -96310 -97715 -109566 -91720 -53476
5865e3476k8128j8784J0150n738j1666j0948J8250j7758J9531j0584p496l99K356
$$ -53476 -81604 -100388 -90238 -95976 -107642 -118590 -100340 -118098 -98567 -109151 -116647 -117046 -114690
5852a14690K766O677j4316R716J444Q303j1590J3740K8866j2715J2381O1j2212
$$ -114690 -111924 -105247 -119563 -109847 -108403 -100100 -111690 -97950 -69084 -81799 -69418 -69357 -81569
5839h1569J4914O942n216j455k1061L255k7858p513k1022j6058L2167J366j9487
$$ -81569 -66655 -59713 -64929 -66384 -87445 -84190 -112048 -119561 -140583 -156641 -124474 -123108 -142595
5826a42595K7815J3208N171j4990j3384p929N719J2136n115K238J4021N065k0632
$$ -142595 -114780 -101572 -96401 -111391 -124775 -132704 -126985 -114849 -119964 -117726 -103705 -98640 -119272
5813a19272L727r04M016J4449m553j0786L2130K3506o225L1174j6982l0232k4531
$$ -119272 -115545 -116449 -112433 -97984 -102537 -113323 -81193 -57687 -63912 -32738 -49720 -79952 -104483
5800a04483R95j457j8285j6701L3139L26k8456O407J4876J8215P966j4432j0960
$$ -104483 -103488 -104945 -123230 -139931 -106792 -106466 -134922 -128515 -113639 -95424 -87458 -101890 -112850
5787a12850j707j8870j8380J8711J5011j729l289P907j4679j7642L2230Q785j4975
$$ -112850 -114557 -133427 -151807 -133096 -118085 -119814 -123103 -115196 -129875 -147517 -115287 -106502 -121477
5774a21477l54j1666K032P359K511N223J406p752R087J818j2056J9508J3959l932
$$ -121477 -121831 -133497 -131465 -124106 -121595 -116372 -114966 -122718 -113631 -111813 -123869 -104361 -90402 -94334
5760i4334J039J3161r702j5334l2096j455K1752q597K0068m913l004J763j848
$$ -94334 -93295 -80134 -89836 -105170 -137266 -138721 -116969 -125566 -105498 -110411 -113415 -111652 -113500
5747a13500N490k1014K6831J3203k2286k9089n635j5988K5702M411m857j4916
$$ -113500 -108010 -129024 -102193 -88990 -111276 -140365 -146000 -161988 -136286 -131875 -136732 -151648
5735a51648j625L7621j0241j3479k450k0688J5840L312j2771K9910J5052l1824
$$ -151648 -153273 -115652 -125893 -139372 -141822 -162510 -146670 -143358 -156129 -126219 -111167 -142991
5723a42991q932J2789n146k759q633K2205K99l514l702j757r72L5704M382q851
$$ -142991 -151923 -139134 -144280 -147039 -155672 -133467 -133168 -136682 -140384 -142141 -143113 -107409 -103027 -111878
5709a11878q574l9738J4335j0365j7234M410j0672O584J6197J1676J5921J6995
$$ -111878 -120452 -160190 -145855 -156220 -173454 -169044 -179716 -173132 -156935 -145259 -129338 -112343
5697a12343l3751N308R025m2705J0640L299K3322J0036j0700k7855q903J5170
$$ -112343 -146094 -140786 -131761 -174466 -163826 -160527 -137205 -127169 -137869 -165724 -174627 -159457
5685a59457J3165J1747j4316j1509L803J5311q883n768j5250O611q766m992J6099
$$ -159457 -146292 -134545 -148861 -160370 -156567 -141256 -150139 -155907 -171157 -164546 -173312 -178304 -162205
5672a62205J6829k624j9222J0040K134M554j4582j0960k496K0320Q5k2429j1694
$$ -162205 -145376 -148000 -167222 -157182 -155048 -150494 -165076 -176036 -178532 -158212 -158127 -180556 -192250
5659a92250k238J6848l412j2323J9959m850Q274J299J9652j0041r226q312J7189
$$ -192250 -194488 -177640 -181052 -193375 -173416 -178266 -169992 -168693 -149041 -159082 -168308 -176620 -159431
5646a59431R981l268J8774j7700j3264p722Q552k0853j2266K6599j7634J3902
$$ -159431 -149450 -152718 -133944 -151644 -164908 -172630 -164078 -184931 -197197 -170598 -188232 -174330
5634a74330J7082k0300J5916R095m073M166j644k2066J0463k0082J2575R070O712
$$ -174330 -157248 -177548 -161632 -152537 -156610 -152444 -154088 -176154 -165691 -185773 -173198 -164128 -157416
5621a57416p544j3827K5780j1128J101j6460J8984J5279m316k565j1908K678l8834
$$ -157416 -164960 -178787 -153007 -164135 -163034 -179494 -160510 -145231 -149547 -152112 -164020 -161342 -200176
5608b00176K8359m164K1309K795J906j9949j9689k921j1100L3829Q753j28j2595
$$ -200176 -171817 -175981 -154672 -151877 -149971 -169920 -189609 -192530 -203630 -169801 -161048 -161176 -173771
5595a73771r486J7106J752L72M618j2996O945J3242J5494N315J0087n512j3880
$$ -173771 -183257 -166151 -164399 -164027 -159409 -172405 -165460 -152218 -136724 -131409 -121322 -126834 -140714
5582a40714L988q936p650J286j106J8749k7539R14J1840L686j0253k3109O586
$$ -140714 -136726 -145662 -153312 -152026 -153132 -134383 -161922 -161008 -149168 -145482 -155735 -178844 -172258
5569a72258l4861J1090J0532k010L5876k8541K149k483L316R013j2579O619R304
$$ -172258 -207119 -196029 -185497 -187507 -151631 -180172 -178023 -180506 -177190 -168177 -180756 -174137 -164833
5556a64833K2482q24j4178k0101N955M413n0j4152j1751J2642J1065L433j3839
$$ -164833 -142351 -143175 -157353 -177454 -171499 -167086 -167136 -181288 -193039 -180397 -169332 -165899 -179738
5543a79738J4324j3658j511Q659K965l068m629Q428J619m915l734J7654j0199
$$ -179738 -165414 -179072 -180583 -171924 -168959 -172027 -176656 -168228 -166609 -171524 -175258 -157604 -167803
5530a67803n080j1097J8931Q085L193L807q506M444o445J7105k223K453j8071
$$ -167803 -172883 -183980 -165049 -156964 -153771 -149964 -158470 -154026 -160471 -143366 -145589 -143136 -161207
5517a61207O715K4131l06J3547j4724j9977K2008r156m27L0553j2915j9998k3446
$$ -161207 -154492 -130361 -130667 -117120 -131844 -151821 -129813 -138969 -139396 -108843 -121758 -141756 -165202
5504a65202J09J8059j8229J4980J7098j5903J7810k5963m852k099K1192J2021
$$ -165202 -165093 -147034 -165263 -150283 -133185 -149088 -131278 -157241 -162093 -164192 -143000 -130979
5492a30979J4498J5901k5861j4608j1968P13n003p324k926M6580K1420j0493o271
$$ -130979 -116481 -100580 -126441 -141049 -153017 -152304 -157307 -164631 -167557 -120977 -99557 -110050 -116321
5479a16321N624q125L03R649J602M432J5007o378q145j119q663J074r861r999
$$ -116321 -110697 -118822 -118519 -108870 -107268 -102836 -87829 -94207 -102352 -103471 -112134 -111060 -120921 -130920
5465a30920K6301K7719j7556K9415j5706l6554J6526P692J3786Q97J975K3515
$$ -130920 -104619 -76900 -94456 -65041 -80747 -117301 -100775 -93083 -79297 -78400 -76425 -52910
5453e2910J391p443J6799K8707K5681Q539j0623Q267J8931n219J464r602l4274
$$ -52910 -51519 -58962 -42163 -13456 12225 20764 10141 18408 37339 32120 33584 23982 -10292
5440a0292j6641q052k450k4710j71K5322l5551J5057J2143k9986M086M118K8192
$$ -10292 -26933 -34985 -37435 -62145 -62316 -36994 -72545 -57488 -45345 -75331 -71245 -67127 -38935
5427c8935N013j2166j7512J3226J7728R179J3896Q776n5K9266L0059R862j7742
$$ -38935 -33922 -46088 -63600 -50374 -32646 -23467 -9571 -795 -850 28416 58475 68337 50595
5414E0595L2366L2642k0037l0395j898N842l6349k9699k1862N288j1945j234L294
$$ 50595 82961 115603 95566 65171 63273 69115 32766 3067 -18795 -13507 -25452 -26686 -23392
5401b3392J2913k2854j859k170N960P652K1259N191J8008n801L4224J7234k1977
$$ -23392 -10479 -33333 -35192 -37362 -31402 -23750 -2491 2700 20708 14907 49131 66365 44388
5388D4388M749n716m2701j304K4503L068l7638K724K9162o960l1474j5183K5656
$$ 44388 49137 43421 720 -584 23919 26987 -10651 -7927 21235 14275 -17199 -32382 -6726
5375f726n970p719j0588M409o444J3087K6659P294l4611Q848O874K5172q701Q175
$$ -6726 -12696 -20415 -31003 -26594 -33038 -19951 6708 14002 -20609 -11761 -4887 20285 11584 19759
5361A9759J2096l82j2822l7225N541k5826k639J774k6504k95J6900K579k34P764
$$ 19759 31855 31473 18651 -18574 -13033 -38859 -41498 -39724 -66228 -66523 -49623 -47044 -47278 -39514
5347c9514P88n752k5689N270o42K785J1665n002m202K2047l542M802Q386J191
$$ -39514 -38726 -44478 -70167 -64897 -65539 -62754 -51089 -56091 -60293 -38246 -41788 -36986 -28600 -27409
5333b7409M899r164k7094n987k3357j8914R261k1298L423n223k2483K5764L1409
$$ -27409 -22510 -31674 -58768 -64755 -88112 -107026 -97765 -119063 -115640 -120863 -143346 -117582 -86173
5320h6173J0071O132O615o219k0298J0549k3624j1508J1173R872q848J2681p383
$$ -86173 -76102 -69970 -63355 -69574 -89872 -79323 -102947 -114455 -103282 -93410 -102258 -89577 -96960
5307i6960k5475J6309J8408N034j6831J421J6560P937N899j9401k1382J4444N137
$$ -96960 -122435 -106126 -87718 -82684 -99515 -98094 -81534 -73597 -67698 -87099 -108481 -94037 -88900
5294h8900M704J8779O053j4564j816P849N040O92j8274n746K1357p620k116j0663
$$ -88900 -84196 -65417 -59364 -73928 -75744 -67895 -62855 -62163 -80437 -86183 -64826 -72446 -74562 -85225
5280h5225k7066M531k768J2852K676k311j8198J6017L813J51M2813K6510Q887
$$ -85225 -112291 -107760 -110528 -97676 -95000 -97311 -115509 -99492 -95679 -95528 -52715 -26205 -17318
5267a7318p873j1426J0607k3399m7700j5551K2168L1340j3037N735j7216m021
$$ -17318 -25191 -36617 -26010 -49409 -97109 -112660 -90492 -59152 -72189 -66454 -83670 -87691
5255h7691j0402p437R93J1289j1557R975q5K0298J4750j5582J0356k388J677K6991
$$ -87691 -98093 -105530 -104537 -93248 -104805 -94830 -94915 -74617 -59867 -75449 -65093 -67481 -65804 -38813
5241c8813p02l260J8393N1043o500k6368m895l1491N775j1210J291k1135J815
$$ -38813 -39515 -42775 -24382 26661 20161 -6207 -11102 -42593 -36818 -48028 -46737 -67872 -66057
5228f6057J2770J4285j7505n222J7967k1249k834J0908O207j4218J8468Q487j7436
$$ -66057 -53287 -39002 -56507 -61729 -43762 -65011 -67845 -56937 -50730 -64948 -46480 -37993 -55429
5215e5429L5078K7228k451l0182p85L1658K4453J6463P220J1194K3118K2079K7631
$$ -55429 -20351 6877 4426 -25756 -26541 5117 29570 46033 53253 64447 87565 109644 137275
5202A37275J8111R823K5J4041l4342Q432J3028N912j5202n123k8787j4817j9750
$$ 137275 155386 165209 165234 179275 144933 153365 166393 172305 157103 151980 123193 108376 88626
5189H8626l9643O358k5947m457m995j6661k190k9944l8847M972p982K830j549
$$ 88626 48983 55341 29394 24937 19942 3281 1091 -28853 -67700 -62728 -70710 -67880 -69429
5176f9429L0478n36k9873j1857j4320K1314k2895K2262J599J6025J4949k6490
$$ -69429 -38951 -39487 -69360 -81217 -95537 -74223 -97118 -74856 -73257 -57232 -42283 -68773
5164f8773j1051K144O580p956j0500q357O429J0930N854o104K096J8041N074m2463
$$ -68773 -79824 -77680 -71100 -79056 -89556 -97913 -91484 -80554 -74700 -80804 -78708 -60667 -55593 -98056
5150i8056K9105K0853l243k2537Q551K0101j8936J8035j489N518M563m52K4205
$$ -98056 -68951 -48098 -51341 -73878 -65327 -45226 -64162 -46127 -47616 -42098 -37535 -37987 -13782
5137a3782J5542J8795J1102J2489O326O972M519L8712L626M4770O1293K3768M5370
$$ -13782 1760 20555 31657 44146 50472 57444 61963 100675 104301 149071 210364 234132 279502
5124B79502K2786K2427L3772M0323L5344J2168q945L442p394p029J8100k4382
$$ 279502 302288 324715 358487 398810 434154 446322 437377 440819 433425 426396 444496 420114
5112D20114m6794o0312m7589l9600l6628l9244l1473p653m677l3732o021k2919
$$ 420114 373320 313008 265419 225819 189191 149947 118474 110821 106144 72412 66391 43472
5100D3472j0914N013M165l4799m731J3355m358J9443J0966k58K660l014k1865
$$ 43472 32558 37571 41736 6937 2206 15561 11203 30646 41612 41354 44014 41000 19135
5087A9135j4772j980J3199k6993J0515j5673o477K6647k1339j8028r129J2763
$$ 19135 4363 2383 15582 -11411 -896 -16569 -23046 3601 -17738 -35766 -44895 -32132
5075c2132J1071k3047J036n701J0416J0395L6762l262r345J3538j2888K5118K1147
$$ -32132 -21061 -44108 -43072 -48773 -38357 -27962 8800 5538 -3807 9731 -3157 21961 43108
5062D3108j462m276L2140O064l1162L0815O451l5092j0529k149j3033N56p978
$$ 43108 41646 37370 69510 75574 44412 75227 81678 46586 36057 33908 20875 21431 13453
5049A3453k8734K567o185O876j3411n397j9136L377J1791N16o157K4520L2908
$$ 13453 -15281 -12714 -18899 -12023 -25434 -30831 -49967 -46590 -34799 -34283 -40440 -15920 16988
5036A6988j4647J1180l0509J563J1873Q089j3845N118K0109J0414k4901K57R56
$$ 16988 2341 13521 -16988 -15425 -3552 4537 -9308 -4190 15919 26333 1432 1689 2645
5023B645k1448K2742l580k7480n875p684j8126P240k187J4388N309q413J0635
$$ 2645 -18803 3939 359 -27121 -32996 -40680 -58806 -51566 -53753 -39365 -34056 -42469 -31834
5010c1834q707l449L3797J0252l5645J6774k45r531K810L7921p560P984J9955
$$ -31834 -40541 -43990 -10193 59 -35586 -18812 -19057 -28588 -25778 12143 4583 12567 32522
4997C2522k2694J2049J3572L3019J8712K0902M5401J9581R581L7225L8496O2552
$$ 32522 9828 21877 35449 68468 87180 108082 153483 173064 182645 219870 258366 320918
4985C20918N3507O3252L3525P928J9647K0431j6166J1814M194l6266n0542n9303
$$ 320918 374425 437677 471202 479130 498777 519208 503042 514856 519050 482784 432242 372939
4973C72939n8305m4369m3787m3051r229m3149l6939l82l0680j290J1942k6577
$$ 372939 314634 270265 226478 183427 174198 131049 94110 93728 63048 61758 73700 47123
4961D7123L530k1527l5934Q177l502J6366k6009j0771N691j6170J4853J753J0858
$$ 47123 50653 29126 -6808 1369 -2133 14233 -11776 -22547 -16856 -33026 -18173 -16420 -5562
4948e562j4137J2588r551r359K0949q797q806K21j2659o138K071K2165J6350r594
$$ -5562 -19699 -7111 -16662 -26021 -5072 -13869 -22675 -22454 -35113 -41251 -39180 -17015 -665 -10259
4934a0259o23K0256R880j0353q043l0430K2963R033j8116K3891J8923j4257j3467
$$ -10259 -10882 9374 19254 8901 858 -29572 -6609 2424 -15692 8199 27122 12865 -602
4921f02r122q384m0J4506K4406J8439M010J0364K452p130L0019K1231p315N0M4735
$$ -602 -9724 -18108 -18148 -3642 20764 39203 43213 53577 56029 48899 78918 100149 92834 92884 137619
4906A37619K1163l995K6217L3090j2632k119K3241M8212O393r674k1670k3407
$$ 137619 158782 154787 181004 214094 201462 199343 222584 270796 277189 267515 245845 222438
4894B22438k3619m2102k5049k0087O0k2305q503j105l0186k8417k9338P387K4734
$$ 222438 198819 156717 131668 111581 111641 89336 80833 79728 49542 21125 -8213 -826 23908
4881B3908r363K4277k07j7535j3153j797p72o226k479j8580K7785k911j7329J3712
$$ 23908 14545 38822 38615 21080 7927 6130 5358 -868 -3347 -21927 5858 2947 -14382 -670
4867f70n112J4512j77q10L7049j9640j9538K8611K1770P907k101J8910l7229o8
$$ -670 -5782 8730 8553 7743 44792 25152 5614 34225 55995 63902 61801 80711 43482 43414
4853D3414K8696k294j1652K104N742M113q046J1882N398k0830n417j2828j1187
$$ 43414 72110 69816 58164 60268 66010 70123 62077 73959 79357 58527 53110 40282 29095
4840B9095M201J6026k722j9647J7741M863l542m462M752N214m253k6053L973J1601
$$ 29095 33296 49322 46600 26953 44694 49557 46015 41553 46305 51519 47266 21213 25186 36787
4826C6787K4122N402L260j5739Q853J1639k4929J4437J4244r530R602J8533l2856
$$ 36787 60909 66311 69571 53832 62685 74324 49395 63832 78076 68546 78148 96681 63825
4813F3825k7806J8156R174k265J0464J3900M965k1700J8972K400J3029J5986Q236
$$ 63825 36019 54175 63349 61084 71548 85448 90413 68713 87685 90085 103114 119100 127336
4800A27336q224J0569M655J2495k0775N594l065k3032o812J4493L1368p861k8480
$$ 127336 119112 129681 134336 146831 126056 131650 128585 105553 98741 113234 144602 136741 108261
4787A08261l303q563k7324K595Q331m449K0465M3J9372m013j796J3561R053j3711
$$ 108261 104958 96395 69071 71666 79997 75548 96013 96056 115428 111415 109619 123180 132233 118522
4773A18522q289j570Q999J3713n842J3190J6421P284J2443k6910j0644j0682j5204
$$ 118522 110233 108663 117662 131375 125533 138723 155144 162428 174871 147961 137317 126635 111431
4760A11431l279O78K1366K3506J2066r263K1808J7398J1161J5002L5874n237K959
$$ 111431 108152 108830 130196 153702 165768 156505 178313 195711 206872 221874 257748 252511 255470
4747B55470p923m6196k9867k9209r10r099j2839k1369j0341N4P466L763j2948
$$ 255470 247547 201351 171484 142275 141365 132266 119427 98058 87717 87771 95237 99000 86052
4734H6052O227q002J124n427Q22P350O709N511J6010j2897n587j3412m540k6637
$$ 86052 92279 84277 85401 79974 80796 88146 94855 100366 116376 103479 97892 84480 79940 53303
4720E3303R679J6823J2305L706q443j1830M891j5710k9900K0525L266j4095l810
$$ 53303 62982 79805 92110 95816 87373 75543 80434 64724 34824 55349 58615 44520 40710
4707D0710Q740n566l31J0757Q523j0951p836K2327m906J912R77J5157j686j0122
$$ 40710 49450 43884 43553 54310 62833 51882 44046 66373 61467 63379 64356 79513 77827 67705
4693F7705J2810J2229j2682j5398J6175j0451R033R963R098J9650J0922K3746
$$ 67705 80515 92744 80062 64664 80839 70388 79421 89384 98482 118132 129054 152800
4681A52800J1434K0588J8650N661P660J2407j5180j5570j1226j1824k8491o945
$$ 152800 164234 184822 203472 209133 216793 229200 214020 198450 187224 175400 146909 139964
4669A39964R463j1445J951N860J1916J1606L0802J2220J4805m424L6713N8488
$$ 139964 149427 137982 139933 145793 157709 169315 200117 212337 227142 222718 259431 317919
4657C17919O2769N9703J128m0593l4472o8305l5102n4161j8507j5317l948J289
$$ 317919 380688 440391 441519 400926 366454 298149 263047 208886 190379 175062 171114 172403
4645A72403k0325r2j797o987p76j9832O702j5969k8588L898j618Q720l1412j153
$$ 172403 152078 151986 150189 143202 142426 122594 129296 113327 84739 88637 87019 95739 64327 63174
4631F3174L0473M0736k8375k0054J0800j2385j8309K7076j0572l0740j3444K3992
$$ 63174 93647 134383 106008 85954 96754 84369 66060 93136 82564 51824 38380 62372
4619F2372j1992o83K2895Q626J4823J729l682R116j8293J1930k239l1464J4943
$$ 62372 50380 49697 72592 81218 96041 97770 94088 103204 84911 96841 94602 63138 78081
4606G8081J0837K5302j7558k579m370J6141J0864j0569j002r244J9428N221j8925
$$ 78081 88918 114220 96662 94083 89713 105854 116718 106149 105147 95903 115331 120552 101627
4593A01627m098J7386J1546j8024j0023J2064M3066J2697k9787p577J6613J4249
$$ 101627 97529 114915 126461 108437 98414 110478 153544 166241 136454 128877 145490 159739
4581A59739J188j2748K147L3189R082k5449j1387M8014J0923k637Q315J561J1351
$$ 159739 160927 148179 150326 183515 192597 167148 155761 203775 214698 212061 220376 221937 233288
4568B33288O421r5K240Q271J1798j5189m05l25J2324J0281J0481K3889j2968M954
$$ 233288 239709 239614 241854 250125 261923 246734 246329 246004 258328 268609 279090 302979 290011 294965
4554B94965O007k1692N561O867j4739O600m568p463n620M145J0807R442k2212
$$ 294965 300972 279280 284841 291708 276969 283569 279001 271538 265918 270063 280870 290312 268100
4541B68100m832j8594j0470K4852K1915p098K0219j1110P204N424L545j0505J946
$$ 268100 263268 244674 234204 259056 280971 273873 294092 282982 290186 295610 299155 288650 290596
4528B90596K2221J229l3047k7987K1813P940P641L70O197L085j964M851r954j7500
$$ 290596 312817 314046 280999 253012 274825 282765 290406 290776 296973 300058 298094 302945 292991 275491
4514B75491J2090k017K3020R734k0985J1506K0579Q831j5K2374J2467N700R548
$$ 275491 287581 285564 308584 318318 297333 308839 329418 338249 338234 360608 373075 378775 388323
4501C88323n967K7223L1307j7082P796L4635K0916k657l580J5877K4428O482J531
$$ 388323 382356 409579 440886 423804 431600 466235 487151 484494 480914 496791 521219 527701 529232
4488E29232q65l3444R955m019l2395j7602K1591p531k135J7596j2532j0888K2577
$$ 529232 528367 494923 504878 500859 468464 450862 472453 464922 462787 480383 467851 456963 479540
4475D79540J7643J4652K5603L0246k7515r898L771L506M262j934P902L6948K1351
$$ 479540 497183 511835 537438 567684 540169 530271 534042 537548 541810 539876 547778 584726 606077
4462F06077N930q776K1185K8224J2466m964k1178K1871j7883k1584L7538K5871
$$ 606077 612007 603231 624416 652640 665106 660142 638964 660835 642952 621368 658906 684777
4450F84777J921j7321O834N653J3931j1339j7226K7152k0440j2538L2665K0811
$$ 684777 686698 669377 676211 681864 695795 684456 667230 694382 673942 661404 694069 714880
4438G14880J2661J0994k864K0295k0030P76l4417p391L152J1033Q849n889p382
$$ 714880 727541 738535 735671 755966 735936 736712 702295 694904 698056 709089 717938 712049 704667
4425G04667k5335N770K2138o586J1471M796N471m538m839l919K6150K4639L262
$$ 704667 679332 685102 707240 700654 712125 716921 722392 717854 713015 709096 735246 759885 763147
4412G63147j3060j5046J0118K5677q691j0684L3866J0390k723o587j376j4015
$$ 763147 750087 735041 745159 770836 762145 751461 785327 795717 792994 786407 785031 771016
4400G71016j596k1724k575L4304J8985j630k657j6368k264N737j1176J9812j0800
$$ 771016 769420 747696 745121 779425 798410 796780 794123 777755 775491 781228 770052 789864 779064
4387G79064k105l646K161n536J5075J9208j3896j6834j758J8023j6151m861j3517
$$ 779064 776959 773313 775474 769938 785013 804221 790325 773491 771733 789756 773605 768744 755227
4374G55227R905Q604L227j1543j5179j226K4885M235Q60Q222K287j8901J5130
$$ 755227 765132 773736 776963 765420 750241 749015 773900 778135 778995 787217 789504 770603 785733
4361G85733j74J8268J140p064J2910J1747J2485m088K1332K5955j224P594Q202
$$ 785733 785559 803827 804967 797903 810813 822560 835045 830957 852289 878244 877020 884614 892816
4348H92816j0181N210J1550L019j3097J0914J5915J6406L886J9872K7414K292
$$ 892816 882635 887845 899395 902414 889317 900231 916146 932552 936438 956310 983724 986016
4336I86016K8131M473J6601J9735K9201Q591O4472O0262J309J1552L25K8985J5823
$$ 986016 1014147 1018620 1035221 1054956 1084157 1092748 1157220 1217482 1218791 1230343 1230668 1259653 1275476
4323A275476k4408P672N170K647L4360L814p93J6996L0672K4837K7253Q720M6277
$$ 1275476 1251068 1258740 1263910 1266557 1300917 1304731 1303938 1320934 1351606 1376443 1403696 1412416 1458693
4310A458693K225K7060K0365L1286K8959M3259L0407K3798N0885K776O76L9537
$$ 1458693 1460918 1487978 1508343 1539629 1568588 1611847 1642254 1666052 1716937 1719713 1720389 1759926
4298A759926K9788k1674j6589Q519Q226K198j2017J5949J877M668J7244L4927
$$ 1759926 1789714 1768040 1751451 1759970 1768196 1770394 1758377 1774326 1776203 1780871 1798115 1833042
4286A833042K5831L9608K4021R199K5750K2336K2697K3497Q157K7855N8835M7470
$$ 1833042 1858873 1898481 1922502 1931701 1957451 1979787 2002484 2025981 2034138 2061993 2120828 2168298
4274B168298M2559N2872K1353J3785N6941M9026L9134J0260L7574N2271K9199
$$ 2168298 2210857 2263729 2285082 2298867 2355808 2404834 2443968 2454228 2491802 2544073 2573272
4263B573272%K7488J5407K1084L9047L2093L2064J9289Q868L8642J8076L1651
$$ 2573272 2573272 2600760 2616167 2637251 2676298 2708391 2740455 2759744 2768612 2807254 2825330 2856981
4251B856981M1378L7758L4467K6736O0754M6066O8703Q1304P7699R5812Q4217
$$ 2856981 2898359 2936117 2970584 2997320 3058074 3104140 3172843 3254147 3331846 3427658 3511875
4240C511875J10052J13557J95516K21416K45392L17371M01455M56565N52622O01652
$$ 3511875 3621927 3735484 3931000 4152416 4397808 4715179 5116634 5573199 6125821 6727473
4230F727473L23454q9590l66143m77775n31634m64996l51669k26313j79725j21125
$$ 6727473 7050927 6961337 6595194 6117419 5585785 5120789 4769120 4542807 4363082 4241957
4220D241957q7742p1934q6175o6803k1745m1439l0381j3436j7280J866l7028l9888
$$ 4241957 4154215 4082281 3996106 3929303 3907558 3866119 3835738 3822302 3805022 3806888 3769860 3729972
4208C729972k3412l4358m0920o0113o8651n2418o4257o8956o7903j04065j01020
$$ 3729972 3706560 3672202 3631282 3571169 3502518 3450100 3385843 3316887 3248984 3144919 3043899
4197C043899p6560o6878r7415m0641n1584n5173k799k0838j8742O026J462m737
$$ 3043899 2967339 2900461 2803046 2762405 2710821 2655648 2652849 2632011 2613269 2619295 2620757 2616020
4185B616020K2275L3857R01N752K8239P748J0925K8330J1353L0114l6822R698
$$ 2616020 2638295 2672152 2673053 2678805 2707044 2714792 2725717 2754047 2765400 2795514 2758692 2768390
4173B768390O17r858k7573j833k6964o23J4052K6752K3335j0289K7783L5181K0322
$$ 2768390 2769007 2759149 2731576 2729743 2702779 2702156 2716208 2742960 2766295 2756006 2783789 2818970 2839292
4160B839292J6414N2190K1724K4171M3050O2279P724K1417J1662R428K227J5592
$$ 2839292 2855706 2907896 2929620 2953791 2996841 3059120 3066844 3088261 3099923 3109351 3111578 3127170
4148C127170J8099J8990J6010Q538N6668J3693N748O9527P4785J5708K5525N6030
$$ 3127170 3145269 3164259 3180269 3188807 3245475 3259168 3264916 3334443 3409228 3424936 3450461 3506491
4136C506491M9718N6948O4703P1046N1711O8242O2653R1093J20542J19485J18173
$$ 3506491 3556209 3613157 3677860 3748906 3800617 3868859 3931512 4022605 4143147 4262632 4380805
4125D380805J28724J35808J36518J42075J98910K60194L57083M65298M88315K56223
$$ 4380805 4509529 4645337 4781855 4923930 5122840 5383034 5740117 6205415 6693730 6949953
4115F949953n9017k73287l74118m08265l51814k52697j81410j12136o5251n4730
$$ 6949953 6890936 6617649 6243531 5835266 5483452 5230755 5049345 4937209 4871958 4817228
4105D817228l6115l5091l2010O013k6841k5320l514j4117K3841P20J3896p886
$$ 4817228 4781113 4746022 4714012 4720025 4693184 4667864 4664350 4650233 4674074 4674794 4688690 4680804
4093D680804K8916O688K0940K7493K8784K4025K8934M0273N0721L6226L0729M9135
$$ 4680804 4709720 4716408 4737348 4764841 4793625 4817650 4846584 4886857 4937578 4973804 5004533 5053668
4081E053668N3307P0321N7792P5068O3005N8733O6061O8588L1873M7289J04373
$$ 5053668 5106975 5177296 5235088 5310156 5373161 5431894 5497955 5566543 5598416 5645705 5750078
4070E750078P6462P4647Q8433N9227O9011N8943Q0459Q2146R6378P8781N7282
$$ 5750078 5826540 5901187 5989620 6048847 6117858 6176801 6257260 6339406 6435784 6514565 6571847
4059F571847O6476J20790R8717Q6272J11726J08272J15525J38148R1640J37025
$$ 6571847 6638323 6759113 6857830 6944102 7055828 7164100 7279625 7417773 7509413 7646438
4049G646438J48739J93550J58084J45894J60939K07183K19780K45725K62357K96314
$$ 7646438 7795177 7988727 8146811 8292705 8453644 8660827 8880607 9126332 9388689 9685003
4039I685003L23126L86074M25797M48056M32127M50539M79949L30472J11346l6173
$$ 9685003 10008129 10394203 10820000 11268056 11700183 12150722 12630671 12961143 13072489 13036316
4029A3036316o7257r6638o3162P65Q2939J45772K28486K39702K83716L24200L70310
$$ 13036316 12969059 12872421 12809259 12810024 12892963 13038735 13267221 13506923 13790639 14114839 14485149
4018A4485149M05820M67133N09009N70549N91383N96997O04535N98595O34526
$$ 14485149 14890969 15358102 15867111 16437660 17029043 17626040 18230575 18829170 19463696
4009A9463696O30650N41707M80296L94338L75800M05324M34872M68737M91718
$$ 19463696 20094346 20636053 21116349 21510687 21886487 22291811 22726683 23195420 23687138
4000B3687138N35477N86705O57128P13446Q08555Q68502R70661J045967J122595
$$ 23687138 24222615 24809320 25466448 26179894 26988449 27856951 28827612 29873579 30996174
3991C0996174J207949J317121J453812J574956J677836J799434J846611J696452
$$ 30996174 32204123 33521244 34975056 36550012 38227848 40027282 41873893 43570345
3983D3570345J436799J243283J197286J167940J253871J450249J591798J737582
$$ 43570345 45007144 46250427 47447713 48615653 49869524 51319773 52911571 54649153
3975E4649153J912088K040672K152128K260761K389312K451527K487387K508844
$$ 54649153 56561241 58601913 60754041 63014802 65404114 67855641 70343028 72851872
3967G2851872K529480K503450K469896K447820K418723K442593K461489K516241
$$ 72851872 75381352 77884802 80354698 82802518 85221241 87663834 90125323 92641564
3959I2641564K593082K599130K685474K722660K726305K716579K702567K666717
$$ 92641564 95234646 97833776 100519250 103241910 105968215 108684794 111387361 114054078
3951A14054078K594386K584122K604736K718206K925630L200219L527255L997919
$$ 114054078 116648464 119232586 121837322 124555528 127481158 130681377 134208632 138206551
3943A38206551M584257N219471N894808O701129P591710Q600560R778228J1114219
$$ 138206551 142790808 148010279 153905087 160606216 168197926 176798486 186576714 197690933
3935A97690933J2638938J4263134J5862286J7115649J7672559J7272183J5586648
$$ 197690933 210329871 224593005 240455291 257570940 275243499 292515682 308102330
3928C08102330J2680048Q750764M154717n10440m822540q361346j0903374j2445054
$$ 308102330 320782378 329533142 333687859 333177419 328354879 319993533 309090159 296645105
3920B96645105j3130896j3428792j3524387j3502357j3501625j3549113j3581427
$$ 296645105 283514209 270085417 256561030 243058673 229557048 216007935 202426508
3913B02426508j3536409j3341074j2938587j2324889j1473369j0545936r527856
$$ 202426508 188890099 175549025 162610438 150285549 138812180 128266244 118738388
3906A18738388q530167p568539o665096n853643n109569m415799l834349l538810
$$ 118738388 110208221 102639682 95974586 90120943 85011374 80595575 76761226 73222416
3898G3222416l585922l544742l284874l086259k811929k437471k115793j883431
$$ 73222416 69636494 66091752 62806878 59720619 56908690 54471219 52355426 50471995
3890E0471995j688402j461319j338894j276695j210441j174086j082856j102067
$$ 50471995 48783593 47322274 45983380 44706685 43496244 42322158 41239302 40137235
3882D0137235j049922r93958r61640r36100r07968q77960q67811q93083q85250
$$ 40137235 39087313 38093355 37131715 36195615 35287647 34409687 33541876 32648793 31763543
3873C1763543q34504q21132q01234p68603p68506p85157p52215p49244o94461
$$ 31763543 30929039 30107907 29306673 28538070 27769564 26984407 26232192 25482948 24788487
3864B4788487o97531o86533o52702o10376n58805n14577n14150n21056m47772
$$ 24788487 24090956 23404423 22751721 22141345 21582540 21067963 20553813 20032757 19584985
3855A9584985m21165m35807m37068m02587l82121l44615l36181l22974l22886
$$ 19584985 19163820 18728013 18290945 17888358 17506237 17161622 16825441 16502467 16179581
3846A6179581k79370k41029k46499k38862k46117k60234k65552k24687k27167
$$ 16179581 15900211 15659182 15412683 15173821 14927704 14667470 14401918 14177231 13950064
3837A3950064k07682j65628j70280j63952j34513j23723p0218p9943m8354j0376
$$ 13950064 13742382 13576754 13406474 13242522 13108009 12984286 12914068 12834125 12785771 12775395
3827A2775395J2070N5805R8724J30708J29738J39604J99665K32938K68004K98315
$$ 12775395 12787465 12843270 12941994 13072702 13202440 13342044 13541709 13774647 14042651 14340966
3817A4340966L68968M10196M46699M52634M15648L91077K88040K06634M8161l5481
$$ 14340966 14709934 15120130 15566829 16019463 16435111 16826188 17114228 17320862 17369023 17333542
3807A7333542j34415k02376k07207k06911j94967j78373j52557j37680j42104
$$ 17333542 17199127 16996751 16789544 16582633 16387666 16209293 16056736 15919056 15776952
3798A5776952j63609k10829k61551l78696m37328n02399n00878n42897n47806
$$ 15776952 15613343 15402514 15140963 14762267 14324939 13822540 13321662 12778765 12230959
3789A2230959m81589m70385m04610l45268l22247l35602k51358k40604k20851
$$ 12230959 11749370 11278985 10874375 10529107 10206860 9871258 9619900 9379296 9158445
3780I158445k07146j80117j69739k09102j67075j35120j32537j38986r8531n7215
$$ 9158445 8951299 8771182 8601443 8392341 8225266 8090146 7957609 7818623 7720092 7662877
3770G662877o3789q9145l9128n6978n6818m3142j1072l0768p5487j2362k6319
$$ 7662877 7599088 7509943 7470815 7413837 7357019 7313877 7302805 7272037 7196550 7184188 7157869
3759G157869l8764m2543o6500n6033j3869o0926o2278n4104r9669q9942o5316
$$ 7157869 7119105 7076562 7010062 6954029 6940160 6879234 6816956 6762852 6663183 6573241 6507925
3748F507925n4116l0062l0448k6986j0199m0731l9826o366j0622J9786K1692J9151
$$ 6507925 6453809 6423747 6393299 6366313 6356114 6315383 6275557 6269191 6258569 6278355 6300047 6319198
3736F319198l2255K3508L6418M0017N5053M6427O8374R1619M9980O1981Q7171
$$ 6319198 6286943 6310451 6346869 6386886 6441939 6488366 6556740 6648359 6698339 6760320 6847491
3725F847491O1140M9039L702J1550p813j9157j4212n319O115p112J5030L3906
$$ 6847491 6908631 6957670 6961372 6972922 6965109 6945952 6931740 6926421 6932536 6925424 6940454 6974360
3713F974360K8216K9968O2897N2757L3755M4513O3981P3341O9977R2502Q6809
$$ 6974360 7002576 7032544 7095441 7148198 7181953 7226466 7290447 7363788 7433765 7526267 7613076
3702G613076J10576J06183J01622P5912J14355J29155J29173J12653J21274J41247
$$ 7613076 7723652 7829835 7931457 8007369 8121724 8250879 8380052 8492705 8613979 8755226
3692H755226J33064J19020J30487J38701J42582J40746J08770J32260J49180J60578
$$ 8755226 8888290 9007310 9137797 9276498 9419080 9559826 9668596 9800856 9950036 10110614
3682A0110614J76789J66677J86711K04406K13251K15398K41202K24096K41549
$$ 10110614 10287403 10454080 10640791 10845197 11058448 11273846 11515048 11739144 11980693
3673A1980693K45615K58381K73715K85278K93621L32939L03683K85886L19438
$$ 11980693 12226308 12484689 12758404 13043682 13337303 13670242 13973925 14259811 14579249
3664A4579249L27515L43175L07939L48585L29576L81451L65247L70821L98177
$$ 14579249 14906764 15249939 15557878 15906463 16236039 16617490 16982737 17353558 17751735
3655A7751735L75935L99539M05615M33841M25786M46975M80839M93670M98314
$$ 17751735 18127670 18527209 18932824 19366665 19792451 20239426 20720265 21213935 21712249
3646B1712249N18125N68078O03975O39010O89156P51553P74136Q22825Q17623
$$ 21712249 22230374 22798452 23402427 24041437 24730593 25482146 26256282 27079107 27896730
3637B7896730Q67422R34424R95271J036034J065441J113142J194991J281309J421169
$$ 27896730 28764152 29698576 30693847 31729881 32795322 33908464 35103455 36384764 37805933
3628C7805933J561445J663251J800310J942617K134610K339519K553065K807899
$$ 37805933 39367378 41030629 42830939 44773556 46908166 49247685 51800750 54608649
3620E4608649L120928L515764L913447M371704M922221N573905O298290P106225
$$ 54608649 57729577 61245341 65158788 69530492 74452713 80026618 86324908 93431133
3612I3431133P920167Q666520R176115R235041Q832373Q046070P097221O142691
$$ 93431133 101351300 110017820 119193935 128428976 137261349 145307419 152404640 158547331
3604A58547331N488735N193003N332193N820288O537178P158285P514625P302373
$$ 158547331 164036066 169229069 174561262 180381550 186918728 194077013 201591638 208894011
3596B08894011O423462M780286K576517J40750k253640m304150n723385o517932
$$ 208894011 215317473 220097759 222674276 222815026 220561386 216257236 210533851 204015919
3588B04015919o803642o628524o204654n759317n426198n347136n616363o254011
$$ 204015919 197212277 190583753 184379099 178619782 173193584 167846448 162230085 155976074
3580A55976074p081828p963183q669728r021216r011484q632901q006895p262767
$$ 155976074 148894246 140931063 132261335 123240119 114228635 105595734 97588839 90326072
3572I0326072o463227n669105m970876m356630l801257l325415k949656k649301
$$ 90326072 83862845 78193740 73222864 68866234 65064977 61739562 58789906 56140605
3564E6140605k425521k195397k011056j840639j729511j523329j389913j238266
$$ 56140605 53715084 51519687 49508631 47667992 45938481 44415152 43025239 41786973
3556D1786973j132052j055814r28591q61180q14114q07912q30898q59679r00736
$$ 41786973 40654921 39599107 38670516 37809336 36995222 36187310 35356412 34496733 33595997
3547C3595997r10760r57887r48196r36931q83119q00465p41266p13293o66214
$$ 33595997 32685237 31727350 30779154 29842223 28959104 28158639 27417373 26704080 26037866
3538B6037866o33066o46984o18182o39128o68573p09212p16252p12128p16177
$$ 26037866 25404800 24757816 24139634 23500506 22831933 22122721 21406469 20694341 19978164
3529A9978164o55671o04305n77369n50676n21938m59830m21011m23200l94348
$$ 19978164 19322493 18718188 18140819 17590143 17068205 16608375 16187364 15764164 15369816
3520A5369816m04903l69914l41449l22446l42232l15582k96517k87409k68204
$$ 15369816 14964913 14594999 14253550 13931104 13588872 13273290 12976773 12689364 12421160
3511A2421160k93103k54576k49948j93698k10410k40286k33594k46848k25846
$$ 12421160 12128057 11873481 11623533 11429835 11219425 10979139 10745545 10498697 10272851
3502A0272851k11658k24098k01399j60786j57145j79885j55505j53548j64197
$$ 10272851 10061193 9837095 9635696 9474910 9317765 9137880 8982375 8828827 8664630
3493H664630j44172j43302j35116j14705j29995r1826q2632j10591p4418j07258
$$ 8664630 8520458 8377156 8242040 8127335 7997340 7905514 7822882 7712291 7637873 7530615
3483G530615r9344r2752j00606o3291r1058p8520p8197o0844o9432n3184o1167
$$ 7530615 7431271 7338519 7237913 7174622 7083564 7005044 6926847 6866003 6796571 6743387 6682220
3472F682220m4265o2389p0863o5460o2340m9581n2130l7893n6909o4802n5843
$$ 6682220 6637955 6575566 6504703 6439243 6376903 6327322 6275192 6237299 6180390 6115588 6059745
3461F059745n1311m6660m4813j8375p249o0215n3605k7752l7500m0382k6183m1890
$$ 6059745 6008434 5961774 5916961 5898586 5891337 5831122 5777517 5749765 5712265 5671883 5645700 5603810
3449E603810k8649l8209l5740k9053m3969m6473l0123k5871k5167r664m9812m8268
$$ 5603810 5575161 5536952 5501212 5472159 5428190 5381717 5351594 5325723 5300556 5290892 5241080 5192812
3437E192812l1289n571l4945j3003k4884j8398l1796p6563j1360o835j9759p735
$$ 5192812 5161523 5155952 5121007 5108004 5083120 5064722 5032926 4956363 4945003 4938168 4918409 4910674
3425D910674k2712k987k1333n2488j7819k6841k0404j8402k256k9302j1647j6030
$$ 4910674 4887962 4884975 4863642 4811154 4793335 4766494 4746090 4727688 4725432 4696130 4684483 4668453
3413D668453j5109j5573o548k4741k8613J5192j1069m550J4955L2485J328K4153
$$ 4668453 4653344 4637771 4631223 4606482 4577869 4593061 4581992 4577442 4592397 4624882 4626210 4650363
3401D650363J2624M3031L0449l8639l5084m669l4157j3382o365l2238k531K4507
$$ 4650363 4662987 4706018 4736467 4697828 4662744 4658075 4623918 4610536 4604171 4571933 4569402 4593909
3389D593909L903J1799J5668L803J5814o839Q82J495L053p811J571n499J3262
$$ 4593909 4597812 4609611 4625279 4629082 4644896 4638057 4638939 4640434 4643487 4635676 4637247 4631748 4645010
3376D645010L7313M9267L4929N1353P7438O5384M8284j1027p861P208j1327N9997
$$ 4645010 4682323 4731590 4766519 4817872 4895310 4960694 5008978 4997951 4990090 4997298 4985971 5045968
3364E045968M1050P9912P0292j0362j5327k5844m0889p8244n4110l6043m4352
$$ 5045968 5087018 5166930 5237222 5226860 5211533 5185689 5144800 5066556 5012446 4976403 4932051
3353D932051j3734n2025j7315k2064k181k2615K434L362J1525L3637J1350L8222
$$ 4932051 4918317 4866292 4848977 4826913 4824732 4802117 4804551 4807913 4819438 4853075 4864425 4902647
3341D902647K8758J8848K6347L3802K8649j855J2672J1654Q063L4341L2661N5658
$$ 4902647 4931405 4950253 4976600 5010402 5039051 5037196 5049868 5061522 5069585 5103926 5136587 5192245
3329E192245L8981M7541K5281L6730P5382O0418R7618Q6681L4599M3042O5933
$$ 5192245 5231226 5278767 5304048 5340778 5416160 5476578 5574196 5660877 5695476 5738518 5804451
3318E804451O9389N1285M2271P0368Q2383M9647M7287Q6642P5590K2015N7272
$$ 5804451 5873840 5925125 5967396 6037764 6120147 6169794 6217081 6303723 6379313 6401328 6458600
3307F458600Q6495N0290J7411O9584M9163K5280J6671J1263j6216J6221K1848
$$ 6458600 6545095 6595385 6612796 6682380 6731543 6756823 6773494 6784757 6768541 6784762 6806610
3296F806610L1753M1945J9450K9602N9232N9855L9937N5806M5249O6432N1514
$$ 6806610 6838363 6880308 6899758 6929360 6988592 7048447 7088384 7144190 7189439 7255871 7307385
3285G307385P7558N9695N3181J4486j5593q183m3944L757k1302K661N6181L8853
$$ 7307385 7384943 7444638 7497819 7512305 7496712 7488529 7444585 7448342 7427040 7429701 7485882 7524735
3273G524735L3656K7695M9183P9439O1722O5084Q5889P5772Q7801R9746P1049
$$ 7524735 7558391 7586086 7635269 7714708 7776430 7841514 7927403 8003175 8090976 8190722 8261771
3262H261771J22967Q7768J11275J28659J04018J25703J34233R8294J13790J43732
$$ 8261771 8384738 8472506 8583781 8712440 8816458 8942161 9076394 9174688 9288478 9432210
3252I432210J24644R0309J19868J36731J12575J61119J13942J54341J65341J59812
$$ 9432210 9556854 9647163 9767031 9903762 10016337 10177456 10291398 10445739 10611080 10770892
3242A0770892K10827J79750J91311K28766K71543K53369K89642L22024L09416
$$ 10770892 10981719 11161469 11352780 11581546 11853089 12106458 12396100 12718124 13027540
3233A3027540K96948K42966K15708J99349J84027K08977K72041L08912L95931
$$ 13027540 13324488 13567454 13783162 13982511 14166538 14375515 14647556 14956468 15352399
3224A5352399M53446M48267N35071N89798O19834P29250P70749Q49487Q75617
$$ 15352399 15805845 16254112 16789183 17378981 17998815 18728065 19498814 20348301 21223918
3215B1223918Q67689R31271R45957R21594Q77512P94323O19825M39665J22194
$$ 21223918 22091607 23022878 23968835 24890429 25767941 26562264 27182089 27621754 27743948
3206B7743948k26852n94749r42159j178501j271548j237842j198232j056947r33642
$$ 27743948 27517096 26922347 25980188 24801687 23530139 22292297 21094065 20037118 19103476
3197A9103476q28914p47807o71098n99483n37314m81543m13028m19122l64389
$$ 19103476 18274562 17526755 16855657 16256174 15718860 15237317 14824289 14405167 14040778
3188A4040778l15427k84378k33394k22111k36485k32135k54190k85182k43012
$$ 14040778 13725351 13440973 13207579 12985468 12748983 12516848 12262658 11977476 11734464
3179A1734464k38764j80822j68032j88509j46394j51814j78971j51979j73600
$$ 11734464 11495700 11314878 11146846 10958337 10811943 10660129 10481158 10329179 10155579
3170A0155579k02425j29980j67267j46364j30929j58523j65101j49424j69807
$$ 10155579 9953154 9823174 9655907 9509543 9378614 9220091 9054990 8905566 8735759
3161H735759j43932j02110j11415j27398q1314m8970r3681n3374m6762o7252p1900
$$ 8735759 8591827 8489717 8378302 8250904 8169590 8120620 8026939 7973565 7926803 7859551 7787651
3150G787651o0085j01076r4738k7300p5425j04203r2671j08546q9956r1895p8761
$$ 7787651 7727566 7626490 7531752 7504452 7429027 7324824 7232153 7123607 7033651 6941756 6862995
3139F862995q4216r4075l2018n2558j4760l0505n0819q0231r9721o1502n1781
$$ 6862995 6778779 6684704 6652686 6600128 6585368 6554863 6504044 6423813 6324092 6262590 6210809
3128F210809n2290m7096o5025p3255n5051l6721m2114l7151l4477o5839m2272
$$ 6210809 6158519 6111423 6046398 5973143 5918092 5881371 5839257 5802106 5767629 5701790 5659518
3117E659518m4173n0072l8365n34m9486n1821m3814j0813n0140m6679r473q004
$$ 5659518 5615345 5565273 5526908 5526374 5476888 5425067 5381253 5370440 5320300 5273621 5264148 5256144
3105E256144m1175o6128m8536k0212k0701k2771l4755k7441m7440o1742l8452
$$ 5256144 5214969 5148841 5100305 5080093 5059392 5036621 5001866 4974425 4926985 4865243 4826791
3094D826791m0253m5121L022l2301l4067k8993l8213k1655j9585j348l2505l3401
$$ 4826791 4786538 4741417 4744439 4712138 4678071 4649078 4610865 4589210 4569625 4568277 4535772 4502371
3082D502371l2597M793l0768l4960k5711j3776j5937l7264m0112M835k3114m3533
$$ 4502371 4469774 4474567 4443799 4408839 4383128 4369352 4353415 4316151 4276039 4280874 4257760 4214227
3070D214227j4846n905j1470j6805r777L345m4957j5548k6776k7845l4610m3639
$$ 4214227 4199381 4193476 4182006 4165201 4155424 4158769 4113812 4098264 4071488 4043643 4009033 3965394
3058C965394k4646r663j3040j7824n685j9776J4127j7674j8255k6350J0209J1104
$$ 3965394 3940748 3931085 3918045 3900221 3894536 3874760 3888887 3871213 3852958 3826608 3836817 3847921
3046C847921n413j9864l2089k305j3939k8765M120l0186O145K521l2426k461J1762
$$ 3847921 3842508 3822644 3790555 3788250 3774311 3745546 3749666 3719480 3725625 3728146 3695720 3693259 3705021
3033C705021J2045j1557n3686k6318p835k5331Q425n949j6903j7152j3700j6218
$$ 3705021 3717066 3705509 3651823 3625505 3617670 3592339 3600764 3594815 3577912 3560760 3547060 3530842
3021C530842n871j5299m8332P558K795o598q931k0357j448O989n164O05j0134
$$ 3530842 3524971 3509672 3461340 3468898 3471693 3465095 3456164 3435807 3434359 3441348 3436184 3436789 3426655
3008C426655j9163L641r572r237q97o931l099J0307K376j3617J1700J2315p31
$$ 3426655 3407492 3411133 3401561 3392324 3391427 3384496 3381397 3391704 3394080 3380463 3392163 3404478 3403747
2995C403747m051J159r508j1990r762J0096L6788J3779J4849l227O685J4442L7906
$$ 3403747 3399696 3400855 3391347 3379357 3369595 3379691 3416479 3430258 3445107 3441880 3448565 3463007 3500913
2982C500913M1776P730J9590L8587K0625J5168O0948M5392L0562L7577P5990M8796
$$ 3500913 3542689 3550419 3570009 3608596 3629221 3644389 3705337 3750729 3781291 3818868 3894858 3943654
2970C943654M9770M3279J7003M0863J5779J7495L6906J2245J4267J9985L0768
$$ 3943654 3993424 4036703 4053706 4094569 4110348 4127843 4164749 4176994 4191261 4211246 4242014
2959D242014j9689M2768O6396J7775K5643l558O6758P609K608K0487L3729M4755
$$ 4242014 4222325 4265093 4331489 4349264 4374907 4371349 4438107 4445716 4448324 4468811 4502540 4547295
2947D547295M8631O6750J05987O4702Q5849J01078R0496R1319Q9360J16709P0768
$$ 4547295 4595926 4662676 4768663 4833365 4919214 5020292 5110788 5202107 5291467 5408176 5478944
2936E478944Q2544M7151O0506Q9414O7880M2927K3335J2119j9596k4133P259J8080
$$ 5478944 5561488 5608639 5669145 5758559 5826439 5869366 5892701 5904820 5885224 5861091 5868350 5886430
2924E886430K565K2574J2987N1334N415L5583L9552L4001K9876L0553M2849Q2067
$$ 5886430 5888995 5911569 5924556 5975890 5981305 6016888 6056440 6090441 6120317 6150870 6193719 6275786
2912F275786R1587O0058J36367J21139J18958J36160J14846J34387P6728R8648
$$ 6275786 6367373 6427431 6563798 6684937 6803895 6940055 7054901 7189288 7266016 7364664
2902G364664Q9750J41250J63396J50763J73949J51085J41805J37685Q5523P6648
$$ 7364664 7454414 7595664 7759060 7909823 8083772 8234857 8376662 8514347 8599870 8676518
2892H676518Q8753N5723M7493N8522O3846P7341O4971M8200P6819O0778J12564
$$ 8676518 8765271 8820994 8868487 8927009 8990855 9068196 9133167 9181367 9258186 9318964 9431528
2881I431528J11494J19120J71678K16171K16546K44847K34963K71415K77733L43531
$$ 9431528 9543022 9662142 9833820 10049991 10266537 10511384 10746347 11017762 11295495 11639026
2871A1639026L86799M09859M27166L85513L25492K01783P8206l4937j67906k65119
$$ 11639026 12025825 12435684 12862850 13248363 13573855 13775638 13853844 13818907 13651001 13385882
2861A3385882l52097l53257l40514k71427k21372j19833j06137l4094L2672M0405
$$ 13385882 13033785 12680528 12340014 12068587 11847215 11727382 11621245 11587151 11619823 11660228
2851A1660228J06761J19850J47619J09888J35540J64878J19643J04878J18945
$$ 11660228 11766989 11886839 12034458 12144346 12279886 12444764 12564407 12669285 12788230
2842A2788230J20884J01098O2273P3221J084p4013j80547k28163k82489l09091
$$ 12788230 12909114 13010212 13072485 13145706 13146790 13072777 12892230 12664067 12381578 12072487
2832A2072487l32022l48007l55035l42199k75183k52237k12795j67897j27017
$$ 12072487 11740465 11392458 11037423 10695224 10420041 10167804 9955009 9787112 9660095
2823I660095j13209r6187n2938n3803p4591p0146q6891j22696j59313j79078j89576
$$ 9660095 9546886 9450699 9397761 9343958 9269367 9199221 9112330 8989634 8830321 8651243 8461667
2812H461667k18065k11474k28166k54571k21267k02632k13555k25743j78715j83108
$$ 8461667 8243602 8032128 7803962 7549391 7328124 7125492 6911937 6686194 6507479 6324371
2802F324371j64483j49489j18423j40630j38235j05207j21527r2580p5393j07275
$$ 6324371 6159888 6010399 5891976 5751346 5613111 5507904 5386377 5293797 5218404 5111129
2792E111129q0198m2730p0020p5704r3950r3719o6129p1939o3969r7840q9579
$$ 5111129 5030931 4988201 4918181 4842477 4748527 4654808 4588679 4516740 4452771 4354931 4265352
2781D265352r5743r1366q5719n1957p0826n7460p3491o3355p0508k6901o5619
$$ 4265352 4169609 4078243 3992524 3940567 3869741 3812281 3738790 3675435 3604927 3578026 3512407
2770C512407q4718p5752o8924j9439m3809p2689n0189l2873r0048n3686k7719
$$ 3512407 3427689 3351937 3283013 3263574 3219765 3147076 3096887 3064014 2973966 2920280 2892561
2759B892561m2733l8641k6456m7379m2766k2273k7220n3358l2177m4498l3909
$$ 2892561 2849828 2811187 2784731 2737352 2694586 2672313 2645093 2591735 2559558 2515060 2481151
2748B481151o4482k1030m2748k8618o3734n0092m2976k8029m9703k8343j9323
$$ 2481151 2416669 2395639 2352891 2324273 2260539 2210447 2167471 2139442 2089739 2061396 2042073
2737B042073k5790m1331p0801n5884R583m283m0573j9862j9088k6551k6794k8807
$$ 2042073 2016283 1974952 1904151 1848267 1857850 1853567 1812994 1793132 1774044 1747493 1720699 1691892
2725A691892l3518k7179k0876M17j8386n5212k055k1409l6164q622k5795k3828
$$ 1691892 1658374 1631195 1610319 1610736 1592350 1537138 1535083 1513674 1477510 1468888 1443093 1419265
2713A419265l8207j6963k6847j2788j7455j3708j8298l6480J560r612j233l7068
$$ 1419265 1381058 1364095 1337248 1324460 1307005 1293297 1274999 1238519 1240079 1230467 1229234 1192166
2701A192166l1846n935m0429j4870j8270j8112N273m1851k7362J0499r439j4388
$$ 1192166 1160320 1154385 1113956 1099086 1080816 1062704 1067977 1026126 998764 1009263 999824 985436
2689I85436k1034o508q757k5716j9131j2101j1930j9704j4775j3925j6814m94
$$ 985436 964402 957894 949137 923421 904290 892189 880259 860555 845780 831855 815041 814547
2677H14547L210k1251k2694l1420l792K3108n970j7150j7808R406J6245K148k0542
$$ 814547 817757 796506 773812 742392 738600 761708 755738 738588 720780 730186 746431 748579 728037
2664G28037m0011k6233m666P995j420j8931K771o589N932j2573n708q493m382
$$ 728037 688026 661793 657127 665122 663702 644771 647542 640953 646885 634312 628604 620111 615729
2651F15729J6487k0356j2696r054l9438j405J8509L418k2855J0829L32r756k079
$$ 615729 632216 611860 599164 590110 550672 549267 567776 571194 548339 559168 559500 549744 547665
2638E47665j8430Q608Q736j8303J3568J8292k2504k0655k0442J1602M980l5469
$$ 547665 529235 537843 546579 528276 541844 560136 537632 516977 496535 508137 513117 477648
2626D77648J7713K3416l680q43j1437J796K3359m308J2326j0309L906m595l280
$$ 477648 495361 518777 515097 514254 502817 504613 527972 523664 535990 525681 529587 524992 521712
2613E21712l025r351P01K5295o96J2759l869j2116r43j3833r793L135K7157j0865
$$ 521712 518687 509336 510037 535332 534636 547395 543526 531410 530467 516634 506841 509976 537133 526268
2599E26268n687L5103q14j3366k595P333k775K3400J1504K3182m810N914J0512
$$ 526268 520581 555684 554870 541504 538909 546242 543467 566867 578371 601553 596743 602657 613169
2586F13169k1339l012J6308K1859L873j0398j0287N658j3018O061O256k119q584
$$ 613169 591830 588818 605126 626985 630858 620460 610173 615831 602813 608874 615130 613011 604427
2573F04427J4755K4475k58l2570j6777M700R759j1594M339J6817Ro670J8433o138
$$ 604427 619182 643657 643399 610829 594052 598752 608511 596917 601256 618073 618082 611412 629845 623707
2559F23707Q584l154L6145J339k395K4737r504l1980J388j3252k7819l762j0887
$$ 623707 632291 629137 665282 666621 664226 688963 679459 647479 648867 635615 607796 604034 593147
2546E93147k1791j9928j9584P859j4311l4919J6376K8466j5384R506q434k1725
$$ 593147 571356 551428 531844 539703 525392 490473 506849 535315 519931 529437 521003 499278
2534D99278J5618j7980q296q81N984J2002k3452k3800J9015j995k2421j040R076
$$ 499278 514896 496916 488620 487739 493723 505725 482273 458473 477488 475493 453072 452032 461108
2521D61108J7281l924k369o81J5614m268j7491j0665l5402l1738k0323k6034r06
$$ 461108 478389 474465 472096 471415 487029 482761 465270 454605 419203 387465 367142 341108 340202
2508C40202q628j8604l2952J6788o105l2305Q945Q175j3042r739J3189p412l645
$$ 340202 331574 312970 280018 296806 290701 258396 267341 275516 262474 252735 265924 258512 254867
2495B54867j6861l508J0540j827k8906l880R699J897o371j8677n501j7637J2848
$$ 254867 238006 234498 245038 243211 214305 210425 220124 222021 215650 196973 191472 173835 186683
2482A86683m631L3630K769m0455j9523M499j4079r953J9484l2963o665j3366k239
$$ 186683 182052 215682 218451 177996 158473 162972 148893 138940 158424 125461 118796 105430 103191
2469A03191J5818o831k0161J2498J397j6183Q879J2234k4669M400j0495p645J4338
$$ 103191 119009 112178 92017 104515 105912 89729 98608 110842 86173 90573 80078 72433 86771
2456H6771j9668l2409L1631K735O902J2304l341j9036r929J5277K439J5537l0324
$$ 86771 67103 34694 66325 69060 75962 88266 84925 65889 55960 71237 73676 89213 58889
2443E8889k52k735j0522k2117J3217R069k765J7235j3363k145J2066J4120r604
$$ 58889 58637 55902 45380 23263 36480 45549 42784 60019 46656 44511 56577 70697 61093
2430F1093Q077k2876l3242Q77P547j1526j8807J0718O464R984j6275n752J9818
$$ 61093 69170 46294 13052 13929 21476 9950 -8857 1861 8325 18309 2034 -3718 16100
2417A6100o223J2122o407k6142Q425K0070p733k8232j210j502p508K1667j2425
$$ 16100 9877 21999 15592 -10550 -2125 17945 10212 -18020 -19230 -20732 -28240 -6573 -18998
2404a8998K1482J0324j0460m625j3591r894J3197J2751n72o835n439J3409j435
$$ -18998 2484 12808 2348 -2277 -15868 -25762 -12565 186 -386 -7221 -12660 749 -686
2391f86r854l39m0987L884J0195k9709K5226J8086L602K6705l545o111j4994J0698
$$ -686 -10540 -10879 -51866 -47982 -37787 -67496 -42270 -24184 -20582 6123 2578 -3533 -18527 -7829
2377g829k3912k3319k19K1728K669j9296K3260N916j9322j219R016L406K0565
$$ -7829 -31741 -55060 -55279 -33551 -30882 -50178 -26918 -21002 -40324 -41543 -32527 -29121 -8556
2364h556j8039j1621k0646l630L1901J9840j1816l745n563J379K2486n236j9492
$$ -8556 -26595 -38216 -58862 -62492 -30591 -10751 -22567 -26312 -31875 -30496 -8010 -13246 -32738
2351c2738m854M775K8672l807k4315K5219o912K0476l5727k9363L1704j0839j3881
$$ -32738 -37592 -32817 -4145 -7952 -32267 -7048 -13960 6516 -29211 -58574 -26870 -37709 -51590
2338e1590K8316N990k523J1724K511n747j576r595j9786J4069r897l291P572J2820
$$ -51590 -23274 -17284 -19807 -8083 -5572 -11319 -12895 -22490 -42276 -28207 -38104 -41395 -33823 -21003
2324b1003j5898j3831M660R254n686K997M446k426j4068J3936N541J0028k0626
$$ -21003 -36901 -50732 -46072 -36818 -42504 -39507 -35061 -37487 -51555 -37619 -32078 -22050 -42676
2311d2676J3751N569m712j1390M847j8049m641L1409k4379p666P781L772J7169
$$ -42676 -28925 -23356 -28068 -39458 -34611 -52660 -57301 -25892 -50271 -57937 -50156 -46384 -29215
2298b9215m488j7537m432j5910P82Q436o259L2088q247M567m25p407r701L677
$$ -29215 -33703 -51240 -55672 -71582 -70800 -62364 -68623 -36535 -44782 -40215 -40640 -48047 -57748 -54071
2284e4071M884O316q142Q544r597K053q139k961O568k5126J0170R713Q485K382
$$ -54071 -49187 -42871 -51013 -42469 -52066 -50013 -58152 -61113 -54545 -79671 -69501 -59788 -51303 -48921
2270d8921q690M134J6300l0568O352j1775O309K0482L243J2541J4189j4244J3018
$$ -48921 -57611 -53477 -37177 -67745 -61393 -73168 -66859 -46377 -43134 -30593 -16404 -30648 -17630
2257a7630k4836k882L1780P042p438j657j0818j7433K397l16m236O216p715p07
$$ -17630 -42466 -45348 -13568 -6526 -13964 -15621 -26439 -43872 -41475 -41791 -46027 -39811 -47526 -48233
2243d8233K2800j3460J4780l063p908j4980j1597M471J5604R396J1519j7027L913
$$ -48233 -25433 -38893 -24113 -27176 -35084 -50064 -61661 -57190 -41586 -32190 -20671 -37698 -33785
2230c3785l290L359k1074r825L3764L919J801j8183O822r530K36m537j0116k7915
$$ -33785 -37075 -33716 -54790 -64615 -30851 -26932 -25131 -43314 -36492 -46022 -45786 -50323 -60439 -88354
2216h8354J8157K0622K2597j5795l264L037k044Q244O584J7961k674j191R542
$$ -88354 -70197 -49575 -26978 -42773 -46037 -43000 -45044 -36800 -30216 -12255 -14929 -16120 -6578
2203f578k3910N842O743K9547j3777l0843J6927j3487q859J5346k305j4299J8786
$$ -6578 -30488 -24646 -17903 11644 -2133 -32976 -16049 -29536 -38395 -23049 -25354 -39653 -20867
2190b0867M767k7744K5452L146R299P727J0711Q455p764j2703K82m070R017p622
$$ -20867 -16100 -43844 -18392 -15246 -5947 1780 12491 20946 13182 479 761 -3309 5708 -1914
2176a914j0917o50P268L349R953j8302j5289J9272k136j4309J3711R165J666J301
$$ -1914 -12831 -13481 -6213 -2864 7089 -11213 -26502 -7230 -9366 -23675 -9964 -799 867 2168
2162B168j8448R315k2060J0257M926L7799J1483k86j0550o763k830K4402K1521
$$ 2168 -16280 -6965 -29025 -18768 -13842 23957 35440 35154 24604 17841 15011 39413 60934
2149F0934l3391J9717j147Q889O428k6028J5531J4088J438q02J5106P124M988
$$ 60934 27543 47260 46113 55002 61430 35402 50933 65021 66459 65657 80763 87887 92875
2136I2875M826N109j9529k0845Q826P234m966m874J0115K904L869K4501j8728
$$ 92875 97701 102810 83281 62436 71262 78496 73530 68656 78771 81675 85544 110045 91317
2123I1317J1795J3557O296k2158l077N637R301J1477J5220J0659j7831Q06M1513
$$ 91317 103112 116669 122965 100807 97730 103367 112668 124145 139365 150024 132193 132999 174512
2110A74512J2405J761l658L891K8232K3455J9051j1763Q633K3076M2375M4162
$$ 174512 186917 188678 185020 188911 217143 240598 259649 247886 256519 279595 321970 366132
2098C66132L029J3064P322L4138J6540J2365M1465L1441m184J6778N7529M6461
$$ 366132 369161 382225 389547 423685 440225 452590 494055 525496 521312 538090 595619 642080
2086F42080M1831O9125P2251P1010P3444O5905O6837P1607J15733J18808J25912
$$ 642080 683911 753036 825287 896297 969741 1035646 1102483 1174090 1289823 1408631 1534543
2075A534543J98302K48646K72774L62573M35859N61256P67859J099391J170981
$$ 1534543 1732845 1981491 2254265 2616838 3052697 3613953 4381812 5481203 6652184
2066F652184K43812o69107p00071r88819j029188p48697n39017l61229k88645
$$ 6652184 6895996 6226889 5526818 4537999 3508811 2760114 2221097 1859868 1571223
2057A571223j83886j27513j12092q8371o6981l4462m5932o8947o8851j03054n5609
$$ 1571223 1387337 1259824 1147732 1059361 992380 957918 911986 843039 774188 671134 615525
2046F15525l8289p169o4548k0358l0054k2819j9959m984m8804n499j8250k2582
$$ 615525 577236 570067 505519 485161 455107 432288 412329 407345 358541 353042 334792 312210
2034C12210k5737k2690l776j4427K3493J599m2645n8915M836n303j2850O50p367
$$ 312210 286473 263783 260007 245580 269073 270672 228027 169112 173948 168645 155795 156445 149078
2021A49078j9767J1668j919n621j7298n397q137k1944L5183J9l0633K7897j3055
$$ 149078 129311 140979 139060 133439 116141 110744 102607 80663 115846 115865 85232 113129 100074
2008A00074L6509k9987l4813K2532j4798j2656J1337J7853k8868j8596K7214q518
$$ 100074 136583 106596 71783 94315 79517 66861 78198 96051 67183 48587 75801 67283
1996F7283o684l244K0253K0272j7715l8510o581m973J4827K790j7939l941M710
$$ 67283 60599 57355 77608 97880 80165 41655 35074 30101 44928 47718 29779 25838 30548
1983C0548M477j7393m201L689k0162P333m790J8223k478o265k90O920M539j8114
$$ 30548 35025 17632 13431 17120 -3042 4291 -499 17724 15246 8981 8691 15611 20150 2036
1969B036N039j3928k3560K672N069j5489K1020K8390q647P922j7625j0261J6819
$$ 2036 7075 -6853 -30413 -27741 -22672 -38161 -17141 11249 2602 10524 -7101 -17362 -543
1956e43K1037l4269j3296J7804j5988k896J672J0932k6103J2760l923n166N87
$$ -543 20494 -13775 -27071 -9267 -25255 -28151 -26479 -15547 -41650 -28890 -32813 -37979 -37392
1943c7392j1486K3517q717J1568k606j5008P571M866J3249J0162k7266J5282M061
$$ -37392 -48878 -25361 -34078 -22510 -25116 -40124 -32553 -27687 -14438 -4276 -31542 -16260 -12199
1930a2199q670N52n3903K8754J0877J0297J2126k7970K5126q723p063J834l491
$$ -12199 -20869 -20317 -74220 -45466 -34589 -24292 -12166 -40136 -15010 -23733 -30796 -28962 -32453
1917c2453J3290j3771J6207p942J5012j036k2747k7J1756P558O565j0183j5955
$$ -32453 -19163 -32934 -16727 -24669 -9657 -10693 -33440 -33467 -21711 -14153 -7588 -17771 -33726
1904c3726L066o512k9800K4670N031J1834P96q476J7366j6878j7927J2080r920
$$ -33726 -30660 -37172 -66972 -42302 -37271 -25437 -24641 -33117 -15751 -32629 -50556 -38476 -48396
1891d8396j7426J372J053l904K4188K989J967Q918J4987j8373J8234R41k2114
$$ -48396 -65822 -64450 -63397 -67301 -43113 -40124 -38157 -29239 -14252 -32625 -14391 -13450 -35564
1878c5564m735m444q947J201J2044K1478j0367j5982J3255j1086k5458K5417J7405
$$ -35564 -40299 -44743 -53690 -52489 -40445 -18967 -29334 -45316 -32061 -43147 -68605 -43188 -25783
1865b5783M853l953J689k363r176j3612K5232q478k458p074k4616P584R662J4602
$$ -25783 -20930 -24883 -23194 -25557 -34733 -48345 -23113 -31591 -34049 -41123 -65739 -58155 -48493 -33891
1851c3891p765K2389m372j5495j365L893O999j1908L583K4434J0739k3489k6126
$$ -33891 -41656 -19267 -23639 -39134 -40499 -36606 -29607 -41515 -37932 -13498 -2759 -26248 -52374
1838e2374K5700m659j4202k9626M8681J0077J1124k8302p975q652J2170M017J0280
$$ -52374 -26674 -31333 -45535 -75161 -26480 -16403 -5279 -33581 -41556 -50208 -38038 -34021 -23741
1825b3741j2676N685J749m59J850j1968K6787M914k3241K0378k2444N645j3158
$$ -23741 -36417 -30732 -28983 -29442 -27592 -39560 -12773 -7859 -31100 -10722 -33166 -27521 -40679
1812d0679j7852J1397n83J3855M727k566j4733K2183P115J2893k358j9254N802
$$ -40679 -58531 -47134 -47717 -33862 -29135 -31701 -46434 -24251 -17136 -4243 -6601 -25855 -20053
1799b0053K597n142k709K5659j1740j1666K2597j0707j1672p491J5282k0154K135
$$ -20053 -17456 -22598 -25307 352 -11388 -23054 -457 -11164 -22836 -30327 -15045 -35199 -33064
1786c3064q765o428K118L5635L192m3306L874k0035J471K1254J7936K4701j4856
$$ -33064 -41829 -48257 -46139 -10504 -7312 -50618 -46744 -66779 -65308 -44054 -26118 -1417 -16273
1773a6273k1552j6763j1500J5289O732M247R515j9672m646p33J3416J536k872
$$ -16273 -37825 -54588 -66088 -50799 -44067 -39820 -30305 -49977 -54623 -55356 -41940 -40404 -43276
1760d3276R077L129J4126L087k0023r911l98K7548j291P32J288K4643j3508p987
$$ -43276 -34199 -31070 -16944 -13857 -33880 -43791 -44189 -16641 -17932 -17200 -15912 8731 -4777 -12764
1746a2764j4432q422K2912r572o559n127j3776p365P443l8646R984L0527M791
$$ -12764 -27196 -35618 -12706 -22278 -28837 -33964 -47740 -55105 -47662 -86308 -76324 -45797 -41006
1733d1006K2425L1266j6369m6553L704O354j087L082O344J690k0485j1256J9374
$$ -41006 -18581 12685 -3684 -50237 -46533 -40179 -41266 -38184 -31840 -30150 -50635 -61891 -42517
1720d2517R191J532l0059r186J9797J1089K012Q332l7935r437K5681M100j3164
$$ -42517 -33326 -31794 -61853 -71039 -51242 -40153 -38141 -29809 -67744 -77181 -51500 -47400 -60564
1707f0564n949K8053o476j599R490M552j5615k413O048n715L6949J0169j8624
$$ -60564 -66513 -38460 -44936 -46535 -37045 -32493 -48108 -50521 -44473 -50188 -13239 -3070 -21694
1694b1694J2633p577j7225j37q253K255K1963J9842k6745k3192P337m59J4130
$$ -21694 -9061 -16638 -33863 -34000 -42253 -39998 -18035 1807 -24938 -48130 -40793 -41252 -27122
1681b7122n183L572k7224J1996J1474k173L063r363R235J521p345n545J1835K3166
$$ -27122 -32305 -28733 -55957 -43961 -32487 -34660 -31597 -40960 -31725 -30204 -37549 -43094 -31259 -8093
1667h093j9330k5162Q187J4706M461j7938j1296m60P019L144K2103j552p147L550
$$ -8093 -27423 -52585 -44398 -29692 -25231 -43169 -54465 -54925 -47906 -44762 -22659 -24211 -31358 -27808
1653b7808M774k0402k6134K7509j9313O176O665J6776K24J0152L507Q430j7991
$$ -27808 -23034 -43436 -69570 -42061 -61374 -55198 -48533 -31757 -31533 -21381 -17874 -9444 -27435
1640b7435o891L13m945J1650j2315J8611k795J2542k1261o928K2664l0095j2647
$$ -27435 -34326 -34013 -38958 -27308 -39623 -21012 -23807 -11265 -32526 -39454 -16790 -46885 -59532
1627e9532N488K5799j952J3618k25q004j5365k211j835j67K1418k6607R201K4954
$$ -59532 -54044 -28245 -30197 -16579 -16804 -24808 -40173 -42384 -44219 -44386 -22968 -49575 -40374 -15420
1613a5420n429p640k318N870L501j8389j9157K5813O138j4491J277o543k73j2303
$$ -15420 -20849 -28489 -30807 -24937 -21436 -39825 -58982 -33169 -27031 -41522 -40245 -46788 -47061 -59364
1599e9364J7659m931J1757j3351q176l573O370J9504Q13l1175K0698N508n413
$$ -59364 -41705 -46636 -34879 -48230 -56406 -59979 -53609 -34105 -33292 -64467 -43769 -38261 -43674
1586d3674Q367J2491j7309O848J5795K6065k6649K887J138j1720q15j0745J383
$$ -43674 -35307 -22816 -40125 -33277 -17482 8583 -18066 -15179 -14041 -25761 -26576 -37321 -35938
1573c5938J638n323K223J0164l854P127j1238j8946R869J2581l23K6100k413l8241
$$ -35938 -34300 -39623 -37400 -27236 -31090 -23963 -35201 -54147 -44278 -31697 -32020 -5920 -8333 -46574
1559d6574l728K6622M933k2218K358K690J2419N78p63k524q46L1495j6199j6748
$$ -46574 -50302 -23680 -18747 -40965 -38607 -35917 -23498 -22920 -23683 -26207 -27053 4442 -11757 -28505
1545b8505M239q02k885p410L940K5237q417j5701n928Q206k4033N429L362L570
$$ -28505 -24266 -25068 -27953 -35363 -31423 -6186 -14603 -30304 -36232 -28026 -52059 -46630 -43268 -39698
1531c9698L1369J0560l5866J3606j4416j534Q435K2650K0089q46l6252n355N491
$$ -39698 -8329 2231 -33635 -20029 -34445 -35979 -27544 -4894 15195 14349 -21903 -27258 -21767
1518b1767J736L78J6251P652m217j7203n955p241j6023o520M1775o757k8903Q937
$$ -21767 -20031 -19653 -3402 4250 33 -17170 -23125 -30366 -46389 -52909 -11134 -17891 -46794 -37857
1504c7857J523J8513L779j5959M397J7517k3701J5970J2499k0603j2008J6731
$$ -37857 -36334 -17821 -14042 -30001 -25604 -8087 -31788 -15818 -3319 -23922 -35930 -19199
1492a9199k022j5915J8387R205j0176j5608K0203J2412n517k5090p564j7599K9597
$$ -19199 -21221 -37136 -18749 -9544 -19720 -35328 -15125 -2713 -8230 -33320 -40884 -58483 -28886
1479b8886M679Q52J4441l1397J453O332M891l1403L4K5640K1288j0086L0273j9506
$$ -28886 -24207 -23355 -8914 -40311 -38858 -32526 -27635 -59038 -59004 -33364 -12076 -22162 8111 -11395
1465a1395l1144J1335M399r998R66R30J951K7878K5015k572n539k4043j1624R809
$$ -11395 -42539 -31204 -26805 -36803 -35837 -34907 -32956 -5078 19937 17365 11826 -12217 -23841 -14032
1451a4032k728K764K1708L812j9222k3156O787K182J7613j4130k857J419J5839
$$ -14032 -16760 -13996 7712 11524 -7698 -30854 -24067 -21885 -4272 -18402 -21259 -19840 -4001
1438d001k3242j6445k231J3897P74M651Q928O955L562M224k3387p384J5208k028
$$ -4001 -27243 -43688 -45919 -32022 -31248 -26597 -17669 -10714 -7152 -2928 -26315 -33699 -18491 -20519
1424b0519J5053j073j9760l821K7045L772o627j5993O859J3287Q633r382K5804
$$ -20519 -5466 -6539 -26299 -30120 -3075 697 -5930 -21923 -15064 -1777 6856 -2526 23278
1411B3278R86j347r500p497j7713j7059r090j0993Q138q850J6083P205J0694j3940
$$ 23278 24264 22917 13417 5920 -11793 -28852 -37942 -48935 -40797 -49647 -33564 -26359 -15665 -29605
1397b9605p230J674n961K990k6653K7917J9455j412M522n706j249j5101q542K8265
$$ -29605 -36835 -35161 -41122 -38132 -64785 -36868 -17413 -18825 -14303 -20009 -21258 -36359 -44901 -16636
1383a6636K115j0985K6605k1692j402O311j4446j3249R455J1334p957J1498N015
$$ -16636 -14521 -25506 1099 -20593 -21995 -15684 -30130 -43379 -33924 -22590 -30547 -19049 -14034
1370a4034p639k2749J0076j3739L620N165J7335K3607J747m5543O039N513q456
$$ -14034 -21673 -44422 -34346 -48085 -44465 -39300 -21965 1642 3389 -42154 -36115 -30602 -39058
1357c9058O714R399o582J4296K72q954j6235l1040J9201j0113R696J4259K6096
$$ -39058 -32344 -22945 -29527 -15231 -14959 -23913 -40148 -71188 -51987 -62100 -52404 -38145 -12049
1344a2049p866k6818J1072J6193J3387K3526j5833j9246j5072M97J2046M6351
$$ -12049 -19915 -46733 -35661 -19468 -6081 17445 1612 -17634 -32706 -32209 -20163 26188
1332B6188p013l6741J293J2635j4883R82N623j6821J3791j5365M676K900J3101
$$ 26188 19175 -17566 -16273 -3638 -18521 -17539 -11916 -28737 -14946 -30311 -25635 -22735 -9634
1319i634J9472n602j8516q880K8149p934j4430j265J591K957J139O768k7892M882
$$ -9634 9838 4236 -14280 -23160 4989 -2945 -17375 -18640 -17049 -14092 -12953 -6185 -34077 -29195
1305b9195K1415q78p326p882P174k693o819K0114R423K589K821l044k8540j1432
$$ -29195 -7780 -8658 -15984 -23866 -16692 -19385 -26204 -6090 3333 5922 8743 5699 -22841 -34273
1291c4273q935J3619k1476R270K8107R521q529j5311N43J2311J7853P583M43o035
$$ -34273 -43208 -29589 -51065 -41795 -13688 -4167 -12696 -28007 -27464 -15153 2700 10283 10726 4691
1277D691p807p35p977n107J0662J399j694J2447o684J0352J7939k8666j6211j2596
$$ 4691 -3116 -3851 -11828 -16935 -6273 -4874 -6568 5879 -805 9547 27486 -1180 -17391 -29987
1263b9987N747J5885j9749j1844K7832J3339m134k4969R182j4342J7417M173j7545
$$ -29987 -24240 -8355 -28104 -39948 -12116 1223 -2911 -27880 -18698 -33040 -15623 -11450 -28995
1250b8995J0479n149j6125K8868j955j1404K2467J655k3764k1209K1945K0541
$$ -28995 -18516 -23665 -39790 -10922 -12877 -24281 -1814 -159 -23923 -45132 -23187 -2646
1238b646k301J0354j1867J3316m289O505l0421k856J2634q626L330K823Q819n695
$$ -2646 -4947 5407 -6460 6856 2567 9072 -21349 -24205 -11571 -20197 -16867 -14044 -5225 -10920
1224a0920J4990O141j130k900R719k3889O37k3399r624o695n449J2258O583j367
$$ -10920 4070 10211 9081 6181 15900 -7989 -7352 -30751 -40375 -47070 -52519 -40261 -33678 -35045
1210c5045q818K048J7450L2533o775k0066O449J2400o24n827j5429J3758K998
$$ -35045 -43863 -41815 -24365 8168 1393 -18673 -12224 176 -448 -6275 -21704 -7946 -4948
1197d948M977l2194p816J4210P656L5558k3005k3852j1881Q150J9529l986J1914
$$ -4948 29 -32165 -39981 -25771 -18115 17443 -5562 -29414 -41295 -33145 -13616 -17602 -5688
1184e688l0516r439j594K524M3605j5352J7465k8049J3698O043l639q072j2558
$$ -5688 -36204 -45643 -47237 -44713 -1108 -16460 1005 -27044 -13346 -7303 -10942 -19014 -31572
1171c1572K3065q347j1009P191K3725M030q841k5303j1627K832K1735J2989J0870
$$ -31572 -8507 -16854 -27863 -20672 3053 7083 -1758 -27061 -38688 -35856 -14121 -1132 9738
1158I738k2692j3327K8105p966l587o157N796J1728J5660k2626J695J1097q389
$$ 9738 -12954 -26281 1824 -6142 -9729 -15886 -10090 1638 17298 -5328 -3633 7464 -925
1145i25k388k3080o118O565K1803l473l407J806K682p73J1338P449J092l772l256
$$ -925 -3313 -26393 -32511 -25946 -4143 -7616 -11023 -9217 -6535 -7308 4030 11479 12571 8799 5543
1130E543p970m925k0422J6856J9630q571k5215q024J6732j7827M637K3004R221
$$ 5543 -2427 -7352 -27774 -10918 8712 141 -25074 -33098 -16366 -34193 -29556 -6552 2669
1117B669j4283J2230j117Q10K0210l289k0274j354J260q706m460j1536J1769L2395
$$ 2669 -11614 616 -501 309 20519 17230 -3044 -4398 -3138 -11844 -16304 -27840 -16071 16324
1103A6324j1569k1079L9776N82j9391p968R841j1489J0937k469l948J9730j0516
$$ 16324 4755 -16324 23452 24034 4643 -3325 6516 -4973 5964 3495 -453 19277 8761
1090H761l432M847K348n038j195l5390J1347p810J3830J3259p814j1706J0957
$$ 8761 5329 10176 12524 7486 6291 -29099 -17752 -25562 -11732 1527 -6287 -17993 -7036
1077g036K0014j1341J5475k5232q896j64Q780M139j4519o93R435j1589L3483K2816
$$ -7036 12978 1637 17112 -8120 -17016 -17180 -8400 -4261 -18780 -19473 -10038 -21627 11856 34672
1063C4672r64j8024j0375K4701k9367j9998K2274j3736k1353k529J7900Q266m6
$$ 34672 33708 15684 5309 30010 643 -19355 2919 -10817 -32170 -34699 -16799 -8533 -8579
1050h579K0891l06j3581m429j5232o668K2674N758R573k5274J6062J6773j0420
$$ -8579 12312 12006 -1575 -6004 -21236 -27904 -5230 528 10101 -15173 889 17662 7242
1037G242L910N667J3168q521j5040m539J0169Q431l3275J082o254J4388K2627
$$ 7242 11152 16819 29987 21466 6426 1887 12056 20487 -12788 -11706 -17960 -3572 19055
1024A9055k0958L904J539O941J6019j1457L157J2668j2083l0492m364Q981N258
$$ 19055 -1903 2001 3540 10481 26500 15043 18200 30868 18785 -11707 -16071 -7090 -1832
1011a832n282K160P22J1200j3559n689j0832L6227K2755j2528k1678O022n934
$$ -1832 -7114 -4954 -4232 6968 -6591 -12280 -23112 13115 35870 23342 1664 7686 1752
998A752l0490O306J4075J1693K954l756m403K2897k3101L0818j0225j5206N617
$$ 1752 -28738 -22432 -8357 3336 6290 2534 -1869 21028 -2073 28745 18520 3314 8931
985H931J414P14n386l6025L1502n376p929M382j4942J4054p57j1344K0600J428
$$ 8931 10345 11059 5673 -30352 1150 -4226 -12155 -7773 -22715 -8661 -9418 -20762 -162 1266
971A266k510r911p34J9061j2850J5143K1260k4499r423J7286J0393K0911l9323
$$ 1266 -1244 -11155 -11889 7172 -5678 9465 30725 6226 -3197 14089 24482 45393 6070
958F070j8305K1487M18j6511O821j1988j9586P965O647M044J5999r214p738J7412
$$ 6070 -12235 9252 9670 -6841 -20 -12008 -31594 -23629 -16982 -12938 3061 -6153 -13891 3521
944C521Q547j9027N076J0228J8972j2706r196K4046k2269j1999j942K0703j1015
$$ 3521 12068 -6959 -1883 8345 27317 14611 5415 29461 7192 -4807 -6749 13954 2939
931B939j8127j2177J146J5989j619O623J3566p697j2638Q945O848q553J0843q675
$$ 2939 -15188 -27365 -26219 -10230 -11849 -5226 8340 643 -11995 -3050 3798 -4755 6088 -2587
917b587J1228m986K7853j3913l8283K4431J2929M252k772J3908j4536m444o318
$$ -2587 8641 3655 31508 17595 -20688 3743 16672 20924 18152 32060 17524 13080 6762
904F762N838j0471J0803n286l3573M856J6141j4721K9348O534j3453L1863Q61
$$ 6762 12600 2129 12932 7646 -25927 -21071 -4930 -19651 9697 16231 2778 34641 35502
891C5502m1081o774K2857P80L881O899n150q755r032l653l274j7050j445J8317
$$ 35502 -5579 -12353 10504 11284 15165 22064 16914 8159 -873 -4526 -7800 -24850 -26295 -7978
877g978J5788K3950K1018k5594l3782L876o38O426J2309j1519P998j6986l38P205
$$ -7978 7810 31760 52778 27184 -6598 -2722 -3360 3066 15375 3856 11854 -5132 -5470 1735
863A735J657L4095j3831j3271P579k6572j8781j7013K1012J4331o292k850l584
$$ 1735 3392 37487 23656 10385 17964 -8608 -27389 -44402 -23390 -9059 -15351 -18201 -21785
850b1785J0372Q152L0787o382j5076r938R208L441q476j1381m414m213k484K2856
$$ -21785 -11413 -3261 27526 21144 6068 -3870 5338 8779 303 -11078 -15492 -19705 -22189 667
836F67K5863j5454J8782j1987l8697O519K3287J6624j3651J3199k7445O225R213
$$ 667 26530 11076 29858 17871 -20826 -14307 8980 25604 11953 25152 -2293 3932 13145
823A3145j4272R497l674J5368J3221k2813p26Q619m470R153k841Q305m719J576
$$ 13145 -1127 8370 4696 20064 33285 10472 9746 18365 13895 23048 20207 28512 23793 25369
809B5369j6922j3295q819K1861k137r824K2508P491j7438J238Q645J8863J131
$$ 25369 8447 -4848 -13667 8194 6057 -3767 18741 26232 8794 10032 18677 37540 38671
796C8671o218k0988j3667J3874j1121N94r777N101J02k042j8363K6663J7489J68
$$ 38671 32453 11465 -2202 11672 551 1145 -8632 -3531 -3429 -5471 -23834 2829 20318 20486
782B0486j1725J601j6967p78K045J5678J1000K3150L292j4164j1161q285j2301
$$ 20486 8761 10362 -6605 -7383 -5338 10340 21340 44490 47782 33618 22457 14172 1871
769A871M552J3810r016P364R288R506k2413K715r511j7940J8959J4500j6413p294
$$ 1871 6423 20233 11217 18581 27869 37375 14962 17677 8166 -9774 9185 23685 7272 -22
755b2K9506M164q735R947p914j0325J171M146r747J3325J8225k8272M408J5098
$$ -22 29484 33648 24913 34860 26946 16621 17792 21938 12191 25516 43741 15469 19877 34975
741C4975q524j3222M705j2574j528R759j1923j9070J4086J9697r368j0643j0947
$$ 34975 26451 13229 17934 5360 3832 13591 1668 -17402 -3316 16381 7013 -3630 -14577
728a4577K6058J0158K191m221K0344q500p007j9213l566L1138R282k748p693q135
$$ -14577 11481 21639 23830 19609 39953 31453 24446 5233 1667 32805 42087 39339 31646 23511
714B3511j1675k731N110r60j1186J9478J3307J5719j7007l0557k1607J942L1377
$$ 23511 11836 9105 14215 13255 2069 21547 34854 50573 33566 3009 -18598 -16656 14721
701A4721N076j1862K7274J1037k8898k4586j2232P240J2895J9612O674L5589j9054
$$ 14721 19797 7935 35209 46246 17348 -7238 -19470 -12230 665 20277 26951 62540 43486
688D3486l89j7834P805J4411k8991O334j9992J3779m845k2302K9896N182k2123
$$ 43486 43097 25263 33068 47479 18488 24822 4830 18609 13764 -8538 21358 26540 4417
675D417K5801K1703k6129k9372J0172p677k478J0958k403N791N103l799r117n005
$$ 4417 30218 51921 25792 -3580 6592 -1085 -3563 7395 4992 10783 15886 12087 2970 -2035
661b035j3877L766K7221J154P265J9978l0727j9854L941j2906K7598k475j4706
$$ -2035 -15912 -12146 15075 16229 23494 43472 12745 -7109 -3168 -16074 11524 9049 -5657
648e657K6753O259k1229j147m459k188k3266Q790K508L2774J3509k9093K7839
$$ -5657 21096 27355 6126 4979 520 -1668 -24934 -16144 -13636 19138 32647 3554 31393
$$ [...]
##END NTUPLES=NMR SPECTRUM
##END=
